##TITLE=1H_Pr 4832
 CDCl3, 8 sc, 
 27.04.2021
##JCAMPDX= 6.0         $$ Bruker NMR JCAMP-DX V2.0
##DATA TYPE= NMR FID
##DATA CLASS= NTUPLES
##ORIGIN= UXNMR, Bruker Analytische Messtechnik GmbH
##OWNER= root
$$ XWIN-NMR		Version 3.5
$$ Tue Apr 27 16:28:44 2021 Russian Standard Time (UT+4h)  she@DPX200
##.OBSERVE FREQUENCY= 200.131506
##.OBSERVE NUCLEUS= ^1H
##.DELAY= (6, 6)
##.ACQUISITION MODE= SIMULTANEOUS
##.ACQUISITION SCHEME= undefined
##.AVERAGES= 8
##.DIGITISER RES= 18
##SPECTROMETER/DATA SYSTEM= spect
##.PULSE SEQUENCE= zg30
##.SOLVENT NAME= CDCl3
##.SHIFT REFERENCE= (INTERNAL, CDCl3, 0, 15.7039)
##AUDIT TRAIL= $$ (NUMBER, WHEN, WHO, WHERE, WHAT)
$$ ##TITLE= Audit trail, XWIN-NMR		Version 3.5
$$ ##JCAMPDX= 5.01
$$ ##ORIGIN= Bruker BioSpin GmbH
$$ ##OWNER= she
$$ F:/spectra/data/she/nmr/H-F/1/audita.txt
$$ ##AUDIT TRAIL=  $$ (NUMBER, WHEN, WHO, WHERE, WHAT)
(   1,<2021-04-27 16:27:15.23 +0400>,<she>,<DPX200>,
      <created by zg, POWCHK disabled, PULCHK disabled
       configuration hash MD5:
       00 E9 B6 7A A2 85 ED C7 34 08 36 98 17 FE 4E 26
       data hash MD5: 16K
       E5 31 B8 0E 41 BA 60 71 1A 34 C7 83 2C 05 40 AE>)
$$ ##END=
$$ 
$$ hash MD5
$$ 7F 08 C8 4F 03 2E CC 95 DE EA E5 92 AF D7 A2 3C
##$RELAX= 
##$RELAX= 
##$RELAX= 
##$RELAX= 
##$RELAX= 
##$RELAX= 
$$ Bruker specific parameters
$$ --------------------------
##$DU= <F:/spectra>
##$EXPNO= 1
##$NAME= <H-F>
##$PROCNO= 1
##$TYPE= <nmr>
##$USER= <she>
##$AMP= (0..31)
100 100 100 100 100 100 100 100 100 100 100 100 100 100 100 100 100 100 
100 100 100 100 100 100 100 100 100 100 100 100 100 100 
##$AQSEQ= 0
##$AQ_mod= 1
##$AUNM= <au_zg>
##$AUTOPOS= <>
##$BF1= 200.13
##$BF2= 200.13
##$BF3= 200.13
##$BF4= 200.13
##$BF5= 200.13
##$BF6= 200.13
##$BF7= 200.13
##$BF8= 200.13
##$BYTORDA= 1
##$CFDGTYP= 0
##$CFRGTYP= 5
##$CHEMSTR= <none>
##$CNST= (0..31)
1 1 145 1 1 1 1 1 1 1 1 1 1 1 1 1 1 1 1 1 1 1 1 1 1 1 1 1 1 1 1 1 
##$CPDPRG= <>
##$CPDPRG1= <>
##$CPDPRG2= <>
##$CPDPRG3= <>
##$CPDPRG4= <mlev>
##$CPDPRG5= <mlev>
##$CPDPRG6= <mlev>
##$CPDPRG7= <mlev>
##$CPDPRG8= <mlev>
##$CPDPRGB= <>
##$CPDPRGT= <>
##$D= (0..31)
0 1.2 0 0 0 0 0 0 0 0.06 0 0.03 0 0 0 0 0.0002 0 0 0 0 0 0 0 0 0 0 0 0 
0 0 0 
##$DATE= 1619526434
##$DBL= (0..7)
120 120 120 120 120 120 120 120 
##$DBP= (0..7)
150 150 150 150 150 150 150 150 
##$DBP07= 0
##$DBPNAM0= <>
##$DBPNAM1= <>
##$DBPNAM2= <>
##$DBPNAM3= <>
##$DBPNAM4= <>
##$DBPNAM5= <>
##$DBPNAM6= <>
##$DBPNAM7= <>
##$DBPOAL= (0..7)
0.5 0.5 0.5 0.5 0.5 0.5 0.5 0.5 
##$DBPOFFS= (0..7)
0 0 0 0 0 0 0 0 
##$DE= 6
##$DECBNUC= <off>
##$DECIM= 32
##$DECNUC= <off>
##$DECSTAT= 4
##$DIGMOD= 1
##$DIGTYP= 9
##$DL= (0..7)
0 120 120 120 120 120 120 120 
##$DP= (0..7)
150 150 150 150 150 150 150 150 
##$DP07= 0
##$DPNAME0= <>
##$DPNAME1= <>
##$DPNAME2= <>
##$DPNAME3= <>
##$DPNAME4= <>
##$DPNAME5= <>
##$DPNAME6= <>
##$DPNAME7= <>
##$DPOAL= (0..7)
0.5 0.5 0.5 0.5 0.5 0.5 0.5 0.5 
##$DPOFFS= (0..7)
0 0 0 0 0 0 0 0 
##$DQDMODE= 0
##$DR= 18
##$DS= 0
##$DSLIST= <SSSSSSSSSSSSSSS>
$$ [...]
##$SUBNAM2= <"">
##$SUBNAM3= <"">
##$SUBNAM4= <"">
##$SUBNAM5= <"">
##$SUBNAM6= <"">
##$SUBNAM7= <"">
##$SUBNAM8= <"">
##$SUBNAM9= <"">
##$SW= 16.9725357007746
##$SWIBOX= (0..15)
0 0 2 0 0 0 0 0 0 0 0 0 0 0 0 0 
##$SW_h= 3396.73913043478
##$TD= 16384
##$TD0= 1
##$TE= 0
##$TE2= 300
##$TE3= 300
##$TEG= 300
##$TL= (0..7)
0 120 120 120 120 120 120 120 
##$TP= (0..7)
150 150 150 150 150 150 150 150 
##$TP07= 0
##$TPNAME0= <>
##$TPNAME1= <>
##$TPNAME2= <>
##$TPNAME3= <>
##$TPNAME4= <>
##$TPNAME5= <>
##$TPNAME6= <>
##$TPNAME7= <>
##$TPOAL= (0..7)
0.5 0.5 0.5 0.5 0.5 0.5 0.5 0.5 
##$TPOFFS= (0..7)
0 0 0 0 0 0 0 0 
##$TUNHIN= 0
##$TUNHOUT= 0
##$TUNXOUT= 0
##$USERA1= <user>
##$USERA2= <user>
##$USERA3= <user>
##$USERA4= <user>
##$USERA5= <user>
##$V9= 5
##$VALIST= <valist>
##$VCLIST= <CCCCCCCCCCCCCCC>
##$VD= 0
##$VDLIST= <DDDDDDDDDDDDDDD>
##$VPLIST= <PPPPPPPPPPPPPPP>
##$VTLIST= <TTTTTTTTTTTTTTT>
##$WBST= 1024
##$WBSW= 4
##$XGAIN= (0..3)
0 0 0 0 
##$XL= 0
##$YL= 0
##$YMAX_a= 132516
##$YMIN_a= -94273
##$ZGOPTNS= <>
##$ZL1= 120
##$ZL2= 120
##$ZL3= 120
##$ZL4= 120
##$ABSF1= 10
##$ABSF2= 0
##$ABSG= 5
##$ABSL= 3
##$ALPHA= 0
##$AQORDER= 0
##$ASSFAC= 0
##$ASSFACI= 0
##$ASSFACX= 0
##$ASSWID= 0
##$AUNMP= <proc_1d>
##$AZFE= 0.1
##$AZFW= 0.1
##$BCFW= 1
##$BC_mod= 2
##$BYTORDP= 1
##$COROFFS= 0
##$CY= 11.3945322036743
##$DATMOD= 1
##$DC= 2
##$DFILT= <>
##$DTYPP= 0
##$F1P= 15.9154993809931
##$F2P= -4.1035820241983
##$FCOR= 0.5
##$FTSIZE= 0
##$FT_mod= 4
##$GAMMA= 1
##$GB= 0.15
##$INTBC= 1
##$INTSCL= 1
##$ISEN= 128
##$LB= 0.24
##$LEV0= 0
##$LPBIN= 0
##$MAXI= 10000
##$MC2= 0
##$MEAN= 0
##$ME_mod= 0
##$MI= 1.114404
##$NCOEF= 0
##$NC_proc= 0
##$NLEV= 6
##$NOISF1= 3.799351
##$NOISF2= 2.8
##$NSP= 1
##$NTH_PI= 0
##$NZP= 0
##$OFFSET= 15.70392
##$PC= 1
##$PHC0= -11116.3
##$PHC1= 5.201013
##$PH_mod= 1
##$PKNL= yes
##$PPARMOD= 0
##$PSCAL= 0
##$PSIGN= 0
##$REVERSE= no
##$SF= 200.130013532006
##$SI= 16384
##$SIGF1= 3
##$SIGF2= 2
##$SINO= 400
##$SIOLD= 16384
##$SREGLST= <1H.CDCl3>
##$SSB= 0
##$STSI= 0
##$STSR= 0
##$SW_p= 3612.71676300578
##$SYMM= 0
##$S_DEV= 0
##$TDeff= 0
##$TDoff= 0
##$TI= <>
##$TILT= no
##$TM1= 0
##$TM2= 0
##$TOPLEV= 0
##$USERP1= <user>
##$USERP2= <user>
##$USERP3= <user>
##$USERP4= <user>
##$USERP5= <user>
##$WDW= 1
##$XDIM= 8192
##$YMAX_p= 0
##$YMIN_p= 0
$$ End of Bruker specific parameters
$$ ---------------------------------
##NTUPLES= NMR FID
##VAR_NAME=  TIME,          FID/REAL,        FID/IMAG
##SYMBOL=    X,             R,               I
##VAR_TYPE=  INDEPENDENT,   DEPENDENT,       DEPENDENT
##VAR_FORM=  AFFN,          ASDF,            ASDF
##VAR_DIM=   8192,          8192,            8192
##UNITS=     SECONDS,       ARBITRARY UNITS, ARBITRARY UNITS
##FACTOR=    0.0002944,     1,               1
##FIRST=     0,             0,               0
##LAST=      2.4114304,     0,               0
##MIN=       0,             -94273,          0
##MAX=       2.4114304,     132516,          0
$$ Real data points
##PAGE= N=1
##DATA TABLE= (X++(R..R)), XYDATA
0@%%%%%%%%%%%%%%qJ6j6J6j6K4l2L2m0M8n6O6p4Q8j04J20j37J54j74J98k23K52
36A34k84L16l53L94m38M86n38N96o58P29q06Q87r77J077j188J308j441J589j754
55i21J943k156K398k681L016l417L905m517N310o385P932j0346J4666k4714R0274
70G4307M8578j50690P1191N0355n9207j6279M3355n6298L0863L5260p8270j4818
82b1653R6135k8659j05639P9168M2414p5148L852L2608j8812J0239K1896o7304
94c0903L6584O2113o1020m3304Q1273J9013p8832L3870K6552k2679J4530n38m0076
107c417M3752M0999r2130J0430P8614l3786o3187M8263K1363m8305K2749j0006
119A5339k4965M1781P729q0661K9706P4541p7854l0975O3006L022n0917K4621
$$ y = [0, 0, 0, 0, 0, 0, 0, 0, 0, 0, 0, 0, 0, 0, 0, -8, 8, -8, 8, -8, 16, -16, 16, -24, 24, -32, 34, -40, 48, -56, 64, -73, 81, -93, 105, -118, 134, -150, 166, -187, 207, -231, 255, -283, 313, -345, 384, -422, 465, -512, 565, -623, 685, -756, 833, -921, 1022, -1134, 1264, -1417, 1599, -1818, 2087, -2430, 2880, -3505, 4427, -5919, 8747, -15967, 74307, 122885, -27805, 43386, 93741, 34534, 18255, 61610, 5312, 36175, 71435, -6835, -21653, 74482, 45823, -59816, 19352, 61766, -13382, -9530, 23078, 4266, 14505, 36401, -30903, 5681, 67794, 6774, -36530, 44743, 63756, -15076, 18794, 45346, 22667, 37197, 36659, -3417, 40335, 81334, -10796, -366, 78248, 44462, -18725, 29538, 50901, 2596, 25345, 15339, -9626, 32155, 39884, -40777, -11071, 63470, -14384, -45359, 17647, 20669, -30248, -5627]
131e627O613k4485M0332j6154m6492M4220M6893p9746m463P9447l1310l4414K9724
144D538J0448k0971K8048j9074k7217N7670P19o2732J8863O6236n5175k7713M8589
157B2229j0619j7614J4514j4367j6717N1331k5538n4163N0257K8613o1176j2423
169d5673N9876k7088j9803K1807j4839j41K9723k7694l5030O5876M37o0573K3685
182b9437M6195l2011j9141L5354j6017O683J7226l0365j812N1974j7945n2745
194d2041N3171K0569m3725k94L0287j4932j571J5977l4503J8308L3817l9883k8710
207c3530N8432J425n9944K8537K2937k5227j338J3975k5000J5994K6556n2792
219b9975P55N4708j9059n1700M4523K2684m3009J0943J2805j3484J0469J4628
$$ y = [-5627, 986, -23499, 16833, 679, -45813, -1593, 45300, -34446, -38909, 40538, 9228, -25186, 4538, 14986, -5985, 22063, 2989, -24228, 33442, 34161, -28571, -9708, 56528, 1353, -26360, 22229, 11610, -6004, 8510, -5857, -22574, 28757, 3219, -50944, -687, 27926, -33250, -45673, 14203, -12885, -32688, -10881, -25720, -25861, 3862, -23832, -58862, 7014, 7451, -53122, -29437, 16758, -15253, -34394, 960, -15057, -8374, 8852, -21513, -23325, 28649, 10704, -42041, 11130, 31699, -12026, -12320, 17967, 3035, 1464, 17441, -17062, 1246, 35063, -4820, -33530, 24902, 26327, -33617, -5080, 17857, -7370, -8708, 5267, -19733, -3739, 22817, -29975, -29220, 25488, 6429, -45271, -748, 21936, -21073, -10130, 2675, -10809, -340, 14288]
231A4288l9452J4686M6586m0870k4231M5954J0327m5795J7806J6438j6164J3043
243A2616m841j9114K1125K4590m9006j27M7048k0912k9127K2441J2893k2776J4576
256I386r282j4098L1459l346m1599J8095M4168m5534j5444L9849n517k2779J4524
269a18r07j6461L3492j4161l4334L6570K4133m9998n035N2020k4140k1832K2270
282A499N58j1947J8845r790k5291M1920J576m4405J4153M0391l0079k0498L3829
295A0761p042p262R244r377p505L0848j0544l6835L6444J7944l5524m439L3152
308A9865j3111j1135J4896j5304P068J8788k0632k0318M1585J416m4026J9176
320a732K3469k1066j0568J9508j3660M187J5535k9718j87L4292j3538l8619L3915
$$ y = [14288, -25164, -10478, 36108, -4762, -28993, 16961, 27288, -18507, -701, 15737, -427, 12616, 7775, -11339, 9786, 34376, -14630, -14757, 32291, 11379, -17748, 4693, 17586, -5190, 9386, 104, -13994, 17465, 14119, -27480, -9385, 34783, -10751, -26195, 13654, 8137, -14642, -118, -1025, -17486, 16006, 1845, -32489, 4081, 28214, -21784, -26819, 25201, 1061, -20771, 1499, 2057, -9890, 8955, -835, -26126, 15794, 17370, -27035, -12882, 27509, -2570, -23068, 10761, 3719, -3543, 5701, -3676, -11181, 19667, 9123, -27712, 8732, 26676, -8848, -13287, 19865, 6754, -4381, 10515, -4789, 2279, 21067, 435, -19883, 21702, 23118, -20908, -1732, 21737, 671, -9897, 9611, -4049, 138, 15673, -14045, -14232, 20060, 6522, -32097, 1818]
333A818J6513l4274L520J7074r836j544J2519k4626R363K8224k8749j6444L6383
346I941N718l8261J7528J6406j5949L173M751j2530J0657J9830l4219N87L6658
359B4290j5103k8990K3816J4714k7217R283L732j0647J2075L952k7196P889L2794
372B3392l2127j6272L1711K185k7857J0774J0200j5809J3561m026j7635J7051
384d852J7706l2255l741L7587j4836j9440J6396R023j3343Q846j447j1932K4515
397A2227l46k5858J1600K8123k4521j2419K6198m413r141N948j043p478J9900
410A8777j0090k4236K6766J0253l1205j855L0004j6566j2433J4608p888k477J1627
423E285j0862j7375L0423M1l3989J5389K4058k1496j1897K4218q599l647J1625
$$ y = [1818, 18331, -15943, -12423, 4651, -5185, -6729, 5790, -18836, -9473, 18751, -9998, -26442, 9941, 15659, -22602, -5074, 11332, -4617, -1444, 3307, -9223, 1434, 21264, -12955, -12368, 24290, 9187, -19803, 4013, 18727, -8490, 793, 4525, -6122, 5953, 9905, -17291, -9402, 23392, -8735, -25007, 6704, 8889, -18968, -8194, 2006, -13803, -242, -4268, -21903, -4852, 12854, -19401, -23142, 14445, -391, -19831, -3435, 5588, -7755, 1091, -356, -12288, 12227, 11881, -13977, -2377, 25746, 1225, -11194, 15004, 10591, 1450, 7398, 6355, -1123, 18777, 8687, -15549, 11217, 21470, -9735, -11590, 18414, 1848, -10585, 4023, -3865, -6342, 5285, -5577, -22952, 7471, 7512, -26477, -11088, 12970, -8526, -20423, 3795, -4804, -8451, 3174]
436C174j1085k035K1933m890k6262K6229J4647k5631o5K1196n811q021J3047j0608
450E818N394J4165j6357r338K4392K013k8534J3777J3352j3154m274P774p746
463G282K645J0229k3718K776K3460j4604k2351K2230Q382k4759O537O755q083
476c219K749O121j8370O835K2924k5149r630K7033M54k5846J3611J1556j4121
489e052O538K052r314Q440J3180k3254j347K8475j3277j7804J6479R604j7782
502c062O584J993q784J2146j956j6383P153K0049k1740j0313K2658k913j5396
515i964O211N044j0311J1760n584j4059J7600O649k2378q04K5322j3322j1782
528a5618J2925J868p162O594j688j1489K0661j755k1902J2523J7687j8261q579
$$ y = [3174, -7911, -9946, 11987, 7097, -19165, 7064, 21711, -3920, -3985, 17211, 11400, 3379, 16426, 5818, 11212, 25377, 9020, -318, 24074, 26087, -2447, 11330, 24682, 11528, 7254, 15028, 7282, 9927, 20156, -3562, -786, 22674, 8070, -14281, 7949, 16331, -8428, -1891, 4864, -3219, -470, 5651, -12719, -5884, 17040, -8109, -17739, 9294, 9748, -16098, -2487, 9069, -5052, 1486, 3538, -5776, 2664, 15844, -7410, -8757, 19718, 6441, -11363, 5116, 14720, -3062, 3522, 5515, -3269, 8877, 6921, -9462, -2309, 17740, -4000, -14313, 8345, 5432, -9964, -3753, 1291, -9020, 2740, -2844, -16903, 697, 7346, -15032, -15836, 9486, -3836, -15618, -2693, -825, -7987, -1393, -3081, -14570, 6091, 4336, -17566, -5043, 12644, -5617, -14196]
541a4196K0563n500o134N484l433l463J3066n517j8423K0755O546k1780J231J8064
555G263r862q081J0231o639J875P556r911q273K0382o01k4139J3914J3324j4564
569g525m683J3873o352k13Q603j3060J905J6059p103j8101J9685R686k1354L461
583e119J3364o555m124Q933j0275L211J4112j5659o262J8611J118k0947Q939J1077
597A0424j0906j047M534m248J890Q644j6623J706J7712j0729j2512J3423O695
610H963j5222N079L926n046N735M47j0961N837J6075j8961m255J9253l268j3789
624f187Q641O095j0296Q136j708q609R939P232j7755p10K2387j2765j1851J3033
638E582L422j1318M709J944q862J1308o00j4164N837J4227j4401r051J7744l232
$$ y = [-14196, 6367, 867, -5267, 217, -3216, -6679, 6387, 870, -17553, 3202, 9748, -12032, -10801, 7263, -2599, -10680, -449, -7088, -5213, 2343, -7568, -15841, 4541, 3940, -20199, -6285, 7039, -7525, -12208, 1665, -4687, -4900, 3703, -9357, -7452, 8607, 1504, -16597, 3088, 12774, -8580, -5119, 8245, 1690, -2434, 6499, -3776, -565, 13547, -2112, -8374, 10237, 11355, -9592, -653, 10424, -482, -1529, 3005, -1243, 647, 9291, -7332, -5626, 12086, 1357, -11155, 2268, 8963, -6259, -1180, 2746, -2300, 3435, 3882, -7079, -1242, 14833, -4128, -8383, 10870, 7602, -6187, 2454, 8549, -1747, 6389, 4681, -3928, 6011, 13243, -4512, -5222, 17165, 4400, -7451, 5582, 9004, -2314, 2395, 4339, -4523, 6785, 6185, -7979, -2142, 12085, -2316, -11367, 6377, 3145]
652C145r230M701K105n585P681l058j1388J4045L488j4310N27J5580q284p392
666g975R342k110j296M431l656o651J4617j523j5973J1249R572j1809m898J3241
680F561n102l308O574o345j85R818m164j4006J5689N003j6813L277J1399o593
694A805n600R013o243M39P798q572n350J3370M47j6911J0008Q326j0659j490O605
709B986l531j027O760j0701J538J1616p187j0828J2141N645j5093M543O108n178
723b208K5L784o945K300J0498j2448l442J3145o08j3380P228P757r760L331J501
738G78m011L317N770j1352P1J5307r131p946R905M354j0685L537L724n807N815
753C646l00p551L993J0166j2219l747J3307l868p689M503L462o070N040j476p406
$$ y = [3145, -6085, -1384, 721, -4864, 2817, -241, -11629, 2416, 5904, -8406, -7879, 7701, -583, -7975, 1367, -743, -2039, 2392, -1264, -7915, 6702, 5179, -10794, 455, 10027, -1782, -6680, 6561, 1459, -1849, 4725, -1620, -1805, 8013, 3849, -10157, 5532, 10535, -6278, -3001, 8398, 1805, -3795, 5218, -1025, -586, 7212, -1360, -6710, 6660, 7107, -9804, 204, 8530, -2129, -3619, 2986, -545, -1572, 5188, -5513, -3975, 7641, 454, -10374, 1767, 7412, -7681, -3138, 2970, -2208, -2183, 1601, -5344, -3044, 7454, -4994, -8436, 4709, 4101, -9279, -2051, 5706, -4054, -723, 778, -3233, 84, 5854, -5498, -5427, 9880, 749, -7197, 2708, 7062, -3623, -86, 3638, -2169, 3646, 3346, -4205, -212, 9954, -2265, -6012, 7295, 3427, -4262, 241, 3703, -2367, 2673, 1197, -6209]
768f209R486K289j1354M19J3824r166o665R780n11n094L489Q00o791R683n02j1866
784h388P611Q919j0343n484J3735l790o025N550p17k878N359o45r709J0079L726
799G000j1390O77J0282m941o610P618k272j371L558l611l501Q539k35j2150Q360
814d7N363p980k074P062k559k528N291o400K051O577m841p289J0717L254j2213
829e616M814N984m613j551N346m670P76P664q509k238J0137m77j1928P440O473
844I032r183J202L658k624j177N654q035P2R565o610o657P514L824j0484L002
859a247M053m635J486P11m349J522P063r536j777R490k418p018L962M672o537
874d558L166L49l758M718K336p723O59J0903p664m809Q089P11n509K709K495n288
$$ y = [-6209, 3277, 5566, -5788, -5369, 8455, -711, -7376, 2404, 1893, -3201, 288, 1088, -5703, 3980, 3478, -8388, -777, 8142, -2201, -7685, 6050, 2260, -3765, 1785, 1068, -1810, 3549, 2904, -6805, 3274, 7000, -4390, -3713, 6569, 1628, -4982, 2636, 364, -1007, 2551, -1060, -4561, 3978, 3743, -8407, -47, 5316, -2664, -4738, 2324, -235, -2763, 2528, -3872, -1821, 4756, -85, -7374, 3343, 6597, -5616, -802, 5182, 569, -982, 4364, -306, 470, 8134, -375, -2613, 7524, 7047, -4881, 2559, 9032, -151, 1051, 4709, 2085, 908, 6562, -1473, -1401, 8164, 1554, -5103, 2411, 6235, -4249, -1247, 2806, -1829, -343, 368, -3981, -2459, 4604, -4932, -6709, 2781, 363, -6655, -2693, 1979, -4558, -1392, -1043, -4801, -83, 2253, -5470, -4811, 6092, -1572, -6381, 1708, 2419, -3090, -381, 2114, -3174]
890c174N945o90o642M367O444q151l676J0916m269m813L830J476l855L214m52
905D70o011P237J119q000Q68Q779n809n161P635k059k189K714j071l552O490m36
921A024q778P193M177o860k074Q161l392l163N163l194j26M377j848o284P976
936B352J973r000L203N745l786m472O513k680j294M393m413j356O117l38q516
951e559O221L832o876m5M001j257k501M039m068N61N122m047m027O486K092q689
967d715M182K923l156N04J737k485M62N463p241l70P918k525o727N590L780p767
983b427L563J724l256J766K978n920O24Q275o644l611O292J627p252K832L742
998D313m997K602M43l651J868M749o280j788P597k871m670K920L252m508J696
$$ y = [-3174, 2771, 2081, -4561, -194, 6250, -1901, -5577, 5339, 1070, -3743, 87, 1563, -2292, 922, 470, -5541, 1696, 2815, -5185, -4317, 4462, -1347, -6508, 1127, -932, -3121, -407, -1478, -5030, 1460, 1024, -7754, -561, 3616, -3244, -5318, 2843, -549, -3712, 1451, -1743, -1869, 2508, 660, -5624, 2352, 4325, -4675, -1472, 4273, 487, -3985, 2528, -152, -1446, 2947, -1466, -2822, 3295, 2957, -5559, 662, 4494, -2382, -2427, 1574, 317, -2184, 1855, -2213, -1652, 3470, -577, -4604, 1882, 3974, -4715, -533, 2390, -766, -262, 1475, -1010, -548, 4915, -2326, -2696, 5222, 2697, -4030, 1560, 5340, -2427, 1136, 2860, -396, 1370, 4348, -1572, -948, 7327, 683, -2928, 3364, 4991, -2261, 571, 4313, -684, 1918, 2361, -1290, 578, 5327, -953, -2741, 4856, 1985, -2685, 235, 3487, -1021, 675]
1013F75J094l808M165J66m670P86O326n519k508N582q53k767R21J333l132M030
1029A821r46n328N313K635o158r40P429m273k540M014j287j094K342m42m752O243
1045B037O62p146K639N795m404l389O299k404j181K453j590j335L929m08o079
1060d122N494K736n376p47N280k100k652M014l198O10K928k491k835M917J088
1075C546o893L366L108k960j336L087k260l53L939n172J47M619j520n613M691
1090C96K782n531J503J829j048j176K630l277r7N428m691k245M633J249n880L005
1106d90K110k992J099K13j251J94L460m522o67N559k434l408L032J928m016K116
1122f9M45k053K690j07k950O42M985m857j842N112n43l051J554J824l450L318
$$ y = [675, 1769, -2039, 2126, 2292, -2378, -1592, 4734, -785, -3293, 2289, 1436, -1331, -410, 923, -2209, 1821, 875, -4453, 860, 3495, -2663, -3603, 3826, -447, -2987, 1027, -260, -1354, 988, 546, -4206, 2037, 2699, -4447, -1808, 3987, -417, -3806, 2493, 89, -1092, 1361, -229, -1564, 2365, 1957, -4122, 1372, 4108, -1268, -2015, 3265, 1165, -1487, 2527, -671, -61, 2867, 376, -2459, 2458, 3546, -3347, 19, 3127, 167, -1169, 1918, -342, -695, 3244, -1928, -1781, 2838, 1318, -4295, 396, 3178, -2353, -850, 979, -69, -1245, 1385, -1892, -1989, 3439, -1252, -3497, 1136, 2385, -3495, -490, 1620, -1372, -273, -60, -1311, -1117, 2343, -2179, -2846, 2713, 279, -3129, -97, 1831, -2185, -69, 376, -1677, 1013, 906, -2044, -1402, 3583, -1274, -3116, 1996, 1453, -1598, -44, 1780, -1670, 1648]
1138A648m85l483L086K565m657j216O548l569k432K889P28k728J481J009l756
1153b372L952J78m008J009L983l254k567M489j204j612R26J85j534K584k96m227
1169c768M297Q02l419l94L969j983j861L031j925K99J538o83k703L902P32n250
1185c416L148K673l365j096M018k289o44K792k858k89L427m50m624L983K074m937
1201a853J131K523j416j870L390k470l12L147k315j800L008J121m879K404K074
1216A883k457J57J240r92m36K768l420O09K990j721k336K328J763l762K028M47
1232A089j100P62P50k137L06L848m123p61L554l71l752K132J870l257J752r7j508
1249a043P56K096l207r80M421k737k063K243J227k987R87J106k180J928j31j774
$$ y = [1648, 1163, -2320, 766, 3331, -1326, -2542, 4006, 437, -1995, 894, 1622, -1106, 375, 1384, -2372, 1580, 1758, -2250, -1241, 2742, -512, -3079, 1410, 206, -1406, -480, -295, -1829, 755, 459, -3768, 529, 1331, -2088, -2482, 1487, -496, -2357, 674, -1251, -952, 586, -97, -2800, 1102, 1834, -3416, -268, 2405, -960, -2056, 1962, -327, -971, 1821, -1037, -1326, 2101, 1651, -2973, 1010, 3084, -1853, -722, 1801, 385, -1485, 1905, -565, -877, 2270, -45, -1845, 1163, 2284, -2595, -191, 1883, -574, -417, 823, -169, -605, 2163, -1257, -648, 2342, 621, -1715, 613, 2376, -1386, 642, 1089, -11, 751, 1501, -636, -330, 3518, -605, -1366, 2188, 1817, -1935, 197, 2067, -1190, 562, 465, -1043, -287, 1809, -1398, -2378, 2043, -694, -2757, -514, 713, -2274, -1287, -181, -2361, -433, -564, -2338]
1265b338L24K982k655j141L339j069j274P68J341j887J943l98k349L200N92k497
1281a119k87L880k288j399K625q31m84Q64K30k331K825J24l319J768K233k213
1297B78j577L462j850j044J431p24m93R65O11l779L118O84k615q5K294n51k288
1314b163K612j358L29P97q88r44K029N12l177K206J190j353l40J501p97l90J954
1331A720k062M33J796r73j815K505O65l107J680R60j152l85J733j789Q8K430k817
1348i0m90K049M21l477K112J398k725R57N16o31n36K136j929n70K839j624j452
1365a096J700Q47k403J345O05j094P05K98q07qK058k185l65K372r02j142Q72R85
1383A785j688J278j18j592J444N45j831j95L075k911p15K114m73j635J066L32
$$ y = [-2338, -2014, 968, -1687, -2828, 511, -558, -1832, -1064, 277, -1610, 333, -65, -2414, 786, 1378, -1119, -1406, 2474, 186, -1213, 1412, 581, 97, 961, 1191, -1140, 1685, 1809, -1510, 258, 2491, 278, -1299, 2163, 313, -731, 700, -24, -517, 448, 1059, -2720, 398, 1082, -1533, -1618, 676, 125, -2163, 449, -909, -580, 217, -671, -1615, 414, 926, -2251, -45, 1145, -208, -548, 953, 156, -234, 1720, -342, 91, 1887, 914, -901, 1604, 2269, -838, 842, 1802, 650, 265, 1998, 209, 297, 2727, -90, -580, 1469, 1890, -1587, 525, 1923, -802, 155, 671, 40, -496, 1640, -289, -859, 1980, 356, -1096, 604, 1451, -952, 393, 998, -96, 609, 907, 100, 92, 2150, -35, -400, 1972, 1070, -72, 800, 1785, 97, 1375, 1257, -335, 1109, 1654, -177, -372, 2703, -208, -923, 1191, 718, -917, 149, 481]
1399D81k058J997n5k070R06J412j643j501L187j213j126J005M95j442J216K07
1415b02j879K003K49j297j88J656n40j263J979q70j04O09r1j004J825Q7k374K202
1433G98M3r12l55J769j026n56J362j175P5J053k05k314K127P83k519J171J011
1450A130j337p07K087j356j59J335j165m93J013P31k711J568R16k014R10M46m1
1467A53j100J505j320L6J246q16o91O41J181k473J205P84j349O24M50j011M8J836
1485I49k212L12R90l80r61P38J366k292J158L59r60L04J096j461k26K489j963
1502f94n39J509J75j500R50Q78j629P60K29n56m28J923j529q87K299j322n15P75
1520a01M90j209O45N4q16J202L5r58l37J992j517l82J287p71j61L86K18j084J316
$$ y = [481, -1577, 420, 365, -1705, -799, 613, -1030, -2531, 656, -557, -1683, -678, -183, -1625, -409, -202, -2081, -78, 171, -1126, -1314, 342, -198, -1461, 518, -352, -456, 153, 62, -942, 883, 970, -1404, 798, 841, -71, -426, 1343, 317, -239, 1123, -52, 23, 1076, 871, -1443, 684, 1467, -1052, 119, 1130, -207, -914, 1173, -183, -342, 993, -172, -665, 348, 1079, -1632, -64, 852, -1162, -252, 194, 153, -947, 558, -762, -726, 520, -296, -987, -346, 835, -1638, -433, 351, -998, -374, 76, -935, -887, 949, -1263, -951, 39, -341, -1302, -564, 802, -1490, -332, 27, -933, -629, 467, -994, -1220, 1269, -694, -1233, 276, 451, -1049, -99, 779, -850, -90, 139, -417, -845, 1078, -451, -1338, 961, -361, -876, -101, 389, -820, -175, -121, -937, 265, 300, -658, -995, 997, -520, -902, 385, -386, -547, -161, 57, -1027, 289]
1539B89p9j496J484L74j197n33K120r83l91R50o47k13O34Pj464J802Q8j364L75
1558b44Q22k42j329J932p52o15Q98k27m98N97M34j895J536K37q23M0N52o9p82
1577d28Q85o18L30O11n02q23J075N09j782J715l55k44J46J79j46l53J506j457
1595B48M44O13p5j276R61R62j608P84kn03j40Q93q59k97J677j349n09N57O51j664
1615d92M24Q26j049P19j80k82k25Q66j071l94J372n40k56k84R41j046O46j05m32
1634e62P08m17m03Q7J230j147k16J091p05K55l9M46j036J145l47q94P12M65q09
1653d36o38J779j333o4Q34j09n20K52O47j423J341n6p68k0J160n67j076J607p52
1672a42R1n2J60m44N86P02j337R41N9k75n63J165l43n87P94r49K24L59p7p16R09
$$ y = [289, 210, -1286, 198, 572, -625, -1158, 962, -21, -412, 538, -109, -322, 312, 319, -1145, 657, 745, -619, -244, 578, 336, -993, 939, 187, -428, 470, 243, -255, 342, 776, -1119, 417, 654, -169, -129, 423, 354, -428, 457, -161, 169, 780, 278, -545, 530, 1039, -743, 972, 617, 373, 519, 698, 552, 199, 1705, 248, 692, 1305, 1230, -46, 915, 1877, 269, 1053, 1051, 548, 408, 1301, 442, 145, 1822, 473, -36, 521, 1172, -492, -68, 758, -291, 428, 248, -34, -259, 607, -464, -858, 514, -26, -282, -566, 375, -671, -25, -130, -562, 146, -271, -674, -587, 643, -504, -720, 371, -334, -79, -118, 328, -708, 437, 90, -804, -92, 373, -436, -1074, 705, -628, -692, 142, 33, -487, -235, 412, -1011, 330, 274, -494, -514, 646, 79, -997, 610, -142, -51, -103, 57, -387, 199, 901, -436, 505, 564, 289, -274, 891, 548, -39, 755, -194, 30, 389, 312, -404, 505]
1693E05p7j208J115J60p28j68Q36n63n60J126j016JO98O9j056Q75L40j108M28
1712c31L10k92m82J445j053k43J173o47k45P64J86p77O42Km71M26L0J76m82O86
1732H17p76KJ092l59n19J31K81o61N13O6o80N87l2o31P8O73j169K84L69K4o81
1753e91M38L44j006Q87j30k62k05P98o13n90J565q20m70M17P36p52L8O29o12N09
1773C10k28j4k94O14l42n32Q49m68J65k50K24n26N34j44o49N96M8o17M4N51p23
1794h52Q3N00m44Q3r0K22p81O90R3o31O08j07J13m96J094o33j94P97l0r5J48O60
1816G38j226P70K65o84M60Q4K69o39O62m00J47L51j84k00k20N81j099O87N2k49
1836A65j23J13m2j76N89p54J71J23m55JJ69j37k17M88k89j73K21L57n54k68J132
$$ y = [505, 428, -780, 335, 495, -233, -401, 435, -128, -688, 438, -578, -577, 121, 190, -866, 9, 349, -759, -331, -21, -313, -795, 650, -403, -646, 527, -120, -365, 399, 585, -192, 450, 452, -19, 407, 437, 613, 131, 817, 41, 43, 1135, 776, 257, 388, 669, 8, 521, 587, -93, 494, 462, -169, -91, 582, -587, -303, 66, 90, -591, -153, 191, -815, 72, -58, -320, -525, 273, -340, -930, 635, -185, -655, -238, 498, -254, -216, 413, -199, 310, 82, 68, -226, 388, 46, -486, 363, -105, 60, -190, 34, -492, 42, -102, -751, -155, -107, -724, -680, -129, -852, -769, -269, -713, -630, -720, -498, -1279, -589, -496, -1127, -519, -626, -513, -1009, 85, -548, -742, 55, 25, -70, 78, 738, -488, 282, 547, -137, 323, 407, 676, 37, 699, 299, 446, 797, 613, 413, 193, 774, -325, 362, 414, 165, 42, 155, 113, -63, 526, -228, -57, 66, -389, -388, -219, -356, -573, -85, -374, -547, -326, 31, -523, -791, 341]
1857C41p46j51O17p1n66M98L77q41O39q4j3n33R19n64j61P58n37N4J27L39p47
1878c45M48J72o48O20m77L23l98P57o50K37J57k68O4M3N02o43K97j53j38N58l58
1899A00r6nO17o75J59K65l33j11M37K71j064R53q6m91K94O5l14r9R63r79j6K00
1921E5J24n28J37M66r12M94j73P5J82P5m60J41L60n94L86J82L21m33K55K20p48
1942c75Q53n36K15r6O06l16l29Q18o96N8M13J51o54O09J10p13L49J05J13p36O85
1963F34l46o46Q13m00j66K1M89n64N5M27n1m94M1L19o25P50n37L44J00l71O08
1984D01m43O00m34L5M3J70J71k17l2n2L11l17M5L01n62k4M64P3p98P54n59J45
2006G5PP2k26p51R82p89r8O22m58l84L48M14r83O79l98L62m27L05L13o59N04M
$$ y = [341, -405, -556, 61, -10, -576, -78, 299, -542, 97, 13, 0, -533, 386, -178, -339, 419, -118, -64, 63, 402, -345, 103, 275, -373, 247, -230, 93, -305, 452, -198, 39, 196, -72, -8, 35, 537, -106, 191, 38, -100, 458, 100, 4, -1, 616, -59, 100, 365, 32, -79, 358, 629, -435, 518, 432, -59, 235, 300, -14, -113, 850, -129, -145, 55, 179, -349, -212, 254, -658, -164, -337, -262, -80, -5, -465, -324, 36, -558, -172, 10, 331, -102, 153, 373, -375, 478, -58, 157, 61, 667, 351, 22, 840, 144, 202, 615, 766, 112, 721, 831, 118, 467, 572, 685, -51, 634, 288, -358, 455, 55, -111, -90, 399, -165, -110, 317, 266, -228, -187, 132, -493, 257, -280, 64, 164, -207, 401, -42, 558, 124, 159, 202, 372, 543, 326, 294, 242, 553, 236, 281, 582, 20, -4, 460, 533, -265, 489, -70, 75, 82, 154, -72, -823, 159, -630, -728, -106, -564, -948, -600, -186, -1169, -490, -888, -526, -953, -648, -335, -994, -490, -486]
2028d86j59R4M17m28m5M55j43K80n97O89k5q7L66l82O37o28M74l89L82k33m2J01
2050B51o97Q84n45L25k93N69p18j38O06l11P0l70K54o77P38%n27L15J59j16o8
2071b89L94o9m23K21J9R8j08M25p21O95j65k1o0r8M13K7P1j79O2l91K07j5k05
2094a12O96n60J71J81k8l76M4L0m43O23o21K85L2l9j4N1L57n80N00l86K87k82
2116a84K38mj66N15l56K89j84K60l84L98J09m75N86k16J94k38K1k08J92J71k97
2137B61K23l56O13o32j08J78k45J26k25mk7L3j54J33J52o18L89j43L16n77L63
2158c02k91N1L12j59L2j83O98m20j33M41l23J24OL02n38L66l69J65J66J1L99o01
2180b46M19l44J94j8Q8n8l50M36k43L6j56M75k76m1J32l33J31l53P11k38J18p2
$$ y = [-486, -645, -551, -134, -562, -607, -152, -295, -15, -612, 77, 52, -35, 331, -51, 586, -42, 432, 43, 425, 192, 150, 251, -446, 438, -107, 218, -75, 494, -224, -362, 244, -67, 3, -367, -113, -790, -52, -52, -579, -264, -105, -221, -289, 105, 36, -387, -166, -147, -49, -157, 268, -453, 242, 77, 56, -4, -102, 311, 338, 409, 230, 292, -99, 108, 93, -112, 584, 24, 195, 376, 348, -28, 16, 46, -397, 226, -395, -110, -78, -117, -131, -80, 277, -303, 197, -189, 98, -184, 54, 50, -116, 399, 43, 332, 148, 408, 24, 422, 531, 56, 642, 426, 620, 382, 403, 195, 387, 558, 261, 484, 128, 741, 109, 1, 179, -66, 60, -165, -169, -196, -163, -317, -184, -32, -650, -261, -404, -88, -665, -302, -593, -542, -230, -389, -357, -540, 158, -262, -395, 46, -277, -153, -147, 155, -383, -17, -386, -221, -55, -44, 355, -246, 173, -171, 23, 5, 93, 35, -315, 121, -122, -86, -242, 233, -43, -84, 48, -285, -154, -507, 204, -34, 84, 12]
2202A2o6M04m77M18k13K86q2k0Q5m84Q96r87O02j81J84n90N48k0m97M28Kk19P2
2225A01J32k50l37M11j62K42j71K50n55J19M3l8n5r8N87n25K12l19J35Q6k07K03
2247a96J42p6k2K28k84K66p2J06L59l04K54l77L79l84J61L13q0n5o01O06r8k41
2269B4O1J06O3l56L12m22K96r0p2J2J42K57n03L50m37J35l7L05p1l23M76m31L44
2292A41l89L40j30j54L58j91J4l5O5J31j65L1J65j30n33N39l62N28n09L85M5l65
2314b21L14j60k39J36k87K86j60J92l85K10j86R76n92k47j49L58K61m74L94r66
2334i39J476o47p1QJ8M80P15j270N46j4j59k47R13l45k99j71K54r1l39J20O8K60
2356B66m06K43m80M60k51R4p5J32o0k66M89l92R8J59p7j50K15K00m53K41Lq1j3
$$ y = [12, -54, 350, -127, 291, 78, 364, 282, 262, 347, -137, 759, -228, 374, 193, 377, -213, 335, 315, -182, 246, 248, 29, 101, 233, -17, -354, 57, -105, 137, -34, 216, -339, -220, -177, -215, -270, -368, 219, -306, -94, -413, -278, -192, -399, -196, -54, -130, -152, 76, -208, 58, -14, 92, 451, 147, 401, 24, 403, 19, 180, 493, 413, 358, -243, 363, 265, 24, 85, 191, 254, -102, 210, -212, 84, -6, -78, -66, 76, 333, -170, 180, -257, -122, -159, 146, 75, -248, 228, -203, 141, -248, 92, -38, -192, 166, -25, -11, -46, 19, 150, -15, 16, 181, 51, -482, 57, -305, 223, -286, 99, 144, -221, 93, -67, -306, -170, -457, -171, -331, -139, -524, -314, -500, 476, -116, -363, -512, -154, 107, -367, 27, -939, 537, -110, -181, -173, -155, 325, 1040, -230, 316, 302, 143, -104, 809, 464, 165, -6, 248, 157, -182, -62, 6, 266, -140, 103, -377, 83, -168, -74, -149, -17, -77, -343, 146, -246, -148, 11, -66, -216, -1, 199, -254, -13, -10, -91, -104]
2379a04m7L97l15L72k49Q9j45L56R9m98K61k85J53L5R7l84m6K99l10J54m8K06
2401H7j55j44j15J22j45k06K93m5J07m29M16l73K45J26j70K95m17M70j67K74n4
2422A5K2R0k03K95K7J68j46p7k6K80r5K7N67o10o2l7J76k72J71N5l55N26l32L1
2446B35k32K04j12j30L54l51L3k71N6Q0k3J10m61O39n58L71m16K11K14k06n0j95
2468d98N57l18J53j3M7j31J36J49j22J27k13J11J66L4Q9m49M44m14M45k61M7j93
2490a07J05K25k71J75j76l4JJ16R2j13K5k79M2j31K85P8m0J6q5L7J40q5j81L96
2514B31l46J07J86j38J3p1p8M1J6J83K6l23PL18k91J48k08K35k75r4K43k00L22
2537E2l80N3j46K23j2k97J80J93k39m0K08l9m3q6n7L44l73N40k96J23N1j10L9
$$ y = [-104, -151, 246, -69, 303, 54, 143, -2, 354, 453, -45, 216, -69, 84, 119, 216, -168, -214, 85, -225, -71, -119, 87, -68, -212, -327, -205, -350, -556, -263, -308, -201, -630, -214, -587, -342, -216, -386, -91, -508, -38, -205, 69, 15, 37, 127, -76, 219, 246, 414, 268, 191, 165, 445, 350, 377, 944, 334, 272, 235, 411, 139, 310, 365, 10, 536, 204, 235, 3, 207, 95, -35, 319, -32, 1, -270, -214, -134, -157, -47, -508, 131, -427, -56, -472, -261, -47, -253, -303, -498, 59, -259, -106, -119, -72, -203, -67, 82, -40, 87, -126, -15, 151, 185, 274, -175, 269, -145, 300, 39, 86, -107, -2, 223, -48, 127, -49, -83, -82, 34, 126, 13, 38, -241, -199, -330, -45, 33, -7, 9, -76, -39, 101, 16, -165, 231, -115, -8, 178, 40, 53, -18, -96, -55, -39, 144, 170, -153, -146, 172, -119, 29, -179, 56, -219, -313, -70, -270, 52, -328, -275, -421, -198, -210, -507, -327, -134, -373, -413, -205, -244, -287, -373, -430, -86, -459, 81, -215, -92, -41, -151, -112]
2560a12l11M48l28K70j8K27l12J4L21j37K06j13O8j11L50k97n0O4J22j62m4K34
2582C29r5l80L09j04m9l01O46l66J68j33J68j75R5m7j61K80j88r2q2J65J76l68
2604b05K05l7K51k00P6k99oJ67j57K26l5m0po8L29k79J9k87M06l73L31J84L6j63
2628G4l01M10k74ql8L05j42j8K06l86J35J75j60l2J80K0j97K62m53L94j74M28
2650D06m44P4j6j31J73m69J67j19K21j22J16J38k20R7r1N09n87K51n9l6J92q3
2672c3J46j31K39k84L34k20l1j24K03P5r4r4K03p7k07L3J11n2J82n52L62J53k46
2695a04J11k94L39k15K07k57o4J66j50J24k03M41m30j1J95l82L05j4J37k00K92
2716gn1O3l17L38K66n14M47k31K11l19M38k43N3l4O1J60r5k62j5N06k82k92L29
$$ y = [-112, -423, 25, -303, -33, -51, 176, -136, -122, 199, 62, 268, 155, 223, 112, 462, 165, 115, 179, 301, 139, 95, 329, 234, -146, 163, 59, 10, -291, 355, -11, 157, 24, 192, 17, 112, 65, -96, 184, -4, -96, -178, -13, 163, -205, 0, -37, 214, 14, 90, -209, -215, -48, -205, 21, -14, -54, -61, -129, 200, -79, -60, -347, 59, -314, 17, 201, 237, 74, -227, 183, -91, -99, -137, 168, 26, 8, 214, -172, -37, 138, -22, -54, 126, 146, -51, 211, -242, 152, -22, 406, -38, 36, 20, -111, 62, -407, -240, -359, -138, -260, -144, -6, -226, -129, -220, 289, -298, -47, -106, -142, 50, -33, 113, -18, 221, -63, 271, 51, 20, -104, 99, 174, 80, -14, 189, 112, -95, -62, 49, -3, 179, -373, -11, 142, -104, 7, -287, 52, -163, 44, -213, -277, -111, -261, -137, -340, 101, -329, -340, -145, -527, -222, -236, -99, -299, -7, -58, 5, -312, 26, 292, -222, 225, -6, 205, -114, 324, 81, 134, 100, 161, 321, 226, -36, -51, 455, 173, -119, 210]
2739B10l6L04k79%k12J93r1M0j57J1J51j58qj52K47j50j7O9k24J49j27O8J55j91
2763b05K08n5L44l78K06l91K99j48O6R1L08k04j87K60k31K09l80M13l22m3M50
2784C10m34J73K05l73rJ29J37j81K8q0K17k36k1L2j02J48j82J34o0P9p3j83L68
2807B6q6J77O3j14k15m1%K53j64K88q8J76k12Q8K57n1l14J89K6l52M19l25q2K09
2831A27J49k52k4J3J22j63P8q4k81M45m78J48m2K23o09M99k05K07k18j44K48j56
2853c97P6J71P5k44J66l6J16O0q0o4J36J1R5J9J54l17N14k29q1J26j03k9j47K43
2877B35k17p0M23j03km71L83l14P7J13m4JN0k07j74L90j25M8j87L8L10n9k05j56
2901b66K0L70l18J34P5j36Q1J9j3o3J00k68K95Q8k19l88O60o4q0k59P6L13q7R0
$$ y = [210, 174, 478, 199, 199, -13, 180, 89, 129, -28, -17, 134, -24, -32, -184, 63, -87, -104, -35, -259, -110, -237, -169, -14, -205, 3, -52, 292, -86, 120, -271, 28, -120, -54, 37, 345, 141, -46, 214, -17, 192, -188, 225, -97, -140, 310, -124, 49, 254, -119, -128, 1, 138, -43, -15, -95, 122, -114, -135, -103, -205, -57, -239, -105, -165, -86, -159, -342, 26, -60, 117, 180, 66, -149, -190, -190, 63, -101, 187, 99, 275, 63, 151, 408, 357, 43, 232, 258, -94, 325, 0, -82, 127, 276, 24, 0, 13, 135, -28, 50, -34, -315, 130, -348, -200, -242, -19, -628, -129, -334, -127, -345, -489, -241, -397, -321, -150, -75, -319, -153, -189, -73, -13, -93, -157, -21, -10, 85, 104, 258, -59, 455, 226, 145, 271, 168, 139, -8, 235, 18, -52, 371, 268, 266, -205, 178, -136, -59, 54, 10, 11, 61, -146, -320, 70, -55, -7, -194, -156, 154, 95, -110, -266, -246, 124, -194, -60, 15, -121, -40, -21, -34, -97, 3, -265, 30, 118, -101, -489, 171, 107, 27, -232, -156, 157, 70, 160]
2925A60l43L18j58M6j70K09o9N5J02o0o3Q2j1j51k3K53lk92PK29l48m0L96l8l4
2950E4r6J63p1K3R1j37q1Q5j29J65J47l15L70j84j13J59m9j58K66m4M6q7j60P
2974d8K26k35L99o60M87j16j8m4J77n5j19K49n87M65k05q5k76L87K01m26K05j35
2996b13p6jM79M8k30j73l66M92K20k11k20J07L84n36K81k68K78k01J81OK07j12
3018G6o5r4J25L17m79K64m5j42j0J83k07K20Q9m76J86L67k65o9Q3o2L1N5J36l15
3042i7K09L8k44O8N9j35j7J03J29l34N22j24l56L17j34j89q0K42O5j87L48j89
3064A4mj37L26l79L88l9k64J8N10n45K26L20L28q22L99M39n02m31J61J15k44K99
3086A76m92L39j30J39j67Pn8J88k2j4l38L16L12j88J08r2m67K81J76j48l10K75
$$ y = [160, -183, 135, -23, 23, -147, 62, -7, 48, 150, 90, 27, 109, 98, -53, -76, 177, 174, -118, -111, 118, -230, -270, 126, 88, 54, -42, 121, 50, 73, 164, 27, -54, 31, -98, 67, 214, -101, 269, 85, -28, 131, 82, -76, 190, 146, 192, 105, -55, -48, 178, -57, 342, -318, 169, 53, 35, -9, 168, 113, -6, 243, -344, 121, -84, -169, -445, -58, 143, -283, -78, -213, -289, -290, 189, 237, 7, -166, -532, -40, 180, -31, -251, -144, 240, -296, -15, -283, -5, -206, -25, -19, 188, 76, 11, -83, 42, 359, -120, 144, 99, -43, -53, 130, -77, 143, 232, -244, -58, 309, 44, -25, 58, -4, 27, 82, 218, -97, 112, 150, -94, -26, 33, -102, -119, -16, 113, -221, 301, 177, -179, 138, 4, -185, -265, -23, 42, -145, 203, 14, 10, -127, 199, -180, 208, 169, -95, -77, 433, -112, 114, 434, 762, -60, 339, 778, 276, -155, 6, 121, -123, 176, -316, 23, -107, 32, -135, -128, -186, 2, -20, -34, -372, -56, 256, 68, 176, 84, -383, -102, 74, -74, -384, -109]
3108a09j99m31J446o89l09J039M24r38k7J07k13M68k21j11m2j51o2L06k13L7K77
3129C89q8k1m98K77O9j01j56J65j33O4N3j69K5nQj73L5K07k73J48J3j28j09K98
3153a03Q7k07K38m43K77rM81m99j90O57m89L69l98K94l8J96qj76Q5j18R6l5J29
3176A96k5k87M44k59J90l03L3J66l8k33J37N1K9j32j3J69m11K22N6j05K24j86
3198g5p0N5L0j14N4K73R0j90k8L41p00P21j99k25Q7p7k4K23j44j9K21k63R1m1
3222A7j56K28j08L2J45l57kQ8J86lr6j49R5n1K99k53N7j72j04L30N2j13K1j00
3246a14K21m33O55l27P4j40Q8qK80k0m23L86R5p2m08K15p2J17J81m04L0J00J33
3269A54n9K54k81kr4r3k4K87r4k6j58K43k05k8J82j49j35p9J30J21j32J04j43
$$ y = [-109, -308, -739, 707, 18, -291, 748, 1172, 234, 207, 314, 101, 569, 348, 237, 195, 44, -18, 288, 75, 112, 389, 301, 280, -218, 59, 128, 27, -129, 36, -97, -33, 20, -149, -124, -129, -121, -294, -259, -52, -325, -177, -164, -292, -401, -103, -16, -223, 15, -428, -151, -160, 321, -178, -368, 289, -200, 169, -229, 65, 27, 223, 215, 39, 124, 6, 102, 67, 196, 171, -116, 328, 69, 259, -44, -11, 155, 117, -116, 21, 72, 101, -31, -44, 125, -286, -64, -8, -113, 111, -75, -145, -90, -60, -174, -120, 153, 243, 53, 25, 366, -334, 387, 188, -37, 50, -27, -51, 172, 28, 9, 230, -33, 58, 17, -139, 89, -19, 13, 158, -199, -201, -113, 73, 70, -26, -175, -80, -131, 168, -85, -28, -200, -304, 26, 78, -35, -14, -114, 107, -326, 329, 2, 76, -64, 24, 16, 296, 276, -147, 239, 334, 262, -146, 69, -3, 114, 295, -109, -79, 21, 154, 95, 349, 68, 66, -28, -121, -145, 142, 48, 22, -136, 107, -98, -126, 56, -93, -228, -307, -177, -56, -188, -84, -227]
3292b27LM90m35j10L07J17j56nR1j73K3K9K57O1k67P9j38j02R1O9j8K55l20QJ31
3317F0n8J06Kk04M3J8q1l23L10O1k6O0J23j08JJ11k43L68l37J69l88M73k07l94
3341d64O12l91J06o2J98P6K62m11J78kl36RQ7M15l40Q6MJ07kk05qJ37J35J75l85
3366a9j63L24J7j53K24j78l1l3j79J62J65K2l42M02l94L4J36M7M1k91R2P1k96
3389c42J36J31k70L20%m01N11j79j73o7N05j87r7R9l99M19l9N37n61L7J18j34
3411c6O7J74j56R1J05j9p3K05l14J21k93M05q0R3j20l29K58O7o8j22L34k15p3
3434B2J58l07J52p4M3j45O1J9L0K7l9J68j11K90p6m24K12k7p7p2K00k0p5J70j49
3459d4J23P8j98l45N91kQM0j46Rj65L09l43J33p8l03L81j21J0N5J54j01q4L57
$$ y = [-227, -224, 266, -169, -279, 28, 145, -11, -16, 75, -98, -75, -46, 211, 272, 5, 84, -54, -156, -65, 4, -14, 241, -79, -71, 60, 2, 108, 110, -94, -51, -33, -114, -437, -127, -66, -92, -32, 91, -17, -16, 95, -148, 220, -117, 52, -336, 137, -70, -464, 148, -243, -137, -199, -1, 75, 337, -74, 104, 102, -234, -225, -138, 277, -63, 23, 27, 134, 132, -73, -81, 56, 191, 366, -19, -182, 142, 159, 6, 230, 52, 21, -12, -191, -29, 136, 158, -184, 218, -176, -142, -6, 41, 82, -209, -117, -46, -342, -206, -75, -345, -25, -25, -426, 85, -94, -267, -334, 171, -16, -113, -14, -413, 6, -33, 504, -57, -20, 98, -36, 31, 205, 49, 140, 245, 226, 153, 358, 44, 165, -128, 277, 197, 290, 170, -159, 99, 166, 98, -24, 310, 95, 22, 180, -127, 25, -49, -6, -151, -90, -71, -41, -14, -53, 115, 4, 294, 218, -206, 6, -21, -98, -170, 30, 10, -65, 105, -44, 79, 157, -41, -386, 205, 203, 211, 251, 105, 114, -51, 258, -85, 48, -30, -333, 48, -73, -63, -8, 146, 45, -39, 318]
3483C18m82J7K91J6k61N3J25n60L65L12l45P5J92j65mP7J39k76J07K27m93N4N99
3506C81m74k62M53L3l27L46k90K9J45Nj07J43j14k14n6K50J43l02J25j34K94l
3528F4k81lJ66K03o81N75j25j54J1K04j42J23L13m31J28Q9q8k73M20o6n21L17
3550a52M68j87qL0q6o2K48l60J29J22Pl06L35J25k71K65k10pR8m02Q1K39Qk27
3574a23NJ59q6pk5j2J01J41p1K4k42J48j6k95K19P3MJ80k68l17N47k4m18M73j92
3599b2k74L28J46j86k97L42K3n6J76j65K6L2J35j40N9L6j92R7K6k32n6K68j7J56
3623B13o3q1j1J17p0l23L64J04n8n31L95k7j59O4J46J55K6J26p48M48pj43K37
3646A74L99o95K17L61p81R20n28j46j6L13n04%K86JJ19k91N16m44Q8P2Q5j96K36
$$ y = [318, -164, -147, 144, 160, -101, -48, 77, -483, -118, 194, -151, -76, 116, -49, -53, 24, 163, -113, -6, 221, -272, -218, 381, -93, -355, 98, 131, -196, 150, -140, -111, 34, 39, -68, 75, -39, -253, -309, -59, 84, -218, -93, -227, 67, 64, -217, -220, -54, 149, -532, 43, -82, -236, -225, -21, -163, -40, 273, -158, -30, 59, -29, -302, 118, 52, -469, -152, 316, 129, 121, 151, 65, 3, 251, -109, 20, 142, 149, -157, 178, 303, 32, 297, 87, 80, 178, -224, -143, 96, 104, -123, -118, 41, -45, -52, -77, -89, 12, 153, 82, 106, -136, 12, -4, -299, -80, -7, -3, 177, -91, -408, 139, 115, -303, 170, -22, -296, 32, 178, -8, -305, 37, 60, 4, 180, 15, 41, 73, 208, 68, 127, 163, -29, 68, 94, -138, -194, 74, 57, 213, 150, 69, 58, 175, 105, -218, 146, 250, 192, -339, 56, 29, -130, -66, 80, 235, 261, 387, -361, 87, 80, -63, 174, 573, -122, 95, 456, -325, 595, 67, -79, -95, 218, -286, -286, 0, 1, 120, -171, 345, -99, -11, 61, 146, -50, 186]
3669A86l14PJ3J4R4j74J30R9J8K5o0K59j45m10K77N6m0j81N05k64j17J3R5l42
3693b56L69L3l34n0O09l75l17N72j48j30Q4J02p2r1K47l90K02J06J4m26M43l7
3715A55l76J38Q0l29O05j35l05K86j00J51m13L73J5j59p5N2M4J18k99J70P5j35
3737f4q5r6K81m3L7L04m79J89q8K31k86R2j34j18L70J29l81K26J19L2l60J73l99
3760c50L55O0r1j36J29J36m49J03L86O0l82L00j10k1k6k0j11J27P9l66K45l9M9
3783g2J38K51q8l68K83j78J40J85k38j51K15M3k91J45R2k52Q9L47l77o9N30n11
3805a37p6P6L03j82j09J26R0j67K37k33J44J30k02r3K34j20k09K17o2j68r1M73
3827A81k65J30p0j98L05J66m95K33p4j02K3K34k13J50j0Q6l9J14j31j30rJ17k8
$$ y = [186, -128, -121, -108, -94, 0, -174, -44, 55, 73, 98, 38, 297, 152, -258, 19, 75, 35, -146, 359, 95, -22, -9, 86, -256, 113, 146, -188, -238, 371, -4, -321, 251, 103, -27, 57, 159, 87, -4, 243, -147, 55, 161, 175, -251, 192, 155, -221, -83, -3, -332, 273, 138, -167, 119, 19, 170, -243, 130, 145, -14, -89, -37, 7, 125, -174, -4, 71, -64, -149, -245, 36, -7, 30, 334, -145, 44, -44, 187, -99, -7, -141, -259, 111, 240, -141, 85, 204, 236, -124, 49, -350, 5, 65, -26, -162, -33, 103, -346, -243, 143, 203, -179, 121, 11, -10, -36, -56, -167, -40, 39, -327, -82, -121, -72, 66, 317, 229, -139, 144, -34, 106, 291, 53, -98, 117, 160, -131, 14, 106, -146, -57, 290, -87, -156, 374, -137, -213, -137, 166, -16, -125, 1, 91, -76, 161, -72, 72, 202, 0, -93, 141, 21, -188, 29, -33, -201, -292, 181, -84, 46, -24, -222, 83, 249, -246, -13, -87, -189, -166, 68, -145, 5, -5, 81, 42, 156, 25, -105, -114, 3, -25]
3850b5M4P6j26J18j66m2j61K32L81k03l8r2j52j6L76l35J22K01j08j72L31l1k52
3873c8j04L95k66l6K64k75j26J24J86j28L14m14j52L11J06k72K50o1j37O2n8J86
3895A31l17J87J65l79J01J50j46K57J3k20J18k8k71L60j55J36j07L20k78l77K98
3916d2K23l43K28p2Nk7J2K04m37L09k54o7L68J57p08O21j8l34L48k29k13P35m00
3939F6j64l3K88k19P1L72n09J75K55Ml69K64j44M7m4M6l79L10K76l16j76K61j18
3962c6P2J09j33Q3O6o8k24r9K79l14Q7L63q3j64J55q6J20l52o0K36Q2p0J95j78
3986b0J64j72j20K96j95K8k8M5l6K58j58j58J22K63l40k81M74j83K85k81o9k4
4008a30M3L06k15N5J18j91J8M4l4j27K75R0j74r6Jp9K91j62o6K82l11K35l01J86
$$ y = [-25, 19, 95, -31, 87, -79, -121, -282, -50, 331, 128, 90, -2, -154, -170, 206, -129, -7, 194, 86, -86, 245, 214, -38, -142, 253, -13, -49, 215, -60, -186, -62, 124, -4, 310, -104, -256, 55, 161, -111, 139, 78, -59, 3, -55, 131, -186, 1, 166, -213, -112, 38, -108, 149, 162, -58, 60, 32, -239, 121, -34, 102, -5, 315, 37, -340, -42, 181, -162, 66, -6, -1, -28, -16, 188, -249, 60, -194, -261, 107, 264, -444, 177, 159, -175, 173, -56, -269, 466, 66, -98, -131, 157, -62, 9, 381, -128, 47, 302, 306, -63, 201, 57, 104, 60, 106, -273, 37, 313, -3, -179, 82, -36, 36, 145, 12, 95, 161, 93, -131, -230, 49, -265, -178, 185, 102, -62, 93, 7, 127, -225, -285, -49, 33, -37, 158, -20, 144, -28, -148, 148, -47, -19, -47, -2, -38, 220, 62, -96, 26, 289, -51, -332, 142, -41, 244, -37, -106, -130, -87, 219, 4, 59, 177, -14, 4, 48, 14, -113, 162, 252, 78, -18, -17, -96, 195, 33, -33, 249, -62, 173, -128, 58]
4032E8r9o9k0PL49k42L07j53r5p8m3K16j71k56K59j45n7Q1K65k32J97pq1oM1J68
4058A94m39M62j55n00O81l78K05k49L40l56J25K35k71K07j27N3K5J3k4j03J03
4079D1Q6q8l61L83j9k3J29k63o0M36k65K58k71oo5l3N35m33l7L0J5j0j32K78k34
4104a09L31j37q2m5J32q4o6L38k78M1K9k31jJ09O9k03J96j78K42q0J64j59k17
4127b19K48k8j62K04r0k7L40k58k23L89j43k99K58K03k31r1J48K6k38M43l25j54
4149b29K14N7l24R9L03k05K08k97J59j45L19k74R3L43k65k00K35K75m89J06J21
4170A04o6J55k52j5pL98o48L22M0qj28J48J00Oj18n0J82l44Q5O2j19J81o0j25
4194a57M53j67k87L7J36r3l0J04k58L13K7m59M70p8Q3rk37J94k64K31J6l50L52
$$ y = [58, -41, -110, -130, -123, 226, -16, 291, 138, 43, -35, -78, 138, -33, -289, -30, -175, -232, -151, 114, -118, 79, 72, -9, -15, 26, 194, -245, 217, 62, -438, 243, -135, 70, -179, 161, -195, -70, 165, -106, 101, -26, 27, 52, 65, 41, -62, 41, 127, 39, -322, 61, 42, 19, 148, -115, -175, 261, -4, 254, -17, -23, -88, -121, 414, -19, -56, -26, -11, -21, -153, 125, -109, 222, 85, 3, -42, 90, 6, -60, 278, 0, 41, 70, -161, -162, -53, 16, -187, 9, -169, 73, -7, 157, -2, -219, 29, 1, -161, 43, -47, -74, 266, 8, -215, 174, 31, -268, -10, 193, -38, -129, 19, 45, -193, 250, -75, -229, -15, 42, -282, -183, 120, -85, 123, -174, -15, -160, 159, -115, -22, 321, 56, -144, 91, 366, -123, -17, 104, 38, 193, -59, -74, -81, 317, -331, -9, 31, 23, -105, 43, 143, 149, 31, -19, 163, -181, -96, -34, -153, 28, -32, -157, 296, 129, -158, -121, 15, -78, -108, -4, -262, 51, 78, -381, 89, 11, 94, 85, -152, 42, -222, 9, 25, -325, 27]
4217B7p3R1l9K87m98j7K98Nj21L1lk72N61k24r0J4L30k35N3j57Q7j29N5j32J78
4242B7j0Q9Q3O5j20m63J03L31j3p9R9j19M05l28l55L50n1J2l47M05R2j56k6R0
4266H4m7Q9M8j00p4j77L02j75o5K37k23J49R0k00m6mK5Q8k8N5n0K01k93o9J39
4291d4J84n6O3l58K17p5J37j35j50L53l77M29j10j0J3m0j33K66j80J61M4j54J8
4314F3q0q1J3rk9J59J50k96K44j50O3j2J86j49l85M32R9l24j7%r6J98k9k73O09
4339B86k83j77K11k62K14k8J94l8j34j66J49k3K3Pk43P9K56rj59J19Oo7M28n00
4363a17J9J02k95L12J81j99k28J40L39j53k17J91j88J13L1l62M69l9j96p6L01
4384A28p2l98K87%K92k85M05n34J25N3j52K03N4J18m59K44j55j30L17p6J10j41
$$ y = [27, -46, 45, 6, 293, -205, -222, 76, 81, -40, -9, -12, -284, 277, 53, -37, -23, 307, 72, 125, -32, 55, -74, -19, -151, 27, 17, 106, 189, 254, 134, -329, -226, 105, 92, 13, 112, -7, 398, 70, -285, 65, 14, 26, -321, 84, 176, 20, -6, 84, 37, 126, 174, 74, 0, -177, 125, -50, -115, 122, -101, 48, 138, -62, -108, -112, -87, 1, -27, 28, -22, 179, -114, -183, -44, 140, 84, 147, -211, 6, -69, 68, -67, -217, 136, -241, 188, 78, 68, 81, 41, -92, 174, -6, 155, 199, 45, 63, -17, -98, -85, -94, -123, 36, 186, -110, 134, -16, 47, 35, 221, 72, -313, 119, 218, -106, -123, -123, -219, -21, -50, -323, 286, 3, -174, 37, -225, -11, -39, 155, 117, -17, -183, -34, -57, -34, -27, -270, -191, 65, 56, -103, 16, 22, -45, 383, -117, -98, 4, -291, 21, 202, 3, -225, -85, 254, 101, -116, 75, -113, 0, 31, -331, 138, 99, -97, -173, 128, 56, -342, -55, -55, 237, -48, 357, -177, -52, 1, -151, 52, 106, 224, -235, 9, -146, -276, 41, -35, 75, -66]
4406f6J69j06k7L19l29J3L06ql37J11q6J79q6L2j08J03Ro3J16P6j99q5R1J4o3
4431b5J8J56l45K76K5k17J80o3r7j7m6K43j61J81l30L83k18L6Mj51L19l30j6L86
4455A91l6j05J90k53jM55l26k58K55j10j40j3N31l59j48J34lJ85j93j4J35j06
4477A1o4q9M5K73O4j71L2j45N3o7R1%k03K8J56J68j59j10n6J75J0q1K82k29o9
4502e5J26p1kn2K35l92M63m42J96J55K0j04l2O8O2q5L40p18N03l09K50k16K92
4525B32j81%j60n4J06P3k34J21J55J57j81n2n3N8n2k1J12K45l76L63m61R4J42
4548C3n5OJ2K74m85K43j03M4J40J8k14K43k28j74J01L94k36k47K74J15m25K97
4570B7M31l45n0Q1k98J2Q8j15L0K24K68l72k84L02r1K26j8j74k12P0k11L30J80
$$ y = [-66, 103, -3, -30, 289, -40, -27, 279, 271, -66, 45, -41, 138, 52, 84, -24, 79, 88, 25, 141, 217, 18, -67, 24, 38, -25, -7, 149, -196, 80, 105, -112, 68, 5, -92, -109, -155, 88, -73, 108, -222, 161, -57, -21, -17, -168, 151, -179, -195, 191, 155, 50, 240, -13, -14, 441, 115, -143, 112, 2, -138, -151, 380, 21, -127, 7, 4, 189, -4, -18, 117, 11, -53, -142, -97, 176, 240, 69, 101, -44, 9, -58, 33, 33, -170, -142, 14, 182, 23, -87, -143, 32, 42, -39, 243, 14, -55, 71, 0, -2, -54, 181, -211, 252, -190, 6, 161, 181, 77, 45, 113, 175, 90, 430, -288, 215, -94, 156, -60, 232, 51, 51, -109, -163, -57, 16, -218, -97, 58, 215, 34, -18, -71, -13, -65, -86, 26, 271, -105, 258, -203, -109, 33, -22, -16, -4, 270, -215, 28, -75, -31, 109, 127, -87, 156, -72, -246, -145, 249, 13, -234, 40, 155, -270, 27, 458, 113, 63, 144, -154, -142, -54, -169, -139, 85, 353, -19, -303, -1, -92, 134, 116, -58, -270, -200, -411, -81, 99]
4593I9l96J4K38m7K10Qk67Q4j23J43J95j3K41l38j96K52l16K74k2M3j82K22K2
4616A45j80J82J9k1K1j4k64Q3q0j05K64J94k26j34K85j36j13J12J47k2l73M93
4638B77k97R7N2p8K4J46k27l0K49k58p2J18J27L2j75J61j15p4J99k48J80J3j85
4661h4J86j73M8J36j42j29P9L95l10j9o6J96k64R4J88l76J00K71K36l31K56k92
4683aj11m2jj29L25J18j0l76K00n9K12q5J48k26N7J01j19K0J42l91L1K66k16J68
4707B2j52O5o7J79k20J00L81m44J26j25J85j01O5K5j35K60p5o8k62M06J23l94
4729a06J1J62k34J06o9J84l17J64k07J77J38l4j18l5M18k85r3K02j38j21J57j67
4751b05J70J10o0k9R3j99J57lR3j75q1J28L07k11j60j5l7K95j77J3P7k60J76Q5
$$ y = [99, -297, -283, -45, -92, 118, 126, -141, -57, -180, -37, 158, 145, 386, 48, -148, 104, -212, 62, 40, 83, -99, 123, 145, -35, 147, 166, 145, 166, 152, -112, -29, -109, -214, 50, 244, 18, -116, 169, 33, -80, 32, 179, 157, -216, 277, -20, 77, 129, 51, 75, 221, -6, -36, 213, -45, -117, 1, 128, 160, -15, 146, 31, -43, 156, -92, 88, 101, -84, 102, -71, -23, 113, -29, -158, -79, 316, 6, -13, -79, 117, -147, -53, 135, -241, -141, 130, 366, 35, 291, -1, -112, -154, -155, -284, 41, 159, 149, -227, -27, -86, 126, 41, 189, -37, 20, 121, 2, 22, 164, -227, -196, 70, -146, 22, -130, -65, -132, 47, -173, -73, 308, -136, -10, -135, 50, -51, 14, 39, -96, 164, 89, 21, -241, 165, 288, -106, -95, 67, -167, -61, -130, 54, -263, -99, -306, -129, 9, -25, -143, -178, 240, -45, -138, 64, -74, -195, -38, -205, -35, 75, 15, -14, 79, -120, 37, 34, 127, -48, -129, -1, 306, 95, -65, -80, -117, 178, 1, 14, 91, -169, 7, 92]
4775I2j60N6j9n9pJ65R7m7j09j00J66p0j22P6J7o3J76m47J81K30m9j67K77Mpj39
4801b8O4j56nk4R0M2O5J3Q4M8j21j18j79L48q1k23K87K32j82k67j64J96L2o8J5
4826a00J72j99L9m0J93j58K24j88K01j87J50k60J70R9J1j24J1K06l28K99k78J6
4848g1K82k56j18J6L02j76k77K67n1L29k01J79k84j73L13k58L60q9j36K59k08
4869IK58k43J4m0j42k2J63P4M5Ql09J33J82j50Q5Q5J0k10K8q9J55K01l19K87l43
4894a30L82q8l55J68lr2K84j01K68l11j60L20J1k97J7Q6O6j76m4J46l5K0J59j11
4918B4n5J34J36k48k7r2JN7p0J11J88k25OJ88j38k36L18j27J12K93j89K1j62K02
4942B22p9k26K21j34J68j46M4j18j4J21m7M2J80k66j78K61L1j07J65l00o3L23
$$ y = [92, -68, -12, -31, -90, -97, 68, 165, 118, 9, -91, 75, 5, -117, -41, -24, -87, 89, -358, -177, 53, 4, -163, 114, 118, 111, -28, 36, -120, -125, -149, -59, -17, 48, 61, 145, 193, 72, -46, -225, 123, 42, -181, 106, 338, 156, -111, -275, -79, -47, -115, -100, 72, -127, -88, -128, 65, -93, 131, -57, 144, -43, 107, -153, 17, 116, 127, 3, 14, 220, -108, 191, -87, -71, 211, -45, -163, -147, 155, -21, -298, -31, -82, 247, 46, 225, -59, -232, 81, -177, 183, 94, -42, 217, 9, 267, 24, 38, -2, -144, -166, -3, 71, 116, 124, -185, -52, 130, -20, 65, 150, 160, -50, -22, -111, 44, 245, -74, 213, -130, 252, 164, -191, -23, -26, -118, 166, 65, 333, 22, -138, 182, 193, -104, -87, -1, 65, -111, -155, -9, -44, -24, 135, 24, -31, 103, 239, -9, -36, -128, -127, -70, -140, -29, 159, -66, -60, 128, -10, -246, 72, -55, 57, 350, 161, 182, 20, 222, 143, -83, 138, 4, 172, 26, 70, -48, -62, 59, 12, 54, 234, -32, -210, 51, 82, -25, 140, -160, -223, 100]
4964A00O6Pl93K01K11n8k15l6j05L09o2n0j16M69k41k6L1K10k03j51LK06j5O1
4988B03l03p0L19j49l1N0j52L4n5J88p2R4k32K93k16J42k0K77m4j67j67J38j40
5011h0Q0q0m8J25P6P2l14K51l10L15K11j50j51p0K03k07J30j68L9k23J76L66l54
5034a11J44j70P8j55P5K8j31M73m67J63Q8J68k10Q7J4j12j03L2K14j86O3k62N90
5057C10k56J64k44QR8J05n2J39k90Q7j60L8M76m13k17P1L40l06j33L78k19K20
5079A44k36Q9k83K89Q9k01K66j58Pj82J15R2j78J69K08l09n2m1q2K97J57l35q1
5102b16J45J91j79Q5K19k24J38r2p2L4j60K58j07J74k01J54r0k76L54m6l6m16
5124c63L15o0J79j65J22J18k96K68k44q2J42P9l00N47k73J5J02p7mj36K22Q5m32
$$ y = [100, 166, 173, -220, -19, 192, 134, -81, -117, -222, 87, 25, -25, -141, 328, 87, 61, 92, 302, 99, -52, -49, 157, 142, 203, -100, -170, 149, 0, -31, 19, -133, -99, -154, 34, -38, 56, -176, 117, -99, 43, 23, 300, 256, 89, -78, 60, -80, 0, -80, -128, -3, 73, 145, -169, 82, -228, 87, 298, 148, -3, -73, 130, -77, 53, -115, -76, -299, -123, 243, -111, 33, -137, -59, -214, -139, -111, -242, 231, -236, -73, 15, 183, -27, 60, 74, -38, -141, -109, 105, -81, -18, -280, 310, 54, 218, -26, -18, 80, 185, 133, 272, -18, 69, -91, -53, 423, 10, -207, -136, 204, -102, -235, 143, -76, 144, -92, -3, -286, 3, 92, -109, 157, -1, 6, -176, -61, 31, -147, 22, 230, -79, -131, -172, -254, 43, 200, -135, -216, -71, 120, -59, 26, 245, 21, 159, 67, -5, 29, -131, 127, 20, 194, -7, 147, 57, -219, 135, 89, 53, -363, -48, -108, 71, -94, 28, 146, -150, 118, -126, -208, -66, 13, -287, 260, -13, 2, 104, 27, 23, -113, 109, 194, -238]
5147b38J11J12J34m1r5l8J53j41j6oK52l7o5mJ00k39J86j82j43J56P7k13J80j99
5171a96J7j2J78M5R3j97K92j93M4r7Q5q7J6J35k17J8j76N5M16k88n3P5k33L68
5195H8J37j73k56K08J28k53L51m04L53m63N16m50J25K14j12j6K6K9Kp9MK11k01
5218a5q5J21N0k60L31k60J30L0j89L04k0j06j02k9K64k1j18r3J19M4k12n5K76
5241A04j6k24Q2J3NJ44J1K0k51o7K48N5j88q2J4J98M9j34J66k14J26j64J44N6
5265I5Rj95J78p1k19R7J11kP8r9J03j71L3J15M9l26L86j8L4L4j59k36o3M43k56
5290e0J23k6m0q6qK62k44L5L8n8p3k24K14J34n4m3J73l9O6K4K6k17K55k97J0J06
5316Gk6M2L8J4K9K6j63K32j18q7Q7r8k6k18L46l53K71m0n4K44pj08j36j70J93
$$ y = [-238, -127, -15, 119, 78, -17, -55, 98, -43, -59, -65, 187, 150, 85, 81, 181, -58, 128, -54, -197, -41, 36, -177, 3, -196, -179, -191, -13, 32, 125, -72, 220, 27, 71, -26, 59, -28, -12, 123, -94, -76, -252, -197, 219, -69, -122, -47, -280, 88, 225, 52, -204, 4, 132, -121, 230, -174, 179, -284, 232, -218, -93, 121, 9, -7, 19, 48, 50, -29, -25, 186, -15, -100, 21, 71, -189, 142, -118, 12, 42, -147, 157, 137, 31, -71, -100, 164, 143, 25, -68, 51, 95, -117, -172, 104, 88, -136, -54, -41, -36, 108, 119, 139, -112, -179, 69, 124, -64, -146, -132, 66, 115, -19, 147, -67, 59, -105, 39, 95, 104, -91, 87, 16, -203, -106, 5, 3, 81, -18, 85, -86, -53, 62, 111, -215, 171, 153, 187, 221, 62, -174, -237, 206, -50, 73, 47, 7, -79, -87, 175, -69, -34, 4, -54, -127, -351, -137, -3, -57, -100, 73, 34, 100, 124, 150, -67, 188, -109, -99, 7, -19, 23, 61, 75, 104, 130, -33, 199, 81, -6, 81, -17, -43, -261, 85, -268, 3, -37, -91, 153, 146, 38, -98, -268, -75]
5341g5k0j19J74k3J46k62j4K85k49K4J52k18J79J93k63L89l21M2K21k95J3l1L3
5364c9N0M0K05l68MN5M8q7O0J60q2k00J33k4K32l80L20q2O3J25k85j55N6N3P6
5389b2j23J80J59k19o5K74j87j15K78m8j51J25k68J88K27l99O3j13M96l42q4k47
5411c93N09j23Q0j77Q2J87J1j60M5Q9l51L10j64RJ47n5L2o8J51l51K20M3j61J73
5435H5l32N59j10k93J9LO4J90q1k21N7J51j76KJ60p6j05M57n07L93k79j21K29
5458F8mL9k00J6N07n51K52k49n42P05N6L04o76M84k69m53J447j373O9K73K37j94
5480e4K03N2j88J88k73mj8m7K78R1k46k6p2O8k22J56K43ol35J09J0J1K20l21M96
5505C13l10K35j52k17jR5j9R9J19m55J39K02k7Q1J81k05k18K69N7j24K28m30J25
$$ y = [-75, -95, -214, -40, -63, 83, -179, -193, 92, -157, -133, 19, -199, -20, 173, -90, 299, -22, 20, 241, -54, -41, -72, -39, 11, 51, 256, -112, -108, -53, -5, -92, -32, 128, 46, -154, -21, -45, 187, -193, 127, 45, 108, 233, -52, -207, -151, -98, -22, -145, 35, 194, -25, -90, 184, -3, -118, 160, 112, -39, 86, -182, 6, 233, -166, -103, -216, 280, -62, -146, -393, 116, -7, 73, -104, -22, 165, 176, 16, 61, 150, -201, 109, -55, -46, 101, 46, 78, 10, 161, -190, 30, 73, -88, 85, -247, 312, 202, -91, -72, -69, -5, 185, 104, -117, -60, 91, -85, -83, 77, 1, -104, 353, -154, 239, -40, -161, 68, 64, 103, -97, -81, 426, -125, 127, -122, -664, 41, 97, 401, -275, 209, -60, -513, 934, -439, -370, -97, 140, -54, 149, 201, 13, 201, -72, -76, -94, -141, 137, 228, -18, -44, -116, -48, -270, -114, 129, 123, -212, -103, -93, -82, 138, -183, 313, 3, 238, 86, -131, -132, -37, -56, 43, 162, -293, -154, 48, 21, 102, 283, 78, -140, 129, 186, 62, 290, -140, -15]
5528a5j91J99j52J7J37j18m1K58N8j89o8J07J04k39Q5N0J47j1l5K1o2j07j98M84
5552B41k48L2k1j79K30k24L46m58K97j14j30J35J57j62j30L91M5j07k01K5L51
5573B76q9j60n3J6%r8k25L01k2J02j67M9j72J78J38l1J51k93O3O3J38k97J71R2
5597A31j75M1J15p4j85q2K28rK8K17k89N9O9k16K73j99J21O4R3p9r1j48L0M7K69
5622B38l44R0Q9r8j65L05J23q3J24l95L77k39N6k04r9R5K58l22K40K18k72m4k3
5645g5K16m04L14R7j3j23j57K03K7l1P6k14Q2l9r6P0m0L12n07K32J24J19m70K72
5669b5J88j59L3k0L6k94J57M9o7J47j33L09k74q2l3R0J29j31Q8J12L9j91L4k04
5693b02L68q6J42j75J25Mk49K63j48jp0L15l00n7l1KJ31J3j15j60K56k3l06J29
$$ y = [-15, -206, -7, -159, -142, -5, -123, -164, 94, 152, -37, -105, 2, 106, -133, -48, 2, 149, 138, 103, 124, 62, -45, -243, 241, -7, 25, 4, -175, 55, -169, 177, -281, 16, -98, -228, -93, 64, -98, -228, 163, 208, 101, -100, -75, 276, 187, 27, -26, -10, -10, -108, -333, -32, -54, 48, -119, -70, -242, -64, 74, 43, 194, -99, -36, 27, 165, -132, 39, 131, -44, -3, 112, 38, -147, -229, -1, -10, 18, 235, -54, 5, 74, -142, 131, -68, 53, 117, 210, 131, 40, -108, -78, -31, 238, -106, -16, 73, -25, -190, 115, 238, 155, 279, -116, 261, 22, 78, -126, -225, -130, 128, -194, 46, 264, -8, -52, -75, 141, -263, 51, 148, 135, 12, -145, 58, 85, 54, 130, -84, -2, -41, -137, -67, -107, 205, -302, -70, 54, 173, -297, -25, 163, 4, 37, 17, 53, -241, -84, -35, -102, 45, -88, 221, -53, -135, -168, -78, 51, -80, 8, 120, 159, -32, 2, -202, 166, 80, 222, 47, 172, 176, -73, 190, 42, 41, -29, 286, -14, -71, -102, -100, 31, 44, -71, -231, 25, 2, -304, -175]
5717a75L63p5j26j06K7L6L66m41K90l21K23j78RL3J87k33J97Q5k21J0o1J33l0
5740hK92n1k35m7J16j39n1L51j05j40k62L87k65K26L9r3R3J9j75k10L33r8O2K47
5764B86n17J70O7j82J08P8j0O3k01r6N19k03j83J50o9J60k17J28J0K07j64j92
5786h8Q4L9Q8j21j87K45mj5J5q9n6K66j00j55j15j04L18m09O34l91p3M32j85j59
5810a30kJ91P5j36K12p5q7Q2p0q6j04J75j07L6j55L17l08K71j30j70J54K8j14
5833a33Q4k6j50J04R1k08N02l95M53k37j98J15N5K9j63L45l57L29l98K50n5j32
5855i5j1k02L16j32L02j38plk64J49J39J72l32n7L06m00O51m01N3k9J36r2K4q6
5879ak8j0O7p4J99r8j29j3L96q4m86L15N0n4l05J86Q0j6J07p2j21J45k38p6K79
$$ y = [-175, 188, 113, -13, -119, -92, -56, 310, -131, 159, -162, 61, -117, -108, -75, 112, -121, 76, 161, -60, -50, -111, 22, -8, 284, 233, -2, -49, 67, -72, -123, 228, 123, -17, -279, 108, -157, 69, 108, 15, 108, 127, -48, -258, 75, -23, 39, 286, -231, -61, 6, -176, -68, 10, 0, 63, -138, -234, 285, 82, -101, 49, -20, 140, -77, 51, 61, 268, 104, -88, -4, 35, 123, 2, -185, 60, 56, 41, 56, -33, -89, 177, 77, -78, -193, -297, 21, -388, 246, -145, -218, 214, 29, -130, -132, 59, 134, -2, 210, 135, 48, 130, 60, -26, -130, 45, -62, -26, -181, 136, -172, 99, -31, -201, -47, -19, -133, -49, -75, -225, -121, -30, -238, 264, -131, 322, 85, -113, 2, 57, 86, -77, 268, -89, 240, -158, 92, 37, -95, -106, -308, 8, -124, 178, 40, 33, 30, -234, -85, 54, 226, -106, -163, 143, -257, 394, -7, 46, 17, 153, 61, 85, -1, -29, -39, 28, -46, 153, 55, -74, -87, 309, 225, -261, 54, 104, 50, -255, -69, 11, -5, 102, 30, -91, 54, -184, -260, 19]
5904A9j25J75k83J54J87j50qk99N5L40J16l13m9K39q8O2j99K13n4j12O9j9K46
5927A76m4j64j04L60l40m1J93j78J29j51J99j72j43N14k19k2r7K84l39K47j67
5948g9l8J07j37L17k4j52j6q0K62k07qJ4J43k55J09J3J69j56Q3N1K0j21J00j35
5972b0L1Q0k91K53pl52L67J11j40P7l27OK57J33q3J22j97m9J04j49p4J96m4N0
5996E4n3J26l23L34k20j9K09j05q5j29M12k24n8K25j55o7M7q0L08m63j6K30k8
6019h0L6j84J41m2J85J64k60l7O9j17j8L27j77j30o0J20k4j03J38M8L2R0%j77
6043e9J51J7n5K5n7J78o2M7p3l10K92k98Q7K56k42L71k89J64j03K29j66P3q4j19
6067b7Q6p2m5L09j91l08J18J38N4j80J36Np2O1j0M6J32l04J98j45J02k56J61N0
$$ y = [19, -106, 69, -214, -60, 127, -23, -31, -330, -275, 65, 181, -132, -181, 58, -30, 32, -167, 46, -8, -120, -51, -70, 176, 132, -32, -136, 224, -116, -157, 36, -142, -13, -164, 35, -137, -280, 234, 15, -7, -104, 180, -159, 88, -79, -117, -10, -147, 170, 146, -6, -22, -102, 160, -47, -55, -41, 102, -153, -44, -31, 138, -18, 65, 116, 136, 15, 115, -20, 11, 91, -200, 53, 46, -306, 61, 172, 32, 109, -218, -212, 45, 178, 95, 217, 20, -29, 75, -74, -148, 48, 4, 54, 1, 127, -196, 138, -82, -101, 108, 3, -82, -211, 201, -23, -81, 144, -11, -78, -31, -111, 197, -266, -282, -52, -80, -44, -228, -87, -129, 56, 220, -40, -77, -8, -125, -143, 184, 7, -123, -183, -63, -87, -190, -52, -4, 28, 118, 118, -59, 92, 109, 54, 79, 22, 200, 138, 185, 112, -198, 94, -204, -117, 139, -103, 268, -21, 143, 40, 269, 103, 176, 92, -27, 59, -13, -58, 251, 60, -248, -130, 8, 62, -118, 18, 23, -49, 12, 2, 48, 180, -124, 74, -71, 31, -225, -64, -14]
6091a4L6J13j66R5m52L67Q9l0K0j53J29p8K2j03K36j28K68j37o4k12J02J33j66
6114i3P0r2L4J20J1j26Q3M2m7K89l59j65K09j65M44k18J20j18P3o3L4K16q4j09
6138A06M9l22K19o5P1M8j36m7l2K16o1r4J19q6JJ86k23P3j76J53M6p1L05k69J71
6163A81j25j31N6L3j25J45j16l9J09Q5q6l9L1l6JNK17j55N0j75J26j3K08l64K81
6188A24J45k64l4o2L7o5Q4P0j32K4J39k01K36n4R3j38R0k83M23r8j25k57K57k10
6212b01J60m8K7K4L60m92K08j42L64m29J93m8K2LJ44n02K71j50K57M6j14K6K32
6235B11p0j12J09l8J61k58k7k36Q5K41L4j08J10j64K12k3l47J40n9Q5J46o4l9
6258a1r8j0Q2K01k18K54j99Q0j09J7J42j90J53m3n3J7r0J0J87j00m6r2J96m41
$$ y = [-14, 22, 135, -31, 64, -388, -21, 68, 38, 58, -95, 34, -44, -22, -125, 111, -17, 251, 114, 50, -162, -60, 73, -93, -23, -115, -81, 39, 50, -76, 7, 49, 2, 291, -68, -233, -24, -189, 255, 37, 157, 39, 112, 49, 83, 299, 215, 106, 155, -167, 52, -13, 58, 106, -30, -77, -109, 107, 46, -48, 71, -15, -14, 172, -51, 22, -154, -1, 45, -26, 279, 10, 181, 56, -75, -19, 14, -111, 34, -82, -121, -12, 73, -13, -52, -21, -57, -56, -51, 166, 11, 61, -114, 12, -1, 207, -157, 124, 269, 5, -29, -91, -54, -119, -35, 35, -97, -73, 66, -135, 101, 47, 140, 2, 92, -191, 232, 134, 9, -248, 9, -201, -41, -89, -62, -38, 322, -170, 38, -104, 260, -169, 24, -24, -2, 1, 145, -357, -86, -236, 21, 67, -47, -21, 211, 141, 29, 138, 100, 261, 3, -24, -260, -175, 66, 100, -8, 102, -62, 150, 127, -220, -80, -139, -54, 92, 28, -11, -109, -119, -37, 164, -54, 200, 1, 81, -28, -11, 131, -59, 94, 51, -2, 15, -75, -65, 122, 22, -24, -116, 80, -361]
6282c61L25J26J33k97K41l18J24J89j41k2Q2J01j39j07o2K26j0j84Kj61M71j50
6304F8M1k83K53J1j89J13j7J32k39K02j56j13l7K61k08J59L5q0j9k80K01J57P
6327A9N8J3l01n5M40j77J56j01L6k5j85L38j65p0j71K13k42K46r8N4J6K46m11
6350a66K58n8J0k03O5N07m89J96q0j20k31L78o5O9j30J32l78M10o7N3k08l0J04
6373d3J56M3k10o1J9L74m18k6J11N6k11R1j1K71m40L05R6N8k94q5J68K41j66j6
6397Hj0k12N29k05j9j30J8l0J80k56O5jK43j89J3j41k1L58j72P2m9J5k12K60j8
6422I6J29m24J57J7J7L7q5J59j29J56j37J75j21j48J59j60l5K75j27k03J1k7J20
6445h8q7J70K19j53Kl30R7K78Rj76o0J57P4n8m1L26m39K9M3R4K1j72j10J34K89
$$ y = [-361, -36, 90, 223, -74, 167, -151, -27, 162, 21, -1, 81, 182, 43, -64, -126, 100, 90, -94, -92, -253, 218, 68, 109, -174, 79, 90, -99, 14, -3, 129, -110, 92, -64, -177, -214, 47, -161, -2, 33, -47, -66, -346, -145, 12, 19, 77, 90, -211, -266, 174, -3, 153, 52, 88, 63, -122, 216, 51, -19, -190, 23, -219, 27, -71, -17, -1, 245, -166, 92, 34, 44, -159, -94, 413, -76, 120, 40, -80, -311, 67, 2, 71, -59, 73, -305, 105, 38, 91, -117, -147, -43, 113, 156, -54, -115, -96, 278, -140, -166, -55, 1, -210, -119, -130, 141, -299, 6, 102, 160, -134, -219, -51, 190, 24, 8, -2, -214, 315, 110, 91, -39, -21, -51, 129, -127, -62, -63, 180, -9, 4, -137, -158, 200, 28, 100, 51, 66, -146, 114, 96, 225, -199, -42, -25, -8, 29, -56, 103, -26, 130, -7, 168, 47, -101, 58, -102, -137, 138, 11, -192, -181, -208, -88, -175, -5, 214, 61, 63, -267, -170, 108, 117, -59, -119, 38, 112, 54, 13, 339, -100, -71, -28, 66, 87, -85, -195, -61, 228]
6470B28m67L21Q8p0j85L62m80K90j09l07J95K09j32k8l5mJ64j18j14K18R8j51
6492b7j4J08J10l37k23M93o9j11J55j90J73K5j90j0RL1L21j2l1l49J33K25j65
6515E5k75K96Q0k58L7L2K23j34J29k30L62n06J70N0j77K45j25J61j65j40J74R6
6537A00k73O0K51n5K6k36m9L55r5k43o5J52M2k1j02M07k50k33K96k53K70J87l49
6560g8J69k60L47l0j43J03J73m34J76j04j44M07j66l7l4L33k80M1j67n2L31m5
6582A06j13O3j40J67j23J29o0N7O9J01j51j65L00l29L9J20q6M9j18p6K0N7LK45
6606A64k65O6N8Nk9j3rN2nJ53j10p8J00j37j3o5J21n9J01Ok09M47j06o4j43M1
6632IM0k23L5K27p3o2j4k9N4J7Q7k94K83q9k13j6O5K05j36J67k78M14k64K36P5
$$ y = [228, -239, 82, 170, 100, -85, 277, -203, 87, -22, -329, -134, 75, -57, -85, -120, -124, 40, -78, -192, 26, 124, -27, -41, 67, 177, -160, -383, 110, 41, -70, 85, -105, 68, 93, -97, -107, -98, -67, 254, 242, 211, -138, -5, 220, 55, -220, 76, 156, -102, -65, -33, 190, 56, 185, -45, 317, -189, -19, 31, -146, 99, -26, 135, -30, -170, 4, 100, -173, -113, 138, 83, 109, -127, -176, 179, 84, -159, -224, -72, -30, -51, -153, 254, 4, -229, 67, -186, 84, 271, -78, 91, -169, 178, 148, 5, 108, 281, -153, 23, -81, -225, 182, 16, -21, -55, 278, -2, 39, -128, -180, 151, 106, -7, 56, -84, 83, -40, 89, 29, 86, 155, 256, 105, -60, 240, -89, -50, 70, -16, 33, -85, -161, -141, -84, -81, 164, -101, -35, 23, 28, -1, -14, -23, 29, 24, 177, 67, -11, 89, -48, -61, -126, -5, -64, 37, 43, -166, 281, 175, 111, -32, 9, 49, -174, -139, 88, 15, -47, -61, -90, -36, -19, 68, -226, 57, -32, -245, -261, -196, 9, -127, 40, -238, 176, -88, 148, 223]
6657B23l71j4r7K68L3j38k6P1k93L71j32l9L59j11j4r1nOj26K62p1j0O1j12j43
6682a39K35k83J22K34k94J16m7N2q0P2O0k36J94K3j5Kj05K58J28k58l88K78K00
6705A29k90J77K2J26l81J69j6OqK6r7jr1J71J12K15l5m30J05K12p5l8P2l52L02
6730C0j45K98j09k9Q5P3l12L2J64k43J64q4J04L4j41Q0j0K13j69J33O6j73k04
6753a43L56k40k46J21O5K14q8q5J82p0q6k2O3L2o6OjK8L58l27l53L63R7l47R8
6778i1J61j68K1J27n9J06K47k57N2r4k7lN5o7J43%j80K09k7n1j36O7M3k31J2O1
6804h7M1K23k09J26K2k35r9P8L15mk48J65l81K04L5P2L0J62l32K57l02P4J76J32
6828B15j50r5J51k40J16J33K4k98L48l59K24L3k9J4PkQj33n7J89k04j69L13J2
$$ y = [223, -148, -162, -259, 9, 42, -96, -122, -51, -344, 27, -105, -144, 215, 104, 90, -1, -6, 0, -126, 136, 65, 55, 116, 4, -139, 96, -187, -65, 169, -125, -9, -56, -4, -84, -12, 48, -188, 6, 29, 14, 16, -89, 169, 297, 39, -349, -71, 129, -161, 16, 38, 164, -217, -48, -64, -58, -66, -40, -137, -138, -229, -58, 54, 269, 234, -196, -91, 121, 46, 8, 80, -272, 30, -115, 183, 74, 45, 130, 203, -109, -77, 87, -156, 8, -76, 28, 62, -79, 1, -9, 204, 35, 168, 234, 61, -143, 213, -27, -273, -152, -87, 127, 39, -46, 136, 66, -20, -42, 21, 53, -13, -7, -8, 20, 378, 51, -302, 61, 158, -189, -91, 70, -98, -77, 50, -9, 97, 344, 87, 139, 45, 18, 15, 70, 3, 146, 146, -34, 175, 148, 97, -39, 28, 71, -160, -148, -87, -46, 177, -32, 94, 116, -119, -218, -140, 175, 171, -77, 88, -293, -89, -54, 18, 48, 210, -122, 135, -167, -93, 83, 215, 65, -30, 121, -119, -3, 130, 154, -144, 204, -155, 69, 102, 73, 87, 94, 92, 100, -33, -90, 99, -105, -274, 39, 51]
6852E1lo1Q3j21N3L7j44J74j9l4m6J70n5j85L1P3o8R8j8L3j6l6j84J00r9K09j6
6879Gq1m8j03L14m4j52r2O8J65J79j86J46p5j29m6K2J04r9J93j57j3j81J94R4
6903H0q6l4J71j45k26L33K39l68J12K0k57O5O1j8R7O2k02J0j41L18K6J08o4j06
6927E5l48K38Pq3K66j21J10k10R9j85R9j25M2J13J60J0q2n5j6L55k85q1L8q4J15
6952C2K6o3K12j51k9o8L60n46K33m2M9k1r7K4%J01j27P2K61l82J56J01j50M5J68
6977A64j98n3Q3L6j69K57j98j4L44j89j16J36n1O2k00N0K61k88j4K0K12k28J12
7000A9J6j18P5j04m1J85P8J21m49K72o8k8P8k6J4k03K67k50R9J48j23j00J64k2
7024DJ02j31O5o9j56K50j92J2K32M1K2Pk29J55q6m4r6K04n8k77P1o2m4K93l29
$$ y = [51, 48, -13, 70, -51, 2, 39, -105, 69, 50, 16, -30, 140, 85, -100, -69, 4, -64, 34, 16, 49, 33, -3, -187, -87, -186, 23, 7, -74, -122, -225, 89, 45, -107, -199, -131, 34, 213, 27, 173, 98, -31, -77, -55, 49, -50, 143, -14, -27, -208, -14, 80, -6, -40, 131, -14, -240, 93, 332, -36, 76, 96, -161, -96, -35, -53, 44, 106, -96, -86, -227, 91, 117, 225, 161, 55, -293, -55, -48, -131, 135, 14, 124, -86, 13, -172, -73, -198, -156, -43, 117, 127, 45, -10, -26, 329, 44, -37, 1, -83, 32, 58, -5, 207, 56, 27, -41, 319, -227, 6, -36, 13, -8, -105, -81, -81, 20, -107, -35, 226, -156, 0, 101, -49, -4, 164, -34, -87, -4, 32, -137, 120, -78, -92, 252, 63, -53, 83, 32, 94, -106, -56, 205, -83, -97, -77, 135, -93, 19, 35, -83, -8, -112, -153, 32, 110, 231, -218, 54, -14, -42, 36, 10, 24, -179, 88, -162, -63, 85, -38, -138, 26, 4, 106, -25, 40, -29, -185, 65, -127, -115, 117, 158, 180, 187, -42, 113, 27, -17, -113, 91, 33, -244, -173, -235, -279, 14, -315]
7049c15J98o2K0J51n4Q2j01O9R0Q3j84q8n5J48K06l34J36Q1K6q4j25J94j10J45
7073A17K0p9j5L8%q6J66k28j97O0P5N9n2K59k96K12j69P2J58o1L7L8j02j42q9
7098b05J90J73l48K53j20J67j67L19q2j84n2nO4J88j96J40K7j25R6n1j14o5K37
7121A40l18J95K2L3j95j1J26j58K85n5N9N9k40k24K57j00J78m2P8j34jmQ3j52
7145a19J37j27l83L69K45j77J06J67k19j7m8J10p7J4j78O9M5L0n5k9Q1J94j14
7168B4l07K73L4J03l4L5j84k19R9K04j80K47P4K0l51J36R6l10K80M9j77J70j7
7191F5j85j6J01L9j51l4J57Pj42K27rP7l86K05J14J37k40J03k35P6K4L4N5j23
7215a00j3nj16L03k17J68M5j31j36K80j23L1J7n7K75mO3k36k0l2L25j49o5J11
$$ y = [-315, -117, -179, -159, -8, -62, 20, -81, -12, 78, 161, -23, -111, -166, -18, 188, -146, -10, 71, 97, 13, -112, 82, -28, 117, 137, 58, 43, 81, 81, -5, 161, -67, -264, -204, -129, -70, -122, 137, -159, 53, -116, -44, 114, 53, 90, 128, 26, -116, -205, -15, 158, -190, 63, -57, 110, -57, 262, 180, -4, -56, -61, 3, 191, -5, 135, 162, 37, 133, 82, -32, -97, 140, -178, 17, 39, 72, -123, -134, -8, -166, 119, 64, 123, 182, -58, -282, -25, -125, 53, 11, 89, -45, -46, -50, 33, -119, 18, -109, -492, -123, 122, -55, 51, 218, -1, -18, -66, 44, -33, -19, -197, -128, -83, -53, -108, -137, -56, 138, 24, -283, -10, 24, 127, 93, 128, -56, -275, -176, 28, -152, 95, 169, 189, -162, -26, 70, -240, 40, 89, -88, 82, 65, -120, -136, -35, 4, -147, -181, -24, -17, -159, 68, 59, 136, -250, -45, 69, 206, -34, 69, -166, -90, -66, -32, 23, -100, -113, -118, -234, 69, -148, 20, 65, -66, -202, 78, -45, -14, 3, -54, 221, 217, 280, 44, 24, -8, 317, 168, 103, 214]
7239B14k31j35O6M7P6Oj42N1J22O3j04Q5j73J33kj68J5L16j38R0k66P0j8J2R5
7264H4kJ10j70J13j58J8j22K86m26N33j67l08L55j55k33J27n9K61M15m25m33O08
7286B52P54n46R5o18l43j03M67P45n61L87o36rM0j77O0K89j55o2p3j64M71k43
7308a30P1K63k51Rnn8N6q6L46q6j7j37J84k49J38qj86L38j56L0k42J85k06M8Q4
7333f5J36k62L61k53K73k98O9K89l40j49L09j04m5K58k63J0K01j79M30n78L94
7354A94l50K15O0j74M4k42M62l56K20Mk39K26m6m1J23j39J63l82K87p4n2K73l03
7377a27r7M19k55K18j06K37l94n0K55k53K56j75o7N20k70N3j99r6L6Q6K07o8m32
7400c02N02k48O7Q6j30p5K22l22L21J8q2k02l2K3K56Kl97L36K9j28j7J85j59p7
$$ y = [214, -17, -152, -86, -39, 37, 43, -99, -48, 74, 137, 33, 118, -55, 78, 76, -92, -77, 239, 101, 191, -75, -5, -23, -11, 84, 82, 192, 22, 135, -23, -5, -127, 159, -267, 266, 99, -209, 146, -9, -242, -115, -174, 87, 502, 77, -356, 252, 1006, 460, 555, -63, -406, -509, -42, 703, 142, 529, -107, -116, -76, -253, -193, 96, -59, -121, -194, -358, 113, -130, -59, 204, -47, -38, -43, -101, -45, -131, 215, 129, 112, -25, 159, -90, 48, 40, -146, 192, 36, 66, -176, 9, -197, -149, -65, 71, -191, 170, -83, 190, -108, -39, 250, -90, -239, 70, -34, -79, 179, -84, -74, 127, -52, 378, -200, 194, -156, 59, 119, -55, -11, -253, 209, -147, 73, 77, -162, 64, 18, -23, 100, -39, 124, -258, 29, -45, -97, 176, -127, -224, 195, -60, 158, 52, 289, -105, -155, 100, -153, 103, -72, -139, 381, 111, 164, -35, -131, -95, -9, 198, 130, -302, 200, -48, 19, 105, -25, -100, 122, -200, 121, 139, 57, -145, -177, -154, 102, 104, -293, 43, 72, -56, -73, 112, -47, -124]
7424a24o9J98m3J12j84M8K52k2j58r4M73m04j64J01rK46k05J57p6N5r1L1j49J85
7448F6j15k57L80Lo0k31K63R7j14j09m3M8K26j38M7j56K1L2K28k24J15j32j26
7471a79L13n3J25l18J90l15K88q0n5O5J10j15J23j41k17J63J35J00j39M5O0j81
7493g6k7p8K57k61K99J4j56K11p0j77M1J9p3N6R3J7j89M4Ol2J56j27nl5N3j85
7519b25K95j66J17Rj60K26N3j35j35J53J2K08j60j49K59j01j01l5k0R2r5j81N28
7542B89l14l16K65j24K68K6q7m2J11j11j21L14j12q8L1J54J8k49N5J55L8l07J95
7565D8l18L85J14j89j50l3K23K22l91J48O4j16J3J32k16K4J02l42J21J9K55M9
7587A64p1k02L9J60k43L3J56j76J20P8p5J56k07J62k48j18M23M5p5j12n7M2k3
$$ y = [-124, -193, 5, -38, 74, -110, -62, 190, 168, 10, -84, 389, -15, -179, -78, -87, 159, -46, 111, 35, 90, -1, 30, -119, 66, -49, -306, 74, 77, 17, -214, 49, 146, 32, -77, -120, -72, 154, 16, 63, -93, -72, -40, 188, -36, 79, -53, -179, 134, 81, 206, -112, 78, -237, 51, -29, -84, -19, 91, -24, 99, -42, -259, -96, 39, 139, 0, 45, 105, -76, -103, -181, 76, -185, 114, 128, -28, 183, 113, -64, -23, -4, -77, -21, 72, 89, -100, -56, -50, -82, 74, -53, -58, -93, -40, -225, 70, -96, 21, 30, -130, 96, 149, 14, -121, 32, 44, 252, 92, -57, 202, 101, 0, -35, -55, 37, -58, -239, 289, -25, -341, -76, -200, 68, 94, 7, -35, 76, -35, -156, 158, 46, -42, -11, 143, 161, -88, -33, 122, 160, -147, 48, -270, 115, 229, 40, -110, -143, 80, 302, -89, 59, 123, 7, 20, 152, -64, -40, 62, -280, -159, -140, 115, 164, 93, -109, -70, 90, -153, -120, 36, -140, -20, 58, -17, 139, -68, 94, -154, -272, 151, 196, 121, 9, -48, -6, -29]
7610b9J87j82Q2K4j49L9m4J23j74M5J97j03j50nM7K78k2k7j01N9P9k19k8j4k54
7635c41L24j36K33k14N7j27J70J96m05K27j10K51K3j7k17lO6N2k91K95o8j7K47
7658A95l48m2J44K9K17j19k12R6L2K22n55M45o8k04J90p9J56j65n0J24P7r1j28
7681a34K3m7K84l4N1k22J82N9k0n2o4k39N34k18k23Q3M0K43l83L63j71m3K73k22
7705F3q1L75m71K68K49m57J58j18J96k64P4j59n3K48p9K12k90L79j67j76J65J2
7727H4k77K50rk62M33j53o1j11J31j92J26j1L7J2J8J99j92K8j07K65k72Q4Q3k96
7751a93K84k44K08j97J88J87k69O0k15K90M6j65N8r5J91L8Qk23j09O1J10J36j31
7774B4j05P8k82K59L7R6M0k72K55k64L6O0N3n5q1J31j66L03nr3j87K51j65J79
$$ y = [-29, 158, -24, 58, 82, -67, -28, -72, 51, -123, -78, 119, 16, -134, -139, -92, 186, 164, 137, 36, 95, 174, -45, -73, -87, -341, -17, -153, 80, -134, -77, -204, -34, 162, -243, -16, -126, 125, 148, 131, -86, -89, -23, 29, -262, 33, -35, -52, 195, -153, -195, -51, -22, 195, 76, -136, -40, -8, 214, -341, 104, 36, -168, 22, -57, 99, -66, -116, 8, 85, -6, -134, -111, -158, 126, 92, 143, -79, 103, 162, 142, 90, 26, -213, 321, 103, -120, -37, 3, 246, -137, 226, 55, 12, 285, 63, -18, 357, -114, 154, 403, -54, 104, -14, 182, -82, -8, -167, -220, 28, -51, 161, -129, 250, 83, -93, 72, 84, -193, 57, 48, -214, 219, 66, 5, -106, 25, -167, -41, -52, -15, -3, 15, 214, 22, 50, -57, 208, -64, 20, 103, -193, 91, -153, 55, -142, 46, 233, -36, 24, -191, 99, 145, -20, 38, -57, 134, 172, 180, -43, -152, -91, 19, 155, 24, -81, -3, -285, -26, 11, 107, 147, -125, 130, -134, -98, -38, 15, -40, -121, 10, -156, 147, 142, 49, -138, 113, -52, 127]
7798A27po4j1o0j66O4J2r1K74K3q8k5O9J81k37R4R0k81J20m2J14j58L16j49m3
7823F2j15P3J05j95K98l35l27K03J92M4Nq6J61j53J9q3K07k18K18k4m1O%k57L85
7848A44j76K30o0l7p4o5L1l5r7K04j4qJ8m0n4p6L06l62O1J78j25O9l13J08K52
7873F5j68J60J24k68J44K0l00N5K75Q2k56j08J7J17J33J0j47KO3J9L7j37n0K72
7897A61o0j91ML2P6N5J91k30K20n05M87k25J78k26O0j1j39k2L62P2l49J63l1l1
7921D1k77J36J06JK4N7r4P3J7j26n3K5J75l33K19m2K74k47L19k70J65J68m12L7
7945a7j46L14j56J34N0p0J54j12l34R7K85k88K0kL2J13j77j47K36J2k77K76j04
7968a07K26Rl76J39q7J99k5k1j67J50Q9R3l36K50k78M21m49J85L43k05r5L3m2
$$ y = [127, 120, 56, 45, -15, -181, -117, -105, -196, 78, 101, 13, -12, 57, 238, 1, 95, 185, -96, 24, -18, 96, -62, 254, 105, 62, -53, 20, 125, -70, 228, -107, -434, -231, -39, 5, 10, -76, 85, -68, -49, -132, 75, -143, 75, 51, 10, 16, 16, -241, 144, -32, 198, 138, 101, 27, -38, -7, -42, -139, 65, 51, 43, 61, 21, -33, -109, 197, -165, -104, 74, -51, 18, -295, -187, 65, -103, 57, 181, -87, 57, 77, -223, -168, 107, 189, -67, -175, -158, -41, 92, 102, -45, -43, 20, 39, 76, -61, -111, 161, 101, -90, -86, -54, 22, 77, 268, 38, 258, -247, 240, 15, 193, -33, 27, 16, -123, -145, 217, 289, -60, 103, 72, 41, -236, -100, 6, 7, 31, 88, -6, 67, 84, -42, -95, -70, 105, -228, -9, -51, 223, -24, 295, 25, 190, 358, -54, -17, -163, 151, -5, 129, 179, 109, 263, 151, -183, -86, 199, -89, -69, -71, -39, 74, -103, -250, -14, -2, -279, -3, -107, 119, 128, -248, -109, -196, 3, -22, -43, -210, -60, 29, 122, -214, 36, -242, 179, -270, -85, 258, 53, -42, -9, -51]
7991e1j34L2K24j23K5J28n16M99m19K63K3M3j08J50j09j13J05J11q9j85K26k2
8013d0j37J80J15j08J4j15Oj52K07j17J01J07rn3J08P7j79j55R2J52j93K03k5
8036G9l4n8pK6J71l38J31p8J39k9L1n5j17j06L5K40K8M7k04o0K21J08j44L9p8
8061a3j09r9L06j7k94K5J07KM8o8K20k58Q7J63P9j58k77K37J42P8r7j45j5J00
8085D4k96K44m4l9K08j79Q2j8P5k23J17m3M3J55rJ8p8k41J83J13m5K7l3k00K12
8110G3j74k75J47P9J42J37J28j54n11L36K45k57J53k59L45j51J31k32nR8n4J18
8132F0k48J76K56l89J53j59K87j39K02q8j36J31p8r4L27k90M3j08J07j5j16K19
8154A01n4j03m6p2K23j41j93M0J25L02j9j7k07m9L09p4j04n1J18J03j26k08J70
$$ y = [-51, -185, -153, 71, -52, -27, 101, -415, 84, -335, -72, -49, -6, -114, 36, -73, -186, -81, 30, -59, -244, -18, -40, -177, 3, 118, 10, 24, -91, -85, -237, -30, -147, -46, 61, 52, -1, 107, 184, 5, -150, -58, 94, -99, 104, 79, 45, -13, -20, 6, 177, -161, -30, -108, 31, 2, 33, -22, -139, -245, -210, 30, 58, 105, -99, -159, 62, 170, 26, 65, -13, -122, -221, 85, 68, -226, -201, -94, -92, -44, -112, 108, -150, -63, 100, 179, 21, -256, -19, 123, 201, 104, -41, -56, 44, -252, -8, -52, -91, 117, -62, 20, 2, 77, -146, -29, -72, -29, 126, 117, 135, 57, -184, -1, 112, 67, 94, 61, -139, 73, -101, -376, -229, -150, -8, 129, 257, 103, -408, -72, 173, -84, 69, -190, 155, 4, 135, -97, -102, -4, -58, 60, -188, -12, 244, -145, 8, -151, 136, -3, 199, 111, -25, 106, 28, -66, 261, -29, 14, -94, 13, -2, -118, 101, 47, -56, -102, -174, 49, -92, -285, -245, -120, 182, 163, 146, -61, -110, 199, 125, 21, -30, 88, 191, 65, -143, 27]
8177B7j46o7M06r3k5j60L0j26j28K75L2k21M1M4
$$ y = [27, -119, -186, 220, 127, 102, -58, -28, -154, -282, -7, 25, -196, -155, -111]
8191a11
$$ Imaginary data points
##PAGE= N=2
##DATA TABLE= (X++(I..I)), XYDATA
0@%%%%%%%%%%%%%%qJ6j6J6j7K5l2L3m1N2o0P2q6R7j09J28j50J69j92K20k48K80
36A49l16L55l98M45m97N53o13O79p52Q31r19J015j119J234j360J498j650J819
54I54k008K219k457K727l039L400l826M343m976N775o830Q290j0466J4126k1934
69a3702P4039n1529J3236J10472p9664k7656M6542k0790j9694N4828p1947k4404
81a0269P5858n647j16892N2279P1731r2205j9437M7625j7389j8732K1614m6039
93e7503M02P0554n7401n0325O8123L8092q7620J3359N7787l2909K012J3446k2542
106d4525K1377N3376o9090j2229R5203k3179o5610M2263N1686n3948P602K2267
118B5193k7356K9166J6538o1048L520Q5446o2340n5357P1773J1443n9794O027
$$ y = [0, 0, 0, 0, 0, 0, 0, 0, 0, 0, 0, 0, 0, 0, 0, -8, 8, -8, 8, -9, 16, -16, 17, -24, 28, -32, 40, -46, 51, -58, 70, -80, 89, -103, 117, -131, 149, -167, 188, -210, 235, -262, 291, -322, 357, -395, 436, -483, 532, -587, 647, -713, 785, -865, 954, -1054, 1165, -1292, 1435, -1604, 1796, -2030, 2313, -2663, 3112, -3718, 4572, -5894, 8232, -13702, 60337, 8808, 22044, 132516, 52852, 25196, 71738, 50948, 31254, 86082, 14135, -10269, 65589, 59942, -56950, -4671, 67060, -25145, -44582, 3043, -14346, -33078, -11464, -57503, -57101, 13453, -43948, -94273, -26150, 11942, -75678, -62319, -4532, -37441, -35429, -21983, -44525, -23148, 30228, -38862, -51091, 44112, 20933, -44677, -2414, 49272, -4676, 2926, 25193, -2163, 27003, 43541, -17507, -13987, 71459, 9119, -46238, 25535, 36978, -22816, -16789]
130a6789L0792l6608J8979K52m9537K7518M5577o4464l3606Q6759k1235n7721
142g0083L1791K1940k6857R008O502l3175M5539J5250n8256J0113O9856l3778
154a2150m9621O2790O640k8739J6067N750j6108L5696J444n7625M4389M0409n4311
167e369k2844O5075q437m3949K9880l025j1030K0073j1752l8822M7684J9067p0609
180c4058J4865M9825k7930l7664L7383j862j7357K1174k2522q522M0509l933n7238
193d7330L9396L8761n1778n769L7318m184j8800K2600j7812J355L8794l0058k9812
206b7319M9127K0635o4512J8209M2405k8671j0769J9567j1072l444L1536l8769
218c077j3974N5206j1020n5130L0070M0950n1038l192K6616j4406j826J4519k5102
$$ y = [-16789, 14003, -22605, -3626, -3374, -52911, -25393, 20184, -44280, -77886, 8873, -12362, -70083, -38292, -16352, -43209, -34201, -27699, -60874, -15335, -85, -58341, -48228, 21628, -12150, -61771, 1019, 7659, -21080, -5013, 737, -15371, 20325, 21769, -35856, 8533, 48942, -5369, -28213, 36862, 28425, -15524, 14356, 11331, 301, 20374, 8622, -30200, 17484, 36551, -34058, -19193, 30632, 2702, -34962, 2421, 559, -16798, 4376, -18146, -26668, 13841, 9908, -47330, -7934, 30827, -20951, -26720, 10598, 6414, -12386, 10214, -7598, -6243, 32551, 2493, -27319, 21808, 42443, -22069, -3860, 38545, 9874, -895, 18672, 7600, 4156, 35692, -3077, -17051, 38155, 27135, -27995, 2075, 43025, -8013, -11205, 15411, 1005, -821, 13698, -11404]
231a1404m989M8672l2674l5201M3655J7568m7331L280L4958k2206K550M561j5485
244a4046J1756K4269l5323j5259N4065j4116l6801K1391K3619k5211J419J0097
256E860j9459K4215M439l6219Q536M6352l2908l2380M7214J329l0530R224J3608
269I281j9139J8905L266l7934K8233K8457m2553j7681N5198j1460l8844K7186
281B915R185j6646Q088M394k6346K7954J5000m6335P937M1940k0754l4045L6352
294I639L922k1375J0090k580q489J8690K471l8795K6111K7598l7558j0686L4513
307A3551l045k5765J8393m646l607J8209j3695j9833L0901J4063m7508J2658L3720
320B3396k0779j7177K1542r92j0733J8915k0108p527L1786n702l8634K3469L0317
$$ y = [-11404, -16393, 32279, -395, -35596, 8059, 25627, -21704, -18424, 16534, -5672, -3122, 1439, -14046, -2290, 21979, -13344, -28603, 25462, 11346, -25455, -4064, 19555, -5656, -4237, 5860, -13599, 10616, 15055, -21164, -12628, 33724, 816, -31564, 15650, 16979, -13551, -4327, 9281, -9858, 9047, 12313, -25621, 2612, 31069, -11484, -29165, 26033, 14573, -24271, 2915, 12100, -4546, 3542, 7936, -18410, 9544, 24544, -21791, -13854, 28086, 7332, -26713, 9639, 13561, -7814, 2276, -304, -8793, 9897, 12368, -26427, -316, 27282, -10276, -20962, 13551, 10506, -15259, 3134, -1512, -5119, 13090, -605, -20438, 10463, 24526, -22982, -10324, 23396, 2617, -14560, 6982, 5990, -4743, 14172, -5936, -13463, 18323, 12621, -26013, -2544, 27773]
333B7773l9131l823K4582p461j0747J2553j2376n125L0139k1867k2354L1872J2800
346A6835m0070O357K9791k0648l923R922o594J217J9400k2613j1145L9567r557
359H539l1318J9364K5393k7674p38J8175j2679P193P233j8090o18L3906k1359
372G327k5699L4506P634l0086L140K2330j7769K828O136j8657J1411J6639k4229
385d489j4201L7478q299k9809J6488J3212j5555j579R105j4209J4780O057k6048
398a7069O819K7580j7163k2474K9646K549j6694O712M931o468J0408K639k5113
411a3697K1582J7478k8558n963L1846o673k3502J9189m32p877R253l300j6165
424f819K0167J0730l6312Q980K7899j8574k0437K4371M95j6653J2792o410o925
$$ y = [27773, -11358, -15181, 9401, 1940, -8807, 3746, -8630, -13755, 16384, -5483, -27837, 4035, 16835, -23235, -16878, 12913, -7735, -11658, -1736, -8330, -7113, 12287, -10326, -21471, 18096, 8539, -22779, -3415, 21978, -5696, -6434, 11741, -938, 6255, 13488, -4602, -5220, 28686, 7327, -18372, 16134, 23768, -6318, -3178, 19152, 1383, 4211, 10347, -8310, 3101, 19740, -4489, -18690, 18788, 10489, -19320, -2832, 10380, -5175, -6754, 2351, -11858, 2922, 8979, -17069, -10250, 17330, 167, -22307, 7339, 9888, -6806, -94, 4837, -1631, 8777, 11416, -13697, 7885, 25363, -3195, -9158, 22688, 16015, -7487, 11702, 11270, 3393, 12646, 9346, -6819, 13348, 24078, -12234, -3254, 24645, 6071, -14366, 10005, 10500, -6153, 6639, 229, -6696]
437f696J5885J32k6744J6092K2069k8137o079K3455j646j6484J2309j731m694
450b269J5650j2368j0469J9949Q671k8607P254K1737j5090p327R522l77n276J1226
464A2226j4807n160K4922j0495k3336J6479J6586k7346l05J4947r742k264O126
477b169j0357l195K2423j8343j7034K6396M465k7266O204K1106j6667n8P772p901
491a4624L764J2472j4271r077L0234o558k2361J6398J5182j7751o9J2774r946
504c833P686L548j3648L814J9724j4116j6798K4334J674j9346L960J1215j0601
517b387L309L022j6607J2923Q843k0543n735K4257p126k0517J4767N186j0067
530a0675J253M228j0995J1782O347k3080Q976K0040j3994j4120K2096J573j3038
$$ y = [-6696, 9189, 9321, -17423, -1331, 20738, -7399, -13478, 9977, 8331, -8153, 4156, 2425, -2269, 13381, 1013, -9456, 10493, 19164, -9443, -2189, 19548, 4458, -2869, 6653, 6276, 1000, 12226, -2581, -7741, 17181, 6686, -16650, -171, 16415, -10931, -11236, 3711, -6031, -8295, -2169, -12526, -15721, 6702, -11641, -28675, -2279, 2186, -25080, -18876, 2230, -14437, -14495, -6723, -14624, -10860, 1612, -12659, -21736, 8498, 1940, -20421, -4023, 11159, -6592, -6661, 6113, -3833, 3853, 7401, -6247, -2433, 17291, 3175, -13623, 10711, 12385, -6961, -3001, 8214, -2387, 922, 3944, -12663, 260, 9103, -11440, -17175, 7082, -44, -20561, -5794, -608, -10675, -9422, -5194, -16189, -4407, 1940, -21140, -12164, 7876, -6118, -20238, 1858, 3431, -9607]
543i607P648J438l291P881K250j7215J4878J4432k2404j091K0303m494j4639J2727
557H816n60m272P772o696p610J3597N663k5017Q063J8791j5721r464J4033j121
571F274r331R577q651l835J4799m855j7387J2412J6071k3072j657J7289n198r039
585f603Q794k471m190J4791j0497r114J7477M825j9894L705J8222j1906l989P421
599F571j112k044Q032r246n247J9569q068j4788J1685J0443j5763r82R864o917
613A997J850J585q111Q22J4386j3004j1708K0432q60j6666N078J0970j1306J371
627c164M647r558O487P726j3170n795K1997o624j7817J4512O955j2045N84Q202
641B937q782O264M479j3423L597J4137q998j3432J8544J806j3727M819N372n055
$$ y = [-9607, -1959, -521, -3812, 4069, 6319, -10896, 3982, 18414, -3990, -5081, 15222, 10728, -3911, 8816, 8256, 3984, 11756, 5060, -2550, 11047, 16710, -8307, -244, 18547, 2826, -6638, 7395, 6274, -3057, 6520, -2131, -5966, 8833, 3978, -13409, -997, 15074, -7998, -9655, 7634, 2436, -6603, 2191, -280, -4470, 10321, -176, -9290, 8187, 13012, -6882, -3177, 15045, 3139, -850, 6571, 5459, 3415, 11447, 2201, -3046, 16523, 8455, -6333, 5352, 15795, 32, -950, 8914, 1997, 3847, 5432, -2679, -1857, 12529, -475, -12183, 8249, 7389, -9277, -4199, 6771, -4535, -3164, 1483, -8075, -1588, 6138, -7032, -12827, 9170, 2546, -15271, -759, 6196, -5849, -5265, 2937, -5845, 419, 4898, -8525, -4928, 9209, 211, -13221, 5323, 7129, -6598, -1779, 3593, -1462]
655a462K404K787j1457R828P214j4506j594J4990l310j3351J0850J168n299L291
669A553k14o137Q563M150j7689Q077J2306j1883p091J2973P0r742P714k677l111
684c138Q009j228j3172R935J0902j8416N73J3613m384r523Q474n08n284Q748n685
699a084o540J0816L964j6693N010J3776j1557m130Q441l98n347O942n287l459
713e546J2468n285j0812R006R618j4836j87J1279n999k053M312l122k351J0730
727G222q451p514J4106O83j3539L705J2099j0206j402O031m385Q68M993o545m316
742f651J5047n684j1188R808N930r810j141Q940o569K385K664o804K097R461q047
757D38q233J4516r66j0276M232N719o040P37L659q293O564M437j0477j580J3349
$$ y = [-1462, 942, 3729, -7728, 2100, 9314, -5192, -6786, 8204, 4894, -8457, 2393, 3561, -1738, 1553, 1339, -4798, 3765, 7915, -9774, -1697, 10609, -1274, -8365, 4608, 4678, -5064, 2650, -27, -3138, 4871, 3643, -9529, 406, 11308, -7108, -6535, 7078, 2694, -6829, 1645, 1137, -4147, 4601, -1084, -7624, 3192, 7156, -9537, -4527, 9249, -2308, -6438, 2003, 1605, -3742, 3200, -2087, -5546, 6922, 1637, -9175, -169, 9449, -5387, -5574, 5705, -294, -2347, 1965, -1157, -3508, 7222, -1229, -8743, 5363, 6046, -7493, -3788, 8311, -1895, -3297, 2734, -1651, -783, 4210, -2335, -6651, 8396, 2712, -8476, 1332, 7262, -2548, -3689, 5251, -1318, 1067, 3731, -3073, -976, 8485, 438, -7795, 6721, 5755, -4521, -289, 5430, -610, 127, 3786, -4507, 2057, 6494, -3983, -5563, 7786]
772G786m964j1839J0873J870p216J322L760o389M653M105j2475N000J0130q433
786a817q301J3313L76j0742O460J628l748K906K466q622N893Q028j2132j80J0530
801F058j819r691P550K181m912L802j768k835N396K859j1798N278Q582q526l198
816b841O819l3n890N210l168k160P408m008p044P110O411j3597J695R183n585
831d90l802N122j237l566P670n496m885R342J179j1130L609J0854j0182j905O927
846B010k388k178M375l208l828J0148m067p864O875N729r316j253Q658n358n62
861b227K639k890m92O347n498n655J0805j372q176K719O459o025p80M628n182
876d700L333K731n880j188R905m673q011R332K203o355N00N421m908J924L351
$$ y = [7786, 2822, -9017, 1856, 3726, -3490, -2168, 1592, -4797, -144, 3961, -8514, -3514, 6616, -1817, -10118, 3195, 3571, -7171, -711, 917, -2831, 75, 2541, -6081, -188, 7840, -4292, -4472, 6058, 4239, -5452, 2098, 4279, -633, 3169, 1401, -1434, 3962, 6821, -4977, 301, 8883, 357, -2841, 3978, 3945, -1945, 3265, 97, -2063, 5345, 1337, -5707, 1403, 7814, -5783, -4088, 5095, -490, -4292, 830, -407, -3973, 3697, -1799, -6684, 2658, 3837, -7293, -3684, 7170, -3012, -4917, 2010, -378, -2556, 1819, -1389, -5217, 4931, 864, -7000, -125, 5604, -3712, -4965, 3693, -1665, -2227, 412, -2478, -2970, 3377, -2121, -7776, 3029, 1657, -6519, -3800, 2659, -3366, -4146, 482, -4700, -1367, 1364, -4516, -5704, 4201, -472, -8483, 849, 3052, -3303, -2803, 2618, -2290, -366, 2985]
891B985p008L592O322n545o038J0858n75q272N067K155l189L70K852o040M353
906A887L778q249K6Q149k939q340P813M17n015K533M76k976K880K647q907M597
922a223N988p073l076P623r2o800N717o29k547L987r92m935N025N283r965J782
938a927P569l205n329N713P30m751N137k250k723N150J307q056L360P116p865
953b4j135M687J76m041K928q61k987N999l304m943N261L683q610J201O402m794
969c62o15K112j304j210M604m027k940P771j656o602L545O075p414L07M878l758
985e96Q44K502l172j879P931l948o168P197K195o803j67P112n429j6L052l504
1001h49L44L834l561m243Q119j410o354K729L787l780j238L726m023K218J753
$$ y = [2985, -4023, -431, 5891, 346, -5692, 5166, 4591, -3681, 1386, 3541, 352, 722, 3574, -2466, 1887, 5665, -2584, -2558, 5591, 2652, -5688, 2125, 2542, -2473, 60, 536, -2440, 440, 3087, -5820, -1223, 4765, -2308, -5384, 2239, 2147, -4653, 1064, 435, -2112, 1875, 883, -4052, 973, 6256, -3709, -1927, 5642, 2437, -2892, 2821, 3551, -1200, 3937, 1687, -1036, 4114, 5421, -2635, 725, 7841, -24, -1159, 3528, 3704, -337, 2591, 1730, -1257, 4742, 1438, -3505, 1756, 5439, -3171, -1970, 4432, -362, -977, 1135, -169, -1379, 3225, -802, -3742, 4029, 2373, -4229, -684, 5391, -2023, -1716, 3162, -596, 248, 2750, -422, -2301, 5630, 1682, -4486, 2711, 4906, -1897, -2064, 5048, -381, -397, 2655, -849, -505, 3329, -232, -4475, 3644, 2234, -4120, -1391, 2396, -1384, -2622, 1104, -2919, -701, 1052]
1016A052m547L84N331k977n370O631L6l549N77K272j947J053K199n597L485L978
1032C011n387k066P442j347n892N207J76j905J386R39l819L104L470o886J156
1047a411N995k926n318O034O66m775L445q50j629K266J270n390K465N020o357
1062a495j031M665j04m827L602l77k286L828k429k704L453K739p193J887M875
1077B603l523k075K804L59k925L851k765k025N521j038n242K814N299o080k99
1092b721L626j068j637J971j22k435N362k904l391M288K362n460K51N297l714
1107b95j73J373j120LK543k058k740N762j660m021K290L352m017n04L145l110
1123a230J822Q01k882K2M376k737m210N910l02l689Q43K771k936R95J887m382
$$ y = [1052, -3495, -3111, 2220, -757, -6127, 504, 540, -3009, -2432, -160, -2107, -1054, 1145, -4452, -967, 3011, -2376, -4442, 3000, 1653, -4239, 968, 1144, -761, 625, 1564, -2255, 849, 4319, -2567, -1411, 4584, 1658, -3660, 2374, 3040, -1735, 1710, 860, -769, 1497, 2767, -2623, -158, 4862, -1495, -2526, 2139, 2035, -2792, 810, 433, -1853, 1975, -454, -3158, 295, 3034, -4159, -2272, 2603, -920, -2995, -191, 168, -2757, 1094, -1671, -3696, 1825, 787, -4455, -1641, 3658, -2422, -2721, 905, -163, -1800, 171, 49, -2386, 2976, 72, -3319, 969, 3331, -2129, -1878, 3419, -295, -468, 905, -215, -212, 2331, 273, -2467, 3295, 1635, -2386, -96, 3256, -761, -1265, 1880, -1230, 592, 1393, -1489, -1467, 2909, 172, -4038, 1872, 1570, -2119, -1276, 1495, -1441, -446, 1441, -2941]
1139b941K521K633l397k497N973j156m770L875J512k450j88K344l276J904K515
1154B602m609R60L710j629m157M613N00l274J392P07j005L49J829m357K421K495
1170B547l789p19L521n22l733L543p67j324K217j255j824K391K083n249J912L671
1186B703k957k042L442j48k752L447j606j212K935J57l654J780M221n158L62K991
1202B509p63k374K253k7j947L332k032j918K297J855m246L99L817l170l67Q56
1218D74N33j889J816j220j695L488j094k912J590K571l722J45K456k078N37O91
1234c09j270o17L445k450k209L958l7k884P37L583l493L97K177k046M25J844j812
1251e61j737M581j260l228K692J412k155m31K542k341R16J139k471M96K298j323
$$ y = [-2941, -420, 2213, -1184, -3681, 2292, 1136, -3634, 241, 1753, -697, -885, 1459, -1817, 87, 2602, -2007, -1047, 2663, 1034, -3123, 1490, 1990, -1284, 108, 815, -190, 159, 1988, -2369, 52, 2547, -1242, -1961, 1560, 1038, -2695, 848, 81, -1243, 974, -281, -2105, 286, 2369, -2880, -968, 2703, -254, -2296, 1146, 998, -1754, 1693, 87, -1125, 1810, 1967, -1687, 93, 4314, -844, -482, 2509, 1746, -628, 1625, 1598, -349, 2983, 951, -967, 1330, 3185, -1061, -662, 3155, -15, -382, 474, 1007, -882, 934, -286, -1981, 1507, 413, -2499, -909, 1662, -2060, -1915, 541, -1537, -1000, -309, -1579, -2196, 1249, -1201, -3410, 548, 511, -2373, -1636, 1947, -1546, -1149, 1028, -1018, -593, 1251, -561, -2298, 2283, 1023, -2205, 487, 1899, -256, -687, 1855, -486, 430, 1569, -902, -406, 1892, 569]
1267E69k862M105o29k503R44J305j243P2J481k927K085J353k506p13L411q70l114
1284b042L149k16j514P86P47j620J000J996l906J749K309j918j895K990L17k880
1300i48K278l35q77P73P83k917J578K374l308q5K215j36k515J640K83j219J161
1317G45o09q05J023R11k644R38K183k135p05J495J88j433K114j504o51K468j165
1334D14j561J617J853l501R88J930j617l7J056l45j319K649j480j479K303K77
1350A748k399K69K836k747o4J666r37j012J474n41j849L001j216j723J188J198
1366H92j886l41J941j695M05K30n29n25J840j001j545K464m37j448N98J383j471
1383a125L09J000j823J324Q55j605o05K953r18k702K976n01j269L28J446k089
$$ y = [569, -2293, 1812, 1183, -1320, -376, 929, -314, -242, 1239, -1688, 397, 1750, -756, -1469, 1942, 1072, -2042, 1107, 891, -623, 163, 910, -710, 290, 2286, -1620, 129, 2438, 520, -1375, 1615, 1932, -948, 1330, 995, 118, 891, 1674, -1243, 335, 2709, -599, -684, 1531, 1395, -1120, 520, 803, -416, 745, 136, -669, 354, 1265, -1379, -441, 1742, -393, -1098, 397, 585, -848, 1266, -238, -889, 1579, 414, -1147, 470, 2323, -1178, -190, 1740, 123, 86, 1142, 797, -522, 2127, 647, -832, 1471, 1748, -651, -382, 2454, -293, -357, 1309, 372, -640, 834, 293, -1556, 1445, 229, -1494, -306, 892, -994, -1335, 606, -1089, -684, -454, -983, -1508, 332, -669, -2214, 250, -187, -1635, -1037, 346, -1125, -816, 184, -1639, -315, 540, -1065, -1670, 1283, 365, -2337, 639, 138, -1131, -803, 643, -1446]
1399a446J170R55k360P89J548r46j949K631J9k480J599N95q66M2J036j652R68
1416c47J365k236Q3J744j35j920J755p2q75J084k72m85O32J021k652J392J481
1433A563j627l51J305p3j327J777q13o70J263j67j601J046J383l025Q82J727j444
1450a52r59J215J28j539J993j025q83Q95R14k020J54K513k516J67J166o38p26
1467a313R57j92r91J548p78l95N20J268j936J1K286j660N01J11O5o60J617r81
1485b2q58K066p33p30L39J461j742j8J290j472N70Q52o25j320K445r45j462J990
1503A086j47j354j28J652j423J56Q90r01j74R24k73j575K588p11j422O62P98n90
1521E8n26J303j290N92M78r56N8J241l97j603J625M2p88O18k38k88K02P10j466
$$ y = [-1446, -276, 679, -1681, -892, 656, -290, -2239, 392, 411, -2069, -470, 125, -741, -699, 337, -1315, -347, 1018, -1218, -1135, 609, 474, -1446, 309, 237, -638, 446, 174, -311, 321, 1342, -1310, 82, 1563, -64, -415, 890, 817, -510, 1267, 454, -216, 1047, 880, -721, 325, 1708, -1317, -435, 1292, -152, -1111, 104, 232, -1307, 686, -339, -1222, -327, 587, -1433, -1279, 1234, -1282, -1115, 51, -587, -1313, -356, -548, -1539, 9, -769, -1164, -644, 624, -1312, -1301, 985, -675, -174, -63, 2, -658, 959, -22, -880, 1186, 453, -277, 62, 1523, -219, -237, 1053, -419, 151, 1003, 378, -942, 1503, 558, -904, 1086, 939, -415, -543, 1109, -314, -158, 732, -169, -343, 581, 308, -1267, 1321, 610, -812, -150, 648, 58, -468, 835, -455, 137, 615, -341, -283, 958, 561, -1042, 583, 625, -163, 455, 217, -71, 131, 841, -625]
1540f25R37O73j012l44J358O1j533J704o51n53N54J70r20P73R82k089P04R44k61
1559H72j249J122L20j344J335l55m33K99P08j482M21J373j636J23J31N36j056
1576c15R64k64k63R03p83k75N05P36j771N21R93j052K56J84r6o47J349q22p29
1595f06J588n92j062L51J596j945N17P82q12j64O94l38r20J546p85q35R26L93
1613C34j051n05J806j395J2M86n21q1L40n3j091J615p43m41r0R56m94l18J057
1632a77j240P43L04l14l28J304n47r73J904n96k71K81N41j128N79R23j690J039
1650C54P23n53r60J694l30j117J046j52l24r8P53j234N56J040j483L0Q61k01j419
1669h14J278p2r29N96l69J46k01N81j116L26P91r99L12M48R2r81R42l63k61P73
$$ y = [-625, 312, 985, -27, -371, 987, 1048, -485, 1219, 568, 15, 569, 739, -181, 592, 1574, -515, 189, 1133, 872, -377, 745, 1065, -279, 1056, 701, 268, 567, 1275, -207, 214, 1587, -49, 74, 205, 741, -315, 649, 385, 122, 1025, 242, -33, 472, 1208, -563, -42, 951, -101, 155, 339, 243, -404, 945, 123, -606, 982, 390, -672, -321, 1275, -670, -153, 629, -183, -347, 347, 9, -911, 635, -150, -985, -59, 334, -717, -1222, 584, -811, -799, -313, -834, -915, -575, -628, -1719, -104, -847, -1288, -1378, -422, -916, -1234, -177, -1417, -674, -370, -684, -1012, 292, -255, -1228, 676, 80, -191, 90, 631, -497, 82, 1005, -685, 354, 1077, 524, -436, 1258, 928, -189, 857, 705, 381, 283, 1036, -198, 358, 1398, -85, -55, 806, 605, -814, 464, 392, -537, 59, -310, -164, -365, 216, -900, -574, 217, -782, -470, -22, 70, -911, 31, -332, -593, 180]
1689A80k83k36M5Q84r95N24N85n15o15R43R1p49J121n89m01M53L93r55K38J070
1709A189j404J81O74l33n38O85j48q13Q89n03n23M07N72o29m03J067q00K03J5
1728b12J24m52N24o0o44J096m63m12Q4Q01p61J58O46p97O92j29j41m20Q17l33
1748A18o67Q73l76j50o5O12j006K24O59q57Q7L56J02j004J174l15p44N80j30L3
1768d96n98J008p28L47K10l04m2M06J00j143J311n38K69J99k30j76m5P09n17M13
1788A55M09p69L80K47J44r76J037n46j29R14n23k36R8P21j304O77L70l74m12N10
1808C93J75r38J014m09j15J59J79k70l75J183r22N5J11M87q77K95O39o47M54l22
1828B69J79m30M73l72j42M53m45K73l22K23k13N36n46l05P05n76Q8p4N82j217
$$ y = [180, -103, -339, -294, 590, -405, 119, 704, 189, -426, 517, 608, -141, 980, 391, -10, 443, 836, -119, 119, 1189, -215, -34, 640, 307, -231, 454, 306, -507, 382, -121, -644, -237, 335, -294, -697, 370, -430, -227, -212, -88, -540, -16, -76, -720, 376, -87, -499, -415, 386, -375, -217, 429, -368, 324, 195, 54, -366, 451, 118, -549, 324, -52, -202, -267, 345, -661, -437, 222, -635, -548, -192, -90, -1094, 80, -235, -979, -399, -529, -496, -1094, -86, -814, -467, -257, -561, -603, -197, -97, -1240, 71, -467, -198, 1, -229, -405, -450, 259, -258, 155, 564, -205, 175, 422, 566, -410, 627, 81, -48, 866, 343, 107, 205, 926, -378, 299, 669, 295, -117, 393, 568, -370, 644, 235, 120, 279, 458, 188, -187, 996, 74, 129, 240, 727, -150, 145, 784, 137, 591, 269, 448, 18, 491, 119, -23, 430, -15, 258, -64, 159, -54, 482, -64, -369, 336, -240, -152, -226, 356, -861]
1848h61O50j04m12N24l73K59n88J195m73m95O93M7j27l07J027j180N28M91k76
1867B18L7K16K20r72J155k23n93O13K62l39m04Q81p18L08pk18k20L0L28p78P12
1888E08j10k75qkj39l95O49q67N82j59k13k71O69p9l81N73o40J14N13J83n69J05
1910b12Q60j233O55J04j00k61N49J26p25O40j71o3q4O94o12k76O84k58j84j59
1930b6K26m20N74o4k14q8r1M42p34N11n38J64K90l57K15j35L56p64Q92m65j37
1951c63M84J26k79j48O02p83O23l1m3k63M42L4p56R37n09J59R1R3l25j53K86k82
1973e8J4j18M75m22M0p1m96O68m27N9k43m7J83j96M27l68J29l96L68l03L12L97
1995g3n51O74n86K33j02J38m77L52M12q70O50j69M43o23L75J15n62P05K4l69m2
$$ y = [-861, -211, -315, -727, -203, -576, -317, -905, 290, -183, -678, 15, 62, -65, -372, 655, -525, 3, 494, 218, 255, 471, 691, -281, 874, 651, 58, 671, 933, 594, 190, 1071, 353, 661, 654, 436, 216, 246, 574, -204, 508, 398, 123, 115, 113, -26, -421, 228, -639, -57, -216, -429, -700, -31, -110, -491, 82, -558, -444, 69, 252, -317, -212, 648, -585, 70, 174, 74, -187, 362, 488, -237, 403, 232, 169, 85, 779, 167, -109, 575, 317, 133, -26, 200, -220, 354, 290, 76, -12, -103, 339, -395, 116, -422, -258, 32, -325, -110, -245, 111, -653, 239, -226, -363, 121, 247, -32, -180, 422, -361, 262, 231, 188, -75, 367, 401, -355, 582, 73, 232, 323, 416, 91, -62, 224, -58, -44, -162, 313, -109, -69, -140, -636, 32, -395, -336, -579, -626, -443, -639, -212, -580, -451, -847, -479, -782, -470, -73, -624, 50, -536, -303, -405, -267, -744, -392, 20, -850, -200, -369, 74, -549, -174, -59, -621, 84, 108, -261, -303]
2016c03R48j246O12J65n15J46L3L08q21Q70m01j00K64NN8n45O12k38O7Q0k21O43
2038D21p17Q33o95N21k15Q1M4m3L66n51O47n92M75j35k66L75j45km20L91l2o5
2060B76r9J81l99k51P40r66N49k74J04K3J44j00l38L12j91K64m07N36l36K9L12
2081A09n70L37j39J52j22K77J77r9O3k85O81n48O63m74j61N56m05J55k5J20l91
2102G1K81K2k16L17k18N5k24L27n01K95K53n05J66l02K60m37M67l16o6J2k5J57
2124a27j51L59m19L86k54M7k73K09L97n57P44o66J81J72k23K54l15L34n11M75
2144F2r9N9k93K65ll69O88n65P1n0L67p06J57N54m92J47k00L38m05L85P5l82L94
2167bp0R5m68R07l58j87L62k74Q8l3L32m06J72J58l89O43m00K77m80N65K26m92
$$ y = [-303, 645, -601, 11, 176, -339, -193, -160, 148, -673, 197, -204, -304, -40, -35, 23, -522, 90, -148, -81, -1, -222, 421, -296, 537, -158, 363, 148, 229, 273, 230, 596, 45, 692, 100, 575, 440, 174, 549, 404, 402, -18, 373, 341, 276, 177, 358, -41, -292, 448, -518, 31, -243, -139, -116, 28, -72, -410, -98, -289, -25, -432, 104, -232, -203, 109, -461, -124, -263, -111, -233, 44, 221, 122, 185, -100, 581, 33, 696, 222, 61, 617, 212, 367, 342, 462, 71, 352, 374, 158, 475, 257, 312, 88, 415, -86, 209, 462, -43, 123, -179, 81, -356, 111, -205, -271, -259, -284, -127, -278, 81, -338, 48, -206, -159, -432, -223, 174, -383, 361, -305, -124, 48, -175, 79, -236, 98, -413, 62, -37, 22, -271, -6, -9, -378, 310, -255, -184, -234, 133, -573, -416, 138, -354, -207, -407, -69, -474, -89, -14, -396, -2, -72, 23, -445, 462, 104, -83, 279, 5, 93, 60, 392, -14, 158, 316, -73, 570, 170, 447, -33, 532, 758, 266]
2189B66PL6J61m18L16k37p5J30k28K26l01L59k85P3k85m4K26j44L15l23J29o1
2211a57K33k25p5K01l6J7p4K59k94J48k77M01m3N9K9o07P99l56K76k13P5Q1k91
2234g0M09m79M3l58O30J05k45j80q8N02o64N10m18L87r5k09L26m30O84l04k3p3
2256d0P6n0k3L40M5j18k37K66l34K11K66m41K16n8J00k71M32j03n01O04m92J70
2278E8m49L51o9j6N8m36K09l39O95m76m2p0J00o5p0K27M6Jl03L04q4K31K0k84
2302d03N24m79K25L86m43K70K08P3j29M77l85j37l31L13m02O92l30p80J124r30
2322d57K31O45l63M20o14k56K56M11j81m23Q83k14r7L1mM26m41o98L82J9O85q54
2344b13Q9J77n27L94N53m70K52P6K04m57N50l10K65k98j1J06l25K79k16J91n3
$$ y = [266, 273, 309, 470, 52, 368, 131, 56, 186, -42, 184, -117, 242, -43, 30, -255, -299, -73, -217, 98, -225, -96, -157, 76, -149, -224, -23, -59, -42, -116, 143, -151, -3, -280, 121, 78, 137, 166, -441, 358, 2, 278, 65, 140, 221, -70, 339, -140, -97, -455, 175, 280, 35, -145, -233, 269, -395, 115, -303, 84, -11, -220, 106, -324, 360, 56, 33, -40, 36, -14, -37, 303, 348, 230, -7, 259, -75, 136, 402, -39, 177, 119, 219, -52, 380, 277, -224, 380, -112, 58, -391, -40, -109, -125, -67, -503, -294, -633, 62, -414, -456, -526, -426, -491, -561, -334, -288, -287, -590, -286, -370, -139, -119, -403, 121, -358, -133, 253, -190, 80, 288, 361, 232, 709, 324, 187, -144, 169, -233, 459, 129, -651, 473, -457, -226, 419, 56, 476, -138, -394, -138, 273, 92, -331, 552, 338, 241, 272, 268, 694, 253, -445, -63, -44, 641, -213, -124, 53, -474, -80, 473, 3, 255, 331, 535, 78, 628, 318, 583, 285, 274, 380, 55, 334, 118, 309, 256]
2365B56K33n74m11Q01j94j70j21K52m65L32J43l98rj02L92n59K11K24r8L4j43
2386c66L65k87J87j15J46K8o3K58k90M18j94K65n95O32j66pJ13r6K90k93J50j57
2408B23k7j06J27O4k05K47j93j49L64k92N7l00M90m38M01j38k58j18K72J43m34
2429b70L55qj63k73K24J38l38N15j07K5k03J96m48M73J47k26J79k41J52l33J82
2450b4J95q0k49K40l14J2L87k69J9L6j91L6l00M32k46J67m46N05k02j0K04j51
2472b49K02k86K49N2L4j1l1j54J85K06k85L22M0k4on4L55o94N30m08M04r3k28
2495E6M1j46M02m78J46O2kk03m5J62J2p7l4n9j9J63l66k36O71o90O24k21k14J23
2519c28LK27k98L67k46K22p3O6j80J8L71m46M50k94K69k12j23P3R6J47k11M39
$$ y = [256, 489, -85, -496, 305, 111, -59, -180, 72, -393, -61, 82, -316, -325, -427, -35, -594, -383, -159, -257, -223, -366, -1, -288, -101, -216, -70, -42, -105, 153, -137, 281, 87, 352, -243, 389, 223, 216, 329, 233, 523, 230, 380, 223, 196, 90, 217, 281, 76, 323, 130, -19, 345, 53, 110, -190, 300, -138, 263, 125, -133, -251, 21, 164, -270, 85, 77, -86, -359, -135, 3, -335, 180, 73, 98, -105, 91, -357, 116, 263, 37, 216, -25, 127, -206, -24, 171, 91, -158, 82, -232, -220, 167, -102, -83, -47, -238, -202, -502, -70, -316, -149, -595, -90, -292, -302, -98, -249, -47, -333, -84, -32, 2, -9, -40, -194, -9, 197, -88, 234, 274, 250, 244, 190, 545, -149, 381, -27, 377, 284, 56, 97, -49, 353, -125, 21, 83, 81, -122, -167, -5, 7, -70, -104, -163, -182, -19, -385, -621, 50, -640, -16, -237, -451, -328, -325, -98, -396, -29, -275, -53, -126, -60, -240, -222, 149, -297, 153, -141, 128, -84, -207, -134, -38, 109, -102, 337]
2541C37m13L47n7M8J1j17J24j13L0q3Q5n0P3pj13lR8J95l12J26J28m07K75j7R4
2566B79m18M56l26L02k5N8r0k56L39p34N70PQ3l56J40L8l60L74l42M16j62P0Q4
2589A47k53j18J37Q3k37L91k50j60K60k86L82l20M57k00l48L96j99L65l37K58
2609A68j59j32N7P4J32j85L45n09L56N1j21k31J94M7N7j70j15N8NR1L4j91K45
2632A01l27N3o9J98q7R2K20m22K52n1J28j68m2J40P4l16K85k5j80L30j38P8j1
2655A15j10J42j18L6j05L95l43j7q8J69k48j48M92l76L91j70J51j15k1q5k50J96
2677a07k44M54j99N3Lj70J21j21K13k69J93n5j25L47p5J11k01J70j41J78l9j03
2699fK68l25L80r8J10j63R9j11j63qJ45K1K67j87k99K61j85j59K38L6j65l6K75
$$ y = [337, -76, 271, 214, 262, 273, 156, 280, 167, 197, 114, 199, 149, 222, 215, 102, 99, 197, 392, 80, 206, 334, -73, 202, 185, 279, -139, 317, -9, 293, 268, 326, 236, -20, 319, -415, 155, 162, 245, -111, 29, 67, -293, 81, -261, 155, -7, 63, 147, -106, -224, -87, -4, -241, 150, -100, -260, 0, -286, 96, -224, 233, 33, -315, 81, -118, 247, -90, 168, 9, -123, -66, 8, 140, -45, 300, -209, 147, 198, 77, -154, 40, 87, 144, -26, -141, -83, -78, 13, 47, -144, 101, -226, -173, -242, -44, -131, -39, 181, -241, 11, -40, 88, -80, -122, 18, 92, -224, 61, 36, -144, 186, 48, 126, 115, 5, 147, 29, 65, -40, 355, 12, -5, -93, 76, -172, -320, 172, -204, 187, 17, 168, 53, 32, -53, -303, -107, -351, 103, -96, -43, -40, -210, -89, -210, 3, -266, -73, -128, -253, 94, 19, 130, -71, 99, -42, 136, 97, -6, 262, -63, 317, 219, 329, 166, 265, 154, -9, -17, 128, 149, 416, 229, -70, 191, 6, -153, 85, 121, -44, -80, 195]
2722A95k16M0K10k57l4j77M26l42J6L23N5j43o7J33q9L30j57k69K23j98K08M9
2744B59J41j32l6L8L6j05k18L8M1M3k39J24k17J26j21L13k10l0R9j4j62Q0j37
2767b83J09j35J65m18M25l3Jk13K77Q5j72L01l9K0k92L96J47m25M81l08o0J52
2789A81N2j82K5L35j62p2p9K70l51J96j25m6l1NJ08q0K56l34J86l22J80N0k33
2812a73R3r0K26k35j83J92j52L02j40q1J26o2R3j49m7K52o0k01M06j42K58m17
2834a84K26k07J27R8k84K31J59j14j28J68J78l74K80j15M14n99J57j92o8K05l43
2855c65M76k49J75j19J48p5k15K34q2O0k12L71j16k17L87k36J88q0J68l08K26
2876A59l4L8j23J24J9o5K6N0k63J45j93K24N0K86n33J82k12J3J55j69K47q3j17
$$ y = [195, -21, 19, 229, -28, -62, -239, 187, -155, -139, 184, 239, 96, 29, 162, 73, 403, 246, -23, 200, 2, 210, 259, 400, 268, 232, 270, 306, 201, -17, 21, 62, 105, -134, -10, -227, -101, -222, 91, -119, -149, -50, -64, -226, -146, -283, -174, -309, -144, -562, -137, -170, -169, -382, -105, -20, -192, 109, 70, 90, -202, 194, 341, -84, 397, 89, 29, 181, 233, 51, 76, 411, 249, 177, 98, 368, 17, 213, 88, 42, 11, 16, 124, 44, 300, -34, 152, -170, 10, 60, -173, -80, -170, 56, -179, -362, -170, -322, -20, -160, -241, -115, -177, -84, -233, -280, -28, -88, -289, 117, -25, 233, -184, 42, -165, -38, 60, -224, 7, 166, 52, -76, 92, 270, -104, 176, 61, 475, -124, 33, -159, -227, -22, -365, 111, -138, 37, -82, 66, -9, -224, 10, -72, -12, -224, 147, 31, -186, 201, -35, 153, 73, 241, -67, 159, 125, 163, 40, 164, 183, 118, 144, 194, -69, 76, -117, 107, 157, 443, -90, 92, -120, -107, 48, -121, 126, 43, -74]
2899g4j37J05L5j40JM4J67l10J70K80j78Q3j49m2K27J79k36j47p2K98P2m14J64
2922g4N8K33n99M39R9L3q2m1L56l33j53J82Kk37M17j82n4P8J98k31k50O27n25
2945c9p7L62k08J07j28K71l38J15Nq7j67L23R1m95J95KL7Nj39R3M3J34l75K04
2969f6L2l00K17j41j24K88J6j40pr2r2K11J34R5k13K14k27l4L91r1j65m2M16n33
2993b53L22J41r1k22Q0M44m88K39J68k85J1J53L5l57J89k62M19j96r3k54K1L24
3015D5r2K28j8j82j00J1j0j40M31j34n1J5Q0l8J34j43n8J95J3k53rK24J28Ok00
3040H2J45N2rJ38k15N8q5M0J36q7q9j93K11r0Q3L8l68n2J44J47j38R4j06j65K86
3065E7j8m8k71K96j27P3k36O21K8L50j326M35P16j90k59l21N03j06K6k5o6j87
$$ y = [-74, -211, -106, -71, -211, -210, -166, 1, -309, -139, 141, -37, 46, -103, -145, 82, 261, 25, -122, -194, 104, 176, -238, -74, -16, 217, -382, 57, 156, 189, 107, 66, 422, 89, -64, 118, 120, -117, 300, 118, 64, 142, 340, 109, -141, 486, -39, -116, 246, 38, 145, 17, 288, -50, 65, 70, -17, -184, 139, 230, -265, -70, -68, -31, -26, -165, -72, -29, 105, -270, -66, -34, -334, -117, -258, -382, -94, -78, -218, -225, -317, -409, -198, -64, 31, -182, 32, -195, -229, 162, 71, -94, -136, 280, -253, 69, 210, 119, -103, -23, 421, -67, 172, 340, 55, 66, 219, 254, -103, 86, -176, 243, 47, -46, -300, -279, 45, -47, 181, 163, -19, -119, -108, -118, -258, 173, 39, -12, 3, 83, 45, 179, 36, -22, 173, 186, -67, -76, 148, 276, 282, 82, 227, 279, 270, 408, 193, 251, 166, 206, 342, 255, 166, -27, 184, 94, 177, 215, -153, -205, -61, 86, -52, 42, -64, -229, 57, 39, -9, -280, 16, -111, -38, -274, 347, 375, 725, -601, -166, 550, 360, 101, -220, 283, 177, 203, 178, 112, -75]
3087g5N27k02J98j74m5J0K7j46K08j61O8J25p01j25N2K92J09L89p6k6N03j429
3109f52J089m44M99J19o73L28r61R87p60O42n69K27q6P6j59J93M13m25RK88j23
$$ y = [-75, 452, 250, 448, 274, 229, 239, 266, 120, 328, 167, 235, 360, -341, -466, -414, -122, -13, 376, 300, 274, 777, -652, 437, -7, 492, 611, -62, 266, -695, 292, -468, 174, -395, -168, -254, -178, -337, -144, 269, -156, -147, 141, 18]
$$ [...]
8191a2
##END NTUPLES=NMR FID
##END=
