##TITLE=1H_Pr 48-70m
 CDCl3
 8 sc, 
 18.11.2022
##JCAMPDX= 6.0         $$ Bruker NMR JCAMP-DX V2.0
##DATA TYPE= NMR FID
##DATA CLASS= NTUPLES
##ORIGIN= UXNMR, Bruker Analytische Messtechnik GmbH
##OWNER= root
$$ XWIN-NMR		Version 3.5
$$ Fri Nov 18 13:43:50 2022 Russian Standard Time (UT+4h)  she@DPX200
##.OBSERVE FREQUENCY= 200.1313499994
##.OBSERVE NUCLEUS= ^1H
##.DELAY= (6, 6)
##.ACQUISITION MODE= SIMULTANEOUS
##.ACQUISITION SCHEME= undefined
##.AVERAGES= 8
##.DIGITISER RES= 18
##SPECTROMETER/DATA SYSTEM= spect
##.PULSE SEQUENCE= zg30
##.SOLVENT NAME= CDCl3
##.SHIFT REFERENCE= (INTERNAL, CDCl3, 0, 15.7039)
##AUDIT TRAIL= $$ (NUMBER, WHEN, WHO, WHERE, WHAT)
$$ ##TITLE= Audit trail, XWIN-NMR		Version 3.5
$$ ##JCAMPDX= 5.01
$$ ##ORIGIN= Bruker BioSpin GmbH
$$ ##OWNER= she
$$ F:/spectra/data/she/nmr/H-F/1/audita.txt
$$ ##AUDIT TRAIL=  $$ (NUMBER, WHEN, WHO, WHERE, WHAT)
(   1,<2022-11-18 13:42:46.35 +0400>,<she>,<DPX200>,
      <created by zg, POWCHK disabled, PULCHK disabled
       configuration hash MD5:
       00 E9 B6 7A A2 85 ED C7 34 08 36 98 17 FE 4E 26
       data hash MD5: 16K
       37 77 99 87 A8 36 E0 7C BF 69 6F 74 AA B3 D6 66>)
$$ ##END=
$$ 
$$ hash MD5
$$ 5E 75 C0 B5 E4 84 E4 3B CE BE 84 BC 13 FB 93 C2
##$RELAX= 
##$RELAX= 
##$RELAX= 
##$RELAX= 
##$RELAX= 
##$RELAX= 
$$ Bruker specific parameters
$$ --------------------------
##$DU= <F:/spectra>
##$EXPNO= 1
##$NAME= <H-F>
##$PROCNO= 1
##$TYPE= <nmr>
##$USER= <she>
##$AMP= (0..31)
100 100 100 100 100 100 100 100 100 100 100 100 100 100 100 100 100 100 
100 100 100 100 100 100 100 100 100 100 100 100 100 100 
##$AQSEQ= 0
##$AQ_mod= 1
##$AUNM= <au_zg>
##$AUTOPOS= <>
##$BF1= 200.13
##$BF2= 200.13
##$BF3= 200.13
##$BF4= 200.13
##$BF5= 200.13
##$BF6= 200.13
##$BF7= 200.13
##$BF8= 200.13
##$BYTORDA= 1
##$CFDGTYP= 0
##$CFRGTYP= 5
##$CHEMSTR= <none>
##$CNST= (0..31)
1 1 145 1 1 1 1 1 1 1 1 1 1 1 1 1 1 1 1 1 1 1 1 1 1 1 1 1 1 1 1 1 
##$CPDPRG= <>
##$CPDPRG1= <>
##$CPDPRG2= <>
##$CPDPRG3= <>
##$CPDPRG4= <mlev>
##$CPDPRG5= <mlev>
##$CPDPRG6= <mlev>
##$CPDPRG7= <mlev>
##$CPDPRG8= <mlev>
##$CPDPRGB= <>
##$CPDPRGT= <>
##$D= (0..31)
0 1.2 0 0 0 0 0 0 0 0.06 0 0.03 0 0 0 0 0.0002 0 0 0 0 0 0 0 0 0 0 0 0 
0 0 0 
##$DATE= 1668764565
##$DBL= (0..7)
120 120 120 120 120 120 120 120 
##$DBP= (0..7)
150 150 150 150 150 150 150 150 
##$DBP07= 0
##$DBPNAM0= <>
##$DBPNAM1= <>
##$DBPNAM2= <>
##$DBPNAM3= <>
##$DBPNAM4= <>
##$DBPNAM5= <>
##$DBPNAM6= <>
##$DBPNAM7= <>
##$DBPOAL= (0..7)
0.5 0.5 0.5 0.5 0.5 0.5 0.5 0.5 
##$DBPOFFS= (0..7)
0 0 0 0 0 0 0 0 
##$DE= 6
##$DECBNUC= <off>
##$DECIM= 32
##$DECNUC= <off>
##$DECSTAT= 4
##$DIGMOD= 1
##$DIGTYP= 9
##$DL= (0..7)
0 120 120 120 120 120 120 120 
##$DP= (0..7)
150 150 150 150 150 150 150 150 
##$DP07= 0
##$DPNAME0= <>
##$DPNAME1= <>
##$DPNAME2= <>
##$DPNAME3= <>
##$DPNAME4= <>
##$DPNAME5= <>
##$DPNAME6= <>
##$DPNAME7= <>
##$DPOAL= (0..7)
0.5 0.5 0.5 0.5 0.5 0.5 0.5 0.5 
##$DPOFFS= (0..7)
0 0 0 0 0 0 0 0 
##$DQDMODE= 0
##$DR= 18
##$DS= 0
##$DSLIST= <SSSSSSSSSSSSSSS>
$$ [...]
##$SUBNAM2= <"">
##$SUBNAM3= <"">
##$SUBNAM4= <"">
##$SUBNAM5= <"">
##$SUBNAM6= <"">
##$SUBNAM7= <"">
##$SUBNAM8= <"">
##$SUBNAM9= <"">
##$SW= 18.0517283424941
##$SWIBOX= (0..15)
0 0 2 0 0 0 0 0 0 0 0 0 0 0 0 0 
##$SW_h= 3612.71676300578
##$TD= 16384
##$TD0= 1
##$TE= 0
##$TE2= 300
##$TE3= 300
##$TEG= 300
##$TL= (0..7)
0 120 120 120 120 120 120 120 
##$TP= (0..7)
150 150 150 150 150 150 150 150 
##$TP07= 0
##$TPNAME0= <>
##$TPNAME1= <>
##$TPNAME2= <>
##$TPNAME3= <>
##$TPNAME4= <>
##$TPNAME5= <>
##$TPNAME6= <>
##$TPNAME7= <>
##$TPOAL= (0..7)
0.5 0.5 0.5 0.5 0.5 0.5 0.5 0.5 
##$TPOFFS= (0..7)
0 0 0 0 0 0 0 0 
##$TUNHIN= 0
##$TUNHOUT= 0
##$TUNXOUT= 0
##$USERA1= <user>
##$USERA2= <user>
##$USERA3= <user>
##$USERA4= <user>
##$USERA5= <user>
##$V9= 5
##$VALIST= <valist>
##$VCLIST= <CCCCCCCCCCCCCCC>
##$VD= 0
##$VDLIST= <DDDDDDDDDDDDDDD>
##$VPLIST= <PPPPPPPPPPPPPPP>
##$VTLIST= <TTTTTTTTTTTTTTT>
##$WBST= 1024
##$WBSW= 4
##$XGAIN= (0..3)
0 0 0 0 
##$XL= 0
##$YL= 0
##$YMAX_a= 595449
##$YMIN_a= -547856
##$ZGOPTNS= <>
##$ZL1= 120
##$ZL2= 120
##$ZL3= 120
##$ZL4= 120
##$ABSF1= 10
##$ABSF2= 0
##$ABSG= 5
##$ABSL= 3
##$ALPHA= 0
##$AQORDER= 0
##$ASSFAC= 0
##$ASSFACI= 0
##$ASSFACX= 0
##$ASSWID= 0
##$AUNMP= <proc_1d>
##$AZFE= 0.1
##$AZFW= 0.1
##$BCFW= 1
##$BC_mod= 2
##$BYTORDP= 1
##$COROFFS= 0
##$CY= 11.3945322036743
##$DATMOD= 1
##$DC= 2
##$DFILT= <>
##$DTYPP= 0
##$F1P= 2.36226072786647
##$F2P= -0.459571619588291
##$FCOR= 0.5
##$FTSIZE= 0
##$FT_mod= 4
##$GAMMA= 1
##$GB= 0.15
##$INTBC= 1
##$INTSCL= 1
##$ISEN= 128
##$LB= 0.24
##$LEV0= 0
##$LPBIN= 0
##$MAXI= 10000
##$MC2= 0
##$MEAN= 0
##$ME_mod= 0
##$MI= 1.114404
##$NCOEF= 0
##$NC_proc= 0
##$NLEV= 6
##$NOISF1= 3.799351
##$NOISF2= 2.8
##$NSP= 1
##$NTH_PI= 0
##$NZP= 0
##$OFFSET= 15.70392
##$PC= 1
##$PHC0= -18025.95
##$PHC1= 5.200696
##$PH_mod= 1
##$PKNL= yes
##$PPARMOD= 0
##$PSCAL= 0
##$PSIGN= 0
##$REVERSE= no
##$SF= 200.130013532006
##$SI= 16384
##$SIGF1= 3
##$SIGF2= 2
##$SINO= 400
##$SIOLD= 16384
##$SREGLST= <1H.CDCl3>
##$SSB= 0
##$STSI= 0
##$STSR= 0
##$SW_p= 3612.71676300578
##$SYMM= 0
##$S_DEV= 0
##$TDeff= 0
##$TDoff= 0
##$TI= <>
##$TILT= no
##$TM1= 0
##$TM2= 0
##$TOPLEV= 0
##$USERP1= <user>
##$USERP2= <user>
##$USERP3= <user>
##$USERP4= <user>
##$USERP5= <user>
##$WDW= 1
##$XDIM= 8192
##$YMAX_p= 0
##$YMIN_p= 0
$$ End of Bruker specific parameters
$$ ---------------------------------
##NTUPLES= NMR FID
##VAR_NAME=  TIME,          FID/REAL,        FID/IMAG
##SYMBOL=    X,             R,               I
##VAR_TYPE=  INDEPENDENT,   DEPENDENT,       DEPENDENT
##VAR_FORM=  AFFN,          ASDF,            ASDF
##VAR_DIM=   8192,          8192,            8192
##UNITS=     SECONDS,       ARBITRARY UNITS, ARBITRARY UNITS
##FACTOR=    0.0002768,     1,               1
##FIRST=     0,             0,               0
##LAST=      2.2672688,     0,               0
##MIN=       0,             -547856,         0
##MAX=       2.2672688,     595449,          0
$$ Real data points
##PAGE= N=1
##DATA TABLE= (X++(R..R)), XYDATA
0@%%%%%%%%qJ6j6K4l2L6m4N6p2Q8j05J29j60J92k29K73l24L80m40N09n90O81p79
31d15Q91j016J152j305J472j654J855k078K324k590K880l198L545l925M341m791
47b512N285n827O419p071P788q581R460j0439J1542j2786J4200j5832J7737j9995
61a0612K2721k6093L0386l6075M4028n6032P6541j21123L89137j99144m90629
72c76895N69384K95714l35407m41310K02322O3647M9355n1371m4758k29660J66911
83a32068L78998q1737m34638j450M64854L1809l72649j28359K39898J30284p8882
94A6060m6663m8983N9693J70895J03220k09868j21607J80049J26899j78765j53210
105a02280O4225N323n1821M4393P284j64969J4332K81714M9268k69302m1346L03207
$$ y = [0, 0, 0, 0, 0, 0, 0, 0, 0, -8, 8, -8, 16, -16, 20, -24, 32, -40, 48, -57, 72, -88, 104, -125, 148, -176, 204, -236, 273, -317, 364, -415, 476, -540, 612, -693, 779, -875, 980, -1098, 1226, -1364, 1516, -1682, 1863, -2062, 2279, -2512, 2773, -3054, 3365, -3706, 4082, -4499, 4961, -5478, 6064, -6722, 7478, -8354, 9383, -10612, 12109, -13984, 16402, -19673, 24355, -31677, 44864, -76259, 312878, 113734, -376895, 192489, 488203, 152796, -288514, -86192, -22545, 26810, -24561, -69319, -298979, -132068, 246930, 165193, -269445, -270895, 193959, 225768, -146881, -275240, -35342, 94942, 16060, -30603, -79586, -19893, 151002, 254222, 44354, -77253, 102796, 229695, 50930, -102280, -38055, -32732, -84553, -40160, -32876, -197845, -183513, 98201, 147469, -121833, -163179, 140028]
117A40028P6067k35551q7021J41135K8790o3221L3179k4731j19441Q8415K41069
128B18718q6664k93058Q2133L29189o2780l50197j9759K43957O013j96982m2364
139a71794Q0447L6883M2620L4044p6345l3422J69123J14494j55389j36760J36944
150D0845J35988j20051j48910M8681R6513j2015m5622k0616k213N2960N9821o3495
162B1886j02948N5277J02792p9786j29518N6011R7327o2337o3268Q3015N6360
173C4811n2250J5242R1058j5963p1431M8166O1747q3225p8346O3607L4442r3534
185d5676l2842Q4300P972p8890K1378Q5534k8393o7954M7725N6877o1551n1372
197f2892N2476K7495m8210k910M9161P58j2443L9450J4021m4558Q621O1169k6770
$$ y = [140028, 216095, -19456, -106477, 34658, 63448, 227, 33406, 8675, -110766, -22351, 218718, 132054, -161004, -78871, 250318, 187538, -162659, -182418, 61539, 67552, -129430, -171794, -91347, -54464, -11844, 22200, -54145, -87567, 81556, 196050, 40661, -96099, 40845, 176833, 56782, -92128, -43447, 53066, 41051, -4571, -25187, -27400, 25560, 85381, 21886, -81062, -25785, 77007, -2779, -132297, -76286, 21041, -41296, -104564, -21549, 34811, -17439, -2197, 88861, 72898, 1467, 49633, 111380, 28155, -50191, 13416, 47858, -45676, -78518, 5782, 13754, -65136, -43758, 41776, 13383, -54571, -6846, 50031, -11520, -62892, -10416, 17079, -31131, -34041, 15120, 15878, 3435, 42885, 56906, 12348, 20969, 82138, 55368]
210E5368q8919R254O7885l5562q7415J4718O5813j0920l9937J7095K7727J357
222c536J6589J1886l7068j3132N8074J5479p7201k6371P7995L2337o5316k4975
234c5239N6860K7643k7168j0421L314j2688O344J7295l7028n1109K9779N3643
246B1225l5160n8000L8955O6964j9023m3252K6197L8101j4999j6702J2770n238
258A1838j7974J3601J0651k8996j2536L4333J1800l1202l650K9410m123k5974
270a2822Q849J5279k2474j5439K2615O441k7961l36L2905K479k1546J1105K3551
283B2646j1365j3128J8582N147k6511k877K6005p834l3110O213L0780o477k5331
296a7260P436K0691m311j1059K352J134j234Q315n30j9116j289K4349K433k6770
$$ y = [55368, -33551, -24297, 43588, 8026, -79389, -64671, 1142, -9778, -49715, -32620, -4893, -3536, 13053, 24939, -12129, -25261, 32813, 48292, -28909, -55280, 22715, 55052, -10264, -35239, 21621, 49264, 22096, 11675, 14989, 2301, 8645, 25940, -11088, -62197, -32418, 21225, -13935, -71935, -32980, 33984, 14961, -28291, -2094, 36007, 21008, 4306, 17076, 11838, -6136, 7465, 18116, -10880, -23416, 10917, 22717, -8485, -12135, 17275, 13152, -12822, -3973, 11306, -11168, -26607, -3992, 2449, -25512, -25848, 7057, 9536, -12010, -905, 22646, 11281, -1847, 16735, 21882, -4629, -7506, 18499, 10665, -22445, -16232, 14548, 8071, -17260, -9824, 10867, 6556, -4503, -2151, -1017, -2251, 6064, 5534, -13582, -14871, 9478, 11911, -14859]
310a4859q67K9544K589k5761j023K0345k131j4264N352O789j1264j173J4218l835
324C660j6722Q086J9776p975j8644Q615J7243p130j2828O196Q320n284m363L099
338B049k377m489L625J404q035r13Q215k244p997P555J1669q015q039J2996R446
353A4850j3983r331J2276O967j1196o141P808K812m735O69K555l502p4P737K1
368F733j1538l780Q967K644r398m736N075M819J783N40l059j77J0087Q242q903
383G299j0750O526Q991p811j1856k19M687k0j301r72k487K105R885N188q229q608
399g572N574J0978l425j4468m816J1952J1837l952j3453j161J7678J3283j1271
412A1184j7104O072J6790l958j9671p801O861N505r94n088p096J802J6199J0256
$$ y = [-14859, -15726, 13818, 16407, -9354, -10377, 9968, 7837, -6427, -1075, 5714, -5550, -6723, 7495, 3660, -13062, -4976, 14800, 6825, -11819, -3204, 14039, 6909, -5919, 277, 8597, 3313, -1050, 2049, -328, -4817, -1192, 212, -7823, -8736, -521, -2765, -10762, -3207, 8462, 447, -7592, 5404, 14850, 867, -8464, 3812, 10779, -417, -6558, 1250, 4062, -673, -4, 2551, -951, -1025, 6712, 6733, -4805, -8585, 382, 3026, -6372, -11108, -6033, -1214, 569, 1109, -1950, -2127, 7960, 16202, 7299, -3451, 3075, 12066, 4255, -7601, -7820, -3133, -3153, -4454, -5426, -7913, -5808, 4077, 9265, 1036, -7572, -1998, 8980, 5555, -8913, -13729, -1777, 10060, 6108, -7345, -8506, 9172, 22455, 11184, -5920, 152, 16942, 12984, -6687, -14488, -7627, -2122, -3116, -8204, -15300, -13498, 2701, 12957]
426A2957j3321j5158J3506K4511n567k8688n288K5179J1810k0205j6909J1901
438e272J8279j01j0978m982L914P152L021q697j4996l630J2097Q338j3258j7146
452b6259R715K6629L680k0977m253K4115J5148j3963j5171L393Q386j157o286
465C000p379o298L176J3442K417j8065r562K0266J7913j6467k3100Q826J9947
478H116n740j8357j208J0596N721K900J675n148o37J6247J2017j4876j8252J1433
492D487K1434j0789k9997k113K3166L206k0176o227J4552P151o104j406L004l773
506c585j632P819K148j2860p065J4502J2828j2465j4758J4939K1156j0102j9769
519h844J0487J9068j1328k0599P683J3272j5401j5908J4638J4362j6079j2944
$$ y = [12957, -364, -15522, -2016, 22495, 16928, -11760, -17048, 8131, 19941, -264, -17173, -5272, 13007, 12906, 1928, -3054, 860, 8012, 11033, 2336, -12660, -16290, -4193, 4145, -9113, -26259, -16544, 10085, 13765, -7212, -11465, 12650, 27798, 13835, -1336, 2057, 10443, 9286, 3000, -4379, -10677, -7501, 5941, 8358, -9707, -19269, 997, 18910, 2443, -20657, -11831, 8116, 2376, -15981, -17189, -6593, -872, 2028, 3703, -1445, -2082, 14165, 26182, 11306, -6946, 4487, 25921, 15132, -14865, -16978, 6188, 9394, -10782, -17009, -2457, 4694, -1410, -2816, 188, -3585, -5217, 2602, 4750, -8110, -15175, -673, 12155, -310, -15068, -129, 21027, 10925, -8844, 1643, 20711, 9383, -11216, -3533, 9739, -5662, -21570, -6932, 7430, -8649, -21593]
531b1593K0420J7167j6705j2770J9951J4030j7491j0604J5756L341j9951k133
543a0582K0192j34j9092M486K3200j340k1401l64J7596j701j9517m706J0717n41
557c187j1591r4R473K0l935Q185J0642n379q656O970J1530o263j4951Q85J3325
572F974J907j1823l130Q954M161l342N19L39p378PJ2698q21k1351m722K3122P921
588A4035k4179j2867K2745J8243j4696j5812R283J3633k623o434j549m052K55
601d018J1516J177k0728r774K3119J6841j9746k0720J5770K4200o579k2110j250
614a2302J6881P134r865r214K466P478L836r38m483l102N355J0524n29j4853q064
629i676J2015J1742j1136j8777K771J7723K331j5970o508J1231Q258k765m013
$$ y = [-21593, -1173, 15994, -711, -13481, 6470, 20500, 3009, -7595, 8161, 11502, -8449, -10582, 9610, 9476, -9616, -5130, 18070, 16730, -4671, -5035, 12561, 10860, -8657, -13363, -2646, -3187, -14778, -14872, -5399, -5379, -9314, -1129, 9513, 4134, -4522, 2448, 13978, 7715, -7236, -6351, 6974, 8881, -2942, -6072, 2882, 7043, 3701, 4220, 4559, -2819, -2812, 9886, 9065, -12286, -17008, 6114, 14035, -10144, -23011, -266, 17977, 3281, -12531, -3248, 10385, 7762, 1328, -221, -4273, -4018, 7498, 8675, -12053, -21827, 1292, 18133, -1613, -22333, -6563, 17637, 11058, -11052, -12302, 4579, 11713, 1848, -7366, -4900, 2578, 6414, 5476, 993, -2109, 3246, 13770, 13241, -1612, -9676, 2339, 14081, 2945, -15832, -13061, 4662, 6993, -8977, -15485, -4254, 4004, 1239, -2774]
642b774j692n88O413Q406n782j4263L178J7981K192j8088p622J4870J2778q668
656F341j4335M35J2403O376p386j1867q8J2814O877j1925j3323O543J5797j12
670H550j3924m628J0294Q675m040r613k342P679P518m190j0614j206R455N254
684F868p469q086L342R649J912p244n016M842P978m63p279k866N639L773m346
699A234n243P87L063J58l85n31j775J51M761K720n173l889M888N186m243o905
715e196J251O249J355m144k535K806M425P33l472k590K281L182k016n687k430
730e788K034K082j549k839j70M292M090p32l638J675O614J607o064l995M215L898
746E732l476n827J199O030J178m391k056L549L152k328m443j370J899o58l805
$$ y = [-2774, -4466, -5054, 1359, 9765, 3983, -10280, -7102, 10879, 13071, -5017, -12639, 2231, 15009, 6341, -7994, -7559, 4844, 11220, 3834, -8033, -8121, 4693, 11570, -355, -13678, -7135, 8662, 8550, -5374, -10002, 292, 8967, 4927, -4686, -7028, 651, 8169, 3979, -6635, -7841, 1614, 6868, -601, -8687, -5345, 4304, 6216, -1028, -6044, -1202, 6776, 6313, -966, -3832, 1807, 5580, 1234, -4009, -3222, -159, -1, -386, -917, -2692, -2541, 2220, 4940, -233, -4122, 766, 5952, 1709, -5196, -3945, 2304, 3659, -485, -3020, -214, 4211, 4944, 1472, -1118, 1163, 4345, 2329, -3358, -5788, -3754, -1672, -3221, -6060, -6230, -1938, 2152, 1420, -2218, -543, 6071, 7678, 1614, -2381, 1834, 5732, 2256, -3571, -2372, 3658, 4836, 445, -1611, 1938, 5090, 2762, -1681, -3051, -1152, -1810, -5615]
761e615k129J580J889O90P46J485J579K466K884K73j859q0K031q43m531k834J955
778c13J410k594j729K147K689r53j935J090J361j091k169l80k23j705j037J435
794c997J933R10M14K649L982Q67j876m01K213k74m280l587J80J10l018k465J462
811e178K667O56q38J302K215O92r33J92m80j201o94O98m97j212J780L373J185
828C727q24N21K076R16k385k953l83J52k665m435j410K292J302j189L31L466M030
845B569L38j553J272K069o03k342n42k49j729p32J724J64j436J536L036l87k564
862E71m56J011p73k593k299p87J054K65r55Q5K707L827J440l69R43K039P02j746
880D666o08m59l150j560J826o90m672o85N853K103n298j722N334K629m729l195
$$ y = [-5615, -7744, -6164, -4275, -3585, -2839, -1354, 225, 2691, 5575, 5848, 3989, 3909, 5940, 5097, 566, -2268, -313, 1097, -1497, -3226, -1079, 1610, 657, -1278, -188, 1173, 82, -2087, -2467, -2690, -4395, -5432, -3997, -2064, -1154, -740, 1909, 5891, 6758, 4882, 4481, 6694, 6420, 2140, -1447, -1267, -1157, -4175, -6640, -5178, -2511, -1855, -2693, -1391, 824, 1516, 583, 775, 295, -906, -1600, -902, -1399, -2611, -831, 2542, 3727, 2903, 3424, 5500, 6416, 4031, 1078, 695, 847, -1818, -6253, -7663, -5371, -4069, -5258, -4927, -1461, 2569, 2907, 1354, 2626, 4695, 4092, 1750, 1208, 959, -770, -1502, 222, 386, -1050, 486, 3522, 3135, 571, 115, 1126, 353, -2240, -4539, -5326, -4272, -4007, -4962, -4877, -2170, 1657, 3097, 2728, 3671, 5710, 6412, 4666, 4058, 3599, 449, -1111, 715, 25, -4647, -5332, 521, 2624, -2674, -4396, 938, 3567, -1162, -4357]
896d357K033J666j618j441K53J233J625K720J373j227k74K949K281k875m234n69
912d62K348K32l750l800J086M713M16m309n64N182J792k903j177J068k49K93J925
929A841j755m106K192O110j056o721j63P544K004n879k695L277J673j281o53k024
945a692k999K727N690l130p830L027J0097l61r282m05P675J625n266j939J647
960d16O42P36Q37l014l394K767O170j161p377r41P819M134n645n860L613P402
976F312L8p086l278M546L726m185m629J112K687q82M61J348l153j967O830N105
992F985r008p507Q812R490q336j0708O552J1133l023p489L375N755j581m97K817
1007F770k984o252L253O024o800j0679L879J0051l172r332J817Q491J764l572
$$ y = [-4357, -2324, -658, -2276, -3717, -3464, -2231, -606, 2114, 3487, 2260, 1986, 4935, 7216, 4341, 107, -462, 1886, 2118, -1632, -5432, -4346, 367, 783, -3526, -4090, 1092, 2884, -19, -1196, -128, -377, -84, 1841, 86, -4020, -1828, 4282, 3226, -3495, -3658, 3886, 5890, 11, -2684, 593, 2266, 985, 332, -1692, -4691, -1964, 3726, 596, -7234, -4207, 5890, 5529, -3753, -4158, 3517, 5142, -124, -2063, -416, 226, 962, 1799, -1215, -4609, -1842, 4328, 3167, -4210, -5151, 2668, 6802, 1157, -4703, -1090, 6312, 6350, -736, -4014, 532, 4258, 73, -4556, -3444, -757, -1639, -1178, 170, -2983, -4950, 1880, 6985, -2023, -9530, -718, 8772, 436, -10272, -3720, 7413, 4390, -3099, 276, 6031, 4450, 3953, 6770, 3786, -2466, 787, 6811, 11, -10668, -6789, 3262, 90, -9242, -7425, 1066, 2830, -742]
1021g42j378J418K386J588j664m683r28M604L121k887l311K478N526J979l267
1036D240l564J135L606j180p684m283L242K314m671k437L975L231N01K625L110
1051D160j881J53O619O85r432l094P989J170j0358l220Q678K877o373m63O117
1066C627j189m301K292J924o969m891M906K458p437k535Q845N616l065J80P242
1081F703M087j275q00p7j689j795j848m311l992L64J139j584l49K306J365N31
1097a225J906L40l046n59K610j235n565l57N940R32l249L255P943J400k460K482
1113I112K562l578l734l40l390p106j805K091k983l727M095N817m87l59N842L128
1129E138k478l01K591j990m556J406K655l060j792O080M181l058n03M985P04n720
$$ y = [-742, -2120, -702, 1684, 3272, 1608, -3075, -4003, 601, 3722, 835, -2476, 2, 5528, 7507, 4240, 676, 1811, 5417, 4237, -3447, -7730, -4488, -2174, -6845, -9282, -5307, -2076, -1575, 1050, 4160, 2279, 2432, 9051, 9736, 304, -2790, 5199, 6369, -3989, -7209, 1469, 4346, -2027, -2490, 3627, 2438, -1863, 429, 2353, -4616, -9507, -4601, -2143, -9580, -12115, -3270, 2346, -719, -539, 6703, 10790, 9515, 8715, 8638, 6949, 5154, 3306, -1005, -4997, -4633, -3494, -5078, -5427, -3121, -1756, -1225, 681, 1021, -2025, -2584, 26, -1209, -6774, -7131, -1191, -259, -3508, -253, 7690, 9090, 6630, 9112, 11674, 8096, 4362, 4022, 632, -6474, -8279, -6188, -9171, -12898, -8803, -2986, -3473, -3832, 2010, 5138, 2660, 2359, 4950, 2960, -1596, -190, 2465, -595, -2387, 3693, 7874, 4816, 4313, 9298, 10002, 4282]
1145D282l112J00m094o073j572m19k856k95N097L201R94M405N848J790k02J570
1161H664N17k868j486l61l535k920K195K381k651j002N178K251l939k224J601
1176A801k079n921k019K04l298k264L884L910q6K779Q209M263j049J584L807j808
1192A1917m841j481j368n074k882Q27j374k649K464M474p93j876K981K109l675
1207a241l452R98m29l634l84L753J218J10M629O028J071K64L576J434m213l589
1223F139j325l848n374k256j120k299j86L239J768J85L403L883j62j885J789M83
1239B434l638j875K485L17k327J943N175J349j033L160L472k550m287l74j636
1254B615o111m320j27j472k759J097L607J611J923M612L376M41J045J788j337
$$ y = [4282, 1170, 1270, -2824, -8897, -10469, -10888, -13744, -14039, -8942, -5741, -4747, -342, 5506, 7296, 7094, 8664, 9181, 6313, 4827, 4466, 931, -1989, 206, 2587, -64, -1066, 4112, 6363, 2424, 200, 1801, -278, -6199, -8218, -8014, -11312, -13576, -9692, -5782, -5868, -3089, 5120, 9383, 8334, 9918, 13725, 11917, 7076, 5595, 4227, -847, -3729, -2902, -4276, -6925, -4461, 13, -780, -2656, 325, 2434, -1241, -4693, -3695, -4124, -7758, -8142, -4389, -3171, -3061, 1568, 7596, 8667, 8931, 12507, 13941, 9728, 6139, 4814, 966, -4408, -6664, -7784, -10083, -10269, -7030, -5262, -5077, -1674, 2209, 2047, 162, 1951, 2434, -1204, -3079, -594, -277, -2604, -661, 4514, 5863, 4830, 7990, 11462, 8912, 4625, 4251, 2615, -3496, -7816, -7943, -9415, -12174, -11077, -7470, -5859, -3936, 676, 4052, 4493, 5538, 7326, 5989]
1269E989k853o36k1k491j477J535J306j017J418L142l6k342k44M96l664m594p25
1286f214l31l065j418L084K920Q56K907N049K368O61K329N39k018k179j059k522
1302A907k845j151J29j262q7K003R84m12M98J423j037k431p60M9k104j966J412
1319e650K273n3J304M364L002L14J382K670o99k602j229j172l416k961j524o11
1335d608j000L00J337M88P14J866J455j96m85L41n93j420m15Q52m1Q4J849K483
1353C011P47N94J646O51j244j439p78j696k866k265r08q90l96N58O80J128J728
1370a739J522J214O26O09j47l42m23n09j055m27P26Q39O4p1J280J185o41j065
1388A646N98l04k167j925n54n5j451k55Q35R68R54J387J441R39Q8K65N27k02j008
$$ y = [5989, 3136, 2500, 2479, -12, -1489, 46, 1352, 335, 1753, 4895, 4859, 2517, 2273, 2769, -895, -5489, -6214, -6545, -9610, -11028, -7944, -5024, -4168, -1261, 3788, 6156, 6817, 9146, 9685, 7667, 5488, 4429, 1907, -938, -2089, -1960, -3222, -3309, -1306, -322, -734, -236, 1187, 150, -2281, -3041, -2992, -5096, -7062, -5650, -3377, -3430, -2126, 2238, 5240, 5554, 6936, 9606, 8907, 6305, 5076, 3904, 488, -2473, -3997, -4608, -5608, -5308, -3971, -3483, -2769, -903, 552, 356, -129, 212, -381, -1801, -2216, -1364, -1405, -1321, 528, 3011, 3758, 4352, 5998, 6649, 5405, 3966, 3188, 1492, -1374, -3639, -4547, -5437, -5833, -5275, -4595, -3467, -1739, -217, 997, 1623, 2232, 2085, 1743, 1320, 811, -244, -671, 55, 894, 958, 887, 2167, 3352, 2711, 1646, 2244, 1940, -227, -2152, -2706, -2761, -4212, -4467, -3632, -2664, -1710, -323, 1118, 2057, 2145, 2410, 2937, 2735, 1727]
1407A727j143m83r4m85p32L28M04O98q3P4J37M66n12j340J98K20p45o91L75O79
1427a002J75L32J185P34o4M2R88L99j363j082K89L12j455j483N35P56q70j47J283
1446d36P70q38K3P92M30p95m41N37M23q37p0P68L78o17k90R94M15r68m15M14J47
1467C84o08j80J94J17l79k24O13L03m80k57N81M48m18r0O82L8p47M26M75n20q94
1488e36L62O09j063p90P47N39p75n29J309P95o96j62J421K11j267%J312o63j899
1507a075J30J661p02j749N35J831l47j139P27J183l62j272M00N67p03j169P19
1524g65R73o65m35J418J230m17n92J132O74q64j779j14L29r01j576n8P22p5m97
1543b260Q74J440L21p56J158J286j150j346J053R30j489j193J523J448j333l27
$$ y = [1727, 584, 101, 7, -478, -1210, -882, -478, 220, 137, 211, 348, 814, 302, -1038, -840, -620, -1365, -2056, -1681, -1002, -827, -495, 690, 1424, 1360, 1402, 2390, 2789, 1426, 344, 633, 945, -510, -1993, -1458, -702, -1572, -1719, -436, 334, -504, -481, 311, 741, -54, -495, 42, 465, -372, -442, 326, 704, 87, -203, 791, 1206, 238, -177, 237, 384, -224, -404, -210, -93, -472, -696, -83, 220, -260, -517, 64, 512, 94, 4, 686, 724, -23, 403, 878, 358, -536, -174, 435, -628, -1418, -671, -132, -907, -1436, -127, 668, -28, -190, 1231, 1442, 175, 175, 1487, 824, -1075, -945, 716, 14, -1735, -1200, 631, 284, -855, -128, 1055, 693, -579, -179, 388, -315, -1484, -765, 208, -457, -892, 526, 1756, 1339, 747, 1879, 2553, 1689, -90, -204, 125, -776, -2352, -2410, -1688, -1763, -2260, -1386, 54, 375, -381, 777, 2063, 913, -433, 620, 1550, 61, -1132, 391, 1839, 506, 179]
1559A79J537Q61j015o43N18n77j899n20J52j252j257Q40J245n51k30J983J761
1576A132rR5J073K31p34k94J5q80p47J22K00l18j6N46P31k46m13j91l36k97j027
1597a363j015k20M1n9k30R62J410P40M15J379J203l76n39O73j34k083j217Q84
1615D71o04j754k84J793L02j356N35J653k36j256J59N94j148j104R45M06r00L57
1633a427J828P73m2O25J464N5o01k34n86r44j199m56j020q00M94K22j76J26J386
1652e12Q32n55N97P69o92n85L03lr89p6J109K75n67Q53J242k12l05R0K00j106
1672F68r22k46p17j309q5P13j34k74J425J247q4mJ418M27r96k46O21o89j063o6
1692c16O38n24m90P65O44m19k54Q79q6j054n75L12p50q33K69L48j92K69J298M19
$$ y = [179, 1716, 2577, 1562, 919, 1437, 860, -1039, -1559, -1407, -2659, -3916, -3076, -1831, -2382, -2612, -629, 1132, 1123, 1218, 2291, 2522, 1788, 1494, 1509, 629, -118, 4, 204, -114, -130, 416, 1147, 901, 488, 297, -39, -336, -1363, -2378, -2598, -2557, -2616, -2846, -1884, -474, 266, 681, 2060, 3263, 2887, 2348, 3021, 2887, 804, -413, 471, -133, -1887, -2171, -378, -76, -1432, -897, 756, 520, -736, -577, 17, -1131, -2235, -1290, -884, -1784, -1427, 401, 1174, 1132, 1757, 3221, 3276, 2675, 2441, 1855, 911, -288, -744, -1764, -2564, -2070, -1848, -2024, -1898, -512, 320, -235, 362, 1131, 439, -146, 157, 154, -835, -911, 198, 473, -94, 759, 2001, 1789, 1484, 1574, 1774, 668, -254, -500, -1217, -2526, -2611, -1898, -2032, -2306, -881, 366, 282, 278, 1696, 2123, 1127, 881, 1502, 813, -250, -316, 322, -202, -692, 73, 717, 298, 44, 923, 837, -217, -792, -480, -1230, -2063, -1794, -1446, -1638, -1369, -71, 348]
1712C48J20P48R24m27l96N24j25j465m94M88o12r07K95P98m26n16Q05Q61j011
1731d68k55Q18pq30k31M36l3j43L81Q18L4Q5O80K94l09k9L74p97r92L74j29j022
1753i51m40P20k26m83P77P90l92l32O36N73o31n44P31K66j104J66Q38R0p83L16
1773A7R37j86n01M32K36q21m38L89N3q18l3L89l64lL92K74k73K18P02l19l74M88
1795C97J40n09k68O28k94n83J53L51R4n61L94O36n69k03P09m1n38k24Q70l24p50
1816d92M75K52n14l08Q52J20q04N8Q78l51o91L81O27m73q30O43N18o12n67Q69
1836C1L19n00q4P54J06o05L90O03k81o91K05j06n45L6J70j31m06M43L5m04M70
1857a91M13j98l73O37N8m89m73Q80J51n87n4R41q4p70N87P88m20p98K79N03p91
$$ y = [348, 468, 1216, 2140, 1713, 1317, 1841, 1716, 251, -243, 245, -367, -1274, -979, -181, -607, -1123, -318, 543, -468, -723, 95, 88, -742, -973, -537, -570, -713, -332, 486, 520, 605, 1285, 1579, 1270, 1241, 1615, 818, -174, 200, 71, -951, -1391, -671, -897, -1380, -603, 187, -205, -537, 99, 672, 41, -503, 228, 494, -610, -444, 394, 484, -299, 17, 954, 768, 267, 699, 935, 114, -324, 65, 118, -700, -733, -344, -708, -711, -319, -45, -318, -100, 602, 283, -91, 397, 537, 28, -240, 388, 94, -489, -336, 15, 109, -452, -58, 578, 9, -194, 515, 474, -64, -288, 582, 258, -492, -17, 235, -279, -587, 265, 385, -419, -361, 517, 166, -525, -144, 483, 10, -820, -177, 341, -271, -838, 31, 350, -150, -234, 520, 626, 21, 411, 1014, 733, 42, 247, 141, -404, -368, -198, -329, -735, -292, -257, -661, -191, 222, 24, -349, 288, 346, -143, -616, 264, 415, -172, -226, 715, 631, -139, 448, 1236, 816, 18, 297, 800, 9]
1878Ip87L80J13q72j48P82J15j55J28O16p6N5K67K20m17j81K02j26k26J95n9m4
1900iL9M55r6k30J46K68l96n59L33k32o94k15P72Q9l71J74Q85J35l36O53M59n71
1922F99n31M65q8q89j77L39n4m95O1O85K6m83L52L79Rn33j65M25k62l37L14J14
1944a46N8J09K90M00J12R6r1P1q7n23m02R9n74n81K7L92J17l68K57P10K62l36
1966a08J99Q25m41m75P5L52k19m55J53O11j7l30M66L18j75n99k6N06r11o61J9
1987h93K58m73m06N58N55j16P8O66N04j44j83M47K32m52o14K20J40n51N9M85j1
2008C59l92J3L65n9n49O1J33l04o11M4L65l21j4L25O22L06j74M49K82o3J1j62
2030F86J59m54m34M8O9l16r6N7M51l18r0J22J69K9n91R2K92k61m37M00L15k28
$$ y = [9, -778, -398, -285, -1157, -1305, -523, -408, -563, -435, 181, 105, 160, 427, 647, 230, 49, 251, 125, -101, 94, 35, -9, 30, 485, 389, 159, 305, 573, 177, -382, -49, -281, -975, -1190, -418, -329, -700, -526, 359, 494, 158, 811, 1270, 699, 168, 633, 545, -344, -521, -182, -236, -731, -670, 15, 41, -442, -90, 289, 298, -235, -400, 25, -237, -574, -260, -146, -88, 21, 311, 711, 823, 919, 828, 899, 812, 289, -113, -14, -588, -1169, -1142, -750, -633, -1001, -744, -34, 228, -108, 91, 916, 475, 0, 75, 427, 208, -247, -94, 517, 500, 170, 636, 954, 779, 180, 154, 660, -251, -912, -893, -635, -1108, -1514, -956, -401, -517, -439, 227, 731, 587, 404, 851, 1083, 631, 17, 237, 377, -174, -115, 370, 359, -33, -20, 345, 286, -263, -202, -69, -373, -984, -940, -575, -896, -910, -585, 37, 343, 169, 618, 900, 837, 848, 686, 845, 391, -43, 5, 74, -242, -338, -281, 170, -148, -238, -116, 53, 82, -509, -417, -125, -386, -823, -423, -108, -336]
2052c36q0Q17M38n19J4P16j70o29l35M63L5r09Q9K77j32m42L30P12k22o26M91
2073a8K90k94m9J42J02l15o0J84J0j23J29J66R8J57j94k21K21l2k15j72J08J46
2095F0k50m8K46K12k74n5M20jl03q3N63k63k78n7L35j38n05L30J90l37j53M50
2117F1J54m61QK23J90l07L5M89j36l58M42J41m08l58L61Q1j52n0K76q4l84K18
2139a9K54l60r4K94k49j0j79L08k24q9J52L41j88N5M54p6j06Q7L29l59l08J8p2
2162d1l88n4K76k38j15L03N95k56k05N97L54n48j99R0O9k40j17L8J26j89K08K10
2184B76q6k0K92j88j97k43j29k86j70j7J15k74N10L64K47O2N39L14r7j23J65q5
2206I69o83k74j00j30n69J21N02k44LK98M74k90k51Q8j98l68k76J68k02K19L54
$$ y = [-336, -416, 401, 839, 320, 334, 1050, 880, 251, -84, 379, 414, -495, -406, -129, -261, -703, -373, 339, 117, -509, -18, 272, -22, -71, 71, 173, -142, -202, -18, -8, -131, -2, 164, 262, 419, 225, 4, 225, 193, -22, -194, -86, 60, -190, -238, 8, 220, -54, -109, 311, 310, 7, -76, 487, 224, -54, -111, 224, 86, -419, -89, 101, -236, -389, 61, 215, -246, -238, -15, 175, -132, -97, 392, 256, -102, 340, 481, 73, -285, 76, 157, 5, -45, 231, 147, -237, -19, 235, -125, -219, 75, -174, -184, -363, -55, -279, -368, -216, 125, -63, -8, 446, 370, 264, 351, 680, 321, 13, 31, -41, -429, -483, -207, -445, -560, -257, 338, 82, -123, 474, 828, 280, 81, 171, 240, 0, -117, -79, 47, -142, 66, 276, 190, 170, 462, 274, 77, -166, -295, -581, -751, -768, -653, -927, -417, -53, 194, 256, 795, 1109, 1012, 889, 1054, 969, 286, 12, -88, -218, -787, -666, -164, -408, -405, -107, 367, 77, -174, -86, -284, -652, -928, -760, -962, -743, -389]
2227c89P01J66J28P96L68m00O4j04l65n03o45l54n37n09N57j45lL79O87r0J46
2248e2Q3L38l58k52N9l0l72K89M51P2L19N69N76j05oJ14r2j001o70j92p89r72
2270b021j90K68j27L00P19N90L54L81O30K29k62n9K3m72l13J37r7Q7K82M34J40
2291A033M9J10K2m89o00l71p24p86m73%L2r5O62Q68M56P30J098N24j50k79K42
2312A859l93p38m87j83l85m13L82K04O8J35L69J83k93m90k39l84n87m16M1l1K31
2333a567M55R09O28Q55Q85J55J16M4l95q64n47q40l73q15k83P7%L94N93L70N4
2354a49K78J37j11l72l87j4k68J2PQ11J98N18O57O65J02K43p1l98r97p14q22o89
2376a364p49k12M8J30L18R03N30N17M06K83K57l78k5l77o1j52k33J66J47N09L49
$$ y = [-389, 312, 478, 606, 1402, 1770, 1370, 1434, 1330, 965, 462, -183, -537, -1074, -1583, -1026, -1171, -1174, -795, -108, -198, -52, 31, 369, 11, -241, -182, -212, -584, -295, 156, 228, 547, 1116, 1692, 1587, 1581, 1695, 1603, 602, -68, -260, -1049, -2021, -2211, -1943, -2070, -1770, -1051, -461, -107, 274, 904, 1133, 871, 812, 835, 363, 50, 187, 90, 177, 459, 893, 1033, 1082, 1192, 1214, 725, 125, -246, -970, -1756, -2229, -2229, -2197, -2292, -1630, -762, -306, 424, 1522, 2046, 1896, 1617, 1859, 1466, 728, 241, 58, -327, -740, -358, -154, -86, 49, 418, 601, 308, -182, -421, -805, -1392, -1808, -1767, -1798, -1567, -1112, -203, 425, 1280, 2165, 2320, 2436, 2480, 2085, 1221, 674, -166, -539, -1354, -1637, -1560, -1560, -1166, -573, -203, -149, 129, 266, 155, -217, -604, -618, -886, -874, -867, -56, 142, 660, 1317, 1982, 2084, 2327, 2256, 1858, 861, 147, -675, -1364, -2113, -2325, -2277, -2147, -1829, -926, -396, 121, 527, 810, 1067, 689, 664, 287, 226, 74, -159, 7, 154, 663, 1012]
2397A012K57K84J4l24n05o52m34p45r92m0l16N1J23P85P98M78O93Q80N75j79j43
2418A620N0n75m76l38j05k38j72J84K88j21J24L47j0l12m97l11l97n64l36j28
2438a967L42J25N64O42Q41O20M39K36K89k78l95j75n56p88n58p8k64J07j34M73
2458e15K26JJ39J02J17l45m48J4jk96J93K36L98J77O94L45M27R6p5m1k37p30m61
2481A6k29n91l73j48N9L59L0Q0O36J14K65J01O7J6n31K43o9k59n0J06M09J89P
2504D47K91K97j39o3k48k49n47l73j56j89k10K4L08K08M17K5N48K23K7M3o6Pk94
2527C31k95q1RO4j79j4J28J19oK12l4k33j42k64K98l59j24N4J42j95L06L71K25
2550C33Q1r5J99Q7j92j53L0n7l81l7K71l75P4Q5%p6o5J98K48k31l8q1J5o8K40
$$ y = [1012, 1269, 1553, 1567, 1243, 738, 86, -348, -1093, -2085, -2125, -2441, -2390, -2267, -1482, -684, -206, 487, 1367, 1942, 1763, 1620, 1670, 1095, 619, 281, 176, -62, -234, -50, 238, 117, 241, 588, 578, 266, -231, -542, -939, -1503, -1839, -1967, -1625, -1500, -936, -294, 547, 1167, 1606, 1842, 2131, 1853, 1458, 1283, 727, -61, -619, -697, -961, -854, -988, -515, -289, -288, -149, -47, 70, -275, -723, -709, -710, -1006, -813, -577, -179, -2, 692, 1037, 1464, 1560, 1485, 1444, 1207, 477, 16, -213, -804, -1177, -1325, -1266, -907, -877, -797, -161, -47, 218, 319, 386, 402, -129, 114, 45, -214, -264, -158, 251, 440, 447, 738, 1035, 896, 833, 585, 336, -211, -584, -740, -929, -1139, -1115, -807, -599, -182, -157, 391, 614, 641, 684, 618, 625, 331, 36, -45, -36, 28, -151, -165, -37, 82, 76, 288, 254, 21, -121, -385, -87, -446, -570, -516, -374, -569, -263, 108, 333, 414, 319, 518, 605, 413, 260, 290, 233, -148, -185, 86, -289, -215, -130, -130, -206, -271, -73, 175, -56, -94, -175, -160, -228, 12]
2575A2J97l03K39J53j04j9J16j27j43J87n1k23J83l01J71j65j54J38Q7J0m4K11
2597G0j34J2J39J11j40r7J98J19l76l6J92J16l77k3K0J65L4J1JJ58L0j04K08L8
2621C35j22p5O3l09J38p9j37o9N7J25k21K91M2J06k19J79J45l25L0QQ0l09J56
2644a10k5P0L8L58L39l49J29J66l98L5n2n4l32k59p3J01j61M9J51J60n3K60L21
2667C11j19j69J49J88k90j11J65J8k92J38K08K16j01N0J39P2l94o5k53k79k30
2688f49J56Nq7k24L98K09K12J63K05k00P2K13j76k98J25j76R5M6r6K26j69N5J73
2711B78Nj56p7j5k41j15j33j23j05J74J69J5J01K50L08R7k6J15O1k10j40l4q9
2734A09l31o6P0l2J38K04J8l6j62K14j39r0k67J87l41L9KL87R9j94N55J69j54
$$ y = [12, 209, -94, 145, 298, 194, 175, 291, 164, 21, 208, 157, -66, 117, -184, -13, -178, -332, -194, -107, -97, -141, 70, -64, -52, 87, 198, 58, -39, 159, 278, -98, -134, 58, 174, -203, -226, -206, -41, -7, 4, 5, 163, 193, 89, 297, 335, 213, 138, 201, -108, 30, -49, -186, -255, -198, -73, -294, -3, 39, 145, -74, 105, 250, -75, -45, -37, 43, -266, -110, -135, -65, -27, 331, 670, 321, 450, 616, 218, 253, 201, 147, -185, -444, -517, -416, -577, -528, -377, -217, -270, -10, 311, 192, 23, 172, 360, 70, -41, 124, 142, -150, -12, 196, 412, 311, 361, 500, 572, 178, 113, -140, -419, -649, -493, -488, -575, -799, -401, -192, 20, 183, 388, 188, 260, 473, 297, -1, 124, -52, 43, 89, -7, 219, 50, 105, 278, 283, 127, 50, 35, -206, -321, -454, -577, -682, -508, -339, -324, -223, 27, 335, 432, 406, 521, 582, 372, 232, 198, 109, -222, -288, -218, -250, -112, 92, 110, 74, -88, 126, -13, -103, -370, -183, -524, -485, -483, -96, 3, -191, 364, 533, 379]
2757C79J6K22p2l12k4M7m72j75Q1l7j78n6K76L41m2J94M8j88j7J26L2m04N5O7
2781i3P5j62K61J97J66Q5J46p4j02k39j46k45l11j18M6p2p7K28K25q2J66K94J29
2804B97n3K69ql10k02R9J84k10k74K74kK1K40o9J1k16P8r0m38k15J59M4m04J56
2828f59L99O2Q2L23J12K9J22M3J37m27J1K2k35j72J7p9J58j59L98M8k06N4r5l6
2852e1k18n7K3k04N1K31K5k2K63J84K39OM3J56k98O1j57k48j68m7jk3k43K43n9
2877b71J68M9J93j36K4J23k92mq6RJ45P6qJ05J47N1o9LK37l06N7l2l38r3K06k26
2903b68k8M1M2J3O6J70J22k6j35J43M4j98j11N8L3k89L42N7k11J03K3K83%p5j20
2928G9l9j31O8j17j0m1J11L7j09J0K18J02o6M4R6r8j19p7k8O8n7J24j38m5p9K88
$$ y = [379, 395, 617, 545, 233, 209, 256, -216, -391, -310, -347, -525, -581, -305, 36, -6, 188, 236, 48, 31, 157, 189, -215, -160, -93, -18, -180, 81, 278, 444, 529, 675, 601, 499, 260, 114, -131, -442, -560, -514, -586, -663, -435, -210, -292, -126, 168, 297, 244, 513, 505, 195, -7, 92, 276, 66, -208, 66, 64, 85, 325, 256, 267, 51, 129, 39, -399, -614, -455, -411, -815, -659, -260, -198, -116, 207, 319, 348, 470, 513, 650, 223, 234, 256, 21, -151, -134, -213, -55, -214, 184, 232, 26, 80, -15, -51, -269, -326, -303, -507, -456, -225, -200, -222, 41, 225, 464, 470, 513, 669, 371, 432, 275, 27, -141, -188, -189, -212, -455, -212, -271, -103, -54, 139, 3, 27, 150, -142, -146, -232, -223, -78, -2, -10, 95, 242, 293, 224, 227, 464, 158, 215, 183, -155, -248, -42, -268, -296, -255, -213, -200, -134, 36, 158, 132, -3, 140, 184, -14, -125, -67, -34, -323, 19, 76, -135, -32, -9, 274, 274, 199, 79, 40, -91, -23, -140, -150, -191, -80, -43, -152, -142, 76, 178, 112, 156, 252, 154, 35, -42, -70, -2, -59, 65, -73, -118, -197, 91]
2954I1p0l3k4Q0Q7j26j6J06o2p7Ln2mJ34N8p5J73J46j93j66Qo7O3j97Q9O7r6J45
2982hk35J85Nm3Q8K06j24l1j11J97n5L0p5om4N5J12l48K11n3q5J93J0J20k56J89
3008A27j25j33k4Q3J37j27LOJ87k07K98j02j12J95n2K2k08N1k01J69k1m4j23K51
3032E0j39J32O2l2J9q9J57L5j65P1j90q0Q4R5p7K80k16R4j84K20j13k27K58l5
3056A0l9m1j95P6J93j91J86K33j15k9o6J55J78j41Rn9j64k2k7r1P6k36o9K99j53
3081b23Q6J04nJ37Ml30R7J50n3R8k2L9P4K8K4k5J61J1j04r1l36K04j82P3k59L0
3107c10n2l3K14O3L6J19p4K76j04j5OM0j17N0p1J44n6j34R7J32l8q7K2k0Q8m68
3133b92K09K3k99j7j15L18m8o1J01J96J30J17n8NP2j48J8J81k15k59J22J99k82
$$ y = [91, 21, -12, -36, 44, 131, 5, -11, 95, 33, -44, -41, -93, -97, 37, 95, 20, 193, 339, 146, -20, -12, -79, -16, -213, -124, -57, -153, -8, -243, -58, -53, -96, -8, 198, 74, 43, -68, 129, 74, 104, 29, 23, -21, 34, 146, -202, 9, -44, -129, 64, 74, 194, -62, 127, 2, -131, -155, -72, 65, -62, -59, -53, 134, -73, 225, 123, 11, 206, 154, 176, -32, 19, -182, -13, -34, -78, -201, 50, -89, 43, 105, 73, 92, 3, 160, 195, 30, 101, -89, -169, -85, 10, -67, 213, -3, 91, -93, 127, 14, -213, 45, 10, -29, -70, -265, -189, 4, -187, -1, 232, 117, 88, 22, 177, 355, 214, 223, 164, 0, -22, -49, -140, -64, -300, -369, -70, -223, -137, -33, -38, 99, 103, -227, -130, 20, -33, 65, 43, 82, 156, 184, 208, 183, 344, 355, 251, 160, -176, 28, -154, -81, -340, -310, -362, -395, -181, -118, -82, 37, -37, 239, 135, 120, 126, 166, 49, 99, 28, 172, 116, -18, 79, 211, 173, 86, 108, 88, 176, -292, -83, -60, -359, -376, -491, -173, -221, -282, -181, 15, 145, 262, 204, 209, 281, 133, 151, 332, 117, -142, -20, 179, -103]
3156a03J57J50k32Q6j28Q9j16k34N3J15Oq3J97k29K70N7J52O5R2k15K64l2k08
3179A73j32k2j43p3j6O2O1J07M2k69K89m3k3LJj01q5N4J10J24k69J97Q6r2J14
3204A55O3J9j02Rj51M5k08q4LK5J14j25K21O0j08J69m1o1M9M3Q5O5j38j09J23
3229A21n7j37K06j46R7l8M1k2j01n3k2K5j12J13j96K27O4j86K20P6O4j16J0R1
3253A69J33k26R9j12Q3m2j97J0o7M5M2L1P1j72P3rn9o5L03j41j00J10P9P2q7q7
3279d4M8M3N6J8K1j20l8j09K74j8j09M6n6L6j15j07O9J05m7pj32J59J91n5r5q0
3305f6o3J40j9p3L4r8J76o0m4O6M8%j04J4J67k0LQ8r8J30j78o0K00j69r1m9J15
3332a1O4j37J14JP2j16n5k5o5q6n9P6R1L9K25m7J96j35J02j06j1l4j9r2Rj41n8
$$ y = [-103, 54, 204, -28, 58, -70, 19, -97, -331, -278, -163, -157, -240, -43, -272, -2, 55, 207, 272, 364, 149, 413, 381, 173, 41, 19, -124, -197, -213, -151, -90, 17, 59, -210, 79, 36, 13, 16, 17, -84, -169, -115, -5, 119, -150, 47, 133, 41, 155, 218, 237, 135, 144, -7, 38, -170, -254, -251, -226, -112, -237, -16, 44, -64, 105, 64, 3, 52, 95, 180, 245, 107, -2, 121, 64, -73, 133, -13, 84, 46, 87, 65, -36, -89, -111, -86, -198, -85, -281, -54, 10, -176, 44, 120, 184, 68, 78, 169, 302, 76, 175, 63, 146, 104, -93, -83, -150, -105, -63, -32, 39, -133, -60, -69, -128, -193, 110, -31, -131, -21, 58, 130, 43, -44, 4, 47, 103, 121, 142, 22, -16, -125, 149, 131, 22, 68, 12, 48, -67, -174, -105, 0, -47, -54, -186, -27, 164, 109, 14, -66, -129, 11, -8, -81, -47, -145, 31, -29, -73, -7, 41, 41, -63, -49, 118, 98, 101, 189, 91, 221, 43, -17, 183, 14, -77, -126, -11, 53, -84, 30, 31, 103, -13, -68, -93, -158, -244, -303, -227, -136, -97, 128, 81, 277, 142, 244, 138, 127, 93, 74, -18, -9, -150, -208]
3359b08P8R0j74J83o3K12o0K00k89J59j36N5Q2m84J77J56K61j73J69P7J43j66
3381B89j32K43l01p0j66L8k00j45J62nN6L4N8J69J0N9J87j14q1o1R7p8k8L4o9
3406a4R2OJ65j08K24%k07O4l41o3r5j26O3j16J08o8L73k7J50L9L18kj71N2j68
3431A48Kj16j7j25N2j00J10O7j46J54j1J51j52J1j93n0j19j29J7O0K64O0K26J3
3455A77M0L85l7l2j06k45j91L1j60j78J02q5Q0QJ04J78M3Pj75Ql2k3k23n9K23
3480a60J10MP2K38J31J39q7J14M6k07l12n2j92j61Nr7L8qj6L02m8j16K40K26K5
3505B34Jn9j12r0l1j24K53%kK34J16j02P4k8l5j94m65Q7j76j19q4p9J30L06k24
3530d89M88J1J33R1J53M9r6m0q9j97o2J55p9kq0J96l5P1l8L9m21L1o7j20p2O7
$$ y = [-208, -130, -40, -214, -31, -94, 118, 58, 258, -31, 128, -8, 47, 129, -355, -178, -22, 239, 66, 235, 312, 455, 289, 157, 400, 99, 29, -137, -99, -299, -444, -282, -287, -231, -197, -139, 30, 40, 99, 286, 172, 91, 30, 127, 49, 21, 55, -14, 78, 84, 249, 141, 365, 365, 158, 222, -119, -182, -277, -403, -340, -456, -348, -416, -43, -70, 80, 119, 437, 435, 264, 316, 148, 150, 34, 17, -108, -56, -156, -46, 21, -125, 29, 18, 169, 17, 28, -165, -215, -334, -463, -446, -386, -122, -62, 164, 177, 217, 602, 565, 533, 427, 182, -9, 22, -138, -316, -214, -299, -219, -211, -107, 71, 114, 121, -54, -46, -78, -101, -324, -383, -160, -50, -46, 26, 264, 395, 534, 447, 561, 607, 400, 88, 36, -156, -317, -312, -409, -371, -379, -395, -93, -141, -257, -17, 209, 234, 235, 176, 64, -26, -57, -181, 72, 72, 70, 304, 420, 318, 392, 364, 329, 135, -330, -243, -419, -538, -622, -701, -571, -265, -489, -1, 10, 143, 234, 387, 436, 340, 300, 211, 14, -48, 107, 28, 26, -54, 142, 107, 178, 140, 179, -242, -211, -278, -398, -470, -403]
3556d03M4J12n5J57J27K65j06K97j3Q4q0m3Ok79l01k1N0Rr7J36J2K72k20N7l4
3581b4Rj80m1j28J29J1j09O8N45j87K80l1J91r6Q5k34j21j52j7l96J31J07l43
3604e03K05O5J89l7J94K0o1J28Np0k75PJ15j1M8M4K3o4J14K16j53R0m1j73j46
3629g1j6r4k11J32k1n3J15J19J95m1l6M4J49m1R3j12o8J3j95K53k04n9J63J18
3653A72J19k96J29j39r3o4j33Q3l1q4j6J21J36J06K01j27K10j13J8K42l61m1N7
3676I6o8m8j69O3N2k8L8J03k09P5O9M9k39K30j29K2P9k32K14k4J0K0R6J74j6o0
3702A68k4O6p8j97J16L2J10j96k8o0j22J82j37K50j29k9L1o2K0J46q0Q3Pj91J84
3727F2N1m1o2P0M8j00l3J50j67j94J36r2J77J8p2l4J58j2p4K4J6K1j66K8l4J86
$$ y = [-403, -359, -247, -302, -145, -18, 247, 141, 438, 425, 509, 429, 386, 392, 113, -188, -209, -159, -150, -247, -111, -99, 173, -47, 10, -24, -15, -195, -236, -364, -235, -224, -333, -265, 280, 93, 373, 342, 533, 437, 522, 288, 167, 15, -2, -398, -267, -160, -503, -298, -233, -44, -81, 113, 133, 72, 200, 205, 135, -140, -133, -18, -29, 19, 63, 86, 22, 136, 352, 199, 289, 248, 75, -71, -87, -181, -392, -260, -281, -334, -219, -100, 95, 54, 18, 62, 211, 170, 263, 151, 83, 96, -99, 154, -50, -109, 54, 172, 291, -5, 124, -15, -108, -172, -305, -222, -253, -337, -353, -232, -96, 10, 211, 84, 294, 181, 199, 441, 80, 39, 96, 28, -20, -189, -126, -74, -102, -64, 39, -170, -95, -26, 23, -216, 14, -115, -93, -14, -246, -32, -56, -46, -26, 70, 244, 228, 168, 144, 210, 132, -65, 51, 83, 193, -3, -31, -91, -213, -31, -168, 82, -47, -76, -45, -107, -87, 59, -21, 62, 69, -122, 62, 113, 72, 10, 80, 128, 28, -5, 145, -22, -216, -80, -172, 5, 23, -49, -83, 75, 63, -11, 13, 29, 50, -116, -88, -122, 64]
3753F4j22J99qj82M9j76J56nrM5O7k9K2J9J09r2q0Q0k16RJ58j44M0J0j47J33m9
3780i9MJ04m6N9j87L87k56kJ36j66j19J72j16K55j28l5J70l9J72l8j48j07J30
3803A03j17J20k82K05j00k63J26J41J00k62J76J03J66Q5k47nK5j87M2Q8l4k1j6
3826e4J27N7j82R2o3J00o5l4J08k10L4j35K32j16J23L8K9p3J97J8j17KL0j20J
3851A9m7k96J8L84j52q2J92N1j48P3J16j23q8P5j1j25P8j71L39m8j08Q0J74j50
3875E0K82j23l3m5k58K55j05j36O8k55J06l0J28n6K48j9J48j89Po1K72m28J68
3898fJ44j72k0Q7R0k8QJ31pr1m7j19j9j36q9l4O0j7J19o4K77oR7JM1J9j41q0j57
3927a59J99j3j41P6J4L5NJ97q6O5q5o2j14k43L22k33M3j18R8PJ09R9O3j0J78r5
$$ y = [64, -58, 141, 133, -49, 0, -176, -20, -25, -34, 11, 78, 49, 71, 90, 199, 107, 27, 107, -109, -100, 58, -86, -46, -36, -183, -50, -99, -95, 9, -37, 22, -165, 222, -34, -36, 100, -66, -185, -13, -129, 126, -2, -37, 133, 94, 266, 228, 80, -27, 103, -14, 106, -176, 29, -71, -334, -208, -67, 33, -229, -53, 50, 216, 301, 54, 49, 74, -113, -71, 17, -17, -38, -54, 73, 130, -52, 40, -23, 77, 12, -22, 86, -124, -90, -225, 7, -109, 14, 52, 81, 8, 205, 223, 106, 108, 138, 18, 19, -28, -324, -306, 78, -74, -156, 36, 87, -61, 12, 128, 5, -83, -8, -19, -144, -66, -237, 102, 54, -54, 26, 200, 50, 332, 209, 176, 131, -127, 128, 23, -113, -45, -300, -194, -224, -96, -152, 96, 77, 225, 36, 43, -18, 254, -174, -6, 138, -34, -54, 33, 123, 95, 103, 234, 227, 136, 89, -30, -49, -185, -274, -308, -248, -265, -146, -210, 67, 61, 158, 159, 200, 219, 78, -2, -159, 40, 27, -114, -38, -24, 11, 16, 213, 127, 192, 107, 45, -69, -312, 10, -223, -180, -298, -200, -193, -84, 15, 78, 68, 246, 151]
3953A51J15j53k3O7r8o1j22J4J91j1j96Q2P8N5P3k53J35j1q9k16k1K54r3r8J44
3978h6Q2J94j77L29k00J20l5o5%m9k10Q0r8Op8L40k96J87P0j7j19M5N4ok17j37
4004b83K60p7j42J70k8M9K29M6R0k25J09k75O1pQLn4jj5J54k55J50L00l53j12
4029a98L15o8J86j72J17q8j96L73k85j05J1J16J28k32k2K25j81n2j6L6p5R1k10
4052c02K11J84j40l2J28K17k07J7N7%j8r9R6j69q9m0J71j47j7KL51j66m5J09j33
4077f1L9n9j45L28j21j49J56k9J8lJ31K0l2M8j55O8p5Q3q4k14M5PO8Q5N2j70J61
4104A2j6j23L7J38j2j41R3k1qlO7o7N5o9j08J62K15k8j05N5j46O2r6O0l0m2Q9
4131C0k22J77O6j30J30J39k4o0RJ6j84J8N1r3oL7Q3m7l9J25OK5o5R4oj53M0k0
$$ y = [151, 266, 113, 90, 157, 59, -2, -124, -110, 81, 70, -126, -44, 34, 89, 162, -91, 44, 33, -56, -272, -293, -39, -132, -230, -86, -4, 190, 13, 342, 142, 262, 227, 162, 162, 113, -97, -17, -115, -109, -187, 153, -143, 44, 114, 97, -22, 23, 77, 71, -146, -283, -23, -100, -242, -72, -100, -51, 178, 224, 314, 89, 198, -77, -16, -23, -15, -12, -66, -67, -82, 72, -183, -33, 267, -86, -198, 117, 49, 235, 63, 180, 92, -104, 269, -16, -121, -110, 6, 134, -98, -120, 105, -76, -128, -144, -108, -183, -92, -302, -91, 93, -47, -79, 49, 266, 59, 76, 133, 133, 115, 16, 112, -57, -146, -186, -15, -162, -179, -177, 174, 8, -37, 72, -61, -22, -81, -226, 102, -19, -168, -12, -41, -23, -26, 105, 125, 93, 141, -14, 54, -21, 62, -22, -236, -191, -184, -116, -31, 21, -149, 12, -4, -127, -90, 48, 36, -105, -12, -33, -41, -44, 23, -44, 11, -58, -166, -4, 211, 183, 78, 133, -13, 49, -47, 13, -17, -59, 30, -192, -15, 51, -79, 51, 190, 166, 106, 115, 131, -53, -35, 16, -77, -83, -46, 37, -10, -49, 76, 82, 107, 42, 136, 130, -23, 17, -3]
4159cJ21j25n0P7J3k20K19j07J33r3O1j9J59j56l21L47j79N7o4j2J2L00k02O1
4183IJ76j15j14N4LOQ9j39M4q7M4P0j01NN8q5K33M8l44J51l3jJ52k75J52j24J70
4210D6m7k3J58p0J1J05n5Nj02M3j16J6N2oMr7k0O3P7k85J75K28j59J49l7R2j60
4237D7j11r9R4Q6n7K28k6oo8o0R4p0Or7p1k7J13p9q7K36Kj17l6J90r2K8j30K13
4265A04n4m4m2L3j2L3O7r4l4j98K77p0N8P0n9J01Jj0j68Q3j52O2M2k6R8n4J42
4292A54j31R4J9R7j14j29N5j80R6L1nj59K97k14L6J21r0P6n5K2j7k7j30R2L8o3
4318h6J79j11J87j42J83k83J86q4K3N0k01J9j2J15j27M6K4j9p8n6K61J05k30K37
4342A86oj73k3Q1q1J64o9R6j53n5n1J90k7j5L6j72n4Q4k48K35o9k7K8l3%K06K46
$$ y = [-3, 118, -7, -57, 20, 33, -187, 32, -75, 58, -35, 26, 7, 166, 10, -311, 36, -143, -86, -150, -162, -150, 150, -52, 9, 185, 70, -44, 10, 13, 19, 108, -31, 13, -74, -30, 40, -61, -56, 2, -83, 150, 198, -146, 5, -28, -29, 123, -152, 0, -124, 46, -1, -24, 134, 64, 75, 180, 125, 130, 28, 71, -45, -29, 23, 17, 21, -76, -96, -33, 44, -241, -66, 162, 3, 152, 115, 207, 47, -64, -163, -69, 17, -40, 188, 162, 156, 88, 28, 122, 52, 58, -39, -110, -137, -24, -103, -190, 46, 48, -69, -105, 85, -7, 21, -109, 104, 50, 6, -36, -3, -15, 18, 85, -9, -43, -241, 36, -34, 24, 94, 35, 136, 137, 127, -41, 42, -110, -48, -6, -32, 66, 12, 154, 23, 117, 136, 233, 119, -10, 45, -135, -39, -8, -13, -172, 125, -89, -53, 68, -22, 54, -1, 21, 4, -23, -153, -61, -23, -86, 93, -18, 169, 27, 210, -73, 113, 29, 52, 102, -99, -80, -92, 23, -104, -58, -34, -53, -131, -187, 74, 179, -51, 186, 180, 7, -16, 65, -16, 148, 79, 175, 22, -33, -84, 106, 79, 64, 100, -72, -126, -42, -290, -55, -124, -151, -123, -156, -156, 50, 296]
4369B96k19J6j50J4P4j26j53K83L3j06J01m0L7mj06P8j2J14j56M6m4j17J11l4
4393f4J9l2J93j11J44J7l7r9k3M2%K9J8j84J48Q1r9j03J19K5p8P5r1m8L5j30J45
4420iJ09j28m3j8K08j54ln1J41LP6j57m5O5j03l8Q9JJ30l9j04J11j33J61j33M5
4446a9KLO7j27L6J2k1J66p5k22J3J38R5j87K56r6N5j32K0J83j44J4r3Q9O8o0j63
4473a22J59K2J5p7J19j88M2j0j10J60j11k5J39j08o0J76J31j76J35j01j92J24
4495e8K9J22K9n5j10K6j18K37k02Q8p5O4J80k33P7m1K3o2J51j76j1K52o1j32K7
4520b9j3J11r6R9n2r5J39r7R2Q7j95J68p9j22N3R3Rm0j57P9J4P9m7r8M3O6p1Q9
4548C0j44K4J36l11K76p1q2J06m1K4J61o7nk6P3n5p3L4n4l6K9N5N2R0p1o6R0q
$$ y = [296, 77, 93, -57, -43, 31, -95, -248, 35, 68, -38, 63, 23, 60, 56, -50, 28, 16, 130, -26, 20, -24, -141, -30, -64, -45, -77, 116, 5, 149, 166, 129, 30, 7, 49, 49, 78, 96, -88, 60, 141, 42, -61, 58, 83, 5, 80, -11, -59, -24, -154, -9, 100, -28, -71, -89, 119, -35, -38, -89, 52, 55, 131, -26, -71, -6, -109, -147, -58, -57, 73, 34, -70, 41, -92, 69, -64, -19, -17, -14, 53, -74, -38, -26, -47, 119, 44, -178, -165, -27, 68, -119, 137, 41, 96, -36, -16, 167, 23, 37, -56, 33, 101, 41, -122, 37, 59, 74, -3, 116, -72, -30, -40, -150, 10, -101, -126, 13, -95, -155, 21, 152, -24, 111, 10, -182, -58, -29, 93, 122, 67, -43, -17, -135, 102, -100, -12, -87, -23, 157, -76, 1, -40, -17, -79, 72, -104, -115, 137, 76, -56, -29, -42, 69, -27, 72, 20, -75, 64, -33, 59, 146, -49, 119, 40, -82, -29, 64, 73, 33, -124, -45, -31, 48, 1, -97, -54, 12, -59, 30, -114, -90, 46, -265, 11, -60, -142, -36, -77, -53, 108, 41, 36, 10, 83, 28, -45, -11, -65, -101, -72, -17, 35, 125, 54, -12, 78, 70]
4576G0P7j34Q1K7k45P9P0K1m2k07P8Q2J10o6N4l2k7J10k24j1J26J3m9L1J56j75
4602b7P0M9p3j12J45R8r0Lk4j53m5J05j90R8K65o6Mo4k5J41o7J3o3j0k9n1J75
4629G7q5p5J42m3l6L8K38k46M8o0J78l15j09J17J41r7k7k9j09L18N9j36k0Q8j61
4654a04K19L0p5j45J98k3N3j73j6P2j13j3K65r0j07N7j04J8m2k6l7j12K24j21
4678a65K91j95J30JJ23n6Q5l4j84K7p8j3k9j5j6Q4q6J41q3J00P1o3l6r2m7N9J08
4705B8o8r7K88k47p4J76J85J63m07K06j17J24k64K91k12j66n6O7R8J14J2r1J26
4728G9j24J5o5m1qmJ93L7Qj17M1q7K24m2L3o6O2j02mn2j09k0M5p9%p4J49J00R4
4757H6j2j13P5j76J84llL2r2j44JL01J1j05J62l7j15l2K1j15K2k2j84R6n2J19
$$ y = [70, 147, 13, 94, 121, -124, -45, 25, 46, 4, -203, -125, -43, 67, 1, 55, 23, -4, 106, -118, -129, -3, 10, -39, -8, 148, -27, 43, 92, 19, -93, 52, 150, 60, 63, 39, -114, -159, -54, -244, -146, 119, 53, 57, -7, -32, 109, 42, 55, -8, -18, -47, -98, 77, -8, -83, 59, 16, -20, 18, 256, 10, 58, -2, 176, -139, -248, -131, 10, -87, -114, -143, -252, 66, 125, -11, -31, 57, -104, 115, 145, 70, -75, 123, 100, 153, -20, -36, 36, -77, -90, 175, 85, -22, 35, -69, -51, -93, -119, -156, -268, -44, -165, 126, -69, 61, 62, 185, 129, 214, 180, -4, 23, -55, -68, -97, -112, -128, -44, -130, 11, -72, 28, 99, 36, 0, -92, -139, -80, 28, -40, -137, 151, -96, -170, 6, 191, 354, -53, 153, 36, 160, -104, 187, -25, -191, -247, -180, -82, 32, 44, -47, 79, -45, -30, -95, -136, -144, -148, 45, 82, 90, -27, 14, -73, 151, 109, 142, 76, 138, 36, 32, -20, -129, -149, -104, -183, -183, -257, -108, -8, 86, 74, -39, 36, -140, 44, 41, 38, 70, -22, -166, -165, 136, 147, 42, 204, 167, 52, 20, 41, -74, -52, -74, -258, -162, -214, -95]
4783i5k6K8P5n2n5J75o3O5k9J48qk00P0O1j05j83K51r3l9J44M8k05J6p5J59j01
4809h9p3J25j87K66O1j57j7J21k14J51J31j21oJ04k36M2J27J61j46k06J63M0q6
4832d6k0K05N1k61M9K7j24J13K4l9k1J03J5L5j39j7M2O5J0j27J52j96Q6p9N6J38
4858A02n0j07M7J7l9n7N9J5k0j10J31J40n0j48j5R4j9J60p2j61K11j04J0J5r4
4883d5K74k04j16L79l17M6P2Lj04j38J65M3j79J24q4J56N2j49M1n2k0m2L03q3
4907A25k12J07j01J72k8j14k7J7M1q4J63oj16K10j33N2l0j48j5J7k0kR4O9m5J44
4933A30j24M2R7M0j93n6K0k1Pj0J9M3O9p2O0l5L9mq6MM5L6j88J89L1j03NK4J87
4962A95k95L03j45K8o1P9p1k9j46K09r3j1O1j55j1K56n4J27j44k4P3r8P6j74J69
$$ y = [-95, -121, -93, -18, -70, -125, 50, -13, 52, 23, 171, 163, -37, 33, 94, -11, -194, 57, -36, -75, 69, 117, -88, -72, -147, 12, -89, -162, -37, -224, 42, 103, -54, -71, 50, -164, -13, 118, -3, -9, 95, -141, -99, 28, 189, 43, -163, 0, 40, -46, -66, 139, 190, -71, -22, 5, -119, -6, 18, -21, -42, 61, 76, 111, -28, -45, -3, 62, 72, -55, 97, -99, -13, -92, -36, 102, 52, -55, -8, 9, -30, -87, -28, -13, -33, -143, -12, 128, 78, -70, -85, 9, -10, 150, 78, -83, 128, 24, 34, 49, -45, 229, 25, -91, 288, -29, 17, 89, 92, -12, -150, 15, 58, -121, 3, -81, 75, 127, -22, 19, -33, -53, -95, 208, 125, -87, 20, -81, 91, 63, -51, -78, -61, -20, -104, 59, 53, -63, 147, 14, 66, 36, -112, -127, -110, -130, -132, -38, 31, -14, 130, 6, 48, 145, 185, -8, -64, -44, -65, -58, -68, -49, -6, 63, -9, 51, 16, 55, 51, -35, -31, 14, 50, -138, 51, 82, -21, -16, 8, 195, -100, 203, 58, 86, 25, 104, 33, 4, -142, 67, -26, -37, 24, -131, -142, 114, 60, 187, 43, 19, 92, -6, 70, -104, 65]
4987F5q1L5l0J01p1J06j15L1N0J0j30J41L8j63M9j11J13j09J26n2O7k09R3J54
5011A08j40R7j82J15Q0o9qk4J9J06pk73J16K28p3o8Mkj01o0J10j38j61K67P2j35
5037a19r2J96J09j53O5m4J80j04O7q3n3k5J64k29L1K05j03j77K24%m2j79J47m6
5061f1M1M4j32N3j94K03P9m0p2K37k12N6n3J81J2j18p6J41K7m7J08j30n3J98j86
5086Fq1O6q9Or6J18j02J82j1j25P1K19j82L4k1J20q0Q6j46J27k22Q0J16r5p6J16
5112B1o6N8P2j7j05j7J00N4q0O1n4k5j09j02L47j12l0J02j36J2q6J70p1R5j07
5137b5j4PJj9p2K2R1J45p3q7k6R7L2o0L9j39K4K43j95j4P9R9j89K7KM8j62o8O9
5166a18J54j74J06r5K75k31Q9l0lPj03J51p5J97k86J7J41o9K03p0j21M4o9j41
$$ y = [65, -16, 19, -11, 90, 19, 125, 10, 41, 91, 101, -29, 112, 150, -13, 36, -75, 38, -71, 55, 3, 70, -139, -46, 108, -32, 65, -117, -2, 78, 9, 1, -23, -4, 102, 95, -178, -62, 166, 93, 25, 29, 27, -74, -134, -24, -162, -323, -56, 16, -119, -211, -15, 94, -59, 6, -38, 142, 38, 105, 22, -31, -56, 108, -121, -90, 115, 12, -165, 59, 59, 17, -162, -15, -61, -20, 24, -108, -55, -249, -46, 33, -7, -79, 158, -54, 2, -51, 130, 142, 24, -52, 89, 116, 69, 177, 47, -6, 192, 6, -75, -9, -98, -92, -188, -70, -172, 10, -1, -126, -55, 164, -18, 16, -5, 115, 35, 121, -25, 102, -120, -40, 76, -19, -95, 21, -45, 13, 85, 68, -37, -54, 46, 100, 20, 81, 27, 2, -107, -209, 138, 26, -4, 98, -38, -26, -112, 58, -13, 82, -25, -39, -32, -31, -50, -122, -100, -9, 136, 63, -24, -50, 47, 79, 19, 58, -81, -57, 186, -9, -23, 56, 155, -34, -7, -5, 43, -119, -187, -118, 36, -138, -32, -127, 148, -83, 6, -24, -27, -20, -123, 28, -47, 150, -136, -119, 22, -47, 156, 86, -35, 9, -60, -201]
5190b01M38m07K17jj50L30k14m5l5o2O1J55n4N0l50K15K44j68j65O0L7rJ84l19
5214a89J29j01K10j77J57o9m0K84o1k20J16j2q8oK1J78j42O2j19j19K9K00O0m9
5238E4j11J39j18J03Nkk9q4n4J48l4j0p7Q3l4pL9J40j84L5p7PJ92j11o6k8J06
5265B5n8J79k94O7j10K08n4Q0n2Q7j83k2O7q2K16m7q9K0M9J42l51J91N9P7o2j80
5291a17J80j34k3j8J02J52p4n9j27K82j16J7L3j7l2j88J35J8O0k01O3K77k12j31
5315a30J00MK8j66O8N9p9J56m1o3N1q9O2k5P7l5kl8PO3J69o7j01n4Q1j65J65j32
5343i7J0P5l6J63p4O9J24k48Q3j41p7J47j2J17k42K16j73K49p3n8O1k5k22J50
5367a4K27l5j69n2O3r3J51q1LL5n5M4PJ57k0r9m4l4l3N4n8O8j06P5J73k06J50
$$ y = [-201, 237, -170, 47, 46, -104, 226, 12, -33, -68, -130, -69, 86, 32, 82, -268, -53, 191, 23, -142, -82, -45, -54, 130, -189, -60, -161, 49, -128, 29, -40, -80, 204, 143, -77, 39, 27, -61, -67, -46, 132, -10, 52, -67, -186, -157, 43, 103, 54, -57, 82, -36, 67, 72, 70, 41, -43, -97, 51, 17, 7, -70, 13, -21, -28, 11, 151, -33, 2, -75, -68, 124, 13, -53, -81, 25, -33, 146, -148, -81, -191, 17, -37, 43, -9, 78, -105, -127, -60, -142, 74, 27, -62, -42, 7, 149, -202, -11, 48, 125, 63, -117, 63, -71, -94, -112, -10, 142, 68, 9, -118, 164, 48, 65, 98, 81, 49, -139, -4, 14, 74, -127, -64, 213, 1, -130, -30, -26, 2, -164, -96, -37, -116, 40, -1, -64, -13, -102, -40, -65, 12, -23, -25, -63, -56, 7, 176, 109, 8, -46, 35, -130, 35, -97, -87, -12, -48, 115, 41, 110, 234, -14, 69, -72, -149, -2, -14, 103, -139, 77, -96, 153, 80, 22, 83, 58, -164, -14, 213, 178, 9, -43, 20, -73, 78, -3, 0, 35, -20, 24, 31, 188, 168, 69, 25, -9, -42, 12, -46, 22, -84, -9, 164, -42, 108]
5394A08j33O0P9l0j22J04O4r7o2MJ19o0M0j55j2j8j1J39k8Q4j29KJ94k10N5o4
5420g9O8j15J44J7q8K36m2j14o4mK15l39J08J83j35L4O1j7j48m5J02J84k07o8
5444a13J19J26m1o8p6p2J84j25j59K50j6Q2j96O0J07j43R9k19K93lj29o6L8r6
5468a64J18J38p8o2J05qp7Q6l9l7J24j28J28j33oj3L1k0n6K57j63L0j4L7j5l1
5494A0P7j46J21qj24J72k00j07J66rq%P0K3j69J81L7k84K28K8j96J23lJ30kl12
5520b02J85r5l6J10J75p4pj86M7J14R8M0k91L08k19L2j11m5J45J19l3J5j24J50
5544A15J12j24J3r2n0N1j68J60m0p1L0L0P7n6Q9k5r0Q8k4qK7m4j16R2N9j58J57
5571C4J28p3k45J56n8J26J23j72l8Q3K6Kn9r4j1O9M2j7j42J21J52j82N0p3J09
$$ y = [108, -25, 35, 114, 84, -38, 66, 130, 33, -29, -25, 94, 34, 74, -81, -93, -111, -122, 17, -11, 73, -56, -54, 140, -70, -15, -79, -11, -126, 18, 35, -53, 183, 141, 27, -37, -41, 174, -165, -57, 126, -9, 25, 86, 69, -79, -124, -22, 162, -45, -113, 6, 132, 91, 23, -53, -125, 59, -66, -225, 25, 9, 91, -105, -45, 62, -81, 18, -201, 92, 89, -40, -106, -68, -164, -46, 92, 14, -48, 57, 49, -28, 58, 19, -18, 106, -22, 106, -27, -33, -46, -15, -35, -91, 166, 3, 33, 19, 56, 41, 10, 87, -59, 62, 54, -70, 102, -98, -205, -39, -48, -56, -56, 14, 37, -132, 49, 86, -198, 30, 58, -138, -15, -18, 112, 110, -202, -17, -112, -148, -38, 137, 63, 56, -130, -83, 31, 129, 169, -122, 186, -33, -1, -112, -157, -12, 107, 74, 89, -35, 115, 227, 103, 116, 24, -26, 25, -143, 17, -23, -94, -64, -34, 43, -13, 76, 51, -39, 49, 25, 17, 44, 0, -116, -24, 35, -123, 34, 162, 89, -156, 0, -58, 68, 191, 19, -19, 64, 90, 92, 33, -61, -72, -3, 39, 22, -120, 1, 153, -29, 21, -52, 57]
5596E7j3o5k72J81m3K25j57K6J19m0l9R4K5l7J05k10M9J29n4j70Q1l5j5n6Q1j24
5622a58P6J35j0p4j7R6Kn5J16j76J25O1p5j04mR8rO9N6p3J17j56l5L9PJ31k44
5649f2J66j39P7r5j11Q6P2J04j40J34o6L3M3jk00K03k46J89j23Q4Qn3O5q0k7O0
5675a9Q7n8O7j49R8j15K00j25o0J11j9J45j01o6m8J43j93J21O9Mr0Q1j09J03m1
5700C6j49J54n9rN2o6L12k74J64k84J13k4M1j2K0K7l4p9j8J17j73J56R3J8q0r2
5726e0J89K5j98R2m2n2j15J04N2k5J9N8n8j49K43r9k5J41j19J28j00l2n0J27J97
5751B61l41Pl5J25N3j86J27k6O9j37k8J51jp2PJ69m9r8J21k1lK6k34K18L0r4r7
5778e8J27j85K48j65K6P9jn0j13J19J09j06j5j63K05n2lK08l50J35p0Q8pj1J42
$$ y = [57, 44, -21, -293, -112, -155, 70, -87, -61, 58, 18, -21, 73, 98, 61, 166, -44, 5, 134, 80, -90, -9, -44, -59, -115, -34, -158, -82, 53, 43, -31, -48, 48, 50, -5, 111, -65, 60, 121, 46, -58, -62, 36, 27, 96, 152, 79, 196, 40, 5, 44, 51, 182, -62, 104, -35, 42, -53, -164, -78, -6, 98, -42, 92, 26, 59, 102, 101, -99, 104, -142, 47, -76, 8, 16, -37, 28, -52, -79, -19, 68, 10, 77, -72, 26, -89, 111, -14, -74, 37, 18, 163, 62, -4, -52, 91, -102, 19, 88, 92, 2, 83, -26, 77, 36, -113, 41, -18, -27, 25, -41, 271, -3, 161, -123, -10, -34, 7, -5, 15, 42, 8, -71, -89, 28, -145, 11, 104, 122, 42, -50, 139, 164, -34, 58, 16, -36, -151, -47, 5, -20, -1, 57, -1, -150, 93, -6, -31, 110, -9, 119, 19, -13, -63, 64, 261, -80, -73, -108, 17, 70, -116, 11, -15, 54, -83, -111, 40, 39, -33, -26, 143, 94, -4, 117, 96, 93, 119, -115, 103, 133, 39, -58, 69, -116, 132, -33, -7, 72, 71, 21, -92, 27, 136, 30, 15, -148, 57, 5, 2, 210, -140, -5, -75, 13, 6, -5, 137]
5803A37n6J5j10L4M6r3L4J6J03n1j34M1N1j1K8r0N5R0q0q2M9L3j81Q1R2L8N7l9
5831G3Pj25m0N8Q8l21K18J93j48J02k17K50k82j0J07K9n5l0m0J20l7Q1N8j61m3
5856a25Q7J34r6L9j51J14J1n1J83l45N34l05rM1j21J39j16L6N5Qj49m0R7J6m6
5881f0Oj35O0J29J28k26N7k6J47r9J25j34J04n8R0k10K7J9J9N1j08o9l1J65j8
5906d7K8j0j29K16k46J01R9j36L0N0m2P1o7N2L3M6R9k07k2J29j10MJ85k6Jk17
5932a15J88k34K73j55j8K37j96j04O4K2Q1j47J80l8j36qM7Q3N8j95Q8J01N1j03
5956B4m3n5p7J75L2K4j1j60J67pm0p9O7n4P0K9j71J44pm6q4J1J64q3J95j07j33
5983e5p6Q6J37k86K71qj97O5Q0K53j96P7j55j39K28r6l6%r9N5J62k6L6l7K8m0
$$ y = [137, 81, 96, -14, 20, 66, -27, 7, 23, 126, 75, -59, -18, 33, 22, 50, -40, 15, 105, 25, -57, -8, 25, -156, -75, 17, 55, 112, 73, 80, -45, -85, -27, 61, -260, -42, 151, 3, 105, -112, 138, -144, -154, -47, -18, -73, -103, -143, -23, -60, 21, 79, -82, -125, -38, 96, 0, 39, -112, 2, 13, -38, 145, -200, 334, 29, 20, 61, -60, 79, -37, -1, 54, 62, -87, -127, -30, -14, -60, -54, -189, -129, 0, 128, -98, -41, -67, 80, -19, 106, -28, 76, 18, 108, -102, -75, -56, -37, 14, -94, -163, -194, -29, -47, -19, -29, -158, 58, -188, -87, 12, -124, -94, -44, -86, -15, -82, -30, 3, 49, 148, -59, -81, 48, -62, -58, 127, 101, 102, -115, 73, -161, 112, -43, -61, 176, -20, -124, -60, -38, 43, -104, 76, 38, -98, -106, -59, 24, 82, -113, -25, 76, 127, 24, -19, -74, -151, 24, 56, 80, 69, -91, 76, 69, 29, -50, 17, -37, 33, 62, -109, 35, 28, -18, -102, -91, 73, -10, 185, 78, -55, -131, -45, 92, -194, 77, 69, -128, -63, 17, 270, 74, 151, -4, -143, 85, -11, -47, -47, -146, -91, 71, 45, 81, 44, 72, 32]
6009C2J7j43J55j52J40o1m8R0j54R0L2j17M4L3J79j46K2R1N1j99l0M4q9mJ27K6
6035C0j24J04l7M1P7j33m1J88o2l4Mm6R3J8j08P4M8j25P8Lr7J22j90J30n1J16
6061G8j95J99j04q0J11q3Q5j3k4p7l5J42j52Q3J3r5J55J17j45QJ31l5m0j40K42
6086A46k7j0l18P5M9J27k0LQ7j27P6j44J56l2n1J2L3j4J3N1mj25K5Q1l1j27N2
6113d4K7j08J38r6N6R9j05L5qJ51k1j52M8mj5p7Q3J1m3J03p2M8l2p8L5j4N4K7
6141D6j01L7P4q4J86k9k38Q9j43K56j83N6JR6kj40O0P9l06L85m7l3mj83J26j6
6167a8p5J8Q3J1l0L3j01K43q2j54K4L7J69j48q3J25j9j57K53j00k8J12o7q8j3
6192e5MK8j13q2K71J2r7J4l7M4j39P5N1q3o8K36M0k00J51K7J6j27K0L3q1N8M8
$$ y = [32, 49, -94, 61, -91, 49, -12, -60, 30, -124, -34, -2, -119, -75, -42, 137, -9, 13, 104, 155, -44, -74, -30, -119, -123, 4, 30, -94, 10, -27, 14, 91, -42, -83, 105, 43, 9, 13, -33, 60, 78, -30, 44, 92, -33, 45, 48, -49, 73, -117, 13, -38, 78, -117, 82, -22, -102, 9, -74, 11, -2, -26, -103, -138, 4, -148, -65, -52, -147, 8, 125, -20, -12, 119, 84, 44, -96, 146, 119, 109, -209, -134, -85, 42, 22, 25, 112, -15, 61, -83, 73, 41, -10, 2, 35, 21, 34, 85, 81, -44, -19, 62, 31, -96, -44, -17, -125, 13, -83, -27, 72, -33, 2, -6, 145, 124, -28, 20, 16, 1, -76, 7, 18, -25, 78, 6, 54, 22, -56, -21, -35, 19, 46, -55, -18, 56, -28, 158, 129, -109, -20, -163, 93, -90, -34, -33, 63, 61, -79, -19, 60, -246, 139, 92, 59, 55, -128, -2, -18, -93, -75, 8, 19, -11, 22, -79, 164, 82, -72, -48, -11, 158, 10, -73, 52, 33, -124, 129, 29, 1, 113, 46, -42, -55, -51, -23, -136, -218, 53, 65, -32, -18, -55, -11, -150, -75, -24, -107, -175, 61, 101, -99, 52, 79, 95, -32, -12, 21, -60, -2, 46]
6219D6J3j56J02j71J92N8k25O6N6J45j46oNJ9O7n2j6l1RJ43j39j31K07J1j04l6
6245g4R8J5n7J57k26J41r1j9M7j1l5J29KLj58N8K31j55Q9j66q6k3J31J03j57J39
6271H5j16P0q4n3J95p5J14j31j3p5J35k0j56J78j41qJ70n6J51k44N8RL7p2R1n0
6297ao5K05j83MJ17K3K3j67Q6r4J90j50j66K00o0m8N14n33J22j5M5m6j2j76K20
6322C3j89lK39j24M3K7l4J58j80j3P2j21J45J05j56K5M6l8k4o5O3l8L8J05j14
6347@M6r6oM4pJ08p6p8l4Q8J50j46m3j11L48k34M5J68l69J86n7mj5J00j30l8R0
6374g1J33J6j66R4L0m3O7L3j48K65j94n4P9j68J28R0q2n9J80j10n5q0M1J42N3
6399A21j8p9j27O1J77j85O6O5L9j68j19M5J57j13kJ36k90L46j85J21p9r8K42q4
$$ y = [46, 59, -97, 5, -166, 26, 84, -141, -75, -19, 126, -20, -26, -21, -2, 65, 13, -3, -34, -25, 118, -21, -152, 55, 66, -38, -74, 24, 39, -18, 139, -87, 54, -37, -56, -9, -20, -55, 74, 76, 79, -79, -21, 210, 55, 144, -22, -108, -131, 0, 103, -54, 85, -31, 39, -45, -98, 97, 22, 136, 5, -8, -83, 52, 32, -124, 54, -87, -95, 75, 19, 170, -74, -16, -7, 30, -42, 49, -1, -66, 139, -44, -40, 77, 100, 123, -44, 42, -52, 138, -12, -178, 22, -38, -86, 428, -105, 17, 2, 47, 1, -11, -187, 33, -156, -159, 80, -44, -1, 26, -8, 150, -30, -43, 29, -92, 53, 158, 2, 27, 73, 35, 11, -54, 9, -29, 9, 114, 0, 46, -50, -56, -12, -19, 89, 13, -65, -99, -11, 139, -7, -50, -161, 187, -47, -2, 166, -203, -17, -74, -78, -93, 7, -123, -161, -71, 62, 78, -88, 6, 36, -7, 60, 93, -55, 210, 16, -38, 41, -127, 1, 91, 9, -50, 130, 20, -35, -115, -74, 68, 121, 103, 24, -103, -42, 135, -50, 16, 81, 120, -48, -167, -122, 35, -78, -80, 56, -234, 112, -73, 48, -31, -129, 113, 29]
6423B9j5j34J34R4j28J07q7P0j79J82j69K02j13q3L5p1J08L5O0j45J21Q0j69J00
6447F4j84K40j81r5J08N4pl2M1j47K51K4r9J28j0j70p6L6l0J9Q3P9J3j34J22j90
6473i3K32o4p4j8l8N5J7l4l4K5R5n0K4R7p1q9J86m1l25J53J18j69L6N5k9J18r5
6500a3MRM0Nr8K1J62j28j44j1O5K0j1L0RJ05r2J00q2J08j60O3k8L0P9p8j40J31
6528dJ13q6j38J8j11J07m5j5l1L45m3N3j29R7k4j35Q5L6r7J1J12m1o1P3N4k16
6554g2J48o5pr9K16k84K27p0L1K4J21j12M7j07j49K9J35k12J82M8k0P5o8m9MO9
6580D2m7J02j31p4l7K62K3L0n2j21Q8o6q3K67j17k01J05j05O8j08J42J43j21J71
6604A80j38L3j53J77m0j21J07L5k17J63N5J4p7L1Jl6N4qK7j43J68j01J17k24j04
$$ y = [29, 14, -120, 14, 108, -20, 87, 0, 70, -109, 73, -96, 106, -7, -90, -55, -126, -18, 17, 77, -68, 53, 133, -36, 64, -120, 120, -61, -156, -48, 6, -1, -33, 8, -139, 112, 136, 37, 165, 155, -15, -91, -55, -85, -66, 17, 96, 109, -25, 97, -93, 139, 75, 1, -17, -55, 0, 17, -17, -51, -26, 69, 19, 43, 140, 69, -20, 166, 125, -200, -47, 71, -98, -62, -7, -36, 82, -13, -9, 0, 40, 45, -53, -32, 130, 2, -142, -153, -88, -68, -79, -49, -40, 65, -27, 73, -9, 99, -61, 2, -26, 4, 83, 5, -135, -4, 109, 23, -115, -97, -208, -101, -146, -161, -192, 153, 110, 163, 34, 131, 107, -28, 57, 93, -4, 7, 119, 78, 17, 90, 144, -72, 76, 11, 4, -95, 121, -163, 64, -6, 25, 49, 170, 58, 105, -2, -151, -122, 13, -199, -17, 31, 11, 86, 18, -31, -27, 42, -5, 97, -34, -108, -145, 117, 140, 170, 118, -3, 85, 19, -64, 203, 86, -115, -10, -115, -47, -155, -13, 130, 9, 180, 42, 75, -78, 99, 59, -62, 45, 80, -137, 26, 81, 95, 18, 49, 50, 14, 68, 60, 87, -56, 112, 11, 128, -96, -200]
6629b00J80J59j68p1K34k55K21j43K9J12k04J35Q0j24q5j9J08J15j77N5P2p3O
6652a3K9J0J30k97J18n3J1J25K0p9P4j70K09m5pJ36j10n6L4O2j52J5j51J46j6
6677c0n1N8Oj4n6K46k02j46R8N9j6L3J7n4n3P9J48q2r2L0j15K51j60p5j2J73J7
6704E7l5P9k59M12k75r3K2Q0N5J6L4r1N2o2NO7k03p7J60j6M7j0J22m6j3j0k2p7
6732h1J39j1m1M1J1j36P4o9LQ0j05O4P4l5J58l24J25M9J34k46R5J10rj08M1m5
6758a2j5j13O1q6J91o5n5J79p2J06n2l9m8l1Q2Q7m3j14J72R5k53k91M26j82M5
6783b7j59K48O3J7j15j5K47l32J92j86Q0Q1p2j46K11j96J63Lp4J2J55j72j06Q9
6807c9L9J19k05Q2J4P7n9p8K01j62k6J39n6r3P9R4j36L3L7J9j28R2l3p9Q8J8m9
$$ y = [-200, -20, 139, -29, -100, 134, -121, 100, -43, -14, 98, -106, 29, 109, -15, -100, -119, -11, 104, -73, -18, 54, -19, -13, 16, 26, 156, -141, -23, -76, -65, 60, 80, 1, 75, -95, 114, 69, 62, 198, 88, 32, 66, 128, -24, -9, -160, -14, -30, -81, -23, -17, -31, -87, 159, -43, -189, -91, -32, -48, -15, 2, -52, -105, -26, 122, 40, -52, -22, -137, 114, -46, -121, -133, 40, 57, 22, 101, -158, 254, -21, -114, -92, -12, 43, 59, 93, 2, 54, -8, -3, 64, -139, -216, -56, -72, -25, -35, 87, 41, 28, 18, -4, -81, 58, 47, 6, 47, 58, -78, -4, -73, -70, 10, -95, -31, 43, 8, 166, -158, -33, 16, 150, -96, -1, 109, 100, -8, 33, -12, -27, -140, -79, -165, 26, -39, -94, 85, 13, 119, 67, 28, -20, -51, 31, 118, 75, -39, 133, 228, -25, -316, 110, -72, -27, -186, 62, 125, 142, 27, 12, 259, -73, 119, -67, 13, 94, 22, -124, 87, -109, 54, 57, -17, -5, 150, -22, -128, -39, 0, 119, -86, -4, 10, 87, 28, -50, 151, -11, -37, 102, 46, -47, 32, 126, -10, 23, 60, 79, -49, 43, 10, -69, 19, 37, -12]
6834a2m0Nk8O5N2l8k0k08L37j93M7L8l3n7%K48j74j88J77K6l9J36p4k50M65j82
6860F0q5r0J41L9j34N6N6j15L2P7O6k49K35j45Q4k9J96l23J76n5j1j5j33J14p6
6885a28J76Q6p2j84K70j06j35K06Nj27p9J33J7j2r6%M6k57J24R8o6J31n2O5l7
6910Fj36J42p3j35K21q1M7J17o0M3r9o2n5n0J83n2m3LJ63r4j3%N1P6j47p5J08
6937a5J43R3l21n7Q2J32K4q7J15k71J43J3J3N1K2k00K69j62p0q3O0J48j4J08r7
6962C9m2l2j2p0K24j84j8M9J90j17N5n2j37L13l49P4J05K4l39K17J31J16r6J6
6986A05j61J02N9p5n6nK3J30r9k3P8j98q9Q0J07J3O7p6J29K2J09m37J87L9j10
7011g9J15q6J26k9j32J31n7j8P9k06K21L8j08O4m4Qr2J26J2k11K7J06j67J47q2
$$ y = [-12, -52, -47, -75, -10, 42, 4, -16, -224, 113, -80, -33, 5, -28, -85, -85, 163, -11, -199, -22, 4, -35, 101, 27, -223, 242, 60, -25, -115, 26, 65, -69, -13, 43, -72, -40, 37, 103, -146, 89, -56, 28, -1, 195, -128, 48, -7, -18, -33, -166, -52, -128, 48, 134, 62, -122, 148, 42, -93, 113, 118, -9, -88, 45, 62, 50, -46, -46, 0, -257, -133, -35, -101, 30, -22, 43, 6, -130, 12, -61, -196, 25, -56, -9, 108, 48, 91, -8, -70, -125, -175, 8, -44, -87, -84, 79, -15, -28, -28, 23, 99, -48, -123, -15, 128, 221, -100, -157, -75, 57, 81, -6, 109, -162, -19, -6, 7, 58, 80, -120, 149, -13, -83, -166, -106, 42, 28, 136, 39, -3, -35, -47, -117, 107, -77, -95, -46, 144, 27, 82, 30, -107, 206, -143, -69, 36, 60, -279, -62, 69, 185, 89, 105, -56, 46, 105, 30, -26, -31, -8, 122, 23, 0, 78, -120, -209, -129, -22, -9, 58, -18, 111, 133, 242, -195, -8, 31, -79, 36, -50, 76, 47, -85, 46, -11, -29, 50, -156, 65, 103, -5, 59, 15, 23, -69, 57, 69, -142, -115, -9, -176, -29, -111]
7036a11J20M2j40J32l8m8J78l03K51q5K14j83J7q2K1J22j01R6j70K2p5J79R6j27
7060B7J9j2Q4koj87M6P9j18P7J17r7K0n1lojP0k7l0n4M8P8j52R1O3L0j76p8K19
7090F8M1p5P5p2o0J05o9M5n6j25J04J31k61K14K9M3n9j93N8J13q4Q3j10P7J2Q4
7116A18o6M6pn8j18K83q3K0k9j75P7Kj51K16j89P1l1M0k5L1j62K83n9j87K28j56
7142h1L27k28j3O6m8o8J7r7K15k8k13L69j93R6n7p4J49Qk27J03J6J3j09m8Q2j38
7168a61K26j16J4M6p2J24n8j06K32k68K44j43O%oo8J16J21k66J76n7R2j57L9%
7193d2M9J16l10J96L1pJ27l12J62O6r3L2n1P1m3O5k9M3Q1l11K08l3n9M2j26J45
7219A8m4M0J4J06r1O8p9J31oj38K2j72J47J0j44M2R7p6R6k07J99M0j03J57Pj66
$$ y = [-111, 9, 51, -89, 43, 5, -43, 135, -168, 83, -2, 212, 29, 46, -36, -15, 107, 6, 102, -68, -46, -121, 58, 154, 27, 46, 34, 118, 116, 110, -77, -31, 48, -70, 7, 124, 27, 47, -4, -7, -13, -14, 56, 29, -1, -55, -7, 71, -81, 10, 73, 103, -73, -151, 68, 109, 34, 109, 37, -23, 82, 13, 58, 2, -123, -19, 112, -149, 65, 94, 137, 78, -115, -57, 56, -28, 55, -55, 22, 34, 118, 52, 98, 91, 33, -85, 198, 115, 135, 106, -69, 8, 10, -141, 75, -114, -43, -74, -34, -59, -28, -190, 93, 34, -153, 75, -81, 246, 18, 5, 71, 23, -45, -28, -125, 90, 62, -151, 218, 25, 121, 64, -10, 139, 147, -80, 23, 39, 52, -57, -105, -23, -161, 65, -51, -37, 9, -63, 61, 3, -103, 129, -139, 105, -38, -32, -32, -38, -106, 10, 131, -135, 41, -16, 76, -81, -42, -42, 7, 123, -187, 9, 40, 33, 160, -152, 10, 76, -17, 15, -36, 35, -8, 57, 28, 71, 152, -159, 49, 16, -43, -1, -127, 18, -26, 14, 28, 134, 43, 111, 32, 163, 157, 19, 41, -131, 16, 26, -118, -76, 21, -55, 41, -166, 33, 73, -30, 127, 134, -32]
7245c2J26j52m9J42o4p4L3K10p0j56K39l27J40O4j27J03m6R0P8j60j04R3J23k2
7269E8j27Q7J09q0n0Q5jj03J27r5j21L8O8M7J27j38RP4n4JN1r0p2kj06L01j09
7296C4J73j86q4mK0Q3J00p5P1j56O3J4r9J8j2l0j62K92l8J45j86l9p6J10JM2j16
7323i7R1N9k5O4n1R4k25J53q4o7oL6J09r9l3k2J31J17o9j69J00j07J62j19J14
7348E7K6l2p0jQ6j85M2Q1J4o4J01jo2n6J38q1K8K8N0j71KO2k8o2n0J41m9K28j21
7377E1K7k6k51K75k6m1J14k21M7r5K60j03K0Q2q9J9M6M8r5o3r6K05q6N8n7j56
7403a53J10O9m1kp7J30lJ39n6j35J22j21JP9L5k58K95L5j80Q7K8k14R8J16m2j22
7429f0J41m2l9j7M8m8j59J11P1J28q0j15LL5R2N0Jk62J48J2J30j44j8J58m6N7
$$ y = [-32, 94, -58, -107, 35, -29, -103, -70, 140, 70, -86, 153, -174, -34, 30, -97, 6, -40, 50, 128, -32, -136, -43, 80, 58, -69, 18, 127, 47, -3, 82, 81, -22, 105, 10, -111, -73, -5, 42, 169, 31, 40, 114, 60, 61, 112, 22, -50, -52, -158, 143, 34, 207, 21, -63, -67, -47, 36, 136, 61, 132, -24, 39, 53, -46, -28, -40, -70, -232, 60, 22, 167, -19, -58, -134, -24, -23, 19, -97, -6, 53, 28, 92, 41, 135, -90, 63, -21, -88, -94, -58, 51, -48, -81, -103, 28, 145, 76, -93, 7, -100, 62, -57, 57, 83, 51, -19, -20, 66, -119, -77, 4, 18, -46, 55, 54, -8, -64, 74, -7, 21, 49, 99, -72, -70, -8, -36, -98, -148, -7, -56, 172, 51, 78, 52, -199, 76, 50, 9, 123, -98, -51, -146, 114, 11, 31, 113, 24, 43, 89, 137, 42, -21, -117, 88, 2, 60, 3, -153, -43, 26, -15, -17, -94, 36, 33, 172, 116, -19, 103, -18, -17, 62, 97, -161, 134, 169, -11, 76, 104, -110, -12, 104, 62, -60, 81, 39, 0, -17, 31, -17, -176, -65, 6, 134, 54, -61, -58, -23, 69, 119, 120, -142, 6, 18, 148, 4, -14, 144, 98, 155]
7455A55k24K6l6Q5p0J33k25J28J2j20J21j1l0L2K5J11j66Q5m0J3m2n8J8J2L3L2
7481aj37K04J7j62K2j36J91O7O8j66j2P2l5m0K7M4r3J37k63J91R9j09j5j09J74
7506C5j41J78j8n0n6m0M3n5Q8N6l5l2p1K35o8j38J47j42o6K27J8j31oM0J61j33
7532D6j31Q0j2kJ20j40k5L8Q7j20k5J50J7j77J55j38J60k21R7O8J5k0j49K01P
7557H1m3j34J17Kj16J43o0K4j7M0j18K38j29Mq3N2n7J42P6j58j12N6J82j38p6
7582h4K04j22q4j17K34j0j9j9o7M9p7j6j2J28N5K9r6J08j02J81j93R0j24J19m1
7607A4O8l1p3O1J59q0j76L8L7j7j17K75j97N5PP3kn5q1L9P1p9O4k6r6P2j57R7
7635e7J55L6k46J59Q6k42J75m9j02J28L9o7j1Q7j57M1m4k7M0P9R1j17j66Q9J28
$$ y = [155, -69, -43, -79, 6, -64, 69, -156, -28, -16, -136, -15, -26, -56, -24, 1, 112, -54, 31, -9, 4, -38, -96, -78, -66, -33, -1, -138, 66, 83, -79, -57, -193, -2, 65, 133, -33, -45, 27, -8, -48, -21, 23, -70, 67, -196, -5, 94, -15, -30, -139, 35, -106, 72, 54, 4, -52, -92, -49, -104, -16, 40, 5, -27, -98, 137, 69, -69, 78, -64, -130, 97, 115, -16, -22, 18, 179, 46, -85, -5, -17, -19, 101, -39, -64, -26, 61, -59, -84, 66, 83, -94, 61, -77, 83, -138, -41, 27, 42, 22, -127, 74, 81, 38, -96, 21, 23, -93, 50, -10, 14, -3, 37, -81, 157, 28, 32, -51, 1, -56, 86, 162, 4, -108, -52, 130, -8, -84, 120, -2, -86, -203, 31, 21, 2, -17, -84, -35, -112, -128, -140, -12, 43, 72, -24, 84, -18, 163, -30, 60, -64, 55, 14, 82, 51, -22, 39, 198, 118, -58, -20, 17, 0, -117, 158, -39, 16, 23, 96, 94, 39, -42, -3, 68, -11, 53, 27, -69, 3, -154, -57, 98, 134, -112, 47, 133, -109, 66, 17, -85, 43, 82, 15, 4, 91, -66, -25, -69, -96, -56, 23, 114, -3, -169, -80, 48]
7660D8j07J87j84j5J97k40J82k63J83K28k60J02j00m8K33k8o0OJ2j65rQ9K42j69
7684F1L0O7l21K02j19N6l3Q1k6p7j0L0J06J1K9j43J01j46J68j53N6QL2r9j12K01
7710@j22N6m4J92p9kJ37n5r2j7q0J53p1Q0j15L9Q0l8k02J21P0m2n0m0K33j11K9
7737C0o1l7l2p7L77n8j68lPL8Q7k66K75O6q1Nj94lN2q7m4J85P0K1j66O2Q9l7k
7766D8j13K02l2j93J3J51j33Q4p0Q6K3Q5j05l7J10m8K7p2k13J83p9kK30l24J58
7791b1p9J42j49KK4L6K01j83K22j52J11j96j0j9N3Kj68L32j86j2n0J26l2O2n7
7816aj38K25j61P8j26J8l5J42kk6J3k8m7R5L1K6pk26J09J32j56J84j22j1PN6p0
7843d0j30o3L67j03kj33O2Q7M0j64J58k0p6N9R0j07Q6m0J1m9J31O7k56L9mM3k1
$$ y = [48, -59, 128, -56, -71, 126, -114, 68, -195, -12, 216, -44, 58, -42, -90, 143, 115, 55, 61, 73, -92, -101, -12, 230, 61, 91, 158, -163, 39, -80, -24, -57, 24, -2, -79, -89, -59, 47, 58, 87, -56, 45, -101, 67, -86, -30, -22, 10, -89, -201, 0, -122, -66, -110, 82, 3, 1, 138, 83, -9, -26, -106, 47, -24, 56, -59, -20, 60, 22, -180, -59, 11, -31, -81, -121, 112, 1, 30, -31, -68, -100, -177, 200, 142, -26, -29, -22, 16, 103, -163, 112, 178, 97, 102, -92, -95, -43, -130, -174, 11, 81, 102, -64, -2, 87, 50, 48, -65, 137, 105, -88, -75, 76, -57, 27, -43, 43, 66, 151, 46, 9, 119, 71, 98, 26, -187, -4, -83, -85, 145, -179, -21, -100, 42, -107, -105, -81, -45, 156, -27, 195, 43, 154, -42, -52, -71, -18, -16, -184, 148, -38, -50, -100, 26, -6, 56, -1, -139, 86, -75, 3, -123, -105, -140, 2, 0, -26, -13, -41, -88, 7, 38, 64, 57, -169, -60, 72, -84, 100, -22, -33, -26, 30, -40, -170, -233, 134, 31, 29, -104, -42, 45, 85, -79, 79, 59, -17, 42, 132, 25, 111, 71, 82, 33, 164, 231, -25, 14, 10, 53, 32]
7870C2j03J74n6j75R0L9M1j14j1J03k9Q3m4j79PL0k4L6J93Kj11J01j5L3j70l9
7896a06M0P3Q7J5p9R0j48j3Kn4L00k78rJ45j21P5j02O0RJ81k47J69R5j47m5j53
7922a61J15L7K5M1p3J87r1o6J31k76R8M7O1L5o3j33k4q7J57j43L28j46j33K6Q0
7947b8J97k58j4O0P1j9j46P6p4K62j21R0l2K9j92J01M5q6J23n1Rm8N6o3q0J74
7973H1N6J8k23Q7J20j78J57j60K8N6o9l3K3k36K54N1j9N9j96K6K6J1K19j38RL4
7999F3j6R9k70M3P9k9J01Qo7Q6l6j05Q0O6n3p8p7K47l16K31Q4Nl3r9O3q4k1j1
8027d0J44k36R2Mr2K06j1k91L25R7k16L2k7o4R1NM5L0k76J39L2mP2j12J1L4J99
8054A89k47J55j28j09J00M7J01k37J04P9Q6k39NM5lj8J43j05j6N6j32J19m7K4
$$ y = [32, -71, 103, 47, -128, -38, 1, 42, -72, -83, 20, -9, 74, 30, -149, -142, -112, -136, -100, 93, 95, -16, 85, 70, 103, -67, -106, -66, 7, 94, 109, 30, 120, -28, -41, -39, -93, 207, -71, -80, 65, -56, 19, -83, -23, -14, 167, -80, 89, 184, 37, -8, -161, -46, -9, 16, 57, -16, 171, 80, 14, 145, -131, -33, 14, 75, 110, 47, -86, -110, -197, -40, -183, 145, -1, -134, -108, -28, 169, -89, -103, -43, 28, 9, -137, -61, -135, 127, 6, 96, 64, 93, -99, 2, 47, -39, 84, 33, 42, -6, 50, -13, -93, 81, 137, 155, -68, 19, 139, -39, 118, -42, -14, 42, -27, -60, -37, -273, -19, 32, 13, 72, -124, -98, -72, -61, 158, 20, 29, 63, 47, 146, -124, -81, -2, -31, 70, 78, 11, 97, 61, -44, 36, 102, 49, -29, -106, 141, -175, 56, 140, 145, 112, 13, 76, -8, -29, -40, 104, -132, -40, -36, -128, 78, 67, -224, 101, 198, -18, 14, -13, -77, 14, 19, 64, 94, -182, -43, -11, -15, 57, -55, -44, -10, 189, -58, 97, -31, -140, -40, 7, 108, -129, -25, 54, 140, -99, -94, -49, -52, -70, 73, -32, -48, 8, -124, -5, -52, -28]
8078b8k57K94l2j2n9J47L8l4Q8j06j49l9Q1J92k6Np6Rj23J48j54K60j51M9j62
8103i7J33j42Q5o7km5RJ17J2lL2nm5j25jLK18j59MQ7m2J35j4n9j25J72l7r6K0
8132c7K9J8N4L7j05k8R9j10J88k23J70j61K8j68Q2J6N5j03J29LN1q4O3j04J9J83
8158A01j03P9k25L0J65o1N6q1K8J0q7J70k02J01M1J9o7l8n1K51j79k6j7M3K2R
8184a2J6K34k80j89J43J40q8
$$ y = [-28, -285, 9, -23, -35, -94, 53, 91, 57, 145, 39, -110, -149, -68, 124, 98, 103, 27, 36, -87, 61, -93, 167, 16, 65, -97, 36, -106, -21, -88, -90, -135, -126, -9, 3, 0, 32, 27, -18, -143, -144, -141, 77, -82, -78, 9, -33, 102, 88, 29, -96, 76, 39, -57, -37, -8, 10, 64, 101, -4, -32, 67, -43, 145, -78, 92, -69, -41, -209, -127, -111, -56, -159, -30, -27, 24, -60, 3, -101, -82, 101, -2, 77, -148, -118, 47, -14, 42, -39, -11, -1, -88, 82, -120, -19, 22, 41, -26, -64, -115, 136, -43, -69, -86, -43, -21, -12, 4, 238, -42, -231, -88, 52, -36]
8191c6
$$ Imaginary data points
##PAGE= N=2
##DATA TABLE= (X++(I..I)), XYDATA
0@%%%%%%%%%%%%Qj6J6j6K4l2L2m0N5o3P2q8J04j20J41j67J92k19K53k91L32l78
34b01M27m81N42o12O86p63Q51r50J057j173J302j440J589j756J938k137K359k603
52a365K868l163L497l870M291m773N333n991O773p727Q925j0482J2604j5691K0644
67A1873k9928N3257k19856l63202O43653M99652m64002l09551K29425K53230j05819
78A98732j30503o2954j78395J46952K42680q0422m53046Q9212M59468L9638m16572
89a45210j06448L11526Q3700j66536j41430Q661L8234J26978M7337j70250o2190
100a75628K29378J84551j65557j11217J22771Q5997p8809j7379j1208j54322k4230
111a15653J91175L431k92297l2659L10351Q7164k47629o8263K07003O3384j00103
$$ y = [0, 0, 0, 0, 0, 0, 0, 0, 0, 0, 0, 0, 0, 8, -8, 8, -8, 16, -16, 16, -24, 31, -32, 40, -48, 56, -64, 77, -90, 102, -117, 136, -155, 177, -201, 226, -255, 287, -325, 361, -402, 449, -501, 556, -617, 685, -755, 834, -922, 1016, -1121, 1238, -1365, 1503, -1660, 1837, -2033, 2258, -2515, 2818, -3173, 3600, -4127, 4798, -5684, 6920, -8771, 11873, -18055, 35202, -184654, -547856, 95797, 595449, 131447, -178104, 51321, 304551, 198732, 68229, 5275, -173120, -26168, 216512, 136090, -316956, -227744, 231724, 271362, -145210, -251658, 59868, 143568, -22968, -164398, -155737, -117503, 9475, 56812, -113438, -175628, 53750, 238301, 72744, -38473, 84298, 170295, 91486, 74107, 62899, -91423, -115653, 75522, 78953, -213344, -246003, 64348, 151512, -96117, -164380, 42623, 106007, 5904]
122E904j3920O037r1897N0253J77838q6871k54429J07287L44949m9376l19678
133a23903L6652L07081L643k47692n9047J02630P947n0124k7111p8036l4336J37235
145b5061R4233j41731j02243J74951J60149j14139j39752Q2588J15291m1886q3844
156b1444j3579J9048M0216L9578m8924o9507P2557J13064o6468j24220N6563R8186
168I5070q0333j05844M8548M0729p8230k0356Q1977J625n8673N8660R2264m5280
180C0157n6142P9747N5133q7281m6293P5303N285r5655l077P8358k4072p1716
192f0253M5838O9619n1179n3120N5720L2653o2141k8175L7651n267l3197K2599
204b9252K1826k9680J3876P1465j047o1657K8188Q2752k5178q6037J3307O2013
$$ y = [5904, -8016, -1979, -93876, -43623, 134215, 47344, -207085, -99798, 245151, 195775, -123903, -87251, 219830, 223473, -24219, -83266, 19364, 27311, -22813, -49924, -127960, -162296, -25061, 69172, -72559, -174802, 149, 160298, 46159, -93593, -11005, 104286, 62400, -21444, -35023, -15975, 24241, 63819, 14895, -54612, 17945, 131009, 64541, -59679, -3116, 95070, 14737, -91107, -42559, -1830, -80060, -100416, -18439, -16814, -75487, -16827, 75437, 30157, -25985, 53762, 108895, 21614, -24679, 50624, 55909, -39746, -42823, 35535, 11463, -60253, -14415, 55204, 4025, -49095, 6625, 39278, -22863, -51038, -13387, -18654, -51851, -29252, -7426, -37106, -23230, 48235, 47188, -14469, 13719, 96471, 71293, -14744, -1437, 60576]
216F0576l0133o9180K642K8177q571k791J0157k0461m471N4852J7808o8528k3196
229e3119P5219K5516p6993l2576O1019K9544l6731j0599K5633R325J0502K0203
241D6943k1041l7303K7642M2789m5135o9156K7369N6237l3369n6724K5250M6563
253A0065j2665j9211K1163J1154j2123J0885J3675k4261j4983K8970R701l4165
265a1795p015L3014K803k4307R511K2985j5346j6863J9582N925l1487q854K6100
278D253k096k9752M223K4563p563j3350K0204J4141j8695j140K7577l067l1529
291a2231N091K9865r017l0498N993K2601n701j5188M700P332l61M425j23j4549
305g661j451K0607O50k6953k527K8080K131k7638o49K4784Q06j6524L646J0320
$$ y = [60576, 30443, -38737, -36095, -7918, -16489, -19280, -9123, -29584, -34055, 20797, 38605, -29923, -53119, 22100, 47616, -29377, -61953, -934, 28610, -8121, -18720, 6913, 16238, 26740, 46943, 25902, -11401, 16241, 59030, 13895, -55261, -27892, 28345, -5024, -61748, -36498, 10065, -2600, -21811, -648, 10506, -1617, 9268, 22943, -1318, -16301, 12669, 22370, -11795, -18810, 14204, 17007, -7300, 2211, 25196, 9850, -7013, 12569, 18494, -12993, -21847, 4253, 2157, -27595, -23372, 1191, -6372, -19722, 482, 14623, -4072, -5212, 22365, 19298, -12231, -7140, 22725, 13708, -16790, -10797, 11804, 6103, -9085, -4385, 2947, 2586, 7011, 6888, -7661, -9112, 11495, 12145, -14808, -17335, 10745, 12876, -14762, -15411, 9373, 10179, -6345, -2699, 7621]
319G621q594m629J2010k332j6342N882J8368q288j9828Q518J8550o886j4292P839
333b403J1225n082n541N118J812l128L120K572o818k572O449k957j0623L007Q686
348B865p726r020J1873R889j2300p531J5023R093j2116p011Q700M282o578j748
362b305L191k110n28O979J465q586j106J0869L121j0413n732M780J827m451m025
377g024k962K49P772O106p465o437J1678J2821n576j0068L907P423k166o310m645
392b697l747K93O497K326p813n213R010J1331l565j3079k356J1551N998j0064
406a528j4359R06J5831Q416j2453j1790J3149K1304k075j7208j489J3139M987
419A6830p907j0439q038J169J0231L157j5518j2278J5420K2616p343k4945J285
$$ y = [7621, -973, -5602, 6408, 4076, -12266, -6384, 11984, 3696, -16132, -7614, 10936, 4050, -10242, -2403, 8822, 3740, -1801, 3317, 5129, 2001, 5121, 7693, 875, -1697, 4752, 1795, -8828, -5821, 2865, -4861, -13881, -2008, 7881, -4419, -11950, 3073, 12166, 50, -6961, 1739, 6021, -557, -2305, 886, -1224, -1752, 5227, 6692, -1894, -3000, 7869, 10990, 577, -5155, -375, 1452, -2999, -7024, -9986, -9737, -1965, 4141, -3324, -9761, 1917, 14738, 9162, -906, 3001, 10424, 8258, 1948, -2697, -6444, -6151, 346, 2672, -5141, -10354, -1344, 9987, 6422, -6657, -9013, 2538, 8536, -1528, -15887, -14981, 850, 9266, -3187, -14977, -1828, 19476, 17401, 193, -1296, 11843, 16830, 8923, -1516, -9554, -8385, 1846, 5003, -10515, -22793, -7373, 15243, 7900, -17045, -15760]
432a5760K7697Q997k3720j6203J4446J6363o580j4339n04J0712R688K137o494
445F440p837L334J2831K614j7939j7523P490J8499o228k6698m280K5469J4379
458A0551j4030j0959J2485J5042N44o253l745j770L231P490k900j7271o303J9336
472E448J4264j7739j8957J4797K2315q254k2271j190J1631M72p088n343n697J36
486a7476J3796R857j2038j1386J7312K4552p536k4406L957K5232K93k4976q147
499a0966J4810M871j1013m101O205P61j129N456P34j1411n081J3055Q143j5610
513e276j5458J3469J8344j1404j8773J2504K3145o837j6235J1278J6700j3256
525H201j6631J2299J2274j8798j7081J5678J3681j8662j4600J9290J5358j5902
$$ y = [-15760, 11937, 20934, -2786, -18989, -4543, 11820, 5240, -9099, -9603, 1109, 10797, 12934, 6440, -1397, 1937, 14768, 17382, -557, -18080, -10590, 7909, 1681, -25017, -29297, -3828, 10551, -3479, -14438, -1953, 13089, 13633, 7380, 3635, 1865, 5096, 12586, 9686, -7585, -13888, 5448, 19712, 1973, -16984, -2187, 20128, 11874, -10397, -11587, 44, 516, -6572, -11915, -17612, -17476, -3680, 6177, -5861, -17247, 65, 24617, 17081, -7325, -3368, 21864, 22157, -2819, -10966, 3844, 8715, -2298, -6399, -194, 567, -562, 4894, 5628, -5783, -10864, 2191, 10334, -5276, -20734, -7265, 11079, -325, -19098, -6594, 16551, 9714, -6521, 4757, 21457, 8201, -8430, 3869, 16143, -2655, -19736, -4058, 9623, -9039, -23639, -4349, 11009, -4893]
537d893r178J9517Q905j8218m460J7731j459k1267J852K1306j694j9268M651K3554
551A7079J840j7172j716J4079O32j4101m343N388m356r547L103P148n857p180
565a5003R249J3600m239j1919L090J3243m92j3493l270J0341L698n869j119L126
579I43k002J406J0721j71j6652j589K1538M081k6549j2471K2799J5267j8840j7663
593a9182J2148J6190m282q588J510K189K229Q427K97j7110o875K0456J1402k2985
607d174j9432J7684K2974j0958k3238L360K0752M999j4020r419N355Q599P95m928
621a651n341j075O644Q933q30j1244j918J5074J1146j1509j6184N538J6987j576
635A2994j8546n568J2688O338p944p389M01K395M660M957o195j0977N212J6868
$$ y = [-4893, -14071, 5446, 14351, -3867, -8327, 9404, 7945, -13322, -11470, 9836, 8142, -11126, -6475, 17079, 18919, 1747, 31, 14110, 14742, 641, -3702, 1686, -2670, -12217, -9114, -1966, -7823, -15003, -5754, 7846, 3607, -8312, -5222, 8021, 7529, -5964, -9234, 1107, 4805, -1064, -2183, 943, -1059, 347, 11068, 10897, -5755, -7344, 14194, 18275, -8274, -20745, 2054, 17321, -1519, -19182, -7034, 9156, 4874, -3714, -2204, -15, 2214, 10641, 10938, -6172, -13047, 7409, 18811, -4174, -23606, -5922, 17052, 6094, -17144, -13784, 6968, 11967, -2053, -11472, -6117, 2482, 3277, -1651, -6992, -8067, -1423, 7510, 6680, -4564, -6482, 8592, 19738, 8229, -7955, -2417, 14570, 12994, -5552, -11120, 1568, 7906, -38, -7427, -7026, -4631, 29, 4986, -1209, -12186, -6974, 9894]
649I894r54j8939m761J7639J1104j1870j3825M763J3836L574r492r193M044J2892
663H712L312j2961j0498Q737J4142l965j5635k256J2743O895p257r267J023R631
677C356N478o099r353J315J0541L301r062p270M245Q688j047q732l742O222O811
692D652j965p260k43P169L946m486m612K814L690q76k814j403j402K99L153J554
708B216m537k960N931N237m598o117K536O220l00n900k734K990L716j71l381n80
724b432M564L978j249l954qL581R06l688m373j154J895J134l196m122K009O525
740D16J415n161j628O209M518l706n316J896N066n21n601j320M894L785j173k807
756I66J674L712n9l558k593M97j50k761k668j166n20N47J679N99j57K225M443
$$ y = [9894, 8940, -9999, -14760, 2879, 13983, 2113, -11712, -6949, 6887, 10461, 969, -8224, -4180, 8712, 12024, -937, -11435, -2698, 11444, 7479, -8156, -10412, 2331, 9226, 1969, -7298, -6275, 3356, 8834, 2735, -6618, -5303, 5238, 8539, -523, -7793, -3548, 5140, 4093, -4639, -8381, -2159, 4652, 2687, -4573, -4816, 2353, 6299, 1813, -2799, 15, 3705, 2829, 15, -1388, -2790, -2491, 662, 2216, -2321, -5281, 650, 5887, 1289, -4828, -2292, 3928, 3628, -2272, -5006, -2016, 1700, 1529, -1852, -2432, 2132, 6110, 4861, 907, 899, 4480, 5386, 1698, -2675, -3829, -1934, -800, -3996, -8118, -6109, 416, 1831, -3330, -4958, 1251, 5769, 2063, -3253, -1357, 3709, 3188, -2413, -3733, 1161, 4946, 3773, 966, 2640, 6352, 6293, 2735, 142, 639, 489, -2272, -4940, -6106, -6626, -6079, -4400, -3801, -3958, -1733, 2710]
773B710J269k314m71K985J294l333l123J244J944j811k177J655K413J4r02Q62
789B259N94k056j699k26p04k404k459L48J881O18p89K273N043K425j426j52K867
806F393R80k762l157mN15k251l122m96J692L76KJ201J415l31n03O49j124k381
824b908o9J094q01j766P04L390K109k03O17L165K769r67l407j109J063j530m593
841b442k897P62J023j344j369K281L693Q80q10J147J753q35j143O57o30k235M10
858a099K183k87j677J344L482J158j237j364l12K82j548l164k326k80N40o65j774
875f744Q60L177J971M46J846K198L7m34J821k88m271j278M205J0o458j353N660
892A405L103m515k421L438K476k437k745p78m64p82L67n6j563O2L745L317j021
$$ y = [2710, 3979, 1665, 1194, 4179, 5473, 2140, -983, 261, 2205, 394, -1783, -128, 2285, 2299, 1397, 2259, 2853, 797, -902, -1128, -1832, -4236, -6695, -6347, -4466, -3848, -4637, -2364, 2679, 5104, 3678, 3526, 6393, 7373, 4611, 1454, 1450, 1965, -286, -3408, -3904, -2212, -1836, -1834, -633, 782, 451, -52, 597, -527, -2908, -2977, -1883, -2684, -4450, -3746, -356, 1753, 1550, 2167, 5332, 8101, 7134, 3727, 2618, 3681, 2151, -2442, -5339, -4577, -3554, -4898, -6267, -3986, -293, 587, -223, 924, 2677, 1842, 699, 1356, 726, -1509, -1099, 1084, 797, -880, 464, 3946, 5104, 3867, 2503, 2191, 2473, 925, -2239, -4565, -4845, -4305, -4970, -6744, -5884, -2707, -736, -290, 1556, 3754, 3791, 3357, 5178, 4890, 619, -659, 3546, 3556, -2902, -4255, 1405, 4508, -7, -2428, 1010, 3486, 1049, -1696, -2474, -2938, -3720, -3353, -3409, -4972, -4910, -1165, 2152, 1131]
909A131j369K274L854K06l623k900J453L118j934n573p21M826J436l694j535K623
925d28J131M2Q90j885l349J695N027j263o622J44P157J453n806j856M695K768
941C793j804q75m17j353J894L035l625p472K929R004j953r857L51R374J945o374
957a405j889L555J870l17J49k509k675K649M726j769p211m22P330K701o735m942
973f894N095P021j521o499q03O873M084m318m958K210L404j829k284J12k358j385
989d050N491L906p973o315R253Q846r009j0622O441J0032n366r634L195O765j370
1004d10j942L929N43k557M729O659n172q917M690R007n408j1777Q19Q175l08o173
1020d113j863L217K883J467j333l083j65M117J333m726l827K218M347L71k881
$$ y = [1131, -238, 2036, 5890, 6096, 2473, -427, 1026, 4144, 2210, -3363, -4084, 742, 2178, -1516, -3051, -428, 703, 745, 1635, -250, -3599, -1904, 3123, 1860, -4762, -4618, 2539, 3992, -1814, -3670, 1025, 3793, 1989, 1114, 697, -656, 1238, 4273, 648, -6824, -3895, 5109, 3156, -6701, -6350, 3024, 4969, -1405, -3294, 261, 2131, 1814, 1963, -546, -3221, -572, 4154, 2385, -4826, -5248, 2082, 4783, -1952, -6894, -1799, 5222, 3701, -2798, -3601, 3272, 7356, 3038, -1920, 290, 3694, 1865, -419, -307, -2665, -4050, 1441, 5347, -2626, -8941, 312, 9158, 149, -10473, -4032, 6000, 634, -9000, -5805, 960, -410, -2352, 1577, 2120, -437, 4292, 10951, 5779, -3138, 1552, 10559, 5151, -6626, -5807, 2368, 2060, -4113, -5976, -2759, 124, 1591, 258, -2825, -2990, 1127, 2460, -2266, -6093, -3875, 472, 843, -2038]
1035b038p11M462N717K78m706j163N114J559o882n565J371Q50l918j424J159j305
1051g202Q43O761K794n683n07J0175K481r612l350Q058J389q396j810O603N93
1066C137l760L186M634l843k998M913J452r164n588M986J192q213m069N704L870
1081d561r04J146M794L292K558K073n42j620P22j64l767l394n4n76j313Q34J153
1098c23p40P92L682k42n322j086L622j981p318j010M907k84k814L556O710J481
1114C630R86N133K385k852q07J993m381p097q23R17n127m401L037L317j760O37
1130e213M970J217k729J944K588m057m046K939K174m084j046O496M255j623J863
1145E648O186J205l343m91n76n389n132j434l263n467j129K690O36j70L999M624
$$ y = [-2038, -2749, 1713, 7430, 7708, 3002, 1839, 6953, 8512, 1630, -3935, -2564, -1714, -5632, -7056, -5897, -7202, -6359, 402, 3196, -2487, -2994, 7181, 9662, 50, -3300, 4758, 6147, -2249, -4059, 2544, 3137, -623, 2563, 7197, 3354, 356, 5269, 6721, -2443, -8031, -3045, -1853, -10066, -14135, -8431, -4561, -5465, -4319, 475, 3767, 6325, 8398, 7856, 6236, 6958, 6794, 3027, -367, -421, -997, -2310, -1476, -323, -1063, -271, 3411, 3169, -2153, -3239, 383, -1598, -8916, -9926, -5019, -5303, -8117, -4561, 2149, 3630, 4616, 9749, 12134, 9282, 8475, 10468, 6087, -1010, -1833, -916, -6043, -10444, -7407, -4090, -5850, -5213, -243, 974, -1755, 189, 2777, -1280, -5326, -2387, -213, -4297, -5343, 1153, 5408, 3785, 5648, 11834, 13039, 9696, 9205, 8629, 3240, -1892, -3326, -6589, -12056, -13185, -10495, -9859, -10029, -6030, -1406]
1161a406J538J810L157q07k395J459R74m340k692L671K691k558L51N679K218k447
1177F903k69J524l625n608j572j845o256l529K958J134k103K666P208L875N24
1192A985L910L729n37j497Q25k343m884r06J802k797l105K957M051j582j418L237
1208C427R66m080k793L24k943n140m51K377j061k57N194N430J718K314N364K355
1224A2744j686l24p77l957m117j676k556l871k15K384m57q96L480L049j658q81
1240a414K005m17m405j606K252r59k345K760N454R90K43M987M589j413j690J131
1256A0162j601n350m024j439l611l567K49R73n44J555M321K087N12J983K228j319
1272B615j619M40m93k545m28K263R54p85K683L901L6j770J542R53l854m611j372
$$ y = [-1406, 132, 1942, 5099, 4292, 1897, 3356, 4330, -10, -2702, 969, 3660, 1102, 1453, 7132, 9350, 6903, 6634, 8158, 4533, -1075, -2647, -4492, -10748, -14277, -11319, -10185, -12288, -9622, -2414, 1461, 1985, 5895, 9624, 9087, 7590, 8415, 6072, 1188, 282, 2084, -713, -3818, -861, 3190, 1608, 190, 3427, 4393, 313, -2480, -2156, -5099, -10239, -10690, -8313, -9374, -9631, -4437, 993, 2711, 5025, 10389, 12744, 11058, 10734, 9957, 6000, 1883, 207, -2349, -6220, -6435, -4051, -4508, -5404, -1924, 1125, -533, -1414, 591, 174, -4231, -5837, -3585, -4544, -6889, -4129, 1325, 2315, 2558, 7545, 12134, 10721, 9031, 10162, 8561, 3211, -813, -2252, -5863, -9430, -9181, -8208, -8752, -7197, -2876, -789, -277, 1706, 3934, 2615, 996, 1436, 943, -1602, -2030, 233, 1187, 402, 3085, 6986, 7022, 5252, 6794, 7747, 3893, -718, -2090]
1289b090j805m503k183J109N90J36K942L809K019K202K974J093o23P8l05k326
1305C117k232j79l77j474N81K160N05q93J089J563j544k830p03n32l395k655N01
1322g298N48j217J256M326K679P88K758L280O89o60J69j047k498j866j357j874
1338a324j451M1O92j28L59J636M97o31n86L61r82j904o27M94p06m11K125K430
1356a15J050J195K693J709l3l70m36j067j982j928j871j692r14k69k11N73J138
1373b530Q86P33J092N01m01l70p8j61j104m50Q68R75j63M0J905J889J03o28O56
1392C763k60j439j687p57j156j470p69K33L59N1R89J310J284M29L02M72M27o16
1410A465q70j55k3k71p63l78Q84R08n4k62L50M97m30j052J2m30r24o69M25K92
$$ y = [-2090, -3895, -8398, -10581, -9472, -8882, -8746, -5804, -1995, 24, 2226, 5200, 6293, 5670, 5748, 5443, 3117, 885, 706, 329, -1145, -564, 1596, 2101, 1208, 2297, 3860, 2316, -514, -1217, -1749, -5144, -7799, -7298, -6750, -7967, -6711, -2385, 294, 1082, 3840, 7120, 7809, 7149, 7318, 6271, 3773, 1907, 550, -1324, -2775, -2734, -2042, -2170, -1811, -175, 322, -309, -895, -534, -1516, -3420, -4047, -3553, -4259, -4670, -2545, -115, 935, 2130, 4823, 6532, 6499, 6129, 5693, 4626, 2644, 716, -1155, -2847, -3761, -4030, -4241, -3668, -2530, -1644, -911, 181, 682, 281, -89, -167, -328, -1432, -1882, -1014, -39, -202, -162, 1743, 3632, 3735, 3107, 3763, 3503, 2064, 377, -380, -1536, -3006, -3775, -3542, -3183, -3132, -2143, -833, 451, 880, 1182, 1654, 2081, 1465, 595, 440, 417, 146, -617, -995, -111, 797, 743, 481, 831, 1328, 898, -154, -142, -572, -1496, -2165, -1740, -1448]
1430a448o45J01J528J152m5r2J095J049j118q24O41K91j324j405M77O97r86m45
1448a301J032K93p02J46Q42L47j030n02P32L90q27l02P79K65k67j59R64K37q02
1467A35j1O27r0o77j99J67K53n69j46K67J90o71O1O78Q8m43J59Q33l15m62N04
1488C79R37p77q60O52N63j214q00N23M05r65l32J213K57p45L29J616lj384L93
1507A87J628p46j970M60J284o12j829Q25J526n41r52P28J157p20r56N38K68r46
1525f71j192O20J071r43o45J220J740ln59P82J558n71j334j94M98r52j618l40
1543a533P31m79j110P32J624n79p85J362J382j490j014J094R73j760r76J417J145
1560G34n73K17J577P00o29M05Q39q78j728l37J91k010j654M40M75q66J4J168J150
$$ y = [-1448, -2093, -1992, -464, 688, 643, 551, 1646, 2695, 1577, 753, 1394, 1685, 361, -1044, -567, 130, -856, -1301, -269, 24, -678, -532, 310, 657, -373, -875, -143, 247, -580, -882, -103, 162, -105, -264, 700, 937, 135, 124, 751, 661, -16, -215, -48, 205, -364, -510, -243, -53, -724, -663, 15, 103, -340, -181, 652, 337, -125, 379, 1316, 539, -321, 331, 894, -320, -1120, -597, -192, -1157, -1489, -276, -19, -764, -435, 1181, 1178, -206, 187, 1815, 1069, -901, -441, 843, 231, -1598, -773, 753, 212, -740, -12, 1145, 425, -531, 7, 275, -671, -1863, -1243, -172, -1115, -1760, -540, 1200, 1197, 638, 1420, 2978, 2407, 1073, 879, 1377, 425, -1193, -1533, -802, -1281, -2391, -1659, -35, -614, -1399, -37, 1345, -145, -1159, -65, 908, -852, -1828, -411, 734, 161, 378, 1955, 2655, 2026, 2431, 3270, 2392, 664, 327, 518, -1492, -3146, -2706, -2231, -3097, -3083, -1915, -765]
1579g65N0P44R83J00l21J17J16p78m53M24L03k2L7K22J044K03l6m64k38O1j165
1600A62j431q35j83o70p43O47J065K75N44J549J538o02J51J612j08j913o20J124
1618A562o08k091J30J557k65j056R47J267o72j156O71M2j654j006L81M3j258L47
1636b819J409Q98J41J205J278L27J12L95j66j158j04o37j264r61K17J32q06N09
1654a292R63r1n6O63M39r24j18L27l38j172p4J079J15k18R67J423jJ01P25k2r71
1675A525o08K12j193j492M4O8q35k64J221P89m00M89J290J68n39J02N34o38o33
1694a60K79L82p77j48P58P27k90K04O26k66o97m37K7r17o98p2k42o57L89Q35K83
1715h51j4J388O58k00J06R46o01r91J63M33p16r17M27O11n93m01Q06L13m79k40
$$ y = [-765, -715, 29, 1012, 1112, 791, 908, 1024, 246, -207, 217, 520, 498, 535, 757, 1801, 2004, 1968, 1504, 1266, 1327, 162, -1269, -2104, -2287, -2957, -3700, -3053, -1988, -1713, -1169, 380, 1918, 1316, 1467, 3079, 2971, 1058, 438, 1562, 954, -1137, -1007, 550, 285, -771, 176, 1443, 771, -385, 286, 328, -1326, -2332, -1951, -1908, -3166, -2819, -1410, -512, -371, 834, 2112, 2439, 2551, 2946, 2780, 1622, 1518, 881, -383, -1344, -1127, -995, -1801, -1292, -329, -420, -476, 187, 626, -298, -416, -89, -427, -1599, -1673, -594, -479, -697, 270, 1693, 1692, 1793, 2518, 2496, 1525, 917, 1129, -64, -1556, -1512, -1444, -2279, -2543, -1322, -533, -933, -444, 846, 1014, 475, 577, 1111, 473, -160, 119, 501, -276, -424, 334, 1061, 771, 975, 1601, 1335, 638, 201, 228, -689, -1387, -1459, -1701, -2358, -1969, -1134, -851, -865, 523, 1181, 981, 1087, 2033, 1432, 441, 604, 1037, 321, -596, -169, 442, -151, -552, 254, 567, 88, -152]
1735a52K24j53p55j19M07p33k02N09L91j77N86R87K13j79P24J61j012j44N59n04
1755F31j092J04N07n69q58P79O23p55j28Q51M32r17j97P61k64p26J58Q48k73n03
1775e88M40Q85k45k91N95L22q34J10K58n31o18M02O7m81j57N83k96p3L11M76l07
1796B8k04M21J96o24J10M51k84o45L38L37l95l26P07J13m14K8P68j12q84L94O79
1817F82o24m33P73p2q06n3R40j07p01J35J094n57q38N88P10p82o35N96K08o93
1837e75k55N56L82o67R5P50K50m58O02J39j11k41J39k59j79no9n90p3O21m13j97
1859e58L22L36n14k07Q04K3r24q4Q12n6p24J68Q59M8m79O06Q56m39o82P95M20
1880A382j029k93J92l51p58p5N40m9m00L42N14k95L45K41k81o8J37J18m84l0J91
$$ y = [-152, 72, -81, -836, -955, -548, -1281, -1483, -974, -583, -760, -174, 813, 1026, 847, 1571, 1732, 720, 576, 1135, 631, -461, -357, 150, -419, -1277, -498, 125, -630, -758, 93, 525, -392, -589, 172, -92, -818, -660, 188, -85, -588, -148, 737, 492, 201, 796, 1118, 284, 394, 652, 121, -497, -95, -28, -509, -666, -83, -379, -452, -141, 335, 28, -176, 245, 441, -183, -73, 378, 94, -551, -213, 124, -271, -597, 110, 223, -191, -163, 605, 493, -391, 3, 682, 58, -375, 398, 326, -480, -533, 407, 300, -401, -266, 828, 271, -567, 21, 731, -51, -686, -90, 118, -575, -830, -274, 108, -559, -464, 286, 536, 78, 680, 819, 708, 467, 606, 347, 168, 163, 94, -496, -569, 52, -361, -558, -236, 100, -414, -621, 183, 206, -718, -802, 10, -46, -770, -602, 257, 305, -174, 432, 1288, 849, 167, 962, 1382, 353, 60, 252, -99, -857, -932, -392, -441, -841, -499, 15, -280, 65, 306, 25, -43, 94, 212, -272, -302, -111]
1901a11J94k85L78L92j60M1K20L18m74m17J58l04o31k41M37j89m66K08R04J52
1921A24m00P47O05o22K6M68k96n14m26L62j17m23j01P34o0k84K36L06k29j43j02
1942a09N7n18j43L4R4m9K11J66O90K35j78L52L00J2n68k45J86k44p72l72L09j1
1964e63l28J36P23o8l87J86P47l78l95K84L12m92n50M99P88k91l42O77N73q7l78
1985F66L13j18n81k76n4k04n67o37L96N47m86O5O28M95j96k45O48M06n94l04L81
2006B83J12n34p2P62j26k20pQ21l34m03k7K36m06o60k23L43m80l21J30M37K75
2027d14o1L89O42k33j13J92K44j58l49l5J67j20k97J58K34Q5l82L01K86k89m37
2048a90J53J14m99n02L60K01j87k44O35M14m39L43O67l7l84q2L68k03o81R1L95
$$ y = [-111, 83, -202, 176, 568, 408, 449, 669, 987, 513, 96, 254, -50, -681, -922, -485, -674, -1140, -932, -28, 124, -276, 471, 1076, 454, 480, 948, 652, 138, -288, 74, -43, -466, -567, 167, 107, -177, 59, 365, 136, -7, -109, -52, -570, -713, -679, -585, -634, -423, -257, 433, 668, 490, 842, 1142, 1154, 586, 341, 527, 283, -489, -861, -552, -563, -891, -755, -32, -100, -487, -301, 446, 68, -327, -43, 269, -223, -773, -274, 514, 223, -119, 558, 1131, 1044, 666, 979, 861, 280, 4, -50, -254, -821, -1458, -1062, -515, -1001, -936, -308, 187, -9, -254, 394, 800, 206, -98, 283, 395, -139, -211, 551, 425, 205, 198, 1019, 685, 282, 255, 491, 85, -575, -798, -455, -935, -1256, -1126, -689, -414, -475, -86, 556, 323, 210, 402, 646, 488, 139, 104, 271, 151, -146, 12, 246, 331, -51, 250, 536, 247, -190, -37, 77, -422, -924, -564, -363, -550, -794, -159, 255, -184, 159, 826, 789, 405, 323, 691, 488, -193, -102, 293]
2069B93k67m77L07M27k57l92M35M21m92j54K52j82o3k19Q5J14k8Q8N9L15M7j99
2091A13J73k2o9j38j25P6Q0k71j53L68q2k00n0O31j23l60L10J82m2m77M38L8k26
2114G1q7J81M5k92k20L53p5m45J52N00l22k35K59K12j77r6L90j3j75j48L68j53
2136I3l32L95L55k36l17J46J51l12J35L7j32l61K36N5l93L6J70pj53L71K95j36
2158I6J91K96L7l29j86K60r9o85J1L21j82m69L21M31j98j02M34K58l78L6J68j28
2180A04m56L84J2l53k4M05K84P8o9M14q4k51k04k79l26n22J85k61k31oN89J15
2202d96K7O15N93j00q2L83m5n75L8J37m17n16J84M62j83j67L39M43l21j05k46
2223c2k33m43j39j34l86rK74M89K48M24N26N55%L56K89k19m51k22l95q01n12K16
$$ y = [293, 26, -451, -144, 283, 26, -366, 69, 490, -2, -156, 96, -86, -149, -368, -283, -169, -197, -109, -50, 265, 312, 113, 286, 264, 195, 57, -68, 8, 88, -183, -336, 32, -50, -250, -300, 331, 208, -152, 158, 340, 298, -179, 259, 297, 71, -16, 165, 210, -82, -302, 51, -24, -469, -317, 183, -139, -374, -115, 97, -80, -176, 214, 201, 26, -122, 246, 93, -239, 156, 511, 275, -42, 104, 255, -57, 78, 115, -17, -378, -142, -87, -480, -444, -274, -281, -434, -63, 232, 96, 287, 583, 620, 291, 105, 365, 266, -419, -408, -87, -269, -738, -417, 14, -184, -286, 148, 406, 28, 64, 232, 104, -352, 32, 44, -309, -333, 72, 356, 434, 365, 779, 695, 444, 240, -39, -365, -887, -702, -963, -1194, -1200, -611, -496, -469, 146, 739, 639, 557, 940, 895, 320, 358, 495, 78, -438, -254, 208, 25, -142, 197, 640, 319, 214, -32, -265, -708, -847, -981, -1367, -1376, -1102, -613, -365, 59, 585, 1140, 1140, 1496, 1785, 1566, 1115, 893, 498, -303, -815, -599]
2245e99j30l30M59M98j38ML70j35l96o8k11j22l77Q2L07J22L45P98P32L22K34
2266A767M22K23o13m68m01r25r28j50j93n24oM26M25J15L23O80J75j50r7j5l87
2287c01L5l02J69L7O15N61J44L69L28M73m38k39m98o43r99o13l82o36l17M37L70
2308a830K86O38J105N54J49M59J72m07m91j99k5m23k49K36J47K42K03M55K29l02
2328I49j73k84o58p39o07n54k84L8J88L95O45J009P99P45M03M02j2k41n07j72
2348A342j020m92j61n07j88J69M54K98pK84J28j19n17n11j33n21l23J11M91L51
2368h71M65J049N16O12N01M23j38l80n82r15o69q33n17j94k91K29Q1L99L92M74
2388b49K95K26q7k21k70j73J65l55Q5M39M33N57M80M50L39q8l09o3o24q88r04
$$ y = [-599, -729, -1059, -600, -102, -240, -236, 134, -1, -397, -465, -676, -798, -1175, -1093, -786, -664, -319, 479, 1211, 1533, 1767, 2189, 2412, 1799, 1331, 930, 5, -923, -1073, -1266, -1790, -1796, -1370, -945, -830, -507, 173, 348, 198, 101, 86, -301, -266, -568, -399, -362, 253, 814, 958, 1327, 1655, 2128, 1690, 1451, 953, 310, -689, -1302, -1684, -2320, -2637, -2200, -1830, -1544, -906, 199, 753, 902, 1361, 1533, 1126, 635, 436, 411, -12, -261, -25, 122, 364, 567, 1022, 1251, 949, 776, 492, -166, -905, -1512, -2066, -2350, -2312, -2124, -1729, -1084, -75, 724, 1469, 1872, 2274, 2262, 2021, 1514, 1342, 322, -170, -331, -838, -1026, -857, -403, -105, -112, 172, 300, 181, -336, -847, -980, -1501, -1824, -1713, -1222, -871, -406, 643, 1159, 1771, 2272, 2695, 2557, 2177, 1595, 680, 11, -822, -1339, -1533, -1824, -1595, -1514, -1115, -723, -249, 46, 272, 185, -36, -306, -479, -314, -669, -584, -145, 288, 845, 1325, 1775, 2114, 2026, 1717, 1654, 1030, 142, -762]
2409g62l87o57m70j24N03J49N12O50P31N16O3K76J23m07k09j80j40k16N4J6N45
2430E86M2K50L62L0l57l48m28m61n87n77m75p5L2M8N89O60O97M60N05M83R3o5
2452A464k15k28l66n21o6j12j51j47K84J43M1J48n7Q1l88m13j32k32m27k67J83
2473a378M45K64M64N61N29M15PM11j24m13k96l34m39n05k73l1k37K44K01K29J49
2494a11m1P1L15j80k49j1p8j74j37Q6L46K26J24M27K70J98k98J64k44k95l85k08
2516a84l51k32k33L84J60j3L1L62J20K72j01K07K8j58k13j07m7j85K66K8K19j5
2538B38%L27p5k30k35K00j69m71k34J51q5r5O9K77L18Q1Q7J85J48j83K44k31r9
2561B18j90J22J5k67J89j38J30o3k6J34j93L5m2j40J48k07J7P0K6M4K81j49J35
$$ y = [-762, -1149, -1806, -2276, -2400, -1897, -1748, -1236, -586, 145, 661, 724, 1000, 1123, 716, 507, 327, 187, -29, 25, 41, 586, 628, 878, 1240, 1270, 913, 565, 137, -324, -911, -1488, -1963, -2038, -2006, -1958, -1369, -709, -12, 448, 953, 1436, 1529, 1464, 1249, 1021, 655, 134, 68, -44, -195, -342, -58, 85, 126, 274, 217, 298, -90, -503, -635, -867, -1294, -1561, -1378, -933, -669, -205, 356, 885, 1300, 1307, 1718, 1594, 1181, 885, 551, 112, -393, -666, -697, -934, -690, -489, -260, -111, -152, -81, 234, 54, -195, -206, -284, -458, -595, -509, -163, 63, 187, 614, 884, 1082, 784, 948, 704, 409, 24, -184, -535, -767, -1000, -616, -456, -469, -438, -76, 44, 316, 215, 422, 450, 292, 79, -28, -75, -260, 6, 34, 253, 238, 238, 565, 490, 260, 25, 225, 56, -415, -649, -498, -583, -678, -609, -332, -14, 67, 154, 339, 487, 304, 548, 317, 218, 28, 150, 165, -102, 87, -51, 79, 16, -10, 124, -69, -34, -76, -216, -68, -275, -258, -188, -162, -118, 163, 14, 149]
2584A49k6L7j38J77n7j12M3M8J01m03n2J54p9J1Q2J44j44O0J58N8k90j05K12k2
2608FL2j09L2j2j24M2J60j18j50K42pl2M7RJ71r2N6K39k25j25J29j96jj15J22
2633a9q1l2J21J47j56j3J20j23j02J03J5l68k5J84N0k1j57N12R1q6K03K01Kk50
2657C16O4O3l04j48k86K54l72OK1J14Q3j1K16o3j73K63L1j15k82K50J5k00L19
2680F1J84MNJ25L55p2j87p2j12m25Mj58r1l52J66Q8J3J90J46L05j92o0L72l30
2704c3J1Q5q3p0j09L15O3q1L12J60Rk07J18j57k36l27k4j06l80KJ65K1O4J52K57
2729g9L05J0K14J13j61k25R4k32jl1n3j45K18j14J91J8PK39m6l05j98L1k82o1
2753d93j17J95m2N8M02J68Q7J72K34n3p7M6j86k57l35J54j40j10kJ80Np1j0M67
$$ y = [149, 123, 160, 22, 199, 142, 30, 73, 121, 222, -181, -233, -79, -158, -147, -65, 79, -65, -5, 153, 211, -79, -184, 28, 6, 38, -71, -39, -51, -175, -133, 27, -91, -241, 1, -6, -38, 9, 18, 189, 97, 153, 392, 167, 42, 171, -25, -26, -141, -19, -100, -132, -11, 136, -20, -33, 87, -36, -138, -35, -20, -388, -413, -229, -179, -200, -357, 155, 246, 160, 363, 564, 566, 316, 380, 443, 139, -9, -295, -41, -413, -407, -386, -272, -189, -200, 16, -47, -220, 43, 74, -41, -323, -73, -58, -258, 61, 245, 249, 254, 379, 734, 662, 475, 403, 291, -134, -130, -288, -379, -731, -565, -477, -464, -274, -128, 177, -15, -75, 297, -33, -22, 63, -20, -90, -199, 116, 179, 98, 410, 570, 579, 372, 490, 333, 97, -230, -254, -360, -740, -738, -573, -552, -488, -336, -79, 226, 236, 450, 563, 402, 177, 271, 39, 38, 7, -46, -191, 27, -87, 104, 122, 129, 368, 322, 17, -181, -150, -432, -493, -610, -415, -457, -399, 3, 171, 258, 430, 664, 611, 534, 580, 394, 137, -198, -44, -184, -294, -296, -116, -111, -182, -192, 275]
2777B75k59J11k37j6n5j19J41j81M8K03K89J52LL39l6q2qj42j88k62j89j20k8
2800c61j81R8JmK62K44K4q7K42Jj26j49R9j4j48J8J80L9q1K40J67j02o3Jj64j29
2826Gn6j53k12j95N4L1R8P8J16K61r6L65p9J85L8j72j39n4pj36L74m67J89O1J72
2851B63n7r7J42k52j08N4l26j18n3J54J91l43K47K57J4R1L87nl4j81K04j95k54
2874a9o1j8k81J71J24j9p5O1J70j43k7Q4o9k12J26m3oj29J04J10K07P4k3L72k91
2899A87J38J03k09j55r6J45j94j47j16J76J8m9J75J88m5j20J76j86o5K1J9Kj05
2922a39p0L40n6j83L37k5k35J52N5K7Qk92J52k23j63l3J76J9J0P2K06j2J75rj80
2947A09J21M7m7l54K2R6l9j01J15J14j5j43M1M9J08j58J76j48o2J15J3j82O8R7
$$ y = [275, 16, 127, -110, -126, -181, -300, -159, -340, -292, -89, 200, 352, 355, 694, 658, 576, 568, 426, 238, -24, -213, -333, -361, -542, -444, -443, -447, -185, 59, 83, -4, 238, 239, 113, -36, 63, 49, -99, -81, 99, 138, 57, 297, 464, 362, 299, 300, 136, 7, -49, -202, -414, -609, -555, -524, -426, -348, -232, 29, -67, 298, 219, 404, 442, 270, 131, 77, 70, -66, 308, -159, 30, 91, 263, 206, 109, 251, -1, -109, -55, -381, -499, -552, -398, -207, -550, -303, -46, -32, 59, 446, 441, 407, 226, 430, 235, -19, -80, -98, -379, -208, -84, -103, -178, -117, 53, -90, -117, -33, -102, -314, -188, -231, -237, -366, -262, -152, 55, 129, 106, 478, 187, 325, 428, 219, 64, -32, 113, -81, -228, -344, -168, -150, -199, -24, 164, 119, -1, 175, -11, -76, -55, -36, -34, -139, -209, 131, 75, -108, 229, 204, -31, 121, 176, 203, 211, -81, 71, -152, -315, -348, -172, -153, -143, -71, 135, 123, 298, 289, 109, 230, 277, 230, -124, -102, -6, -45, -146, -31, 83, 68, -75, -34, 15, 123, -35, 141, -7, -69, 46, 59, -123, -55, 42]
2971D2l5R1l1J59m1j60L0m0K3p4j50K24k07K6Mj7n4L89k91O7J50kOp9o4Q7J4l6
2999C1k6r8Q5j07J72J22q0P2p4j05jQ3K8j06k00m4K27J2o0q4J04N8N9N2K1k9R4
3026B06j03q9r3R5p5n2q8R3j67O3K77j04J58J4M6k48R2m1LN4J49j72p2J05m9J55
3052A57M8j55P8M1J6k25M3j04q2k6P6k6j7j0J22J81j48P1J73J88j65j9P2j89J45
3077B45j15j80N8m5j15J07o6j05L08j47PN8q7L6k43m0K83j89J25K0J16O9J41L2
3101B73p6J56J27l10L3N5k66J81j89k63k1N5p5K4L11j05O5M3j19L27l39M0k2L0
3125f5P4k57K59O6M9Q6M3K00j69J6k47L9j26k1k65k5j1k7K51j57J83J02J30R5
3149B23o7j13K20j16m5L6k51K67j40p8J94k0J55k19P9O7q8j73p8j27k6n1j14L42
$$ y = [42, 7, 98, 67, 226, 185, 25, 55, 15, 38, -36, -186, 38, -169, -143, -139, -156, -210, 179, -112, -45, 105, 103, 109, 30, -34, 53, 67, 31, 5, -93, -8, -115, 57, 179, 99, 171, 97, -8, -9, 74, 102, -4, -204, -248, -21, -9, -69, -153, -49, 9, 68, 120, 141, 112, 206, 103, 14, -79, 16, -59, -111, -199, -106, -273, -210, 67, -37, 121, 135, 181, -67, 25, -16, -13, 41, 190, 18, -54, 51, 2, 157, 205, 50, 128, 169, 185, -40, 3, -101, -183, -209, -133, -159, -176, -186, -64, 117, -31, 40, 213, 401, 236, 217, 289, 100, 245, 130, -50, 8, -37, -152, -45, -111, -216, 92, -55, -48, 10, -77, -41, -284, -324, -41, -230, -105, -85, 31, 100, 241, 273, 197, 353, 480, 170, 203, 258, -8, 173, -16, -279, -300, -245, -320, -296, 15, -90, -25, 18, -101, 226, -113, -73, -95, -65, 9, -248, 11, 77, 126, 212, 255, 455, 286, 302, 55, 94, -32, -53, -318, -343, -354, -381, -130, -287, -104, -2, 128, 223, 156, 43, 263, 147, 102, 138, -113, 154, 14, -64, 130, 110, 265, 46, 125, 192, 104, -69, -147, -274, -300, -351, -465, -123]
3173a23q5J28O1O7Q6J36J1J43j82j47Ln5j04J53k91J26r5J16l3J31Q1j30p7J72
3197I2k74j6J54j47kJ02j6K22k1OJ06J21k05N4j12J4o2j58K02j30j86L23k52J1
3221a74K0P3J75j05N5LP6r0o0R1j83L57L0k79J77jj91J12j28L4R9q4j1j84m9P0
3247a67m2J81j53J1J32j23Q5J74R5kk64R5L1l7l9N7N4l0j77K33j3j33m8J98j41
3272b3J17l28J41P0m0o2J19L9j86J35k9j15N8J15J33j15j3kJ2J83j98r5K04O5
3296A85j37n4j18J84n5L6j20J12J8l9J54j03M1j38M1N7q5j41J46j38j26J94J28
3319D2nr3j24K69K76k17j02P3l29J44J54J09k0k74L11j60N7m7O7j5K6r0J7n7r3
3344h1j28P1k49N6N8R7N5K07O1J30L0l4j39j35K57k72m0o2J94q7m3m2R1k2J08
$$ y = [-123, -208, -80, -19, 48, 134, 270, 281, 424, 242, 95, 98, 43, -61, 92, -199, -73, -168, -52, -85, 46, 127, -3, -80, 92, -182, -198, -44, -191, -193, -91, -107, 115, 94, 100, 206, 327, 122, 176, 64, 78, 16, -142, 60, -70, -256, 67, -185, -174, -154, -81, 94, -11, 44, 47, 123, 33, -27, 64, -119, 238, 268, -11, 166, 165, -26, 86, -42, -8, 91, 7, -4, -188, -237, -167, -209, -28, -181, -170, -38, -161, -76, 98, 193, 191, -73, 22, 53, 16, -23, 34, 88, 58, -119, 114, 101, -32, -80, 118, -23, 94, -234, -93, -23, -63, -125, -6, 33, -153, -18, -47, -162, -104, 11, 144, 29, 16, 14, 26, 209, 11, -84, 120, 185, 48, -6, -124, 60, 5, 41, -79, 33, 51, 12, 166, 63, 104, -34, 7, 64, -21, -162, -16, -154, -280, -86, 42, 37, -56, -180, 89, 365, 148, 46, 119, -210, -66, 88, 197, 177, -97, 214, 54, 111, 64, 131, 116, 142, 52, 69, 12, -81, -209, -138, -387, -331, -273, -176, -121, 86, 147, 277, 307, 273, 134, -1, 256, -16, -56, -118, 76, -11, -54, -96, -5, -27, 81]
$$ [...]
8191A4
##END NTUPLES=NMR FID
##END=
