##TITLE=1H_Pr 48-6g
 CDCl3
 8 sc, 
 26.1.2023
##JCAMPDX= 6.0         $$ Bruker NMR JCAMP-DX V2.0
##DATA TYPE= NMR FID
##DATA CLASS= NTUPLES
##ORIGIN= UXNMR, Bruker Analytische Messtechnik GmbH
##OWNER= root
$$ XWIN-NMR		Version 3.5
$$ Thu Jan 26 15:44:19 2023 Russian Standard Time (UT+4h)  she@DPX200
##.OBSERVE FREQUENCY= 200.13135
##.OBSERVE NUCLEUS= ^1H
##.DELAY= (6, 6)
##.ACQUISITION MODE= SIMULTANEOUS
##.ACQUISITION SCHEME= undefined
##.AVERAGES= 8
##.DIGITISER RES= 18
##SPECTROMETER/DATA SYSTEM= spect
##.PULSE SEQUENCE= zg30
##.SOLVENT NAME= CDCl3
##.SHIFT REFERENCE= (INTERNAL, CDCl3, 0, 15.7039)
##AUDIT TRAIL= $$ (NUMBER, WHEN, WHO, WHERE, WHAT)
$$ ##TITLE= Audit trail, XWIN-NMR		Version 3.5
$$ ##JCAMPDX= 5.01
$$ ##ORIGIN= Bruker BioSpin GmbH
$$ ##OWNER= she
$$ F:/spectra/data/she/nmr/H-F/1/audita.txt
$$ ##AUDIT TRAIL=  $$ (NUMBER, WHEN, WHO, WHERE, WHAT)
(   1,<2023-01-26 15:42:12.07 +0400>,<she>,<DPX200>,
      <created by zg, POWCHK disabled, PULCHK disabled
       configuration hash MD5:
       00 E9 B6 7A A2 85 ED C7 34 08 36 98 17 FE 4E 26
       data hash MD5: 16K
       FF CB 93 16 22 91 FB 66 4E 2F F1 20 E1 C7 41 99>)
$$ ##END=
$$ 
$$ hash MD5
$$ C1 99 1D B4 3B 2A 8C 39 60 DC 88 28 BF D7 2F 7C
##$RELAX= 
##$RELAX= 
##$RELAX= 
##$RELAX= 
##$RELAX= 
##$RELAX= 
$$ Bruker specific parameters
$$ --------------------------
##$DU= <F:/spectra>
##$EXPNO= 1
##$NAME= <H-F>
##$PROCNO= 1
##$TYPE= <nmr>
##$USER= <she>
##$AMP= (0..31)
100 100 100 100 100 100 100 100 100 100 100 100 100 100 100 100 100 100 
100 100 100 100 100 100 100 100 100 100 100 100 100 100 
##$AQSEQ= 0
##$AQ_mod= 1
##$AUNM= <au_zg>
##$AUTOPOS= <>
##$BF1= 200.13
##$BF2= 200.13
##$BF3= 200.13
##$BF4= 200.13
##$BF5= 200.13
##$BF6= 200.13
##$BF7= 200.13
##$BF8= 200.13
##$BYTORDA= 1
##$CFDGTYP= 0
##$CFRGTYP= 5
##$CHEMSTR= <none>
##$CNST= (0..31)
1 1 145 1 1 1 1 1 1 1 1 1 1 1 1 1 1 1 1 1 1 1 1 1 1 1 1 1 1 1 1 1 
##$CPDPRG= <>
##$CPDPRG1= <>
##$CPDPRG2= <>
##$CPDPRG3= <>
##$CPDPRG4= <mlev>
##$CPDPRG5= <mlev>
##$CPDPRG6= <mlev>
##$CPDPRG7= <mlev>
##$CPDPRG8= <mlev>
##$CPDPRGB= <>
##$CPDPRGT= <>
##$D= (0..31)
0 1.2 0 0 0 0 0 0 0 0.06 0 0.03 0 0 0 0 0.0002 0 0 0 0 0 0 0 0 0 0 0 0 
0 0 0 
##$DATE= 1674733331
##$DBL= (0..7)
120 120 120 120 120 120 120 120 
##$DBP= (0..7)
150 150 150 150 150 150 150 150 
##$DBP07= 0
##$DBPNAM0= <>
##$DBPNAM1= <>
##$DBPNAM2= <>
##$DBPNAM3= <>
##$DBPNAM4= <>
##$DBPNAM5= <>
##$DBPNAM6= <>
##$DBPNAM7= <>
##$DBPOAL= (0..7)
0.5 0.5 0.5 0.5 0.5 0.5 0.5 0.5 
##$DBPOFFS= (0..7)
0 0 0 0 0 0 0 0 
##$DE= 6
##$DECBNUC= <off>
##$DECIM= 32
##$DECNUC= <off>
##$DECSTAT= 4
##$DIGMOD= 1
##$DIGTYP= 9
##$DL= (0..7)
0 120 120 120 120 120 120 120 
##$DP= (0..7)
150 150 150 150 150 150 150 150 
##$DP07= 0
##$DPNAME0= <>
##$DPNAME1= <>
##$DPNAME2= <>
##$DPNAME3= <>
##$DPNAME4= <>
##$DPNAME5= <>
##$DPNAME6= <>
##$DPNAME7= <>
##$DPOAL= (0..7)
0.5 0.5 0.5 0.5 0.5 0.5 0.5 0.5 
##$DPOFFS= (0..7)
0 0 0 0 0 0 0 0 
##$DQDMODE= 0
##$DR= 18
##$DS= 0
##$DSLIST= <SSSSSSSSSSSSSSS>
$$ [...]
##$SUBNAM2= <"">
##$SUBNAM3= <"">
##$SUBNAM4= <"">
##$SUBNAM5= <"">
##$SUBNAM6= <"">
##$SUBNAM7= <"">
##$SUBNAM8= <"">
##$SUBNAM9= <"">
##$SW= 18.05172834244
##$SWIBOX= (0..15)
0 0 2 0 0 0 0 0 0 0 0 0 0 0 0 0 
##$SW_h= 3612.71676300578
##$TD= 16384
##$TD0= 1
##$TE= 0
##$TE2= 300
##$TE3= 300
##$TEG= 300
##$TL= (0..7)
0 120 120 120 120 120 120 120 
##$TP= (0..7)
150 150 150 150 150 150 150 150 
##$TP07= 0
##$TPNAME0= <>
##$TPNAME1= <>
##$TPNAME2= <>
##$TPNAME3= <>
##$TPNAME4= <>
##$TPNAME5= <>
##$TPNAME6= <>
##$TPNAME7= <>
##$TPOAL= (0..7)
0.5 0.5 0.5 0.5 0.5 0.5 0.5 0.5 
##$TPOFFS= (0..7)
0 0 0 0 0 0 0 0 
##$TUNHIN= 0
##$TUNHOUT= 0
##$TUNXOUT= 0
##$USERA1= <user>
##$USERA2= <user>
##$USERA3= <user>
##$USERA4= <user>
##$USERA5= <user>
##$V9= 5
##$VALIST= <valist>
##$VCLIST= <CCCCCCCCCCCCCCC>
##$VD= 0
##$VDLIST= <DDDDDDDDDDDDDDD>
##$VPLIST= <PPPPPPPPPPPPPPP>
##$VTLIST= <TTTTTTTTTTTTTTT>
##$WBST= 1024
##$WBSW= 4
##$XGAIN= (0..3)
0 0 0 0 
##$XL= 0
##$YL= 0
##$YMAX_a= 440260
##$YMIN_a= -343262
##$ZGOPTNS= <>
##$ZL1= 120
##$ZL2= 120
##$ZL3= 120
##$ZL4= 120
##$ABSF1= 10
##$ABSF2= 0
##$ABSG= 5
##$ABSL= 3
##$ALPHA= 0
##$AQORDER= 0
##$ASSFAC= 0
##$ASSFACI= 0
##$ASSFACX= 0
##$ASSWID= 0
##$AUNMP= <proc_1d>
##$AZFE= 0.1
##$AZFW= 0.1
##$BCFW= 1
##$BC_mod= 2
##$BYTORDP= 1
##$COROFFS= 0
##$CY= 11.3945322036743
##$DATMOD= 1
##$DC= 2
##$DFILT= <>
##$DTYPP= 0
##$F1P= 2.36226072786647
##$F2P= -0.459571619588291
##$FCOR= 0.5
##$FTSIZE= 0
##$FT_mod= 4
##$GAMMA= 1
##$GB= 0.15
##$INTBC= 1
##$INTSCL= 1
##$ISEN= 128
##$LB= 0.24
##$LEV0= 0
##$LPBIN= 0
##$MAXI= 10000
##$MC2= 0
##$MEAN= 0
##$ME_mod= 0
##$MI= 1.114404
##$NCOEF= 0
##$NC_proc= 0
##$NLEV= 6
##$NOISF1= 3.799351
##$NOISF2= 2.8
##$NSP= 1
##$NTH_PI= 0
##$NZP= 0
##$OFFSET= 15.70392
##$PC= 1
##$PHC0= -19113.96
##$PHC1= 8.400789
##$PH_mod= 1
##$PKNL= yes
##$PPARMOD= 0
##$PSCAL= 0
##$PSIGN= 0
##$REVERSE= no
##$SF= 200.130013532006
##$SI= 16384
##$SIGF1= 3
##$SIGF2= 2
##$SINO= 400
##$SIOLD= 16384
##$SREGLST= <1H.CDCl3>
##$SSB= 0
##$STSI= 0
##$STSR= 0
##$SW_p= 3612.71676300578
##$SYMM= 0
##$S_DEV= 0
##$TDeff= 0
##$TDoff= 0
##$TI= <>
##$TILT= no
##$TM1= 0
##$TM2= 0
##$TOPLEV= 0
##$USERP1= <user>
##$USERP2= <user>
##$USERP3= <user>
##$USERP4= <user>
##$USERP5= <user>
##$WDW= 1
##$XDIM= 8192
##$YMAX_p= 0
##$YMIN_p= 0
$$ End of Bruker specific parameters
$$ ---------------------------------
##NTUPLES= NMR FID
##VAR_NAME=  TIME,          FID/REAL,        FID/IMAG
##SYMBOL=    X,             R,               I
##VAR_TYPE=  INDEPENDENT,   DEPENDENT,       DEPENDENT
##VAR_FORM=  AFFN,          ASDF,            ASDF
##VAR_DIM=   8192,          8192,            8192
##UNITS=     SECONDS,       ARBITRARY UNITS, ARBITRARY UNITS
##FACTOR=    0.0002768,     1,               1
##FIRST=     0,             0,               0
##LAST=      2.2672688,     0,               0
##MIN=       0,             -343262,         0
##MAX=       2.2672688,     440260,          0
$$ Real data points
##PAGE= N=1
##DATA TABLE= (X++(R..R)), XYDATA
0 0 0 0 0 0 0 0 0 0 -8 8 -8 8 -16 16 -24 31 -32 41 -49 64 -78 89 -106 128 -152 176 -201 234 -271 312 -354
31 -354 407 -462 520 -590 663 -745 834 -934 1041 -1158 1287 -1426 1581 -1747 1931 -2130
47 -2130 2350 -2589 2852 -3141 3460 -3814 4205 -4647 5144 -5707 6355 -7107 7994 -9055
61 -9055 10352 -11982 14101 -16980 21135 -27694 39671 -68812 296728 285107 -23515 337702
73 337702 316002 114079 -188158 -30008 -92899 -135345 -69105 -159127 -217492 -167807 73707
84 73707 37731 -170695 -61631 48220 86124 -125193 -124127 -42016 -42244 47909 30389 68703
96 68703 88216 180324 241432 85253 72212 72968 79055 -11160 -66259 -44400 -135901 -118300 -99498
109 -99498 -93188 -140102 -127198 42016 38859 12310 -2060 51112 101110 15314 -6276 -20283
121 -20283 25148 34364 6514 28237 772 32663 63589 84658 22763 -28261 73537 68678
133 68678 -28494 -117700 -71996 -14126 -107543 -124541 -84846 -29494 -5846 7571 38934 14613
145 14613 56482 97253 68436 -3453 -7255 68197 23194 -39353 -41208 8517 34635 499
157 499 22731 18868 26267 53237 24757 -27962 -57018 -11306 -31888 -102427 -94697 -41313 -28872
170 -28872 -63315 -12699 36349 32541 48011 70574 82542 40054 38762 56475 14102 -10731
182 -10731 -7908 3694 -21009 -32866 -6056 -6431 -21600 -23242 5740 -4032 -32779 -27788 -22963
195 -22963 -25023 -49484 -37049 -9424 -8926 14691 34632 48452 52473 61157 68742 41808 21992
208 21992 22840 20162 -16629 -43611 -33183 -29638 -38595 -55548 -33604 -4366 -7421 -2742 -904 5054
222 5054 4698 -1311 -4371 -18792 -10357 12046 13109 -542 14669 43587 38214 23941 21655 31366
236 31366 20892 927 -504 -21414 -33946 -26179 -26282 -36976 -42315 -12163 11325 -1546 -7915
249 -7915 14069 26287 8433 -2182 3905 10003 -564 -4208 5861 -1676 355 12547 11164
262 11164 6336 5657 16185 11772 -4960 -3743 -1680 -13074 -19121 -12506 -11476 -14839 -11846 1691
276 1691 7577 -2968 5433 15635 8592 2934 3231 8620 92 -7611 2557 1219 -8546 -3082 7218
291 7218 3516 -2992 1141 8122 2966 -5963 381 -810 -6433 -2997 -4621 -6456 -5606 742 5797
306 5797 -2837 -1231 11340 8873 -1936 -933 6414 5811 -4299 -4411 4262 -1489 -6311 -1400 -3767
321 -3767 -5080 -3959 -379 1363 -3081 2308 7654 2426 922 1789 1755 2051 -1017 -1044 1649 -321 466
338 466 1329 -2873 -964 949 1583 -178 -4408 1725 765 -8718 -5858 -907 -3565 -5736 -607 8097
354 8097 6055 1035 7094 8322 2931 3356 2170 1708 1899 -706 219 -4379 -7114 -4114 -7435 -9365
370 -9365 -7252 -3871 251 -213 1348 6118 3752 4553 10044 5612 1223 4187 6453 2018 -7251 -4483
386 -4483 251 -4172 -2269 841 -1505 1902 2689 -2308 -7337 -9042 -7090 -9543 -9833 -2154 -321 2559
402 2559 14257 15951 11556 11920 15099 14651 2665 -5480 -2967 -4078 -8504 -14491 -17725 -9495 -2350
417 -2350 -3485 -4049 -2277 4871 7089 -1561 -4211 -4608 -6294 -2024 -48 25 2217 11552 23829 17173
433 17173 4740 12954 18804 6777 -4772 -5669 -5078 -11366 -15371 -16841 -25757 -22410 -4380 -2601
447 -2601 -6471 4166 15474 15770 9020 6275 1578 -5057 2051 5343 -5879 -4384 9706 10595 1195
462 1195 -49 9282 9218 3253 8761 6777 -7032 -8102 -5549 -16073 -26953 -17220 1427 195 -3718
477 -3718 11187 14468 1378 -83 3890 -2094 -9550 776 12850 3002 -2620 6884 5552 173
491 173 4954 6138 5309 10507 12070 -2233 -14421 -6819 -10753 -28760 -19421 1751 -1413 -8153 4039
506 4039 12560 -2139 -9401 7840 11719 1535 9780 21465 13386 1186 1648 2309 -11162 -12816
520 -12816 3518 5365 -3770 -375 3096 -3084 -9642 -9367 -9725 -10575 172 3507 -11482 -10559 2870
535 2870 -4113 -12727 2775 21308 18813 17305 31720 25354 747 1366 5298 -15257 -26774 -11777
549 -11777 -3542 -16406 -19752 -4466 -4169 -10187 1980 10461 5284 6818 14664 11389 -4861 -7880
563 -7880 1743 763 -31 8878 11768 11525 13766 8041 -6098 -13190 -5435 -8037 -22104 -16558 -3938
578 -3938 -10155 -12704 -517 4573 -2226 5288 24318 17964 -1891 5832 16103 2723 -9857 -4649
592 -4649 3943 3264 2345 4983 -253 -1701 4366 -1365 -10645 -7707 -3199 -3043 -6725 -8710 -8673 -7466
608 -7466 515 2637 -5749 -414 13945 12662 1240 -530 8201 8533 927 2781 3690 -2386 -118
623 -118 1709 -6204 -10888 -4664 3367 675 -3428 2387 2968 218 2782 -142 -5640 -956 5506 1910
639 1910 -7051 -4644 1996 -2984 -5169 -295 -1578 -6 7232 6107 -3315 -5197 5497 6087 -6090
654 -6090 -3613 6966 4342 -152 926 201 -3864 -2575 5090 1173 -5715 2405 8328 -327 -7041
669 -7041 -4817 94 -1537 -3376 -1118 -1898 303 5192 -161 -5489 15 5632 3278 -1229 2221
684 2221 5155 -995 -1939 966 -3860 -4007 2154 4665 1017 -729 3608 3954 -2687 -2796 -1132 -3068
700 -3068 -1417 -945 -3352 -3596 -2024 603 -1267 -1952 3998 4564 2682 4702 4007 1286 -470 820
716 820 885 -3927 -3282 1892 750 -1594 -413 -55 986 253 -588 -1313 -2498 -167 -1147 -5822 -4440
733 -4440 -535 -1013 -853 386 3690 5728 4147 4965 4210 1736 2375 891 -2353 -3555 -3543 -1860 -3065
750 -3065 -4641 -1038 499 409 1131 -204 718 1640 699 -763 -2629 -1044 1000 -2106 -1791 1700 1841
767 1841 3245 3563 4048 4526 2735 1593 404 -2915 -3102 -5080 -6409 -4188 -4671 -4675 -2140 -350 1520
784 1520 1819 2125 5565 5035 3729 2752 447 868 -308 -3260 -1139 177 590 2657 3127 3647 2446
801 2446 -24 -33 -3213 -6234 -6140 -7291 -6837 -6532 -6359 -1857 1169 2510 4610 6648 9591 8678 4758
818 4758 4414 2700 -1012 -1613 -3265 -2443 -392 -79 994 1649 1591 853 -2400 -3336 -3104 -6172 -6205 -5402
836 -5402 -5919 -4781 -3232 -426 2594 3353 5985 8752 8677 8114 5632 4203 3328 -1116 -2279 -2314 -4138
853 -4138 -3104 -2906 -3013 -2353 -2608 -1725 -1814 -2812 151 18 -1963 106 -738 -2500 -1293 112 1170 284
871 284 2405 6601 5555 4408 4515 2998 2342 961 -1768 -3086 -4235 -3674 -3870 -5802 -3953 -1783
887 -1783 -1299 644 1452 2601 3507 2340 2120 75 -3075 -1898 -1510 -2899 -2314 113 3226 4573 3948
904 3948 4724 2498 1835 3426 -824 -4748 -2359 -1673 -4235 -6123 -3195 -1049 -3179 -234 4427 1915
920 1915 2107 5623 4213 -244 -1566 498 -742 -3513 -1445 324 -727 2122 2261 -1869 -2806 834
936 834 2611 -1869 -2800 2905 1729 -3079 -1696 -142 -2444 -2602 3244 6261 756 868 7524 3352
952 3352 -4814 -3009 966 -952 -3981 -777 624 -3021 -706 1236 -4497 -3853 3351 3357 -198 570
968 570 2992 -215 -2854 831 -566 -3851 2149 6981 1927 -1910 482 2211 -3572 -5597 145
983 145 446 -1247 2529 3007 -1667 -2539 1544 1921 -3276 -1664 4795 3090 -896 -221 -302 -817 200
1000 200 2184 1126 -641 2403 1761 -5269 -6605 -5131 -6654 -5076 -283 992 593 5276 9813 3625
1016 3625 -594 6743 7454 137 -1161 1962 -871 -6248 -4834 -2035 -5236 -3438 4846 4196 -9
1031 -9 616 2058 -2274 -6401 -5320 -4191 -5589 -1740 1875 -1594 -245 5848 6292 2880 5501 10903
1047 10903 7284 729 2829 1287 -6728 -7213 -2444 -3584 -5847 -1552 3597 -735 -4956 503 278
1062 278 -3983 -1858 449 -1587 -3550 -1465 -173 -3435 -900 6316 6669 7488 11119 10893 6960 3939
1078 3939 2270 -2123 -6095 -4835 -5693 -9840 -8188 -5586 -7720 -6684 -2030 1236 1311 3507 7566 3586
1094 3586 -1362 640 -431 -4126 -1812 3072 5201 4889 8426 11116 6913 4841 6257 2331 -2123
1109 -2123 -2867 -5792 -11295 -14525 -11958 -12228 -13552 -6278 2068 2464 5391 11588 11277 5785 5059 7351
1125 7351 2572 -2321 2167 3265 -2533 -1799 2922 2217 -723 2219 5830 735 -2609 -721 -6071
1140 -6071 -13356 -12327 -9906 -11251 -9842 -1907 4726 3957 7875 14249 12430 9663 11232 10067 4197
1155 4197 -713 -904 -3038 -9525 -8420 -5304 -5784 -3832 568 2166 660 -116 772 -3021 -7565 -5345
1171 -5345 -5006 -7187 -4581 136 2624 4295 8192 12846 12110 11663 12976 9257 3206 -393 -4412 -8843
1187 -8843 -11670 -12141 -10493 -9739 -6596 -2925 -1785 1529 3282 1837 1819 1646 285 -1777 -2393 -770
1203 -770 40 497 4873 7249 8526 10836 11187 9871 6071 2400 -739 -6154 -10444 -11554 -13754 -14009
1219 -14009 -11186 -8237 -4769 -1752 2985 6280 5967 6630 7835 5145 2495 1517 1090 175 -611 2036
1235 2036 3500 3181 5479 6790 4918 3166 1830 -1354 -5507 -9197 -9975 -11936 -12983 -9902 -7030
1250 -7030 -4357 -314 3998 7603 8973 8866 10199 8726 5036 3800 1821 -115 -1968 -2921 -1324
1265 -1324 -1272 -1014 1343 1407 688 257 -1081 -3011 -5792 -7701 -7797 -8877 -7365 -4475 -2636 842 5084
1282 5084 7527 9872 10222 10226 9523 6054 3424 330 -2435 -4809 -7260 -6547 -5356 -4613 -2651 -98 245
1299 245 789 873 261 -1232 -3537 -3545 -3459 -4490 -2398 -896 1155 4396 6342 8359 9109 8687 7989 4929
1317 4929 1355 -810 -4412 -7138 -8663 -8961 -7161 -6217 -4370 -1402 387 1327 2287 3195 3054 957
1333 957 121 1310 -182 -812 858 1477 2322 3994 4891 5325 4463 4027 2971 -112 -2094 -4177 -6595
1350 -6595 -7570 -7581 -7109 -5602 -3813 -1404 677 1814 4015 5040 4345 4255 3453 2850 1641 -226 25
1367 25 -553 -771 409 915 1163 1947 1840 1274 -93 -790 -1652 -4416 -5261 -4285 -4832 -4756 -2446 -903 34
1386 34 1449 3800 4575 3536 4292 4714 1803 1394 932 -1130 -1924 -1806 -1051 -1322 -973 1540 1118 -228
1404 -228 393 324 -1570 -2383 -2053 -1836 -2941 -2563 -476 -1055 -1207 1238 2442 2125 2402 3729 3428 1463
1422 1463 1503 1319 -1731 -2004 -310 -823 -1879 -910 1079 -50 -1730 421 709 -1441 -639 871 -175
1439 -175 -1358 -855 -382 -1400 -1468 1371 824 542 2471 2141 610 490 1141 -68 -1608 -234 1082
1456 1082 -1235 -1672 215 -577 -2034 -711 1229 706 -530 1564 2170 -707 -660 386 -319 -984 416
1473 416 1289 114 -241 614 -710 -2475 -392 176 -1245 219 1595 732 -676 264 1160 -855 -347
1490 -347 2636 1408 -369 813 951 -1081 -2269 -204 765 -1125 491 1831 -427 -1510 -633 -1018
1506 -1018 -2562 -1617 1151 956 -10 1506 1368 -460 398 1271 623 647 2032 1843 -762 -1746 -477 -2470
1524 -2470 -3571 -819 356 -452 526 2116 686 -1795 -581 1665 -514 -994 2274 2064 -142 -50
1540 -50 1209 -57 -1010 1827 2531 302 1340 1524 -1318 -3452 -2771 -2728 -3916 -2402 771 -308 -1663
1557 -1663 1878 1906 -927 633 3564 2655 762 2085 3200 -934 -1978 432 -580 -2067 457 2713
1573 2713 1121 -735 970 536 -3429 -3182 -1175 -2543 -3507 -938 -341 -2174 -1765 1689 1621 710 3826
1590 3826 5587 3113 2508 3012 930 -2442 -1736 394 -1831 -2304 831 586 -1647 -887 498 -714
1606 -714 -1998 -147 453 -2605 -2524 -493 -2011 -2865 -12 1846 2051 2465 4808 4667 2220 2306 2367 -344
1624 -344 -773 -290 -1300 -2916 -2616 -1395 -2715 -2702 -28 190 -731 692 1676 -267 -1575 -764 -514 -2099
1642 -2099 -1367 1326 1077 560 2739 3291 2241 2007 2748 2008 -308 86 -73 -2902 -3506 -2337 -2891 -3127
1660 -3127 -1696 118 308 36 2126 1590 -82 518 1186 -152 -596 303 269 -122 114 1186 1033 523
1678 523 2058 2058 1099 587 -211 -1060 -2426 -2681 -2014 -2814 -2394 -885 -405 -324 455 1854 1944 1205 2191 2241
1698 2241 721 390 472 -571 -1002 -814 -125 -69 -369 870 573 -435 377 -25 -1086 -930 -1299 -1639 -1613
1717 -1613 -1352 -645 -595 54 1174 1344 1536 2009 1619 1674 1414 391 102 -509 -754 -720 -1324 -530 -804 -974
1737 -974 -261 -273 -279 -297 -327 -383 -594 -862 -399 -375 -588 -169 420 703 1073 1149 1859 1178 981 1802 810 -145 -323
1760 -323 -362 -852 -1111 -1248 -869 -1398 -865 -62 -380 -193 320 -321 -57 -579 -24 212 -172 152 203 386 664
1781 664 339 416 961 466 678 493 102 76 -177 -458 -221 -833 -517 -566 -807 8 -362 -247 -246 32 148 216
1803 216 -53 543 129 -453 323 14 -274 -12 -538 -178 114 94 406 414 321 765 422 649 298 87 161 -213
1825 -213 -259 -231 -509 -298 -172 -529 -98 -419 -279 287 -275 -198 -28 -471 -326 -461 -405 314 170 208 704 750
1847 750 858 671 780 836 -68 136 339 -726 -779 -782 -914 -1218 -972 -215 -534 -499 341 356 -343 416 663 -39
1869 -39 -193 361 738 144 307 992 467 18 621 681 413 -25 120 184 -757 -680 -581 -1175 -1598 -639 -581 -608
1891 -608 -185 447 623 51 1069 1269 591 753 809 734 66 -25 -77 -597 -761 74 -41 -545 172 197 -25
1912 -25 -533 -112 -664 -905 -627 197 -390 -301 678 315 342 751 917 979 1071 1321 957 -349 -339 -321 -1772 -1338
1934 -1338 -426 -832 -592 162 323 -254 -725 307 437 -571 389 609 304 -182 -110 346 -195 24 1444
1953 1444 1359 756 1809 901 -60 -948 -712 -923 -1679 -865 -78 -938 -1071 2 -516 -766 45 1072 564
1972 564 -115 1208 925 -890 -536 -18 -272 -185 1230 1688 624 274 1297 201 -837 -83 -71 -822
1990 -822 -702 -10 -1058 -2095 -970 -165 -1325 -266 1438 878 433 908 1094 -56 -1076 556 955
2007 955 -287 675 1962 255 -465 409 299 -945 -505 754 233 -1657 -309 -255 -1835 -2010 -73
2024 -73 -179 -623 295 1867 147 -205 1189 484 -651 491 1508 267 -455 839 588 -1587 -578
2041 -578 556 -101 -818 696 926 -774 -1206 338 -462 -1634 76 1073 -137 -246 752 597 -510
2058 -510 -432 1065 290 -445 990 615 -1087 -859 -133 -876 -1146 37 750 -377 4 958 -135 -772
2076 -772 442 696 -20 -145 838 477 -1023 -178 531 -654 -387 955 553 -125 226 533 -480 -1371
2094 -1371 170 -58 -865 57 899 -138 -630 30 219 -545 -29 926 589 -231 427 627 -378 -410 -120
2113 -120 -118 -434 303 847 -100 -488 207 -171 -600 -373 974 268 -227 301 561 -712 -617 30 -409 -432 475
2134 475 459 -388 -490 175 218 -194 671 721 -34 710 473 -26 -622 -393 -104 -289 -517 273 202 -34 63 31
2156 31 90 -373 -303 138 -260 -323 -228 -538 -647 -382 -179 96 278 651 1135 -89 666 522 -227 192 -134
2177 -134 -82 -107 184 388 70 -80 959 364 123 527 206 -439 -744 -814 -733 -1410 -962 -469 -874 -63 736
2198 736 701 834 556 1199 858 258 494 398 -175 -61 77 -390 191 117 458 481 408 663 247 -300 -270 -1080
2220 -1080 -1372 -1519 -1617 -1302 -1133 -834 333 615 1019 1779 2161 1832 1606 1300 946 459 -21 -287 -921 -708
2240 -708 -553 -512 -480 -28 -130 -125 -626 -2 -709 -1260 -1402 -1038 -1014 -809 -238 537 1213 1461 2497 2127 2510
2261 2510 2113 1439 914 149 -761 -880 -1930 -2140 -1847 -1739 -1249 -719 -540 199 550 397 348 -62 126 -223
2281 -223 -703 -304 -37 23 661 1220 1568 2197 1835 1759 1266 557 -264 -1258 -1913 -2123 -2897 -2731 -2221 -1664 -727
2302 -727 -473 479 1153 1178 1653 1230 1064 702 141 157 -71 -310 101 640 1001 1236 1629 991 731 177 -301
2323 -301 -1294 -2097 -2284 -2590 -2733 -2163 -1781 -635 -124 769 1791 1986 2159 2266 2096 1415 1061 284 -268
2342 -268 -186 -293 4 -189 -31 529 272 -295 -88 -627 -1205 -1782 -2156 -2483 -2271 -2048 -899 -856 232 1424
2362 1424 2191 2451 2819 2928 2491 1992 1199 363 -492 -903 -1170 -1485 -1380 -1295 -885 -680 -557 -291 -268 -633
2382 -633 -420 -1415 -1513 -1178 -1049 -545 -362 818 1789 1874 2456 2788 2366 2172 1963 1150 -206 -988 -1374 -2148
2402 -2148 -2676 -2034 -1883 -1717 -745 -83 -110 47 632 593 -266 -154 134 -203 -422 342 616 699 900 1741 1563
2423 1563 1129 1451 1499 579 -381 -829 -1587 -2009 -2023 -1878 -1751 -1543 -289 525 166 920 1480 1119 636 890
2443 890 988 177 -339 280 -496 -738 280 1138 537 593 1216 751 -177 -73 -441 -1428 -2052 -1386 -1358 -1413 -627
2464 -627 -89 -76 -57 1400 1867 1249 1301 1745 785 71 48 -73 -1107 -960 388 -104 -686 227 902 -139
2484 -139 -432 -29 -136 -1230 -807 -89 -1032 -1354 -255 -8 -222 592 1628 1563 1136 1566 1153 158 -173
2503 -173 390 -454 -1083 -501 -434 -747 -987 -404 -80 -844 118 383 -182 -183 249 -269 -586 -654 34 44 85 1176
2525 1176 1350 437 653 1066 320 -179 132 383 -299 -791 -328 -720 -1160 -868 -403 -537 -118 864 820 88
2545 88 130 588 -265 -174 139 119 -128 -199 590 -166 -633 308 631 18 234 916 274 -573 -208 -261 -985 -789
2567 -789 -92 -128 -70 333 448 34 -7 224 134 -315 79 400 -383 -325 31 -176 -421 -190 604 -69 119 651
2589 651 291 82 -295 2 -263 -449 170 389 -67 -241 352 -11 -658 0 -201 -339 60 208 -227 -577
2609 -577 -459 196 -250 -140 125 226 242 284 201 -282 -136 281 257 109 370 592 -143 -78 -78 111 -49 -137 -290
2632 -290 -327 -442 151 -137 -549 -54 504 159 -140 219 353 -255 85 -69 -246 -126 272 452 335 144
2652 144 620 516 196 244 450 -152 -290 57 -443 -937 -556 -248 -97 -374 -61 509 121 741 330 498
2672 498 412 180 46 -122 -339 -150 79 -88 -96 13 106 317 147 301 -142 -105 -422 -326 -454 -413 -556 -369
2694 -369 -173 -98 150 597 614 473 164 178 726 167 34 -266 -317 -208 -262 -319 -380 -79 -242 -37 -181 -30
2716 -30 -112 -64 -296 -233 10 -97 -305 254 261 154 714 821 495 725 632 706 127 -443 -337 -851 -899 -973 -805
2739 -805 -867 -502 -116 54 148 234 439 -68 262 199 120 101 -23 122 165 -10 543 616 530 603 541 201 124 -195
2763 -195 -407 -635 -1205 -603 -873 -938 -718 -353 -199 133 416 388 188 524 538 510 289 100 -87 136 47 -82
2785 -82 178 254 231 352 171 82 -45 -257 -420 -487 -576 -411 -508 -462 -145 4 -27 130 242 594 922 386 550
2808 550 141 165 5 -480 -435 -344 -70 -133 -175 0 -71 -287 133 -218 -231 56 -228 -258 -475 -201 -26 -141 210
2831 210 557 309 512 508 420 178 153 -23 -233 -449 -511 -646 -530 -308 -17 -203 107 91 292 386 23 313
2853 313 88 113 -122 -215 -238 126 190 -10 292 281 321 -183 175 97 -235 -469 -547 -500 -450 -586 -438 -229 -188 117
2877 117 -26 442 502 410 170 285 219 43 107 -91 64 -198 -209 400 469 137 5 115 -123 -352 -208 -82
2899 -82 -600 -200 -107 -339 -518 -104 166 104 345 409 189 -40 552 390 -117 -146 38 -47 -316 -145 87 -261
2921 -261 -277 130 252 -50 -85 320 -197 -604 -121 154 -184 56 102 134 -180 397 303 181 237 317 771 -56
2943 -56 -13 263 -668 -681 -224 -305 -223 17 350 -83 -192 -19 4 -421 -314 190 -98 -329 -16 272 -319 -325 163
2966 163 -71 -102 141 239 -89 -224 -184 -278 -325 -103 363 185 63 415 294 -63 -207 368 -180 -227 301 321
2988 321 -84 -140 56 -242 -597 -42 -54 -252 -292 302 -126 -330 -211 6 121 -47 420 525 -30 100 270
3009 270 -65 -214 -106 -104 116 237 390 128 2 58 -126 -419 -27 -15 -246 -3 43 6 -165 -249 149 145 244
3032 244 812 481 119 -88 85 -152 -338 -253 139 -55 -327 226 -21 79 10 -132 252 -227 365 430 -34
3053 -34 -189 68 -372 -240 -88 169 -199 -9 219 -107 -113 350 304 -80 -4 280 -29 -120 47 209 -206 -331
3075 -331 207 -148 -223 -98 65 -206 1 107 170 -364 68 -7 -55 151 178 202 285 31 230 -130 -231 232
3097 232 88 -314 -290 -122 -382 -204 -204 139 -171 179 204 212 -116 144 49 22 -173 -10 -122 -365 -150 88 -196
3120 -196 -39 54 232 -75 -401 18 66 -278 -180 -176 -517 -179 -142 -84 -144 163 261 499 303 457 655 170 280
3143 280 234 -256 -195 -294 -10 -173 -203 -317 -54 -151 230 -30 -285 30 0 -110 -134 -68 -139 -244 49 467 344
3166 344 334 216 224 258 -175 37 -296 -189 -21 -90 192 -133 -110 -72 -354 -91 266 -198 3 -115 -156 -349 -162
3189 -162 -219 -151 349 82 315 342 281 103 149 59 443 186 -261 -14 27 84 -178 -424 -210 -366 -225 -162 -54
3212 -54 236 30 172 212 194 252 27 114 -119 181 -33 92 -30 100 -50 130 110 -201 218 -23 29 -1 -334
3235 -334 -296 -177 -421 -259 204 68 116 153 45 513 144 230 -42 -137 -55 -177 -258 -15 92 -110 41 -252
3257 -252 -154 24 -28 -215 -15 -225 -14 -26 -88 124 -89 185 326 27 326 230 174 -14 34 168 221 -191 -44
3280 -44 -306 -285 -73 -14 -177 152 -138 -58 62 -96 110 -41 -173 29 100 203 284 -81 249 -29 84 29
3302 29 -16 56 -141 31 151 141 33 185 53 51 274 80 -59 -234 174 -290 -123 -46 -29 120 159 -111 -16
3325 -16 28 -5 -53 -38 -394 -357 -2 -108 -188 -81 -101 483 174 210 440 310 125 263 369 87 -49 -79 -377
3348 -377 -286 -129 -270 -480 251 98 -241 -13 37 -15 -352 -198 -23 36 -241 102 0 35 373 261 225 295
3370 295 322 341 17 -195 131 -307 -158 -317 -513 -407 -653 -256 -45 -223 32 10 -89 130 108 -121 -184 18
3392 18 -82 -237 -92 612 309 117 424 428 44 -109 72 52 -620 -354 -204 -651 -284 -209 -109 46 73 190
3414 190 338 128 49 -109 -196 -39 -327 -33 259 134 289 175 77 263 -106 183 95 354 -351 -597 -529 -406
3436 -406 -775 -414 -355 -73 81 464 177 533 275 264 184 -72 311 172 200 79 -109 -248 -444 -46 56
3457 56 -11 69 94 -68 -29 -169 -204 -621 -289 -337 -280 -243 132 281 -83 279 709 710 409 600 725 -33 -648 -103
3481 -103 -294 -633 -564 -402 -503 3 440 53 -131 12 393 -178 -230 70 -173 -336 15 118 189 390 628
3502 628 644 709 370 636 -41 -637 -586 -591 -692 -833 -675 -227 -616 -217 186 -276 -206 307 355 33 340 440
3524 440 352 -200 45 380 -31 136 584 688 108 437 129 -299 -259 -41 -591 -880 -311 -286 -519 -152 -26
3545 -26 101 204 362 527 129 428 451 -14 -28 -179 -117 -130 -255 108 112 111 -55 495 136 195 -173 50 -248
3568 -248 -736 -414 -428 -576 -398 106 -38 -159 405 712 408 417 438 135 -50 174 193 -357 -207 -266 -135 -147
3590 -147 132 217 224 17 315 -298 -182 -63 -279 -174 -450 -156 -70 -302 74 224 167 289 369 718 321 248
3612 248 294 20 -307 -106 -365 -796 -324 -137 -225 -41 -196 -62 -269 44 85 137 -134 43 212 -141 -336
3633 -336 341 371 184 396 340 346 -89 -185 -342 -415 -560 -485 -349 -517 -69 251 -159 223 182 257 77 283 384
3656 384 205 -7 88 280 -219 214 -58 -95 343 159 25 -10 177 -67 -264 -237 -425 -451 -350 -230 -99 -270
3678 -270 -220 283 34 -52 92 293 276 208 64 326 258 48 33 -62 -45 52 106 -104 -182 47 -333 -349 -164 -110
3702 -110 -267 -308 95 -147 -271 -199 -204 -17 118 120 153 153 155 172 124 50 23 175 -58 73 155 -386 33 -97 -27 -78
3728 -78 -47 88 71 -105 187 -37 -300 -118 -25 158 141 371 -74 56 155 199 317 44 -52 134 5 46 15
3751 15 376 76 -1 2 69 -104 138 -350 31 -141 5 -90 -314 -12 112 -189 -64 63 -108 -139 51 -60
3773 -60 -87 114 45 198 113 33 55 76 41 104 -133 74 -132 120 -178 -138 57 9 -142 53 -86 13 16 70 -119
3798 -119 -72 -328 -142 14 -186 49 97 239 -213 388 179 -39 41 -70 198 57 -84 -5 -329 -148 43
3819 43 114 -294 82 -6 -10 144 183 220 -38 -81 130 -219 62 -209 193 -180 -27 33 340 23 -46 151 116 -161
3843 -161 -27 -381 -493 -375 -121 -382 -81 -165 -46 460 36 221 167 171 237 34 -143 26 -79 285 -401 87
3865 87 285 180 24 105 149 -57 -172 -174 -83 30 -317 -206 -70 27 -24 109 412 358 644 246 336 454 280
3888 280 -181 -1 -230 -355 -135 -83 -340 -25 67 -26 -83 164 20 -56 -79 -495 -214 -209 -450 7 -48 17 322
3911 322 251 237 333 262 313 -57 -31 21 -76 -254 -65 -219 -396 -259 -141 -176 -28 132 -160 -19 -153 71 -271
3934 -271 -318 185 23 -67 316 163 257 490 536 421 151 107 -142 77 -122 58 114 -533 -304 -21 -504 -330
3956 -330 -104 76 -60 286 232 83 98 -146 63 -96 9 163 4 11 304 200 52 11 299 137 0 76
3978 76 -2 -570 -587 -308 -133 -308 -87 547 -91 100 411 272 28 399 285 148 -117 -9 -11 -72 -134 224
4000 224 -205 -37 41 382 -103 -367 -119 -86 -342 -441 123 55 123 357 287 -115 350 193 179 205 166 -9 -317
4023 -317 -374 -44 -275 -185 -194 2 -178 -120 213 -106 -161 12 220 156 -133 111 83 -294 -314 -78 -79 -15 265 163
4047 163 58 -9 169 366 -204 -35 -8 97 -179 122 -37 -318 -122 -7 -209 -67 158 124 -210 -100 -3
4068 -3 6 -68 7 50 230 -67 350 201 165 138 427 -48 -103 116 78 -313 -402 -141 -405 -309 56 -125 -128 195 166
4093 166 -41 -165 123 -85 -34 7 261 -5 2 43 148 69 30 -533 145 -21 -69 433 -59 -3 54 -164 97
4116 97 0 146 143 -118 72 -8 -105 121 -13 -14 -131 -73 -126 -183 -343 -117 -217 -117 -223 270 21 211 289 -21
4140 -21 -94 65 -59 93 339 150 225 -291 -125 -28 -29 -123 -167 -70 -38 120 78 57 -261 6 -174 -37 117 -59
4164 -59 104 -389 -20 -40 331 -92 -102 -11 10 -11 -49 -307 -107 -158 -71 164 158 -271 -112 -77 35 43 -150 126 330
4189 330 -57 77 -72 99 53 -50 48 -432 17 -250 123 -191 49 121 139 -59 -191 73 -138 -246 -238 -96
4211 -96 -43 70 -6 115 -27 215 -139 -52 -72 78 -77 -232 114 -412 85 39 58 -125 30 35 -121 -16 30
4234 30 144 110 184 -281 175 -27 49 42 -27 -137 178 -25 66 77 -18 113 35 207 -78 -67 -185 -70 -487 -72
4258 -72 217 -118 -123 -157 -76 126 -24 89 42 -171 -52 25 57 296 188 71 22 193 95 -19 -28 18 -43 142 -92
4283 -92 -68 -362 -199 -63 -289 -368 -401 -304 175 -38 188 353 -25 70 -19 -33 -158 -54 39 133 128 -20 -16 98 -177
4308 -177 311 -91 -181 -32 -333 -254 -59 -205 -165 -198 -150 -131 166 6 65 253 65 -80 146 182 122 113 82 47
4332 47 342 47 5 186 189 188 -127 -61 76 -110 13 11 -118 29 -288 -434 3 236 21 144 -27 134 266
4355 266 103 -73 265 120 0 -62 12 -118 -282 65 47 -83 97 -216 52 -320 167 -296 -131 -43 -221
4376 -221 130 -22 112 93 -65 -106 -89 219 137 -201 -55 28 -114 -101 -66 -181 -230 19 -20 -171 -118 -168 180 -138
4400 -138 -164 30 135 19 -155 -7 -218 86 -143 125 -101 275 131 0 -221 71 -117 -41 104 -106 -57
4421 -57 28 81 -110 124 83 -71 225 120 336 271 -75 254 200 60 -189 179 142 236 -156 304 -266 -197 -158
4444 -158 67 -185 -105 270 -110 -10 69 100 60 -75 225 123 -36 -96 93 -112 -220 71 3 -293 -126 123
4466 123 -115 -168 6 94 -133 37 98 193 -248 91 -98 -255 -238 -129 89 -141 -388 -158 104 -228 30 -146
4488 -146 -199 69 173 197 166 161 -55 -6 -271 267 52 205 83 392 -46 31 44 -16 -6 -37 4 -59 -321 117
4512 117 -95 -13 -1 -255 114 23 294 336 2 36 214 245 -92 2 196 36 172 -121 137 168 -224 -14 4
4535 4 177 134 25 42 -122 157 -132 -122 -8 -93 -199 -13 -53 123 298 216 39 114 45 260 176 272 193 75
4559 75 -47 -130 -284 -209 -66 -10 117 145 -218 -34 -129 111 145 138 -75 69 -234 132 -71 102 234 -185 341
4582 341 44 149 95 -44 -252 -56 -69 -262 -82 -412 40 -37 -339 -145 63 -6 -293 305 272 390 124 -85
4604 -85 -99 -179 -34 110 123 102 235 -8 300 218 181 -14 -175 -191 -116 -255 -395 -154 -316 -316 -18 64 200 233
4628 233 304 193 -31 134 107 135 -217 -50 47 -134 -130 49 56 -371 144 25 11 -175 63 -46 -185 -142 -122 86
4652 86 144 228 -53 223 181 495 198 513 103 -77 -90 -209 101 -57 -225 -187 -258 26 145 179 167 39 4
4675 4 -86 -174 115 -45 76 -21 -161 146 16 81 298 320 369 224 236 -136 328 1 -176 -446 -213 -124 -166 -223
4699 -223 -358 135 70 -101 119 85 -16 -22 -67 -174 -443 190 148 185 104 37 162 167 361 132 99 -51 -77 -35 -187
4724 -187 -274 -367 -116 -23 -143 75 10 23 -93 113 -22 74 95 -18 -9 -59 -308 25 -40 60 27 148 160 -135
4748 -135 -121 -3 -353 317 24 -223 -164 -17 51 -6 63 13 256 139 257 -113 118 196 -223 -25 -126 83
4770 83 -167 -103 73 24 -45 -68 0 -30 -64 7 -37 7 160 -63 -103 -8 11 107 -106 -92 199 75 -72 -206 -212 227
4796 227 -111 -37 99 -68 -71 -209 -183 118 59 149 19 106 -99 179 217 -55 -127 -68 -33 -109 97 247 7 104
4820 104 -97 250 95 42 292 -161 102 129 -135 89 77 -40 -267 104 110 78 -45 43 -64 -187 -160 161 -127
4843 -127 -27 32 2 -3 98 150 -215 5 -229 65 139 137 156 310 173 -83 135 -212 129 173 222 -92 -115 -171
4867 -171 -77 -96 67 51 245 24 86 71 98 144 313 -97 -26 58 125 250 82 -126 -330 83 -11 -118 -29 -185
4891 -185 -96 -1 -122 149 -19 90 -250 21 40 -26 12 67 -26 -194 136 15 -44 66 -85 99 77 -44 -108
4914 -108 -151 -149 119 355 -198 -35 201 124 -99 -39 35 -283 -216 -251 -231 -55 -88 72 80 -108 395 -255 110 144
4938 144 45 143 -104 255 -155 -124 -34 208 -157 132 33 -75 -73 -3 -34 -83 -286 14 -137 -442 -113 283 -4
4961 -4 170 173 387 70 44 -28 1 55 -9 156 -174 210 242 -137 139 90 141 63 -144 11 185 -15 -57 -326 -256
4986 -256 -291 88 72 -90 112 311 154 64 -53 95 212 2 -22 -233 -220 87 -100 -165 43 -59 -116 74
5008 74 39 266 -296 65 62 -141 -12 -23 50 20 325 46 259 335 47 64 -39 -33 84 -265 -99 -166 -162 4 -226
5033 -226 77 166 -258 127 186 25 85 38 -250 -115 18 -224 42 -177 193 143 77 -8 156 361 34 77 0
5056 0 147 87 -127 -91 -263 -12 -275 115 -36 -166 -50 -120 176 375 63 90 426 -88 164 -67 0 -23 107
5079 107 197 214 3 -30 91 -51 -63 -100 -44 -94 -121 -33 45 -296 -55 -222 79 81 326 302 -8 16 -174 6 -88
5104 -88 258 31 -55 -71 -11 42 5 385 139 -146 68 -273 6 -51 -244 -112 -328 55 118 33 -18 485 288
5127 288 102 276 -122 18 35 16 -221 -524 -46 -144 -295 -32 -137 2 135 -146 259 179 43 36 130 -3
5149 -3 -163 -73 -311 1 33 178 189 -156 200 -5 33 199 181 102 -216 -319 140 -55 -28 58 196 -61 208
5172 208 -157 -104 51 -52 179 59 -137 -210 -135 -130 -100 -195 -41 -48 -66 95 259 -63 106 99 -504 -268 -151 62
5196 62 -48 -178 43 -162 91 242 164 192 18 99 -115 -225 56 36 -232 -77 7 98 40 52 -55 -39 -149
5219 -149 -76 106 132 132 137 169 38 -75 77 -1 171 -55 21 226 120 152 -36 299 13 -30 -79 171 -259 -111
5243 -111 -165 -161 199 201 153 3 223 15 -18 -311 21 280 -204 16 -88 6 37 -255 -108 30 22 -43 -111 -142 235
5268 235 10 196 94 -110 70 -42 101 150 124 15 130 425 142 37 36 129 182 -132 -165 69 -233 45
5290 45 114 15 -9 -203 -77 -210 310 207 -113 -93 12 94 -234 -27 -95 -26 157 83 95 -102 93 -158 78
5313 78 49 -126 -184 -9 107 -239 -148 -141 260 66 197 -165 -52 132 145 49 274 77 -3 -1 -152 37 -46 138
5337 138 -72 -132 26 120 -57 -151 290 164 -86 6 142 85 75 22 -17 -59 -57 91 18 86 -20 190 -114 -89 -49
5362 -49 -104 -212 26 -224 -8 69 214 19 152 58 -41 -223 -76 -168 98 -284 64 -76 43 -184 4 157
5384 157 166 -77 -132 78 19 90 66 125 -132 -86 37 41 141 -46 -287 -51 -38 152 174 167 -182 107 -51 83 47
5409 47 -15 123 -326 -235 -77 -180 332 -201 285 53 -170 4 -174 -63 54 -291 -241 -95 84 55 132 -267
5431 -267 217 268 78 117 13 420 -40 9 -40 120 144 83 -124 -187 -169 -80 -30 -237 35 -153 -95 5 86 -39
5455 -39 -131 -48 176 281 214 199 344 18 148 19 -187 -88 115 -32 -156 165 52 -306 -42 73 42 -181
5477 -181 290 24 -115 33 -59 -140 -378 -229 -156 -45 257 108 249 -172 77 -17 -42 7 21 -52 140 41 -59
5500 -59 -148 -45 -134 -238 37 -91 276 253 -10 -14 -20 -180 -59 -63 206 69 81 100 -41 -140 99 -4 182 201 233
5525 233 72 -224 -142 -6 -40 -54 57 231 -1 18 115 307 164 -136 -219 -100 -283 -5 -213 -91 -3 54 67
5548 67 16 -91 -31 -13 148 -214 131 -18 48 108 -160 162 115 92 75 -148 36 -132 -53 85 -23 147 98 -64
5572 -64 -101 -91 -177 -36 -198 66 106 21 78 48 66 24 66 -138 -97 91 188 104 98 -88 -98 107 -203 203 288 105
5598 105 182 -237 32 -120 -72 33 170 -30 79 -194 -287 -170 -94 -10 -74 94 243 -1 114 -88 106 -143
5620 -143 90 32 -156 23 -11 -15 -55 0 -174 358 -234 106 -71 -78 -204 -203 -147 -118 -143 -59 58 61 -5 126 -119 172
5646 172 82 -196 32 -45 -124 42 -62 119 -66 20 -73 20 220 142 87 -2 26 -61 83 -13 -5 68 -142 101 54
5671 54 -197 52 29 81 25 25 -173 314 41 178 97 -7 64 31 -154 161 -243 -95 -76 58 158 -38 16 151
5695 151 265 55 -101 -16 -45 -68 14 -210 -90 180 57 -129 28 75 93 -48 52 88 22 -91 -159 213 208 78
5719 78 56 -30 157 70 208 245 17 -114 16 -277 -174 143 -3 18 -65 -29 -126 -108 -15 -181 -80 97 -99 -224
5743 -224 -172 77 -208 -153 -11 41 199 251 37 157 193 -178 -35 -109 -165 -180 95 -363 47 187 -10 58 -51
5766 -51 6 40 -118 191 -28 -166 -2 -285 163 -128 -98 -47 135 156 -355 -62 -46 136 -32 -275 120 57 -92
5789 -92 -147 132 -36 -71 165 -144 39 16 -80 -51 127 -146 70 73 -221 -172 -190 99 -175 76 182 60 -164
5812 -164 -276 122 4 288 -10 -89 263 336 72 -175 -101 -15 -37 242 128 124 -210 -48 153 -228 -61 -39 36
5835 36 -144 115 -30 -161 102 10 60 -126 221 162 76 179 -94 89 -142 -111 -108 -129 162 351 -121 159 9
5858 9 24 -47 -116 -72 -46 -75 -114 -42 -207 225 24 173 -153 -22 176 127 -205 186 -20 73 108 -77 19 -139 339
5883 339 -101 7 47 -41 141 308 -44 -133 -114 78 -89 -1 -198 232 64 53 151 80 -73 42 -26 34 -65 -165
5907 -165 6 -16 13 -58 174 80 -303 -85 246 -113 -41 -125 59 -136 -182 106 -289 -25 34 -107 -49 169 -9
5930 -9 -221 84 341 269 71 263 -195 -10 66 -402 18 -208 6 112 -63 179 224 -20 14 193 106 -71
5952 -71 166 119 -93 43 -52 112 328 73 78 22 -52 -10 32 -54 35 82 279 -136 45 83 -303 176 -90 25
5976 25 -121 -64 367 117 -126 -126 -2 29 -93 -204 -209 -11 -67 -83 59 94 -99 224 50 -88 -2 -43 -57 -34 2
6001 2 -76 83 39 180 -14 -43 -252 46 -136 -64 -149 115 172 85 189 50 -92 62 -158 91 78 -54 -16 -231
6025 -231 -109 -7 113 -83 20 3 118 -57 222 -134 95 175 249 57 144 92 50 245 33 -31 -64 226 -49
6048 -49 -91 -16 7 -30 -116 -87 104 -22 -236 -99 68 -309 83 -4 -65 265 -82 171 41 -215 -189 178 -116
6071 -116 169 -39 -36 -9 121 -5 -88 -44 173 -107 -77 -275 303 -10 196 -30 -32 47 -134 94 28 -222 -25
6094 -25 -154 -124 94 -149 226 -75 -212 -198 334 98 286 -32 94 415 -31 -4 27 -130 -74 -75 -158 65 -95
6117 -95 52 75 -51 50 -195 57 294 32 2 -185 -19 -86 -50 194 212 252 -55 27 326 -32 -19 119 -304
6140 -304 -72 -186 -186 -148 -154 158 56 36 34 97 44 238 44 -133 100 -115 101 54 -30 -29 138 119 -78 3 -236
6165 -236 -20 144 -38 248 -91 -108 358 44 172 -83 128 -14 163 84 132 -160 -13 -45 23 105 -196 77
6187 77 -271 -141 -288 53 -45 151 -116 7 -39 -84 123 -63 56 49 323 186 49 331 53 -5 197 312
6209 312 -36 243 62 -62 100 121 -81 -162 12 33 156 -169 104 -105 -187 -218 212 79 18 29 162 -127
6231 -127 57 -289 -71 -228 115 263 120 -44 -235 -41 93 -39 -176 49 -70 122 -177 -179 -73 193 -140
6252 -140 -120 173 291 -37 -12 -156 11 66 85 -98 112 -165 127 110 4 159 192 10 -7 38 -107 -92 134
6275 134 58 -223 227 -28 14 225 17 32 -81 -105 -138 223 73 -188 130 80 -121 -273 42 -178 -62 157
6297 157 -118 179 -39 -104 -23 -207 -136 102 -84 -306 -54 205 -78 -49 101 87 115 299 -152 -172 -221 -69 -265
6320 -265 -13 -399 -10 12 -162 -25 -5 -42 28 39 143 -11 91 83 53 -147 -1 -18 155 77 -6 57 31 76 -66
6345 -66 85 -438 77 43 60 -72 -55 29 152 112 170 222 149 287 -12 -52 -73 -74 52 331 33 -31 -41 -92 44
6370 44 -6 -9 121 42 -4 -180 28 -16 -215 -282 92 -54 7 -14 -64 156 -16 -289 19 267 -6 337 -266 42
6394 42 1 -253 -167 88 150 -40 22 58 56 40 210 -172 -101 453 -39 165 -41 -232 70 248 -49 93 -32
6417 -32 187 31 180 206 12 -96 105 -212 -284 65 -106 -16 -116 127 -78 170 -38 46 37 -128 9 -216
6439 -216 113 -64 -178 113 -61 99 -39 -126 165 -154 71 1 -147 45 -92 -183 25 47 -121 -39 -202 -20
6461 -20 -88 35 216 -90 170 160 55 7 79 66 68 -198 -24 271 -100 35 -59 -64 43 116 22 -210 67 -15 -56
6486 -56 0 -35 -96 184 36 -36 -29 105 265 312 77 -125 298 -131 189 -150 -191 -79 84 180 -104 -11 -28 -6
6510 -6 -197 -75 -160 -113 -52 7 86 -113 -294 101 -74 -314 -136 286 -111 -53 4 -45 46 295 89 222 -59 -100
6534 -100 138 -83 192 85 259 208 -6 -77 48 137 -52 -13 -59 123 206 -21 -235 -150 60 56 305 121 27
6557 27 -28 250 100 -52 -106 120 -20 137 -71 -136 -257 56 1 -200 -90 145 -156 -233 101 6 -42 -195 39
6580 39 -171 -21 -273 207 -101 49 170 130 -64 146 153 182 120 103 220 100 72 298 215 32 257 88 23
6603 23 -76 -161 195 -95 -55 152 20 5 5 110 38 185 -306 -18 -45 86 197 108 -144 -142 2 -57 35 190 -73
6628 -73 -19 -107 34 37 65 45 -222 14 125 -34 81 2 -33 -30 -106 78 -54 291 98 285 -43 -12 -67 148 -221
6653 -221 -44 -66 -162 110 269 119 -126 -14 -81 17 -77 -61 60 -121 -76 -77 -180 -58 -102 59 91 -6 103 80
6677 80 52 -24 -43 89 31 -252 -52 -10 -168 -54 -160 -143 -241 71 36 -449 -177 122 -245 -313 -120 171 20
6700 20 58 -21 -78 -71 328 -252 -213 7 -44 -4 19 -94 220 -10 -291 -143 86 -64 28 1 394 106 -33 479
6724 479 -100 19 -114 16 -186 34 -34 179 27 133 154 8 54 -69 -259 -233 119 34 118 -1 121 -159
6746 -159 32 16 -62 -172 0 171 -86 -80 -144 25 -88 1 53 -9 -268 -125 -69 -107 -268 188 -35 -87 -52 -161
6770 -161 -150 -18 -110 -92 88 -55 -7 -225 -8 193 -143 147 100 32 39 -229 10 121 -125 60 4 120 -124
6793 -124 36 -33 159 -75 -39 245 -239 110 182 -56 102 -190 170 -303 225 -136 -211 105 -3 11 -213 112
6815 112 -16 153 31 -44 97 244 -41 -297 -187 226 238 -195 216 -27 277 -67 -79 -111 61 20 -249 -80
6837 -80 -111 93 -278 61 -147 -33 -47 50 -288 -92 35 137 -28 20 131 337 75 -134 247 50 216 -28
6859 -28 -8 -110 64 -224 -49 -97 20 -43 -78 -83 -4 19 -227 -161 -111 112 -44 -184 93 39 223 152 -44 35 -37
6884 -37 79 2 40 0 80 -105 -5 52 -165 -180 172 26 54 -182 -79 236 94 -51 145 -32 -8 220 343
6907 343 131 -12 261 -118 -42 -99 206 18 -34 -37 -164 -183 23 131 -176 51 169 120 175 168 -208 132 206 -100
6931 -100 107 -99 -207 -206 -112 45 -65 -82 -12 21 -118 -267 37 23 65 57 2 -198 109 61 -127 364 317 59
6955 59 70 191 141 58 -223 -122 -50 112 -157 115 70 62 -135 -147 -329 -87 144 -61 -226 -63 -136 74 105 -249
6979 -249 24 -179 -111 220 215 -86 0 -168 17 230 -85 6 -14 140 -94 44 41 -45 148 -217 -52 -78 27
7002 27 -407 -221 -201 218 81 -121 -22 251 160 -156 328 3 -230 90 78 -190 92 -3 -75 16 -140 144 16
7025 16 350 30 77 -106 44 -34 -87 -174 -149 204 51 126 -230 264 -245 -41 -35 201 -130 -99 75 -241 -59
7048 -59 -37 -33 -83 64 93 175 1 61 167 157 -128 98 49 72 192 -138 -50 -131 -45 -209 239 -53 239 -32 139
7073 139 109 -70 141 -85 -95 -175 107 118 232 -51 118 273 12 16 58 64 -151 -196 -146 -141 -76 -38 56 -25 151 242
7099 242 -165 110 10 -228 87 35 41 126 28 -94 -279 99 166 59 -34 30 -28 -254 34 345 -80 -54 -120 143
7123 143 199 68 -66 -103 56 -10 -25 -149 -56 -192 -191 205 -53 -54 133 -58 377 -89 300 -140 59 -41 92
7146 92 -109 36 135 177 -176 -50 69 114 -46 72 247 -146 -113 97 -139 -349 -86 -162 63 -138 40 61
7168 61 -123 12 73 273 209 94 169 303 216 -17 142 -23 -19 -69 -22 15 58 230 -55 -144 166 -366 101 -106
7192 -106 204 -197 9 39 -28 -197 -46 24 -51 181 -10 -131 -165 129 -242 -32 -116 -20 37 251 82 166 -190
7215 -190 -80 16 175 -63 -204 17 -76 -9 -46 -28 90 -158 87 86 -5 86 114 242 57 -14 -130 20 19 273
7239 273 253 -138 161 14 163 -93 -148 -108 -106 49 163 -245 256 -106 98 68 53 156 -32 -25 50 33 82 68
7263 68 -57 -112 142 115 -122 94 -71 121 140 -10 175 71 -114 28 -83 -17 -83 -279 -38 130 48 -58
7285 -58 123 -173 11 -41 124 76 -39 144 6 126 165 104 128 180 -248 146 39 -324 26 14 -161 7 -70
7308 -70 54 -101 0 -352 331 207 204 376 -85 139 228 260 216 143 138 -131 6 1 -58 -143 -119 -47 -16 -53 347 130
7334 130 -119 -6 152 -24 -62 -235 121 216 149 103 97 -38 95 -4 65 -141 42 -41 243 -229 31 71 -141
7357 -141 -56 66 28 -1 200 90 29 -17 -172 77 47 7 70 -123 101 171 2 -12 29 137 -199 125 46 -212
7381 -212 -186 115 -216 -120 168 244 11 -310 75 238 52 68 188 -17 35 -40 52 142 -169 -138 -49 74 121 -98
7405 -98 -56 -205 -219 -139 30 171 -40 -27 -63 -48 -238 75 -37 71 124 -94 60 100 113 37 -123 -87 112 80
7429 80 80 -27 46 23 -1 197 -71 289 95 -184 100 302 92 -228 -158 -78 -151 -132 -74 -166 -33 160 -47 26
7453 26 157 67 292 -76 136 149 -102 -139 86 -100 104 47 -92 183 25 241 165 -150 90 -38 148 222
7475 222 -190 13 -270 63 3 3 45 -34 4 -92 -28 80 -170 -87 -31 -232 -88 -64 -235 66 104 129 -56 232
7499 232 240 -95 88 -72 -23 -153 -308 -295 70 6 -130 -122 -126 -3 103 76 125 186 345 159 81 -64 -134 -269 156
7524 156 -62 -67 86 130 -207 -17 61 -116 144 98 -88 -128 -218 -72 -79 -165 -32 -36 -315 119 -44 -15 172 -159
7548 -159 251 -294 130 -5 134 -192 190 -189 146 4 -112 -188 307 -76 -16 -159 64 -146 -91 81 -36
7569 -36 -246 -52 56 -115 -78 -98 -189 -200 87 -184 -60 120 -19 -126 -132 -18 178 -44 -299 -6 63 -115 66
7592 66 129 -47 -13 103 231 38 -174 40 158 52 30 71 146 124 102 49 -9 -76 287 -48 15 183 9 40
7616 40 -36 39 -86 243 -65 -22 -36 117 6 -13 181 -151 68 -197 -94 -29 131 -158 65 87 140 199 -27
7639 -27 -6 -66 43 -76 153 101 -147 165 -220 41 11 -122 83 218 -86 -190 22 -190 48 63 122 26 -295
7662 -295 -114 -199 -79 -238 -39 237 -123 228 -51 -59 -83 -367 -46 81 -143 111 -39 263 -6 -152 132
7683 132 198 184 391 -15 87 -218 -189 37 -90 147 -72 39 99 52 -46 -8 -114 -302 40 -73 -68 142 -174
7706 -174 -43 125 99 -99 159 59 -14 143 208 97 -118 -69 -82 -251 135 -102 -38 281 -13 201 -119 -32
7728 -32 -231 -81 -39 -80 -162 -155 -45 -279 197 122 -68 232 -95 69 -288 -37 -52 -333 -66 -115 399 174 296
7751 296 69 110 159 23 426 163 159 93 -81 -92 -73 -59 72 -154 181 123 -77 -74 13 -77 20 -140 91 36 3
7776 3 -225 108 -351 -9 -78 185 193 -54 118 63 -13 141 -144 -48 -105 41 32 83 -111 -8 -80 -201 101 -85
7800 -85 -80 47 -147 -193 23 -50 -18 -87 -165 -63 234 45 61 33 175 -100 -31 -36 -125 174 -124 267 -208 -165 -142
7825 -142 -79 -187 -176 -46 214 -88 -11 138 -99 122 -120 46 149 127 -2 111 -192 29 101 158 -129 113
7847 113 -52 172 3 -46 -89 84 -79 -124 1 -137 112 0 -181 -181 101 -42 132 197 -158 -85 134 -108
7869 -108 -18 -6 20 -1 -52 205 -26 -109 42 79 60 -77 11 150 -111 -79 -101 198 53 -43 -170 -70 38 -213
7893 -213 -309 -185 -5 163 -41 18 130 -129 -93 -128 -118 -90 166 -164 147 -165 -37 122 31 -67 33 -118 262
7916 262 32 -87 -281 225 140 217 350 -103 -104 -320 -220 11 15 -164 -61 -45 -87 -12 -282 110 -39 81 117
7939 117 -40 164 4 40 71 67 -176 -97 169 126 17 170 197 -72 115 -167 -100 -180 76 -153 76 127 143 -90
7963 -90 107 82 159 62 -72 155 -56 180 226 -64 108 -92 -40 237 67 61 26 -98 127 318 19 46 -305
7986 -305 -333 1 170 45 22 237 -89 88 203 -138 84 41 47 -170 -140 -98 -235 102 109 118 226 151 -126 64
8010 64 76 -58 112 162 128 74 267 -176 84 234 -51 -169 -70 126 -53 302 103 124 -69 -59 101 197 -91
8033 -91 62 -304 -99 -75 90 -42 -46 28 34 69 45 -42 93 -198 -18 153 -16 -82 0 125 207 94 57 38 120
8058 120 -58 36 68 -159 -140 -72 71 124 118 197 1 9 -202 62 16 75 -116 107 -190 -36 -129 15 -32 17 79
8083 79 134 173 -113 4 -4 55 262 -103 38 23 -172 54 -42 -197 -114 36 -111 -83 565 -17 -82 -11 -28 -65 -334
8108 -334 80 420 -473 -11 111 3 -52 126 -132 43 -5 -187 -149 23 320 46 61 -278 106 55 -199 -162
8130 -162 -3 -10 109 127 135 247 277 134 -118 -28 -65 167 116 -40 90 16 148 97 -46 93 -66 164 -107 -211
8154 -211 -34 -40 8 -46 60 -97 123 -213 254 131 88 247 -171 -13 -241 166 86 -91 1 255 -80 -17 1
8177 1 -23 217 -84 -60 -24 -33 -64 134 -190 -283 -58 -149 79 -66
8191f6
$$ Imaginary data points
##PAGE= N=2
##DATA TABLE= (X++(I..I)), XYDATA
0 0 0 0 0 0 0 0 0 0 0 0 0 -8 8 -8 8 -8 16 -16 23 -24 32 -37 43 -53 61 -71 82 -95 109 -125 145 -165 188 -213
34 -213 240 -270 305 -343 382 -427 475 -528 586 -650 719 -797 879 -970 1069 -1177 1298
51 1298 -1430 1577 -1739 1921 -2126 2359 -2626 2937 -3301 3737 -4273 4947 -5827 7034 -8804
66 -8804 11676 -17170 31632 -153972 -343262 103381 440260 173415 84756 288554 274825
77 274825 221690 72751 73894 -114453 -65537 117773 -10460 -129977 -127479 108298 74168
88 74168 -127269 -90151 -60291 -7795 -101374 -112377 -139528 -162467 -29606 -29225 -25432 -22432 117041
101 117041 211783 123422 159606 132196 113876 60830 39272 33376 -101547 -75185 -24720 -35646
113 -35646 -119522 -147800 -29524 -13338 -12344 -44278 -4380 57170 15752 6745 -44841 -33742
125 -33742 -27609 -7879 44094 -17361 7591 89748 132212 53959 -15229 84315 107991 32854
137 32854 -49746 -27415 -6380 -73956 -82868 -106721 -96408 -56215 -1883 23665 -34811 16842
149 16842 81620 53427 -18724 -33453 32863 16125 -15967 -19208 -2011 17430 27892 47744
161 47744 9531 31098 90652 76586 17237 -17410 26021 -14931 -92152 -84193 -64828 -68111
173 -68111 -78368 -31019 -5783 -19261 6758 40132 43680 17635 43845 59660 27822 17698
185 17698 17712 22756 -9877 -14013 20730 13047 3619 6232 24433 10917 -25423 -29160 -31297 -45005
199 -45005 -61882 -49897 -43752 -41653 -14084 1408 13102 17435 47055 73034 49412 40971 46715
212 46715 46443 17446 -17938 -13384 -8229 -20004 -32411 -21261 -8364 -5701 -1722 -9202 -12581 -14614
226 -14614 -4695 -10905 -39405 -26332 -4891 -5603 -14703 -4683 26041 30846 29770 38759 37575 27735
240 27735 28142 23777 -5752 -20232 -12815 -6513 -26585 -42251 -12720 2074 -9030 -12829 -247
253 -247 13760 1693 -3810 2610 -3598 -8201 -1418 -350 -8369 -2566 9775 13503 6832 9609 23143
268 23143 12753 4881 8888 2923 -5843 -13124 -7463 -7377 -19417 -13436 -490 -1792 -6574 1839 9287
283 9287 5221 -212 5129 8330 -5564 -3797 5639 -1386 -6167 -2852 6813 4601 -3086 4835 7473
298 7473 2286 2267 2294 -2688 -4355 -2226 -2145 -8500 -10437 2591 3237 -7317 -1724 7037 7851 -1001 -2155
315 -2155 8936 4819 -1541 3241 3550 -1454 -2006 -1041 -2717 -7382 -5120 1731 -1942 -3972 1931 2103
331 2103 2982 916 -791 2593 465 590 2469 -889 149 2120 1398 180 -1532 3661 5965 -2032
347 -2032 -1233 4890 -1970 -8052 -7331 -3059 -4380 -9798 -1590 4393 153 1606 4115 4371 5133 3606
363 3606 4682 4883 3741 7132 4621 -2015 -2866 -4273 -5823 -7699 -9426 -5130 -4830 -5386 1645 30
379 30 -3113 2689 7631 6162 1535 4243 9227 1822 -3481 -228 -2882 -765 4503 3210 3337 5598
395 5598 6133 763 -8853 -9780 -12835 -17162 -10183 -7024 -9553 -3096 6986 12016 8303 6512 15025
410 15025 18443 13405 7581 1290 1196 93 -9546 -13687 -10615 -2358 3159 -1017 -1668 2300 -1291 -4251
426 -4251 -8251 -14749 -14500 -7625 1178 -2185 -10679 2493 17408 11677 7949 16160 23681 21444 14512
441 14512 10590 -1494 -11097 -6505 -12856 -24956 -17586 -5073 -3949 -6781 -3662 1108 -764 3515
455 3515 7657 -3140 -4645 7346 3724 -9836 -12120 -1452 3618 1393 10243 18021 11384 13026
469 13026 18352 6091 -9170 -8022 1102 -6678 -18166 -6865 930 -9986 -8913 2048 1008
482 1008 -5048 2312 11192 8 -10487 -1237 -902 -9707 -5104 1400 4193 12087 17843 11153 3937
497 3937 12721 13416 -6570 -6426 8319 -2306 -16954 -9196 -1419 -14834 -23017 -4856 3191 -8606
511 -8606 -3824 10222 5040 -2638 4321 10995 3129 -478 13052 13709 -772 -149 5328 418 -3820
526 -3820 114 3942 2591 6219 6993 -8556 -12833 -1785 -10061 -25740 -16604 -3164 -8905 -13667
540 -13667 2246 9379 -606 12055 32300 21960 10677 20931 21208 -1715 -15736 -7716 -9260
553 -9260 -20687 -12234 -1826 -6683 -6297 2805 2808 -7274 -6362 5884 4218 -4635 -817 702 -1510
568 -1510 3422 6459 4338 8659 21768 22600 5096 325 4826 -9063 -21704 -14582 -10761 -17609
582 -17609 -12843 4400 1681 -14723 -3994 13959 4955 -4315 4910 13412 7863 -282 -453 -2111
596 -2111 -2363 7415 7992 2320 7476 12702 7740 -1701 -7703 -8386 -7203 -3376 -1609 -10351 -9217 2721
612 2721 -1096 -13495 -11512 1195 6959 2272 5119 10609 4942 3885 5338 -1790 -5726 1128 7726
627 7726 2773 -4964 -1217 469 -4417 -3018 -1328 -3084 4043 10948 6533 -3265 -3406 2840 -2510
642 -2510 -7622 -1885 -486 -1015 4145 2463 -6299 -7664 1802 4089 -6546 -4020 8912 6417 -1756
657 -1756 -937 -2 -2777 -2211 4180 2900 -4013 3428 10092 694 -6441 -1751 3518 2257 -1477 236
673 236 487 -1189 1268 -3284 -9693 -3291 2976 727 -2739 1446 5933 813 -2037 1966 -1088 -3349
689 -3349 2169 3678 -1184 -2786 1830 3878 -1415 -881 4243 2755 2635 2906 -738 -2548 -2432 -2204
705 -2204 -4486 -6652 -1839 -196 -2589 -20 1765 207 538 3082 4213 869 -72 4358 1584 -2745
721 -2745 -1334 -252 565 553 477 1699 1829 2582 2549 -2548 -2813 372 -2473 -5207 -4953 -3212 -1871 -3386
739 -3386 -1799 901 1649 4545 5573 3791 3909 3817 2922 540 -3214 -1826 -330 -2242 -1787 -1458 -813
756 -813 1178 195 -106 -347 197 1829 -1625 -3852 -1165 -1764 -3305 -2450 -1268 1319 2301 3416 5385
773 5385 4907 5083 4399 1783 1525 -401 -3791 -3674 -4040 -4511 -5457 -5802 -2154 -708 -1194 1292 2536 3652
791 3652 4010 640 351 712 -1750 -1817 -903 399 2674 3444 6199 5894 3807 4645 3263 88 -2408
808 -2408 -5571 -6258 -6418 -8982 -8906 -6874 -3668 -694 125 3697 6831 5461 5066 3823 1697 1743 -228
825 -228 -1282 309 1507 3173 3360 3802 5055 2459 808 1166 -2142 -4375 -5333 -7009 -7135 -8272 -7752
842 -7752 -4796 -3120 -404 1831 4773 7746 6040 5135 6107 3843 2497 1923 661 290 -57 -52 -531
859 -531 -2840 -1294 -595 -2826 -240 91 -2086 -1559 -1286 -2595 -5017 -5434 -2203 -1542 -1852 2056 3720
876 3720 4476 5535 4321 4007 4454 3836 2822 -381 -1387 -910 -3431 -4547 -4932 -4235 -1167 600 2037
893 2037 3310 1570 1920 1755 -1735 -3913 -3647 -2638 -2115 -2318 -353 1138 1090 4284 3482 1685 5325
910 5325 6818 2385 -1062 -918 -1171 -5570 -6215 -2591 -3850 -3625 2494 3237 309 250 2766 2470 -490
927 -490 151 2029 -236 389 1646 -2199 -2977 386 2074 -876 -1749 3841 4148 -2142 -1811 266 -2873
944 -2873 -4445 -772 1113 -2707 -2686 5329 3923 -3418 -136 5913 3717 36 1728 2906 -1260 -1931
960 -1931 726 -4198 -5234 1658 1914 -2159 -1096 2342 726 -3145 -236 392 -3594 379 4594 -425
976 -425 -3365 1586 4502 180 -2842 2082 2847 -1302 -25 141 -3827 -3272 1203 2509 -2055 -2101 4506
993 4506 2464 -3349 -1693 -110 -775 -88 1827 2063 914 3643 5176 282 -355 3181 204 -1908
1009 -1908 -2122 -4579 -7898 -6612 -2579 -5157 -7013 3369 9064 3411 3119 7900 5640 131 117 2859
1025 2859 -1716 -3281 2218 1479 -3810 -1446 2934 2124 610 2771 4101 -190 -2175 -2395 -8864 -10441
1041 -10441 -4906 -4126 -6051 -1535 5689 5380 928 4678 8167 2306 2689 7319 4951 -864 -413 1812
1057 1812 -3633 -7786 -1652 1989 -1314 1025 4445 1209 -3003 -3493 -4177 -8107 -8125 -2928 -3289 -4586
1073 -4586 -450 1640 892 3144 7172 9335 9547 11756 11524 4665 1178 -147 -6042 -9215 -6633 -4876
1089 -4876 -5707 -3865 567 -1039 -4263 -834 601 -3498 -2596 487 -861 -4955 -4489 -1163 -2471 -753
1105 -753 7164 10422 10776 14400 14546 8986 3594 2008 -2089 -9504 -9428 -7241 -11594 -13048 -7485 -5980
1121 -5980 -7066 -3246 4594 5139 2720 7136 8347 271 -2393 884 -504 -2956 737 6703 6109
1136 6109 4839 9623 8902 2115 2353 2685 -3414 -8996 -8803 -9130 -15040 -15134 -8325 -6566 -5701 2871 9075
1153 9075 9608 9620 12128 11360 4897 2521 3543 -797 -3424 -1800 -1670 -2437 -1724 1946 2258 114 2458
1170 2458 2292 -3135 -5931 -6444 -9994 -12247 -11072 -6812 -4781 -1966 5425 9550 10071 12549 13729 11913
1186 11913 9242 5869 3519 -958 -4651 -6265 -8762 -7796 -5411 -5217 -2943 379 977 142 -1065 -1720
1202 -1720 -3707 -6367 -6321 -5246 -5695 -2709 1093 4149 7317 10306 13128 13405 11988 11058 7012 1422
1218 1422 -2038 -6350 -9948 -12130 -11541 -9188 -8650 -6326 -886 722 543 2375 3061 1683 -43 -509
1234 -509 -197 -2720 -1195 1761 2262 4463 8352 9862 9811 9019 8093 5169 -503 -2984 -6347 -11067 -11750
1251 -11750 -11519 -10901 -9132 -6497 -2216 1606 2444 4932 6566 6500 5623 3467 2965 1427 -486 316 719
1268 719 679 2679 4073 4946 4672 3846 2936 -337 -3705 -5570 -8406 -10214 -9715 -9482 -8050 -4828 -1659
1285 -1659 2686 4906 7558 9227 9509 8780 6277 3531 2208 -1336 -3235 -2362 -2859 -2562 -1024 519
1301 519 1576 929 981 696 -2525 -3777 -4726 -7041 -7054 -6345 -5440 -2467 62 3628 6231 7830 10076
1318 10076 10233 8456 6252 3146 816 -2060 -4851 -5282 -5189 -6163 -4842 -2880 -1385 -1204 -611 934
1334 934 363 -1625 -1067 -1490 -2925 -2735 -1808 -218 1215 3118 5399 5991 6800 7604 5912 4104 2355
1351 2355 -755 -2877 -4818 -5855 -6309 -7009 -5727 -3804 -2987 -1292 437 1768 2599 2435 2537 2054 170
1368 170 129 -295 -771 408 964 1858 2532 3505 4545 3336 1502 1981 -261 -2610 -2946 -3662 -5262 -5852
1386 -5852 -4812 -3343 -3083 -1292 1729 1526 2529 4169 3185 1613 1382 1081 -73 -1051 749 768 -932
1403 -932 465 1967 1389 1126 1575 1600 116 -1268 -643 -1879 -4460 -3357 -2232 -2552 -1934 -71 1218
1420 1218 506 1443 3372 1481 881 2609 1627 -229 119 1067 83 -2086 -483 833 -804 -333 1646
1437 1646 484 -662 -204 -83 -1419 -2257 -455 -513 -1758 -115 -183 -1275 -332 1345 1250 554 1522 2696
1455 2696 444 -1098 621 -272 -2071 -618 824 -31 -1033 431 1093 -1382 -1297 1205 629 74 1129
1472 1129 1229 389 -690 232 -234 -1636 517 1547 -554 -337 536 -777 -2439 -1582 106 -692 -550
1489 -550 2330 1375 -670 44 1044 -773 -1500 1086 2207 186 309 1779 -414 -1816 41 353
1505 353 -945 -228 1267 483 -1847 -1639 -593 -3130 -1475 677 871 1160 2444 2921 231 -363 1206
1522 1206 412 -1447 1181 1911 -1020 -1315 -368 -1243 -3153 -1663 1480 73 -543 2262 1629 -1442 -1846
1539 -1846 -642 -947 -1574 1154 2916 651 1483 3034 1027 -372 1397 1789 341 160 1215 -1434
1555 -1434 -4768 -2577 -2283 -4666 -2784 1129 1578 -338 1202 3136 -120 -1520 1858 1511 -816 1147
1571 1147 2972 807 -1278 940 2087 -313 565 3657 1816 -500 410 -711 -4035 -5239 -2590
1586 -2590 -2770 -4271 -1230 1548 -223 -173 2506 2275 1052 2068 4230 2292 -136 2029 1467 -2257
1602 -2257 -1377 761 -25 -613 1426 2784 71 -1359 454 -1517 -4538 -2778 -1412 -3161 -3362 -979
1618 -979 -33 -1458 613 2989 2553 2838 4438 3893 1764 940 877 -573 -2239 -817 -263 -1883 -792
1635 -792 821 -465 -946 20 551 -1121 -1829 -365 -1001 -3046 -2106 -1059 -1578 -628 1784 2682 2327 3168
1653 3168 4383 2471 812 1672 540 -1445 -1465 -886 -2228 -2703 -1224 -930 -1822 -512 1543 597 331
1670 331 599 407 -634 -1201 -556 -621 -1428 210 1532 790 1470 2113 2369 1410 1328 1740 329 -1465 -954
1689 -954 -1681 -3091 -2834 -1922 -1447 -1543 -135 1543 709 835 1575 1277 354 760 388 8 -439 44 412
1708 412 -459 564 1317 248 938 840 575 -42 -997 -945 -1868 -2193 -1927 -1625 -1556 -410 -69 443 1075 1122
1728 1122 1399 1422 1517 1383 786 273 288 -316 -240 -250 -517 -77 -139 267 284 -412 -572 -296 -1117 -808 -915 -1075
1750 -1075 -1016 -840 -288 108 -231 1007 1297 798 1498 1283 1261 780 304 609 -63 -555 77 -814 -1063 -209
1770 -209 -394 -189 -565 -626 106 -259 -480 -171 -480 -220 -269 -428 120 -6 221 703 468 660 738 701 762 239
1792 239 349 195 -204 -69 -44 -616 -246 -198 -269 -471 -425 187 -23 -380 74 -130 -346 364 -518 -240 -46
1813 -46 -502 -35 -396 -229 317 -58 134 371 205 1082 699 376 675 398 256 -64 -241 86 -122 -157 155
1834 155 -45 -471 -36 37 -224 -313 -728 -414 -480 -1000 -442 -346 -576 -2 336 584 331 911 1100 752 687 902
1856 902 701 42 257 -197 -420 -947 -328 -355 -1193 -640 -20 -601 -347 -469 240 -160 -424 263 199 -867
1876 -867 427 532 222 604 820 1333 678 516 1001 311 -460 85 -311 -674 -1217 -860 -853 -1398 -814 -61
1896 -61 -528 101 656 712 254 676 804 258 -161 350 507 -513 193 538 -201 -141 456 283 156 -60 559
1917 559 -574 -1127 -496 -1026 -1454 -728 -325 392 292 923 1102 603 766 1410 553 207 831 524 -428 -620
1937 -620 -579 -1013 -1401 -347 422 -428 192 799 76 -947 -953 -339 -1063 -612 237 433 -255 640 1065 215
1957 215 657 1344 1518 571 955 1223 -347 -1290 -657 -1072 -1631 -881 528 234 -821 244 660 -1226
1975 -1226 -809 378 -364 -627 374 725 -525 -740 545 337 -404 1361 2178 1020 809 1298 256
1992 256 -1282 -1090 -222 -1284 -1208 273 173 -1244 -737 -12 -1124 -1251 417 1358 -414 -51 1119 -173
2010 -173 -1240 117 1090 560 277 1839 1711 -370 232 779 -661 -1414 196 -100 -982 -805 121 -938
2028 -938 -1910 -172 94 -848 450 1597 453 -446 293 589 -1102 -789 1292 127 -371 698 708 -490
2046 -490 -914 629 331 -742 -108 1359 -622 -1360 -123 -87 -1188 -702 745 624 -392 914 1089
2063 1089 -359 -318 683 43 -571 322 602 -538 -910 162 -455 -1341 267 930 -324 -8 753 469
2081 469 -899 -451 583 -364 -550 946 672 -415 -120 597 99 -655 531 762 -308 124 203 -591
2099 -591 -1047 -665 -248 -612 -392 717 480 -461 105 445 -621 -434 260 592 37 127 987 -510 -1146
2118 -1146 306 233 -693 17 931 474 -546 -206 623 -640 -390 835 6 -431 201 199 -661 -954 -163
2137 -163 -580 -870 52 367 -80 -69 333 200 -162 89 525 178 -17 485 -283 -242 -88 -195 -159 187 281
2158 281 708 473 47 42 117 -519 -362 -258 -558 -376 -362 -82 -596 96 94 -348 350 871 215 153 23 -251
2180 -251 -362 -640 76 66 -151 372 919 481 649 649 591 -103 -276 16 -1032 -1145 -628 -1179 -1005 -648 -302
2201 -302 -79 0 483 778 312 445 546 62 -171 50 7 18 -208 619 1023 710 966 1253 657 653 305 -212
2223 -212 -964 -1712 -1473 -2000 -1917 -1700 -1109 -738 -122 675 1388 1483 1382 1837 1189 795 782 232 242 55 -68
2244 -68 162 295 193 468 132 429 -173 -866 -1045 -1428 -1954 -1731 -2038 -1702 -560 -311 491 1301 1578 2255
2264 2255 2394 2207 1640 1254 722 -98 -636 -1176 -1233 -1079 -727 -770 -465 -122 105 154 -508 -793 -637 -1030 -1076
2285 -1076 -1021 -1040 -617 57 915 1512 1854 2497 2496 2126 1789 1320 298 -427 -1221 -1748 -2160 -2422 -1692 -1523 -1083
2306 -1083 -283 -274 350 460 493 320 -52 -85 -436 -580 -411 36 395 1345 1565 1896 2577 1793 1543 1243 -12
2327 -12 -657 -1601 -2387 -2525 -2818 -2615 -1902 -1786 -678 289 366 1020 1190 1177 1317 785 573 484 117 459 593
2348 593 700 1109 1202 1509 1232 906 693 -445 -1344 -1684 -2408 -2945 -2988 -2925 -2381 -1505 -410 256 1075 1788
2368 1788 2195 2384 2552 2426 1028 890 490 -85 -306 -141 -2 59 4 410 396 -348 -447 -1049 -1391 -2081 -1912
2389 -1912 -2028 -2507 -1522 -658 0 760 1835 2621 2496 2963 2434 2080 996 700 104 -1078 -963 -914 -1400
2408 -1400 -1547 -1082 -660 -386 -293 289 8 -385 -643 -965 -1303 -1499 -903 -245 -156 633 1654 1599 1966 2176
2428 2176 2143 1209 853 461 -369 -1407 -1627 -1557 -2186 -1639 -661 -793 -559 524 754 518 354 444 133 -592
2448 -592 3 95 -485 4 433 750 740 897 1609 1069 642 1341 424 -841 -776 -1188 -2039 -2380 -1560 -929 -785
2469 -785 -520 870 624 542 1169 1247 660 409 957 536 -912 -142 676 -395 -243 527 859 492 505 845
2489 845 -367 -1106 -740 -754 -1648 -1332 -522 -661 -819 -193 651 453 712 1534 1475 836 1249 874 94 -507
2509 -507 -32 -317 -841 -238 722 -162 -566 287 40 -887 -501 123 -439 -796 -271 -318 -791 -429 245 412
2529 412 288 985 1712 1104 417 851 299 -761 -248 -60 -470 -573 -114 -157 -977 -318 715 -160 -130 909
2549 909 342 -232 -337 109 -401 -961 -37 173 -291 365 763 550 -159 269 246 144 58 370 159 -598 -73
2570 -73 92 -653 -600 161 322 304 302 489 261 -185 -21 0 -442 24 237 78 -290 41 -13 -405 -184 339
2592 339 -22 18 162 443 180 -50 326 187 -277 117 762 123 178 245 -78 -187 -473 -80 -189 -341 342
2613 342 99 -445 -181 34 -404 -193 355 275 35 202 355 -129 -216 328 205 24 368 339 61 -150 -256
2634 -256 -37 -623 -483 285 -153 -263 95 294 -57 -174 108 -36 -430 83 -13 -348 -326 189 238 -22 275
2655 275 904 642 348 740 392 47 -152 -157 -424 -812 -624 -192 -629 -322 15 -139 -191 249 387 213 -121
2676 -121 436 90 -288 -329 -104 -313 -258 67 -5 117 -77 297 50 -23 4 -256 -378 -205 -346 -613 -465 -783
2698 -783 188 -257 204 338 493 353 840 553 473 238 159 110 -192 -207 -187 -211 -158 48 -160 -141 -245 53 -159
2721 -159 -434 -240 -491 -740 -275 -308 -346 4 244 667 566 997 1236 1004 492 414 199 -550 -611 -822 -550
2742 -550 -745 -757 -39 -309 -297 -75 167 181 103 -116 -219 -271 -296 -194 -41 -55 196 646 601 709 879 843 100
2765 100 322 178 -424 -451 -605 -943 -783 -566 -433 -146 -368 25 42 355 260 173 199 178 -15 119 19 28 510
2788 510 401 260 107 325 336 108 201 -18 -437 -339 -298 -718 -519 -477 -694 -294 -188 -66 143 405 532 812
2810 812 121 520 238 146 22 -184 171 20 -29 136 135 381 295 81 246 -18 -255 -214 -376 -567 -567 -485 -153
2833 -153 -189 42 399 863 581 597 417 535 84 -2 -64 -13 -446 -287 -114 -218 -518 -69 53 23 -107 72
2855 72 -99 -87 -6 -593 -383 -236 -12 -51 132 183 498 404 247 515 553 120 -208 -39 -409 -856 -630 -474
2877 -474 -305 -219 20 -57 146 234 360 143 119 349 -41 -92 162 -98 -332 172 235 291 375 246 523 140 26
2900 26 224 175 -459 -114 -262 -157 -507 -243 63 -52 71 212 322 211 278 330 221 -2 320 -26 -310
2921 -310 72 163 -180 -209 331 37 -400 -147 208 -190 -541 -120 -422 -590 -486 -12 -228 127 313 279 -103
2942 -103 366 684 -20 94 -157 -106 -265 -245 -32 -233 -383 -35 120 -333 -187 257 229 -104 28 404 -102
2963 -102 -210 210 50 33 165 281 -27 -371 216 -142 -383 -42 188 -172 -166 -1 61 -303 -417 503 203
2984 203 -98 494 319 54 -105 117 3 -188 104 458 70 -448 4 -114 -541 -346 44 -256 -207 112
3004 112 96 -193 100 203 -114 -261 158 75 -205 179 251 -73 -309 -3 326 -86 -48 515 542 -529 -176
3025 -176 15 -621 -563 -363 49 -52 79 170 -391 -176 231 50 -68 91 403 -74 -155 -61 -282 -433 144
3046 144 94 225 7 167 96 -425 105 350 -107 59 459 341 217 63 8 -362 -587 61 555 -21 325
3067 325 176 -233 -62 174 261 77 44 482 386 -8 -45 292 -406 -156 -167 164 -61 -38 -11 -159 -80 -231 -162
3090 -162 -428 -11 174 336 -30 275 420 -139 68 232 10 -99 -46 -112 -154 -301 6 31 -206 89 255
3111 255 342 -185 143 -200 -212 -208 46 -240 -251 514 393 16 22 220 120 71 251 325 -241 -459 -131 -128 -594 -394
3135 -394 -610 -420 -343 371 156 239 248 406 226 32 190 423 199 116 202 33 -5 180 20 -260 146 260
3157 260 -75 -297 -74 -16 -436 -346 -498 -425 -225 23 56 358 340 239 333 227 417 414 -137 -65 124 113 -186
3180 -186 10 226 11 79 275 212 73 138 -344 -269 -106 -328 -229 -281 -294 -21 -47 -156 293 160 161 -35 366
3203 366 361 60 226 362 54 -214 63 -325 -176 -269 -270 -14 7 -65 90 145 136 -209 233 -357 -78 12 62 -225
3227 -225 -67 1 203 163 388 182 324 -43 -130 22 -276 36 -247 -194 -31 -334 259 -1 177 79 225 63
3249 63 6 -102 252 217 -80 -6 -91 -100 -231 263 48 -109 -38 -128 -110 -67 -419 -4 -259 -129 -123 201 431 453 147
3274 147 102 186 -147 76 -41 96 -124 274 11 -60 171 -72 -141 -250 -327 -163 14 -251 -150 -42 76 -6
3296 -6 -38 58 170 -108 152 -100 58 117 95 68 -161 -155 -6 286 -38 -232 154 142 190 12 117 -125 161 58
3320 58 146 -97 44 -80 -218 193 28 191 -23 -49 11 -62 19 -181 -246 -274 -308 -76 94 50 506 292 107
3343 107 398 161 216 229 253 25 -8 -364 -127 -137 -91 -5 -189 -27 -122 -12 -131 -292 -339 -40 -546 -146 -75
3366 -75 -299 -134 -177 87 212 271 525 653 293 302 215 127 -106 -85 -28 -125 -667 -199 62 -216 231 139 16 77
3390 77 -232 -78 -17 -192 -128 -224 -536 256 315 193 397 641 358 332 340 363 -50 -236 -128 -450 -714 -442 -247
3413 -247 -433 -272 -144 117 4 133 282 202 -174 -121 36 -175 -431 185 261 29 540 491 600 296 172
3434 172 -35 -191 -397 -125 -230 -475 -213 -549 -409 -244 -148 187 -108 102 768 16 259 285 -190 17 158
3455 158 -108 208 70 253 -16 -132 -130 -39 -6 -32 -53 -237 -535 -542 -710 -707 -599 -293 -114 -20 372 729 401 557
3479 557 514 559 101 8 147 -128 -341 -341 -325 -354 -311 107 211 -49 266 -29 -505 -451 -364 -499 -283 -150 59
3502 59 85 26 601 668 585 748 534 224 259 59 -155 -435 -823 -602 -537 -840 -203 214 -115 -291 280 -127
3524 -127 -151 171 263 -256 -82 167 188 -80 69 665 572 352 353 493 -105 30 157 -389 -500 -209 -355 -478
3546 -478 -407 -137 -202 -339 128 193 159 261 423 226 -53 -12 215 -351 -227 2 95 -130 340 568 306 184
3568 184 440 -152 -302 1 -83 -302 -332 -294 -390 -401 -342 279 298 287 471 661 249 257 -223 -129 -403 200 318 -194
3592 -194 -99 311 120 -161 39 355 111 -218 -131 -257 -494 -464 -349 -303 -352 -45 277 191 222 225 532 193 381
3615 381 477 -197 105 -4 -77 -276 126 -234 -196 -415 99 -166 82 -97 58 -222 -419 -239 -226 -44 -11 327
3637 327 208 123 407 625 287 254 123 -52 -167 24 -249 -184 -338 -352 -454 -100 -265 203 108 140 328 -200
3659 -200 -209 65 117 -72 -322 49 399 233 242 386 229 221 272 62 -115 19 2 -299 -283 -129 45 -371 -168
3682 -168 -108 -64 -92 448 338 312 202 52 30 102 138 122 48 130 28 -81 -156 273 -50 -253 -92 146 -27 -162
3706 -162 -7 -147 -113 -130 -133 -277 -142 -367 -203 1 132 193 178 228 -40 23 111 91 -3 -20 -179 135 176 -27
3730 -27 -195 7 101 -66 69 36 -139 -308 -41 110 -37 213 -14 71 217 207 -111 99 146 -6 -100 187
3752 187 -19 271 59 88 -20 118 169 218 -198 -244 141 -211 181 156 -62 -74 -40 -4 49 56 -113 89 -313 -184
3776 -184 -308 -19 -31 -3 210 -63 148 -76 -14 -15 -42 -213 53 -123 -49 14 151 254 147 105 137 354 -376
3799 -376 -194 -208 -37 -103 15 -311 -2 -198 -37 -24 -14 266 410 23 296 513 124 91 154 -161 16 -138
3821 -138 -141 -276 -299 -26 -31 112 299 25 203 -64 150 157 -144 -69 -32 -144 -157 -8 121 107 296 225 131 -125
3845 -125 -110 -42 -135 -293 45 -301 -432 -489 -114 13 60 140 152 213 182 -18 198 107 -119 -40 29 73 -91 146
3869 146 99 290 36 89 -42 -52 210 -216 -160 -271 -465 -417 -214 -18 -40 71 253 559 394 450 397 204 176
3892 176 16 -130 -159 -19 122 -112 -216 -305 257 111 404 86 -239 -340 -237 -319 -384 -298 104 -49 -28 6
3914 6 113 97 410 215 6 268 147 151 98 71 113 -146 -294 319 -262 123 38 77 -164 -426 90 63 -384 -147
3938 -147 -402 77 -63 -47 289 175 -61 185 261 317 427 127 353 -122 371 -95 103 -293 -105 -188 -413
3959 -413 -96 38 -25 -67 156 -232 -79 304 -88 -176 -141 185 -95 107 351 147 335 340 396 194 8 111
3981 111 55 -193 -508 -418 -632 -489 -354 -180 -176 -113 432 367 287 6 144 -74 -185 78 332 -86 106 -37
4003 -37 -52 -200 -16 49 168 -168 -37 39 -434 -454 -125 -131 -83 98 143 -114 290 307 201 -49 152 314 -156
4026 -156 -29 211 -96 -273 -383 -126 -288 13 99 86 10 -12 107 -33 -472 74 -89 29 -4 139 -191 -250
4048 -250 24 -82 -109 384 339 76 243 401 -263 -237 -71 -285 -80 -303 30 271 80 91 -130 145 -217
4069 -217 130 14 99 51 30 -241 -316 81 -133 141 153 253 362 232 -242 -5 -32 -9 276 -69 -193 -163 -25
4092 -25 -222 -217 -100 -40 -148 -103 13 180 -20 -105 -11 -44 103 -99 145 -45 54 221 91 176 7 -150 148
4115 148 236 191 -152 -211 -97 34 -323 -344 26 128 -13 74 48 1 -158 38 50 -118 143 -132 -303 -260 -61
4138 -61 -75 -279 31 -116 101 153 207 83 150 -36 -87 -79 15 90 147 -152 -198 -41 -115 -25 32 -68 -349 -62 57
4163 57 -116 -63 48 -22 86 -48 114 22 56 -25 418 69 145 -11 -12 263 4 -79 205 -63 133 -256 -38
4186 -38 154 -202 31 -319 38 134 169 -352 -135 -65 -9 -381 -20 -5 -134 34 -18 213 -94 37 -58 99 283
4209 283 -38 48 99 -226 -145 73 -75 38 62 -105 101 -93 81 109 -78 -164 17 -138 52 -190 -364 -87
4231 -87 -218 1 39 220 74 210 71 -49 -487 106 -153 151 -130 52 -31 51 103 1 -21 13 -18 -147 121
4254 121 187 77 -74 370 -142 -128 -218 -187 126 10 43 -57 -18 -203 -4 -59 28 -239 -27 315 -171 -6 -20
4277 -20 47 189 211 261 -121 213 16 -47 -114 34 15 -216 -141 -315 11 -160 -197 -81 -18 133 51 53 187 90 -7
4302 -7 111 -17 227 96 -120 144 -53 17 180 258 36 272 -60 -372 52 -220 -60 -249 -106 32 -229
4323 -229 -33 45 146 225 15 -133 99 -60 -62 105 -74 75 -32 304 -321 246 -72 238 108 -72 111
4344 111 -18 -191 166 166 -329 -144 -69 -40 183 -80 110 83 44 139 229 361 -101 -53 -183 111 156 -198 280
4367 280 -103 14 -12 134 223 284 220 214 -132 -117 -36 -196 -181 -66 -160 -167 190 -33 14 63 -114 361 223 41 -21
4392 -21 -205 -101 -35 5 138 64 218 2 67 117 -94 -310 -137 -212 10 20 -3 -86 156 65 218 354 199 109
4416 109 22 277 27 -60 -86 130 130 -165 -309 -47 -17 36 -187 -197 -419 -42 60 180 4 121 -109 83 310
4439 310 71 59 -96 -180 -73 14 -64 74 3 -27 -261 21 117 71 193 81 153 -92 -191 -283 34 133 239 -208
4463 -208 44 163 18 -232 57 -57 177 -114 95 160 -195 -18 -193 -169 -139 239 211 -128 199 306 -316
4484 -316 -346 324 17 63 -38 -191 -135 277 -124 -195 5 -266 47 220 -12 184 87 -366 -53 -319 176 -111
4506 -111 160 -254 -147 -102 68 56 -143 -36 38 10 -165 130 36 -323 1 -1 293 39 46 185 -122 84 216
4529 216 170 242 -9 -131 50 2 263 -81 -114 -222 -177 49 70 0 243 10 -19 -306 -155 -288 -155 -37 -151
4552 -151 198 -23 -77 3 214 122 -66 225 175 -206 -364 -87 100 -41 69 86 17 -107 98 -42 39 -138
4574 -138 110 -172 -227 -46 -301 -271 -287 128 -62 -179 97 60 78 261 323 270 -154 87 9 -11 -293 99 -213
4597 -213 -173 68 -119 -22 -19 5 120 -57 190 -6 11 89 145 -188 117 336 430 235 434 199 240 248 -70 15
4621 15 -335 132 -412 -441 -162 -34 -163 -179 -87 195 76 109 231 141 101 125 59 299 -99 -197 -88 84 -33
4644 -33 -15 -12 225 -10 25 -88 -92 15 -69 -219 -264 -236 -172 -12 -143 514 376 316 392 -105 -85 107 203 143 -118
4669 -118 50 -120 -82 -187 -15 46 -192 -139 15 -111 -238 -219 -150 7 -155 -281 -63 31 25 247 146 179 279
4692 279 122 374 401 179 27 -353 74 -43 61 141 -247 -33 -63 -33 -102 85 128 -2 -78 -313 -108 -288
4714 -288 -210 -90 174 -151 -8 132 -92 73 350 145 288 -77 -72 -172 -272 -198 -195 -181 -220 -102 -247 180 2
4737 2 251 25 -39 -52 -50 4 -240 -136 -33 105 -29 249 -13 240 355 121 30 121 103 102 -15 -40 -69 -157 -39
4762 -39 -125 79 57 7 -52 11 345 110 -124 72 109 -214 175 -41 -87 212 -40 368 53 58 -41 -96 -57 -154 -198
4787 -198 132 -55 -124 -46 159 -244 39 204 -305 229 117 555 66 17 -138 10 -186 -55 265 95 -6
4808 -6 -89 100 127 9 21 -53 -177 -90 57 -187 -40 38 -348 258 -141 32 296 -19 180 95 42 -44 -52 235
4832 235 -16 37 -273 -308 -94 11 -177 -263 20 -251 8 -179 153 -84 -214 0 -225 36 8 -176 99
4853 99 -3 -41 109 145 64 111 -141 26 70 153 -105 223 -20 43 -64 -111 145 -256 -233 58 135 -278 -46 -195
4877 -195 69 -7 -6 -14 -174 1 207 -108 -392 -112 -114 128 -85 77 148 -21 -103 70 77 -295 -47 80 -149 -173
4901 -173 -35 -300 120 43 -40 -92 210 198 116 -127 -184 5 273 137 -140 -18 216 5 -101 35 -291 188
4923 188 81 -118 -1 -149 -3 -214 -1 -172 -4 57 -94 -167 -74 -82 -10 -166 161 -10 158 -397 117 -145
4945 -145 -66 273 120 2 -75 -6 268 205 -48 47 62 226 -143 19 4 -267 -47 5 -62 -428 194 130 88 96
4969 96 38 111 -54 -50 -252 -124 161 -30 -110 -339 277 -262 -111 -156 51 -33 -224 -139 -59 96 67 -184 114 -451
4993 -451 -79 126 -82 129 85 -181 -97 205 181 -313 -143 65 -6 37 -78 -45 -104 165 38 -32 -94 32 -131
5016 -131 -242 -74 -208 -333 -205 -29 163 217 204 173 133 -65 119 -27 -76 -281 -46 125 -96 -169 -72 164
5038 164 -191 106 212 375 49 14 284 -323 -186 61 -266 -207 286 91 46 110 105 177 213 351 215 113 -177
5061 -177 -170 -76 -389 -51 -40 8 87 284 17 -2 99 186 -70 41 17 -106 6 -71 68 -2 -67 120 -227 58
5085 58 166 65 232 54 187 -19 -178 -306 -336 -161 -227 -201 -68 105 -75 421 66 -197 339 -92 -80 -50
5107 -50 -219 -152 -167 45 -153 -202 47 12 -11 39 93 7 -22 -111 10 216 -206 21 -203 274 82 -129 3 102
5131 102 315 378 160 -105 17 -2 10 171 -46 115 -134 -5 75 -31 -18 -25 216 95 46 -59 -287 52 -302
5154 -302 360 66 45 76 186 253 354 3 26 -181 -48 170 62 89 -313 0 -247 -166 -18 -63 240 -49
5176 -49 229 386 147 -146 -70 11 109 -233 80 -121 -47 233 152 61 -1 117 3 187 116 -492 60 -184 -110
5199 -110 -49 -116 -90 -74 150 23 146 -100 122 270 -293 -98 -70 402 118 -72 -69 -48 -201 -132 123 -209 155
5222 155 70 137 -5 -467 -32 -215 -260 -213 -123 85 29 72 -65 87 -56 -73 50 101 124 330 -107 5 9 -120
5246 -120 95 -99 82 76 265 239 -72 -8 123 -157 -58 206 132 -44 -181 46 1 -214 11 32 50 -149 221
5269 221 -148 -12 296 48 -71 141 34 190 -252 43 152 20 61 26 194 15 250 -125 -151 74 -91
5290 -91 -60 -49 52 299 258 -52 281 15 -225 105 80 -164 -38 -131 -184 32 119 -40 86 382 334 131 -274
5313 -274 -98 -254 -63 -117 103 -84 17 135 -164 -219 173 -323 -29 -58 -129 93 -157 -173 -48 85 59 129
5335 129 -114 185 29 151 16 110 205 -54 27 -130 60 200 -212 194 -111 -109 -137 -4 82 -19 144 74 81
5358 81 36 72 94 86 -293 156 208 -69 -164 -228 -61 -147 -1 108 136 218 111 -205 -72 230 -98 -96 -71 -47 -229
5383 -229 -203 211 212 -182 109 -96 139 -79 0 -100 -307 -75 -174 185 34 -136 54 -21 56 29 74 16 -19 46
5407 46 191 119 64 -185 -152 104 11 -249 -72 -177 275 92 -1 181 -255 60 208 -152 -77 -302 -32 -292
5429 -292 -7 -295 175 -55 299 122 101 18 4 187 162 111 53 37 -119 339 -91 -108 -99 131 -35 -349 168
5452 168 -113 -57 -256 -28 -115 -100 -151 -12 -10 47 69 -110 13 127 296 334 -146 -111 166 -35 -14 78 -196 -82
5476 -82 -155 -188 -66 116 51 130 -59 -3 -276 181 -87 29 48 -224 216 -76 170 -38 149 4 -30 96 13
5499 13 -65 194 -161 -244 -257 -75 -297 -167 -86 163 230 -4 -63 127 -149 103 -519 15 -208 -95 148 -264
5521 -264 63 12 -15 80 186 -26 24 -122 -217 -6 -274 81 -26 -150 -186 -203 176 190 -80 -2 -138 132 151
5544 151 -45 -111 139 -215 5 122 -188 31 35 -77 -13 -7 216 81 -124 36 -46 -267 28 -103 -30 67 -101
5567 -101 136 80 11 -5 218 -196 -31 -72 145 -61 246 8 29 84 15 -74 0 -218 -94 121 -77 262 23
5590 23 -40 -215 -32 -92 42 -89 20 -29 -194 47 103 90 -30 117 -69 59 -152 -39 -121 -133 -22 93 -352
5613 -352 -237 75 261 78 -7 166 136 -281 -119 235 189 -104 95 -183 -38 86 -106 -56 215 46 88 -44
5635 -44 -38 -161 121 311 -266 107 -32 -94 -58 -30 236 -162 200 259 -1 91 -128 122 71 -148 -14 73 81 94
5659 94 56 29 -45 226 -20 -63 245 -53 9 83 -60 -167 167 101 132 179 -239 11 -71 216 -92 -54 2 44 -27
5684 -27 -6 -173 -25 9 -25 -112 111 129 10 145 -84 -41 -48 119 134 208 90 -6 76 -306 -77 130 57 59 81 -122
5710 -122 188 39 38 154 -183 -105 147 101 75 3 -177 67 159 -10 -24 94 229 96 74 -40 -30 2 -151 91
5734 91 -100 -421 -267 -4 -27 -80 -6 -96 206 271 -259 22 -128 32 221 -229 -174 -45 -158 -94 70 -23 -176
5757 -176 203 -14 -26 -63 132 -149 -101 110 84 -54 -116 55 -215 41 -107 -66 128 54 389 162 79 -96 116
5780 116 -57 139 270 -92 -208 -186 161 -180 -72 -278 -95 21 -48 -177 44 29 40 -214 165 78 224 249
5802 249 198 165 16 131 -211 75 97 15 -213 -12 130 135 143 73 -100 -21 154 92 -40 33 48 -146 -15 246
5826 246 -168 -106 469 -34 20 356 206 269 51 -60 -170 -36 -269 -221 -326 67 38 -149 -45 80 -31 -14
5848 -14 -36 88 -312 -354 -223 29 51 35 195 22 157 12 -296 79 105 247 -132 -123 -214 -54 -322 -306 -86
5871 -86 88 53 116 70 276 59 159 177 108 -297 -90 50 39 182 -44 247 76 -228 -55 219 -122 30
5893 30 -82 -74 -178 84 145 -222 -110 97 -225 -104 -84 196 61 78 43 114 93 85 -99 520 -35 -175 119 -71
5917 -71 -22 26 -31 31 -74 103 -72 -28 -96 -38 -17 150 92 38 -17 -146 252 129 9 -30 -48 18 9 114 -131 -360
5943 -360 25 -27 -9 -370 -77 35 116 133 -141 55 -35 -4 53 29 -75 138 168 327 92 9 -9 -88 92 198
5967 198 -18 -231 -373 -99 -110 -165 -50 353 51 -130 -229 66 -83 1 66 115 -192 165 -280 163 -158 -44
5989 -44 -53 161 -35 -346 -193 -98 -22 34 92 -272 322 -372 -78 -53 -27 224 -294 223 18 -107 -54 90 2 -93
6013 -93 -3 55 -313 -142 -109 97 133 99 93 104 108 24 191 28 51 -113 -27 20 296 -145 21 -236 -82 108 57
6038 57 -65 -221 -327 -270 35 -287 68 192 238 199 243 160 -77 -50 17 -93 68 121 -52 217 -65 -80 81
6061 81 -96 -185 -110 -148 -122 -6 -74 32 -54 68 269 -247 -10 -363 30 -1 -136 -4 -266 128 192 14 104
6084 104 172 -115 294 -186 79 71 -142 30 -194 -131 66 106 -32 116 -350 -38 7 -62 113 141 51 180 175 -350
6108 -350 46 26 197 -11 -133 123 -23 -40 -182 -216 117 -125 165 -131 -37 -9 -112 -133 25 142 -169 187
6130 187 -170 -276 -15 -394 47 -16 -82 -114 150 119 253 -106 -40 67 -43 -139 190 -112 77 57 46 -9 -67
6153 -67 -58 -94 201 -34 3 -281 102 -54 -7 141 102 51 3 -175 -152 -1 213 -114 -2 -277 -104 -205 25
6176 25 102 -199 56 -112 107 68 -14 40 111 373 179 143 32 105 -358 -50 59 -34 120 129 180 114 -9 215
6200 215 101 -317 107 67 -267 100 -26 133 54 3 133 89 -127 -58 205 133 -294 -90 25 0 12 -180 58
6223 58 -69 196 -187 235 -73 -82 -69 168 -114 46 -18 -144 -49 147 185 -140 -37 20 -13 -293 31 -103 57
6246 57 -137 50 -326 -153 -94 168 -59 -118 134 -98 -23 249 356 -119 -88 -220 -70 -2 -115 -53 140 66 -100
6269 -100 -14 50 80 200 130 -35 37 54 34 1 -150 81 11 -166 142 76 -201 -163 -118 127 19 -228 -15 118
6293 118 22 -214 279 190 173 -123 -9 196 92 50 -56 -102 32 -75 -2 136 -271 59 124 -45 397 262
6315 262 -59 187 116 -11 214 54 7 189 -219 -208 -54 107 92 -152 0 153 -41 68 -155 -33 19 -139
6337 -139 87 -157 -251 82 -90 -145 20 82 191 190 261 104 141 -222 41 22 23 -130 -147 -171 -16 -58 114 95 81
6362 81 -131 -67 -103 145 145 51 -66 27 38 -143 134 -41 9 29 252 -195 69 34 55 -24 -72 53 242 37 148
6387 148 -67 -139 -119 162 172 -192 -90 4 -81 -133 -2 -280 -93 37 196 46 -27 -213 -49 -3 83 37 -107
6410 -107 55 83 -83 -140 -286 -287 48 26 205 41 102 142 62 142 65 21 127 173 -158 -7 -124 -126 -54 252 -11
6435 -11 20 -272 200 40 19 297 -36 125 54 -338 -46 3 77 101 98 199 -267 -141 -49 -7 -35 -43 118 -13 -71
6460 -71 -41 -81 60 -86 95 179 140 158 211 143 94 -68 -39 -12 -153 164 -69 -332 -87 153 232 -91 -47 159
6484 159 137 -32 -330 -39 -86 25 179 -260 231 111 -22 -60 -387 -35 226 46 143 -74 -230 298 35
6505 35 -85 242 -244 111 -151 -137 -17 -356 10 57 -177 -47 -78 97 182 -192 30 -61 -192 -145 83 225
6527 225 -24 -50 196 103 -113 -6 96 -237 -133 145 18 -77 -40 -47 -84 83 38 346 -193 187 123 -274 71
6550 71 -222 23 -130 63 -55 -257 99 -151 -286 -15 -196 43 84 126 79 41 17 -158 -28 264 -165 -175
6572 -175 337 179 -54 7 225 -90 288 27 -66 -52 -202 11 160 144 -249 -137 -27 -9 46 3 104 191 61
6595 61 -98 -35 205 -7 223 -132 216 28 75 237 63 -145 -20 25 0 -56 64 -79 -30 -21 165 -79 -57
6618 -57 145 -45 -137 153 -98 39 -12 77 166 -221 307 329 182 66 -91 -277 92 19 55 21 184 -251 4
6641 4 -123 12 -45 50 -198 -315 84 -85 125 79 -58 159 24 -56 0 66 36 185 -143 -93 -108 20 100 -45
6665 -45 -235 15 -140 246 259 -362 -33 199 -96 -217 225 49 168 59 30 179 351 51 -89 -8 -20 173
6687 173 172 -50 -113 -3 43 88 166 -30 -230 -190 -138 -309 153 45 111 131 -45 177 -23 88 -61 172 6
6710 6 -130 -27 127 -133 181 -194 -76 128 -234 -100 124 -72 57 8 -86 -85 34 -144 -58 -79 23 168 -77
6733 -77 -128 102 27 126 253 29 9 137 -11 -72 -187 90 -28 52 0 -161 17 -311 -74 -113 44 122 139 165
6757 165 227 -120 -88 -77 6 -207 221 87 -30 136 -34 183 139 -218 246 -31 -128 61 -321 53 -270 123
6779 123 -219 353 -57 51 64 -31 -45 -107 -249 -121 89 18 60 29 -65 129 67 104 124 142 162 -27 99 118 -142
6804 -142 -106 -123 -126 230 24 -184 182 -286 24 308 -312 -70 15 297 147 76 -76 -41 -22 -129 194 -192 115
6827 115 -16 68 -159 217 -35 26 -155 -176 141 85 121 33 30 -207 68 -66 27 -73 -37 -12 -18 43 -124 -132 -156 65
6853 65 56 -72 -15 -171 -77 344 -14 6 130 43 -75 -87 190 166 -148 -13 -68 -103 -112 -130 77 -148 66 -29 32
6878 32 -107 -304 -125 30 -41 -72 5 141 221 67 -67 213 -51 -99 -175 -289 -308 -14 -10 -69 80 36 -30 -48 -10
6903 -10 -335 119 146 81 157 -69 8 -90 -170 -224 246 -107 94 83 184 -179 20 104 -259 79 -67 -25 -18 -32 -41
6928 -41 76 192 -244 -281 140 -53 -80 11 34 68 14 -137 70 156 45 -279 -15 -341 164 -68 159 154 -178
6951 -178 -87 51 318 3 331 294 198 -33 -180 -66 28 130 283 66 -30 -153 189 19 73 -346 -6 196
6973 196 109 -84 8 -104 1 -128 -119 -74 130 87 -77 -59 -147 21 -110 3 22 -322 40 17 -122 -141 -28 84
6997 84 -24 67 -209 -39 -154 12 -253 -54 -69 -94 -255 -157 39 -28 -141 60 211 118 -6 61 -160 -173 31
7020 31 -100 -236 -70 78 85 -131 -144 14 301 -97 -70 -68 18 57 -95 182 14 -18 -48 -156 -19 -199 70 234
7044 234 85 58 55 99 -49 -122 113 -335 -214 -62 93 400 199 -102 -26 94 -42 193 -122 7 115 0
7066 0 20 31 -64 180 72 -214 176 -92 114 -14 -58 115 -195 -162 -297 -142 12 0 206 -56 141 43 -79
7089 -79 -17 -313 222 -100 323 -127 -102 -5 -100 -47 -30 -207 -60 -183 -66 -81 -210 -14 -118 -75 -401 -8 50
7112 50 95 -157 -38 256 189 51 41 327 279 -110 18 -46 -94 301 198 285 -44 86 148 -74 -25 -55 201 -154
7136 -154 -191 -121 -109 -52 -257 -36 -96 -38 -183 -164 -26 -80 128 -80 205 -31 139 43 14 179 -122 -198 -161 92
7160 92 177 86 -49 118 -106 -169 197 144 -11 -210 -267 -75 -84 45 -202 -84 -2 109 313 -195 -283 219 -46
7183 -46 29 -25 11 -43 15 144 73 -1 -89 14 72 132 -257 3 85 30 -5 -408 -59 -138 124 -54 -16 -20 13 131
7209 131 237 9 -114 266 -24 41 39 268 13 140 -76 98 -53 -240 -154 156 56 -58 30 30 140 -85
7231 -85 -20 170 131 -67 13 -20 -25 55 70 -87 103 -169 64 108 -6 -44 50 -110 -57 181 7 -184 138 285
7255 285 -62 -3 85 104 -327 65 36 158 -12 -6 -47 103 -194 116 -26 -55 -265 95 72 88 -42 100 41 230
7279 230 1 23 193 -55 -140 82 32 90 56 -22 -1 83 -177 69 -131 94 83 -135 -8 -35 -43 36 238 88
7303 88 2 76 118 57 194 -126 -100 -166 -150 6 54 -73 -127 -240 -45 -125 -190 26 28 188 29 -174 127 -93 -159
7328 -159 33 -126 145 -87 81 145 -228 70 -16 5 -55 48 -262 -285 87 243 76 -157 316 40 -396 68
7350 68 299 312 -78 -155 187 126 -159 -45 -108 -219 -86 -75 -7 -60 -128 -96 -260 -105 90 -88 114 -84 56
7373 56 66 21 166 -173 65 5 198 118 30 -166 -132 207 -62 -200 61 -339 -181 -87 -175 -92 -160 -138 -31 237
7397 237 86 115 92 76 -139 -103 -62 32 -39 -19 -116 248 70 41 -126 71 16 -191 76 -136 58 -261 -289 -208
7421 -208 -19 -94 124 248 152 130 147 -75 -143 -393 -217 52 -12 -206 148 -102 -63 210 192 180 33 101 -36
7444 -36 -22 142 -45 94 119 -86 -63 130 30 76 -157 99 94 1 90 -162 -38 192 -92 -36 -62 -132 -69 163
7468 163 -280 -42 331 21 -110 -64 12 217 217 61 112 -102 -201 -226 88 -122 -128 248 40 -14 -21 58 -232 -140 146
7493 146 106 -78 -165 87 -136 -257 -38 -50 311 126 124 40 -66 -100 236 -126 41 -77 41 67 279 -120 -72
7516 -72 -5 113 174 98 249 -41 -109 78 -20 -84 31 125 130 93 255 -15 -125 -50 -2 -93 7 -201 17 -110 228
7541 228 157 -35 -253 67 41 -6 88 -13 74 22 -92 90 -175 -79 -220 210 -226 -115 120 110 -78 13 87
7564 87 27 -83 102 -236 38 -49 -108 306 163 26 240 164 246 107 31 -77 -127 8 202 -17 7 120 -33
7587 -33 156 124 206 202 206 -25 294 -284 30 -115 99 281 -130 192 274 68 -47 -49 19 -33 138 -227 228 87
7611 87 -52 -121 113 153 -174 -146 -112 190 103 -45 169 22 -48 102 -73 28 17 91 52 243 254 -112 -42 13
7635 13 110 182 -68 -20 13 -20 -280 148 -137 -147 284 -9 -192 -153 -80 153 -165 169 -324 100 -24 197 50
7658 50 183 189 -42 47 43 -101 -61 48 102 127 16 2 -161 -151 49 92 -106 120 46 116 -25 -22 121 -48 142
7683 142 152 -128 30 -14 336 307 56 28 -85 -136 -176 180 -71 -21 150 35 145 66 -100 175 58 14 -252
7706 -252 274 71 262 -114 47 -43 168 176 77 -108 -168 9 -61 40 77 -211 114 -138 -127 -114 -194 117 39 52
7730 52 8 39 -30 -110 54 196 -36 -39 -300 -208 24 148 -35 -207 -130 -31 -148 -114 -1 99 116 11 57 257
7754 257 41 50 -92 -94 -58 -49 78 56 114 -249 213 345 -29 68 -105 161 -57 6 -109 146 -61 72 -27 -142
7778 -142 -226 45 89 36 -56 27 24 -308 -107 5 -262 114 -34 -10 -138 -171 -169 287 -51 61 215 -45 28 -171
7802 -171 20 33 -191 -199 161 -232 157 -117 -204 -119 165 168 -71 -14 -166 -107 -59 170 69 51 -11 -243 -242 -98 -174
7827 -174 116 76 198 92 -29 2 257 12 -132 27 -101 245 -209 -252 29 -47 -253 -152 -97 -92 30 -127
7849 -127 107 12 139 76 136 298 -52 -124 104 -9 -71 -188 108 48 187 -194 -39 319 -62 55 -83 227
7871 227 133 -83 269 -14 -131 118 15 -90 1 -25 -229 -81 -41 -121 -129 -283 160 38 -26 -230 8 99 -50
7894 -50 126 43 -237 94 171 -138 355 -28 -159 2 -104 35 -32 120 83 -20 44 -122 1 165 -50 -82
7916 -82 -208 -18 -192 133 -70 26 19 -69 -221 209 -89 39 -154 226 53 -186 222 -159 59 -119 4 -51
7938 -51 -70 107 -35 -30 -222 -36 -12 -72 -25 233 -8 -106 -130 56 -196 -164 114 -155 79 90 -170 -53 -107 197
7962 197 252 -181 244 -137 -351 169 130 -128 -27 -25 19 148 -36 210 -119 -31 -65 224 -123 -20 -327 -163
7984 -163 -4 18 347 -179 -110 18 -158 -112 68 47 149 -21 192 -151 -37 129 -105 -162 101 -260 -207 122
8006 122 -128 261 -28 130 -105 -112 36 -52 85 97 175 39 221 -129 42 14 50 96 -88 7 15 24 -212 54
8030 54 -76 -40 137 -76 -135 38 109 212 145 183 -136 -212 -311 29 -127 97 -73 -12 -322 -131 -14 189 7
8053 7 116 262 -254 -140 79 301 -44 63 -37 28 -214 -26 -26 16 -76 0 139 -59 356 -35 -94 -145 85
8076 85 94 77 -84 129 -55 168 -17 -54 -119 240 -11 -132 345 15 90 -8 75 -73 -202 -305 93 334 77
8099 77 163 2 92 254 -345 53 26 117 -49 -87 78 47 -143 113 131 21 -85 -1 321 86 -151 97 13
8122 13 -283 177 104 92 -6 -131 -282 -179 -245 -152 -93 -28 -48 129 234 -110 -35 173 76 -67 96 -49 1 286
8146 286 268 56 -132 -76 127 -4 -318 154 -297 96 -177 284 -48 160 -476 -270 99 -312 240 29 70
8167 70 -188 -29 -20 -35 -141 -84 -53 154 -197 116 -215 -253 51 -15 -413 -71 116 29 246 83 -48 -164 -155 86
8191H6
##END NTUPLES=NMR FID
##END=
