##TITLE=1H_Pr 48-65
 CDCl3
 8 sc, 
 15.11.2022
##JCAMPDX= 6.0         $$ Bruker NMR JCAMP-DX V2.0
##DATA TYPE= NMR FID
##DATA CLASS= NTUPLES
##ORIGIN= UXNMR, Bruker Analytische Messtechnik GmbH
##OWNER= root
$$ XWIN-NMR		Version 3.5
$$ Tue Nov 15 16:19:52 2022 Russian Standard Time (UT+4h)  she@DPX200
##.OBSERVE FREQUENCY= 200.1313499994
##.OBSERVE NUCLEUS= ^1H
##.DELAY= (6, 6)
##.ACQUISITION MODE= SIMULTANEOUS
##.ACQUISITION SCHEME= undefined
##.AVERAGES= 8
##.DIGITISER RES= 18
##SPECTROMETER/DATA SYSTEM= spect
##.PULSE SEQUENCE= zg30
##.SOLVENT NAME= Acetone
##.SHIFT REFERENCE= (INTERNAL, Acetone, 0, 15.7039)
##AUDIT TRAIL= $$ (NUMBER, WHEN, WHO, WHERE, WHAT)
$$ ##TITLE= Audit trail, XWIN-NMR		Version 3.5
$$ ##JCAMPDX= 5.01
$$ ##ORIGIN= Bruker BioSpin GmbH
$$ ##OWNER= she
$$ F:/spectra/data/she/nmr/H-F/1/audita.txt
$$ ##AUDIT TRAIL=  $$ (NUMBER, WHEN, WHO, WHERE, WHAT)
(   1,<2022-11-15 16:18:49.46 +0400>,<she>,<DPX200>,
      <created by zg, POWCHK disabled, PULCHK disabled
       configuration hash MD5:
       00 E9 B6 7A A2 85 ED C7 34 08 36 98 17 FE 4E 26
       data hash MD5: 16K
       E6 09 F0 59 75 51 F4 7E D5 E8 B0 DB BD 82 E0 51>)
$$ ##END=
$$ 
$$ hash MD5
$$ 05 79 D1 79 EA A3 6C 4C DB AE 85 12 A6 B0 74 2F
##$RELAX= 
##$RELAX= 
##$RELAX= 
##$RELAX= 
##$RELAX= 
##$RELAX= 
$$ Bruker specific parameters
$$ --------------------------
##$DU= <F:/spectra>
##$EXPNO= 1
##$NAME= <H-F>
##$PROCNO= 1
##$TYPE= <nmr>
##$USER= <she>
##$AMP= (0..31)
100 100 100 100 100 100 100 100 100 100 100 100 100 100 100 100 100 100 
100 100 100 100 100 100 100 100 100 100 100 100 100 100 
##$AQSEQ= 0
##$AQ_mod= 1
##$AUNM= <au_zg>
##$AUTOPOS= <>
##$BF1= 200.13
##$BF2= 200.13
##$BF3= 200.13
##$BF4= 200.13
##$BF5= 200.13
##$BF6= 200.13
##$BF7= 200.13
##$BF8= 200.13
##$BYTORDA= 1
##$CFDGTYP= 0
##$CFRGTYP= 5
##$CHEMSTR= <none>
##$CNST= (0..31)
1 1 145 1 1 1 1 1 1 1 1 1 1 1 1 1 1 1 1 1 1 1 1 1 1 1 1 1 1 1 1 1 
##$CPDPRG= <>
##$CPDPRG1= <>
##$CPDPRG2= <>
##$CPDPRG3= <>
##$CPDPRG4= <mlev>
##$CPDPRG5= <mlev>
##$CPDPRG6= <mlev>
##$CPDPRG7= <mlev>
##$CPDPRG8= <mlev>
##$CPDPRGB= <>
##$CPDPRGT= <>
##$D= (0..31)
0 1.2 0 0 0 0 0 0 0 0.06 0 0.03 0 0 0 0 0.0002 0 0 0 0 0 0 0 0 0 0 0 0 
0 0 0 
##$DATE= 1668514728
##$DBL= (0..7)
120 120 120 120 120 120 120 120 
##$DBP= (0..7)
150 150 150 150 150 150 150 150 
##$DBP07= 0
##$DBPNAM0= <>
##$DBPNAM1= <>
##$DBPNAM2= <>
##$DBPNAM3= <>
##$DBPNAM4= <>
##$DBPNAM5= <>
##$DBPNAM6= <>
##$DBPNAM7= <>
##$DBPOAL= (0..7)
0.5 0.5 0.5 0.5 0.5 0.5 0.5 0.5 
##$DBPOFFS= (0..7)
0 0 0 0 0 0 0 0 
##$DE= 6
##$DECBNUC= <off>
##$DECIM= 32
##$DECNUC= <off>
##$DECSTAT= 4
##$DIGMOD= 1
##$DIGTYP= 9
##$DL= (0..7)
0 120 120 120 120 120 120 120 
##$DP= (0..7)
150 150 150 150 150 150 150 150 
##$DP07= 0
##$DPNAME0= <>
##$DPNAME1= <>
##$DPNAME2= <>
##$DPNAME3= <>
##$DPNAME4= <>
##$DPNAME5= <>
##$DPNAME6= <>
##$DPNAME7= <>
##$DPOAL= (0..7)
0.5 0.5 0.5 0.5 0.5 0.5 0.5 0.5 
##$DPOFFS= (0..7)
0 0 0 0 0 0 0 0 
##$DQDMODE= 0
##$DR= 18
##$DS= 0
$$ [...]
##$SUBNAM2= <"">
##$SUBNAM3= <"">
##$SUBNAM4= <"">
##$SUBNAM5= <"">
##$SUBNAM6= <"">
##$SUBNAM7= <"">
##$SUBNAM8= <"">
##$SUBNAM9= <"">
##$SW= 18.0517283424941
##$SWIBOX= (0..15)
0 0 2 0 0 0 0 0 0 0 0 0 0 0 0 0 
##$SW_h= 3612.71676300578
##$TD= 16384
##$TD0= 1
##$TE= 0
##$TE2= 300
##$TE3= 300
##$TEG= 300
##$TL= (0..7)
0 120 120 120 120 120 120 120 
##$TP= (0..7)
150 150 150 150 150 150 150 150 
##$TP07= 0
##$TPNAME0= <>
##$TPNAME1= <>
##$TPNAME2= <>
##$TPNAME3= <>
##$TPNAME4= <>
##$TPNAME5= <>
##$TPNAME6= <>
##$TPNAME7= <>
##$TPOAL= (0..7)
0.5 0.5 0.5 0.5 0.5 0.5 0.5 0.5 
##$TPOFFS= (0..7)
0 0 0 0 0 0 0 0 
##$TUNHIN= 0
##$TUNHOUT= 0
##$TUNXOUT= 0
##$USERA1= <user>
##$USERA2= <user>
##$USERA3= <user>
##$USERA4= <user>
##$USERA5= <user>
##$V9= 5
##$VALIST= <valist>
##$VCLIST= <CCCCCCCCCCCCCCC>
##$VD= 0
##$VDLIST= <DDDDDDDDDDDDDDD>
##$VPLIST= <PPPPPPPPPPPPPPP>
##$VTLIST= <TTTTTTTTTTTTTTT>
##$WBST= 1024
##$WBSW= 4
##$XGAIN= (0..3)
0 0 0 0 
##$XL= 0
##$YL= 0
##$YMAX_a= 195954
##$YMIN_a= -315880
##$ZGOPTNS= <>
##$ZL1= 120
##$ZL2= 120
##$ZL3= 120
##$ZL4= 120
##$ABSF1= 10
##$ABSF2= 0
##$ABSG= 5
##$ABSL= 3
##$ALPHA= 0
##$AQORDER= 0
##$ASSFAC= 0
##$ASSFACI= 0
##$ASSFACX= 0
##$ASSWID= 0
##$AUNMP= <proc_1d>
##$AZFE= 0.1
##$AZFW= 0.1
##$BCFW= 1
##$BC_mod= 2
##$BYTORDP= 1
##$COROFFS= 0
##$CY= 11.3945322036743
##$DATMOD= 1
##$DC= 2
##$DFILT= <>
##$DTYPP= 0
##$F1P= 2.36226072786647
##$F2P= -0.459571619588291
##$FCOR= 0.5
##$FTSIZE= 0
##$FT_mod= 4
##$GAMMA= 1
##$GB= 0.15
##$INTBC= 1
##$INTSCL= 1
##$ISEN= 128
##$LB= 0.24
##$LEV0= 0
##$LPBIN= 0
##$MAXI= 10000
##$MC2= 0
##$MEAN= 0
##$ME_mod= 0
##$MI= 1.114404
##$NCOEF= 0
##$NC_proc= 0
##$NLEV= 6
##$NOISF1= 3.799351
##$NOISF2= 2.8
##$NSP= 1
##$NTH_PI= 0
##$NZP= 0
##$OFFSET= 15.70392
##$PC= 1
##$PHC0= -18036.59
##$PHC1= 18.8007
##$PH_mod= 1
##$PKNL= yes
##$PPARMOD= 0
##$PSCAL= 0
##$PSIGN= 0
##$REVERSE= no
##$SF= 200.130013532006
##$SI= 16384
##$SIGF1= 3
##$SIGF2= 2
##$SINO= 400
##$SIOLD= 16384
##$SREGLST= <1H.CDCl3>
##$SSB= 0
##$STSI= 0
##$STSR= 0
##$SW_p= 3612.71676300578
##$SYMM= 0
##$S_DEV= 0
##$TDeff= 0
##$TDoff= 0
##$TI= <>
##$TILT= no
##$TM1= 0
##$TM2= 0
##$TOPLEV= 0
##$USERP1= <user>
##$USERP2= <user>
##$USERP3= <user>
##$USERP4= <user>
##$USERP5= <user>
##$WDW= 1
##$XDIM= 8192
##$YMAX_p= 0
##$YMIN_p= 0
$$ End of Bruker specific parameters
$$ ---------------------------------
##NTUPLES= NMR FID
##VAR_NAME=  TIME,          FID/REAL,        FID/IMAG
##SYMBOL=    X,             R,               I
##VAR_TYPE=  INDEPENDENT,   DEPENDENT,       DEPENDENT
##VAR_FORM=  AFFN,          ASDF,            ASDF
##VAR_DIM=   8192,          8192,            8192
##UNITS=     SECONDS,       ARBITRARY UNITS, ARBITRARY UNITS
##FACTOR=    0.0002768,     1,               1
##FIRST=     0,             0,               0
##LAST=      2.2672688,     0,               0
##MIN=       0,             -315880,         0
##MAX=       2.2672688,     195954,          0
$$ Real data points
##PAGE= N=1
##DATA TABLE= (X++(R..R)), XYDATA
0 0 0 0 0 0 0 0 0 0 0 0 -5 8 -8 8 -11 16 -16 24 -32 32 -40 48 -59 72 -80 96 -112 128 -151 171 -197 224 -255
33 -255 288 -326 367 -413 462 -517 575 -643 715 -791 876 -970 1071 -1183 1305 -1436 1584
50 1584 -1744 1921 -2117 2336 -2579 2854 -3168 3526 -3943 4431 -5018 5733 -6631 7794 -9371
65 -9371 11636 -15186 21566 -36619 149939 -26372 -243909 165854 124417 -102488 6386
76 6386 83410 -141277 -42879 146301 -45256 -183787 61575 93455 -87586 -28916 83390
87 83390 -16487 -7320 64623 -47258 -88097 85260 71409 -89682 -37560 62014 -20739 -26036
99 -26036 58354 -9274 -69736 46818 77408 -28381 -24876 31347 -18637 -27991 41173 6966
111 6966 -59578 1680 43736 -28937 -46480 25342 28817 -28712 -18751 32200 21335 -16365 -3360
124 -3360 13581 -13779 -16179 31580 26176 -35716 -19875 40036 5023 -42113 9029 31529 -24609
137 -24609 -19965 27537 5788 -20556 4714 -2385 -15948 28959 27949 -31692 -6955 40945 -8075
150 -8075 -29611 24668 7035 -37318 10587 23760 -42646 -17073 44643 -19032 -51787 37923
162 37923 38366 -41531 -1347 44738 -23173 -23610 49851 4345 -49026 27656 39876 -48667 -15097
175 -15097 56927 -15405 -52230 35639 33003 -40226 -1189 33664 -29932 -22698 41292 -4817
187 -4817 -48026 19907 27942 -39023 -10310 35932 -13951 -23610 33766 12009 -28792 20029 32098
200 32098 -30985 -14324 40842 157 -32752 17199 17466 -28606 -3909 26293 -14225 -23307 20131
213 20131 8467 -23881 3913 17022 -19203 -13589 19648 2463 -18129 6902 14440 -10361
225 -10361 -4820 15491 1476 -10620 7917 9910 -8217 -2254 10265 -3599 -12281 5093 9119
238 9119 -8727 -5691 10254 528 -9819 4156 6812 -8234 -1820 10331 -4950 -11654 9287
251 9287 6310 -17412 -3235 16740 -4487 -12550 11575 5442 -13649 5770 14872 -13204 -7574
264 -7574 21276 1011 -20593 9830 15327 -16578 -4871 19003 -6343 -14717 16660 6619 -21831
277 -21831 3366 18692 -14942 -12842 18732 -932 -20395 9758 11736 -19152 -2869 20272
289 20272 -7655 -14449 17604 6417 -18612 7106 17801 -13811 -7165 20436 -941 -17006
301 -17006 11383 10910 -16822 -1163 16440 -9321 -12892 14580 2941 -18044 3671 12343 -12249
314 -12249 -7754 13050 -1621 -13276 7621 7729 -11589 -1200 12723 -4123 -8456 10047 4988
327 4988 -9217 2152 9438 -5261 -4965 9069 1090 -8373 3165 6336 -6617 -3683 7117 -1127
341 -1127 -7617 2931 4642 -7203 -3312 6503 -1334 -7579 3717 4317 -6470 -1301 7490 -1865
355 -1865 -6207 6151 5328 -6969 -69 9312 -2676 -6001 7465 3113 -8115 1931 8375 -6068
369 -6068 -6243 8793 686 -10590 3209 6514 -8427 -3272 9071 -2926 -9436 6948 4920 -10192
383 -10192 -397 9733 -5128 -6361 9595 1258 -9865 6002 9485 -8379 -2831 11633 -1131
396 -1131 -8997 7004 4703 -10294 1062 9396 -7381 -7622 9716 1153 -10799 2699 7123 -7604
410 -7604 -3239 8609 -3219 -7739 7668 4282 -9299 506 9179 -3812 -5075 7595 1493 -6925
424 -6925 4216 6556 -6067 -2308 7833 -943 -6840 3672 3817 -5951 -1322 5099 -2630 -4646
438 -4646 4244 1337 -5847 1009 4777 -3673 -3390 4906 586 -5421 1034 4587 -3304 -2615 5196 532
454 532 -4251 3216 4133 -4168 -1324 5561 284 -4895 2294 3188 -3439 -611 3583 -2821 -3093 5061
470 5061 926 -6922 728 5463 -3333 -4013 4275 -53 -5452 2929 4040 -5865 -1986 6992 272
485 272 -5335 3492 4269 -3687 129 4923 -2372 -2550 5301 56 -6422 2267 4923 -4639 -3382 4678
501 4678 -1039 -4469 3756 1962 -6845 -925 7066 -1999 -5902 3300 2823 -4083 694 3908 -3142
516 -3142 -1249 5337 -660 -4430 4336 3963 -4955 -1454 5058 -1279 -3254 3679 366 -5945 1851
531 1851 5824 -4482 -4897 4773 2142 -4537 611 2623 -3602 -1795 4114 -598 -3873 2378 2142
546 2142 -3157 497 3608 -1811 -2233 3553 600 -3246 2045 3555 -3222 -2051 3844 511 -2928
561 -2928 1321 1648 -3171 -503 3612 -740 -3804 703 1663 -1780 -129 1056 -2428 -1410 2938 528
577 528 -3704 585 3249 -1094 -1684 2885 766 -2614 2019 3227 -2246 -1714 3728 548 -3542 587
593 587 2338 -1617 -773 2097 -1449 -2347 2202 1076 -3383 -558 2719 -1123 -1551 2078 -926 -2902
609 -2902 2674 2784 -3924 -754 4950 41 -3056 2047 1759 -2270 1327 3164 -2696 -2124 3908 630
625 630 -4048 992 2218 -2873 -796 2747 -1539 -2726 2307 822 -3534 370 3230 -2005 -2382 3055
641 3055 866 -2803 1094 2162 -1748 -504 2657 -290 -1768 1919 986 -2206 621 2194 -1184
656 -1184 -1993 1432 581 -1912 460 1170 -1760 -1078 2212 -136 -2652 381 1258 -1377 -831 1378 -225
673 -225 -1594 1367 1557 -1550 -560 1924 -105 -1177 1256 1083 -1689 232 1783 -794 -1376 1995
689 1995 675 -2411 78 1538 -968 -1052 1302 -493 -2110 993 1348 -2456 -679 2140 -629 -1700
705 -1700 1611 666 -1730 537 1929 -1452 -1025 2051 337 -1768 1160 1759 -1504 -377 1888 -466
721 -466 -1502 1345 911 -1872 -23 1875 -1252 -1371 1867 336 -2023 751 1322 -1577 -637 1624
737 1624 -214 -1557 1147 949 -1616 52 2017 -723 -1377 1667 760 -1332 375 1291 -1007 -843
753 -843 1408 -25 -1647 746 747 -1634 -442 1244 -724 -1483 852 785 -1158 -166 1244 -851 -1005
770 -1005 1236 50 -1256 610 1234 -928 -389 1491 282 -913 839 1282 -1094 -152 1297 -413
786 -413 -1030 835 437 -1306 24 991 -733 -846 1090 -28 -1291 288 848 -1068 -412 1122 -368
803 -368 -1123 873 731 -1062 24 1182 -424 -913 1289 578 -799 535 918 -1019 -603 1046 234
820 234 -1326 276 845 -977 -501 1201 -16 -1059 798 499 -938 -79 1040 -737 -840 1042 492
837 492 -1027 326 1101 -532 -392 1156 235 -904 963 844 -1146 -114 883 -501 -768 901 38
854 38 -1328 62 879 -624 -667 953 -324 -919 277 330 -864 -277 912 -132 -736 726 354 -843
872 -843 374 1100 -385 -436 935 375 -620 351 785 -929 -567 803 92 -1030 525 400 -724 -246
890 -246 1081 -244 -835 552 167 -915 156 621 -459 -563 597 214 -561 332 666 -433 -226 924
908 924 -50 -590 665 538 -621 111 875 -155 -690 800 31 -576 68 543 -562 -642 845 174 -671
927 -671 144 475 -440 -194 805 32 -737 536 817 -566 124 549 -221 -533 547 109 -639 198 762
946 762 -435 -129 765 -211 -746 263 254 -634 -114 713 -513 -571 703 92 -653 -32 871 -419 -216 862
966 862 172 -500 444 657 -235 -318 650 28 -354 519 145 -718 -110 551 -320 -340 424 -16 -569 109 366
987 366 -533 -305 557 77 -517 202 357 -559 -421 680 71 -439 271 397 -439 32 824 -328 -379 390
1007 390 145 -379 335 403 -561 -303 530 -123 -720 164 9 -448 7 478 -299 -640 428 288 -564 31
1027 31 690 -415 -169 505 164 -350 256 -44 -43 58 508 -131 -586 238 188 -306 67 253 -233 -113 542
1048 542 -158 -604 158 567 -241 -232 381 -117 -532 166 201 -99 -374 238 -299 -63 422 324 -358 143 599
1069 599 -22 -208 293 200 -480 -120 259 -384 -203 189 42 -363 -21 292 -39 -282 317 100 -464 192
1089 192 129 -244 -235 101 -475 -286 455 86 -458 357 328 -204 0 432 191 -48 485 470 -719 -292 374
1110 374 -414 -247 417 -87 -302 0 180 -303 -241 216 -85 -647 156 383 -180 3 212 -98 -469 327
1130 327 220 -172 232 139 -76 -168 415 175 -237 -122 92 -334 -211 282 -11 -332 148 287 -326 45 60
1151 60 -168 -179 67 337 -344 -57 431 -241 -88 435 -125 -456 -153 406 -10 -106 356 -9 -304 126 240
1172 240 -270 171 208 -535 -333 304 -235 -57 -68 249 -179 -79 230 127 -224 340 16 -323 -119 319 -173
1193 -173 -159 403 -13 -226 190 302 -205 24 233 -64 -325 218 382 -268 -84 385 11 -91 153 -92
1213 -92 -305 -223 279 -294 -469 105 181 -354 -142 224 -117 -99 510 219 4 265 26 -57 17 300 -11 -234
1235 -234 216 163 -318 176 298 -308 -319 260 -117 -160 1 18 33 -85 270 -140 -254 228 84 -130 109 191
1257 191 48 -29 287 210 -213 105 39 -208 -413 125 219 -388 305 270 -131 108 115 -148 -299 240 203 -518 -99
1280 -99 147 -117 -101 251 88 -203 5 395 -105 -265 218 63 -19 183 79 -249 -40 57 -96 -215 293
1301 293 34 -299 182 199 52 -241 144 -94 -9 47 29 -133 106 284 42 -173 197 26 -45 321 139 -22
1323 -22 -91 -67 -16 -136 -55 179 -124 46 -27 174 -244 143 12 -305 -276 185 -44 -381 95 156 -294 -120 38
1346 38 -185 79 283 -118 -167 10 287 -167 83 394 61 -53 -15 152 -208 124 253 -30 154 58 -132
1367 -132 -196 -169 89 -126 52 120 -82 -454 -10 94 -85 -109 61 -221 -239 192 212 -316 -53 287 196 -147
1389 -147 458 190 -26 44 -106 -179 164 201 -173 -212 59 92 37 -34 144 122 127 34 159 -104 -162 249 -333 -337 195
1414 195 -29 -328 -28 -18 40 -210 319 -45 -38 263 320 -77 -62 337 -54 -147 56 -225 -321 19 -125 -201 -204 -33
1438 -33 -147 -118 96 246 -212 82 -98 -276 -125 120 13 -117 -119 135 -8 -126 227 80 -95 -128 54 -203
1460 -203 56 189 -110 -211 -66 -86 124 137 297 84 -128 -207 -121 -14 -56 106 -67 -267 124 60 -208 161
1482 161 160 -18 -76 180 226 -253 317 114 -249 -174 150 -143 -210 180 100 -31 -8 -148 -299 -125 79 140 -129
1505 -129 -56 168 -171 -26 99 -128 -273 -133 143 -10 170 301 -95 -176 199 41 -53 110 208 -158 -235 -28
1527 -28 118 -131 240 86 73 -250 220 -147 -144 263 179 -221 86 82 -40 -60 243 243 -54 184 157 -48 -78 133
1551 133 174 54 184 152 139 -201 -93 -294 108 248 -196 -439 -167 69 -166 -199 100 -287 -117 -31 173 -54
1573 -54 -266 143 7 -246 119 104 -86 146 -94 119 -294 26 273 -62 -179 246 -4 102 146 -54 149
1594 149 223 67 -145 112 50 -126 39 222 -114 -65 -49 -163 -104 -40 46 -116 -211 106 119 -88 107 466 -33
1617 -33 -145 2 121 117 35 -142 -133 -221 56 76 -284 87 11 -95 -260 -244 -71 -174 -88 195 -76 -45 245 -24
1641 -24 -90 -51 238 -13 -19 165 -49 165 370 -44 187 -137 270 -268 -54 308 -1 164 -18 72 76 15 -26
1664 -26 -95 -256 126 -211 -193 78 303 -194 -254 175 164 -202 376 19 -231 -105 94 216 -4 -47 -58 -289
1686 -289 24 119 -7 -51 -49 -84 -168 80 -36 -66 95 -225 -346 -69 29 196 235 -265 190 -41 19 220 332
1709 332 195 -49 36 13 20 438 66 -247 -98 -74 -29 108 -15 92 -287 -44 -125 -46 -105 198 -162 -138 -63 191
1733 191 -311 -16 59 136 81 238 -27 -135 -37 -95 109 -54 193 234 -52 365 -14 -179 334 -62 -81 -34 170
1756 170 -36 308 -11 104 -109 31 -119 -254 97 19 -38 -39 92 110 -33 349 -175 183 -26 -93 114 -52
1778 -52 -165 301 253 68 -151 -74 121 177 87 -64 -101 3 -139 -130 21 -75 135 -106 147 17 -261 -64 347
1801 347 53 -85 137 47 36 194 35 -59 134 8 -300 98 35 -52 -295 -8 176 -95 -22 196 -143 198
1823 198 95 11 -23 -125 -25 -207 -240 21 53 -106 103 -91 -123 -106 151 -88 148 99 103 -94 -37 -83 36 -173
1847 -173 -81 166 -138 76 234 -133 -295 46 165 -106 -111 -87 39 -224 104 -153 190 40 140 -174 -12
1868 -12 -146 -35 -83 229 65 -162 239 389 -18 -79 132 53 -3 -246 -100 71 -394 116 55 -172 51 -123
1890 -123 -159 -152 291 434 -191 -43 -144 7 18 286 178 -122 -336 24 -131 -137 99 212 -23 -163 164 -295
1912 -295 -26 -54 -15 -51 -158 -238 53 13 53 92 118 -118 -132 168 105 41 5 -76 177 -101 -62 178 570 -158 -38
1937 -38 162 -225 -111 137 155 -70 43 60 -14 -190 17 -115 -125 26 51 10 -194 139 -170 -17 -26 105 -174
1960 -174 -7 -3 -78 -215 40 7 167 155 69 159 3 -250 30 -26 -50 -163 -166 -159 271 -140 -188 -42 -19 -256 -98
1985 -98 63 -244 30 -11 -173 41 89 98 -24 117 89 -8 -177 -52 -126 178 -214 -187 30 -217 121 -102 -220
2008 -220 106 -159 -95 83 30 4 -31 244 -156 -96 -80 12 -17 51 -231 40 -76 9 -61 22 196 112 -66 -89 114
2033 114 -134 22 325 103 -72 -66 68 -54 -95 -30 82 -84 128 4 127 -86 344 54 15 127 85 -46
2055 -46 54 233 -35 108 -38 107 133 80 -43 153 -102 358 -62 195 -76 221 -29 -46 151 94 120 -21
2077 -21 -135 26 152 64 -83 -147 137 8 54 -64 24 -38 -402 -16 13 -266 -94 113 -93 -174 88 -71 -94
2100 -94 -89 126 -91 47 138 272 23 72 107 -33 39 26 424 167 -30 39 -334 -12 11 -44 -71 -96 308 122
2124 122 11 61 119 14 127 -244 19 120 233 84 -83 90 -144 -113 23 -107 -80 150 27 82 -39 -170
2146 -170 -99 -145 -177 -76 -170 -5 31 -166 -42 102 134 -127 93 38 -185 -78 -54 -33 13 -57 316 206 31 148
2170 148 163 -37 25 -69 -4 -106 220 284 109 -111 -55 -168 148 -100 -115 -12 124 -3 53 -16 -46 82 -72
2193 -72 139 -46 234 113 -416 -89 94 -74 -117 -129 39 -5 127 151 341 -242 -45 -106 51 -46 264 -146
2215 -146 -63 -49 133 57 -124 58 19 244 42 247 -72 192 164 98 -47 140 152 66 122 12 37 146 45
2238 45 -19 130 139 294 166 -34 -7 144 -65 27 95 -86 60 -154 -207 255 -32 357 179 26 51 -217 -55
2261 -55 -319 4 -121 63 111 52 -75 2 -82 47 78 257 88 -267 15 27 88 -152 89 -174 -184 -15 224
2284 224 -64 82 175 -9 -14 51 -33 94 246 -8 -234 -167 -14 -454 1 127 130 -115 -9 -148 25 -1 -113
2307 -113 203 68 -95 -126 -123 -72 25 11 -45 -124 -179 -66 74 94 7 -271 24 -132 -166 -131 160 -58 -25 131 98
2332 98 169 -158 -189 164 -16 70 -136 94 -42 1 -37 -11 77 48 -144 -8 70 24 144 78 -165 213 62 -89
2356 -89 -106 -66 -35 -136 -261 -40 -95 -282 -92 63 -249 -114 105 184 110 -135 0 150 47 163 -19 12 -134
2379 -134 -174 -169 33 213 -98 -9 -55 -82 -20 261 96 -4 -122 69 -74 -184 -64 -180 89 199 102 -178 -81
2402 -81 -83 -73 22 -58 115 -15 -145 -132 -67 152 -142 123 38 97 227 -183 -42 -217 85 60 167 8 -125 8
2426 8 -392 -13 112 -53 -72 361 197 -119 -199 131 184 204 52 -24 89 -42 39 -156 -122 21 24 7 -183 137
2450 137 -40 -11 -81 18 -42 -107 110 63 37 83 -73 189 -69 -128 -133 -168 -15 -202 35 174 -187 285 323 177
2474 177 9 -224 -23 0 -338 24 89 -62 -31 228 -99 -3 -36 -185 209 -12 18 174 182 30 -34 -45 39 2
2498 2 -30 -64 110 -82 78 90 227 42 -170 168 313 -45 -28 79 49 60 -1 102 50 -107 58 53 55 138 102
2523 102 -58 172 148 -23 126 51 -65 -1 -145 131 48 -140 24 -62 -127 -196 221 73 186 -78 145 191 -49
2546 -49 114 106 -97 -27 -254 81 250 -271 72 66 35 -122 12 -59 202 -38 0 -25 -90 209 -112 10 -36 7
2570 7 65 -152 -32 -8 -196 53 -213 -91 5 -235 68 161 -147 56 -68 59 64 177 -205 -369 275 -135 152
2593 152 140 -92 -94 32 -134 30 -2 -168 -92 58 -124 17 -1 -223 81 -216 45 161 -226 -434 17 7
2615 7 52 -141 -341 -32 -59 -89 146 20 47 -162 103 -60 -9 -99 92 120 -53 -7 -33 47 87 -83 82 -15 -10
2640 -10 108 -95 -83 231 -218 -100 41 53 17 152 -199 -53 74 25 10 -103 -297 150 18 74 252 98
2662 98 -85 -93 170 6 -122 -292 -16 43 157 171 -7 -20 -72 -104 -28 -136 -37 -134 -93 30 -69 -129 98 77 -113
2687 -113 -67 -447 -239 156 -8 26 -25 153 117 -59 -115 59 -255 -7 -81 9 -81 69 -35 -115 95 -49 -26
2710 -26 -377 -40 24 -205 -15 145 56 -217 -58 0 -58 -104 -79 -108 50 -203 53 15 -90 -84 -133 -217 127 -186
2734 -186 -146 -36 -129 186 202 27 -79 -157 130 -201 103 180 -31 -114 86 -120 -42 55 77 207 -134 131 -3
2757 -3 217 12 -90 111 62 -185 48 114 61 157 40 -55 -124 -329 -163 -127 36 52 126 -267 51 77 183 85
2781 85 -101 -73 -34 170 -54 -104 12 1 135 264 84 -134 -118 -62 12 183 -321 -20 -51 122 31 -24 -309 60
2805 60 318 294 76 -58 -28 99 -35 -12 41 -21 133 243 146 -57 106 -68 -5 -235 -147 -73 52 -151 -124 -74
2829 -74 -53 62 -98 -67 26 43 -169 90 -3 -97 -78 -11 93 110 -54 -174 315 288 -10 -21 -32 89 -173 43
2853 43 224 54 179 -55 -46 7 -115 -37 64 -4 128 -18 21 -85 57 7 32 60 -207 -57 0 121 36 -99
2877 -99 51 -39 40 -36 39 -44 -96 -73 127 -199 -309 -11 25 -50 210 138 225 106 -81 165 118 -33 8 45 -35
2902 -35 61 210 7 132 231 -159 -51 -125 -41 -98 180 -41 133 -144 290 -261 -128 97 196 178 62 87 293
2925 293 -60 -40 140 -47 26 203 -97 172 166 -141 15 86 75 313 59 -168 21 195 121 -66 35 -14 22
2948 22 165 199 214 -159 74 115 60 -54 55 -94 -110 150 182 -116 45 -115 -46 67 84 -29 -52 -74 -44 -8
2972 -8 137 6 -81 118 -19 229 -13 -126 94 80 194 117 -84 -54 64 33 25 -89 -73 6 -48 -164 -142 47
2996 47 14 86 -213 -138 -24 -165 33 -42 167 -190 -86 -247 -75 97 28 78 79 11 -14 68 -201 -100 -137 49
3020 49 -60 170 -99 156 5 27 45 183 -179 -143 12 56 5 45 60 -191 -94 267 99 -82 175 0 -80
3043 -80 -121 -185 -69 -35 -24 -14 -116 -290 101 -267 9 -189 223 39 87 -13 -90 -96 -113 230 -68 116 -53 63
3067 63 -67 158 27 -34 -380 -74 162 24 -154 -150 -288 0 48 -41 136 33 -145 -117 28 1 -78 0 -68 -47
3091 -47 -98 -229 -277 -139 68 56 98 18 -126 -242 -122 240 -156 -95 160 -81 -229 -116 -120 11 -164 36 -82
3114 -82 8 -41 -223 -83 212 89 -208 25 -25 -107 -56 -133 -133 130 52 -54 -41 -57 26 -152 122 131 72 -44 -210
3139 -210 185 -315 74 -175 -82 21 -288 -268 191 -22 -80 -177 91 8 136 -37 130 240 -6 -58 -125 -187 30
3162 30 -107 -82 -32 107 100 -169 89 110 170 -94 51 112 -126 -13 -37 -103 -94 -86 -71 287 91 238 138 14 -46
3187 -46 -24 106 20 -91 40 220 12 169 171 -145 74 -183 -110 185 43 -44 55 28 280 50 92 14 0 244
3211 244 -15 -41 -20 3 308 31 -337 -213 50 -119 -10 -213 -35 -83 236 -99 -26 -52 -99 -72 29 53 -67
3234 -67 -55 84 369 -45 21 -102 233 -19 -114 -62 78 -60 24 152 -187 222 117 100 142 7 39 -96 -206
3257 -206 111 -55 -135 -14 77 106 10 79 99 74 -9 -48 -43 -47 -10 98 -268 115 -17 243 34 168 158 67 -15 66
3283 66 37 173 45 65 -85 -173 259 62 -176 -22 -96 275 -105 -167 -167 -94 212 -72 18 60 -155 -35 174 -90
3307 -90 -8 54 -157 -200 116 53 182 -95 161 147 -18 -71 -75 51 -48 -113 -145 110 9 45 27 -17 -25 -51 72 -1
3333 -1 35 -124 113 -132 -134 40 -148 188 -120 -230 -206 -191 80 -192 -130 -186 -82 127 157 144 -220 -43 64 35
3357 35 -43 74 -94 153 -13 -111 -24 -262 0 -99 89 386 -13 32 216 133 -273 84 -273 29 80 17 261
3380 261 46 66 -9 -169 197 89 -32 19 -164 81 -106 4 -24 -98 130 94 154 87 139 -119 118 -88 -33
3403 -33 -92 -52 -42 101 -143 -57 48 114 49 -99 10 -71 -42 149 78 -63 -120 4 116 231 163 -51 -226 -21
3427 -21 -164 112 186 -193 90 16 106 124 44 -41 199 -154 -73 94 56 205 15 232 -158 147 207 -40 258
3450 258 -263 -81 -146 56 -120 66 62 -7 115 121 234 -88 118 161 251 32 46 -365 -23 80 -47 -140 -19
3473 -19 -26 150 -162 -313 -161 60 168 42 8 112 -67 -63 -36 218 14 112 0 293 215 -186 231 -6 235
3496 235 -7 -80 -239 120 82 62 -162 27 -119 135 25 84 16 -140 -79 -22 -71 20 -99 -118 -46 -33 28 -325
3520 -325 104 221 9 -217 -46 -252 -16 82 69 68 -135 49 73 116 -32 -70 -54 108 -191 293 -66 51 -114
3543 -114 51 -27 179 -116 -38 35 68 322 -101 50 45 -101 41 74 -272 85 85 -134 -7 102 -49 -196 -53
3566 -53 102 -79 135 -38 -191 143 57 -219 -157 -108 126 43 -130 104 -50 -33 171 94 -114 35 -43 17 18 22
3590 22 -27 165 77 -106 82 10 21 14 -473 -265 -56 -234 58 169 46 7 -3 -9 -92 -46 -120 -10 -7 -190 3
3615 3 -188 260 -94 2 8 326 -36 -75 48 -43 59 117 -81 -78 253 -82 76 -63 177 4 70 32 133 -193
3639 -193 62 -41 -83 34 222 65 -233 89 -3 -36 -29 15 162 -52 103 -80 -51 50 80 -89 -32 -24 52 267
3663 267 264 -6 105 -84 25 118 -5 125 -111 -9 232 -36 -46 -18 -11 -84 195 -86 -194 -20 224 -20 -11
3686 -11 13 -142 -59 21 139 -226 61 119 12 -71 145 -111 54 39 74 82 103 58 59 8 -97 183 -181 -46 25
3711 25 -6 46 38 -25 -72 200 -146 59 92 -144 92 67 -18 8 65 76 -237 62 -65 -112 21 -155 95 187 -47
3736 -47 7 -50 -289 -245 -114 71 -70 160 129 -355 94 -206 78 -13 113 342 -14 38 65 98 -13 -118 -105
3759 -105 214 -37 83 226 -170 -67 -64 -258 -152 -116 155 92 10 183 -107 112 -81 -311 -37 44 50 -46 -176
3782 -176 40 -30 -72 -266 -271 151 86 17 30 -237 48 107 -94 154 33 -307 -218 43 -129 156 -188 154 1
3805 1 -15 -12 -117 -160 277 148 -234 65 86 174 -174 43 -74 88 -73 38 127 29 -272 51 144 147 -38 -132 -238
3830 -238 223 -75 -78 19 121 124 -213 230 2 132 -74 -79 -52 -50 -137 152 -78 207 60 77 -57 334 51 288
3854 288 55 -213 -172 -250 74 -128 -60 -42 89 -108 84 14 -213 84 71 -132 -28 -443 -93 155 -161 78
3876 78 -149 16 -79 -97 117 -79 -194 133 -86 -238 -31 130 -206 -84 18 -93 151 -92 168 31 272
3897 272 133 1 7 -46 93 72 -77 -331 -240 17 220 -112 -151 -77 96 -124 -114 28 -162 205 57 -106 2
3920 2 25 -172 117 -66 -104 55 -49 105 88 -85 -172 -99 -243 26 120 39 49 85 -24 -248 -148 -136 89 58
3944 58 92 169 2 -205 159 48 120 -157 -142 -113 -190 -109 -263 -130 296 -39 -6 82 161 228 94 34 13 -54 144
3969 144 161 -249 -34 96 204 -244 -207 26 73 -81 249 85 -276 196 -190 47 49 9 14 68 -172 -30 -129
3992 -129 -10 4 148 -1 14 11 -53 -97 -161 150 -4 361 56 246 -144 -62 -353 154 37 -23 130 -73 214
4015 214 -168 -32 -118 -193 143 -47 -99 16 -234 39 7 182 -134 149 20 24 -111 -38 -152 59 -61 -23 132
4038 132 -9 -183 68 55 -153 176 19 91 126 207 53 -19 324 62 86 -162 -34 -68 118 -106 -138 45 35
4061 35 30 -148 -214 112 20 -169 -26 -53 -222 25 175 -86 -195 -175 8 -69 -145 -43 185 -222 102 73 -5 -140
4085 -140 -208 -32 54 -21 -146 8 -153 -17 -108 -78 136 149 147 -168 -87 69 -3 -58 29 -150 164 202 -40 -153
4109 -153 34 149 -85 39 -18 -205 -50 10 49 -91 -319 -117 69 -12 -5 -5 -129 -274 -186 3 -22 -170 -246 -80
4133 -80 47 -137 7 182 -267 194 201 185 30 208 -193 77 46 31 31 -79 38 -18 131 91 -117 -37 266 179
4157 179 24 177 -225 -70 -113 149 134 -129 96 89 -6 -239 15 8 -146 88 -115 31 -32 77 307 123 -208
4180 -208 -155 83 42 -193 85 272 3 140 35 -181 90 115 8 -8 -59 -303 -13 -157 407 -69 -186 -141
4202 -141 -201 6 -12 -209 -261 -184 -4 309 116 -63 50 242 17 88 -68 -152 -16 -60 303 -130 208 10
4224 10 142 -65 226 13 10 -80 33 97 -221 -203 -148 -31 -10 -54 -117 206 -104 84 -7 2 -86 134 12 -138 -155
4249 -155 -121 -157 -157 -55 279 135 -65 40 74 -191 149 -236 238 207 288 -297 71 42 20 90 -88 -97 -52 114
4273 114 88 -132 -146 120 -196 28 122 -90 93 112 132 -131 25 34 -181 135 88 35 -89 -23 -175 -15 31 71
4297 71 -341 -310 -69 -196 188 12 140 -130 -58 -87 -55 22 121 -14 -37 90 125 -185 -105 100 47 -58 52 216
4321 216 -259 -83 -127 34 61 -20 254 -46 155 135 -86 -24 -84 -97 -165 182 -137 -40 75 36 -143 -155 31 185
4345 185 -309 -94 55 -56 63 288 142 5 242 -131 205 5 -160 7 -81 -333 -18 243 -105 -316
4365 -316 25 22 -214 -6 56 -29 121 27 -172 -152 -7 77 -27 -231 28 -185 -278 -269 163 -336 -233 208 -116
4388 -116 96 81 50 -35 169 21 -197 -33 -83 197 -157 132 338 16 -1 142 107 50 9 111 -63 -111 -70
4411 -70 37 36 -143 -7 66 58 11 -148 -120 -107 -200 282 42 142 -63 -158 50 -126 -38 153 -45 69 -43 74
4435 74 -91 214 -82 -366 -40 132 36 9 262 -3 158 29 70 -23 -2 -83 -68 -91 162 -96 -15 -145 -174 70
4459 70 -62 -364 46 127 5 42 -75 213 -112 53 37 105 -61 64 135 28 110 -200 0 -127 74 -59
4481 -59 -103 -25 -46 12 12 168 59 186 182 132 138 -49 -138 -34 -56 18 42 96 -31 -131 -119 156 26 -149 169 124
4507 124 212 263 59 285 -92 -256 -99 -235 136 -90 -124 11 -97 -58 187 248 62 84 -121 92 -303 -122
4529 -122 9 -151 66 51 -99 69 52 53 117 -108 -304 151 30 -77 -305 -151 -243 161 163 53 141 21 -26
4552 -26 46 77 -226 163 -71 -43 173 266 -42 -48 -95 144 -53 -230 -84 25 288 -80 -379 78 143 -188 156
4575 156 -24 -129 15 -83 -73 7 107 128 43 153 -89 263 -98 -41 113 179 89 -134 45 -63 -31 69 -12
4598 -12 -153 -124 -189 -17 180 106 162 1 225 -314 246 -31 117 -87 65 -53 -211 -107 -154 -128 177 30
4620 30 38 108 -53 -117 59 -228 105 70 65 179 -77 -177 -158 -182 33 79 -131 219 -34 -143 -88 -139 -227 69 43
4645 43 -297 -117 56 112 -109 -114 -241 134 118 -37 -26 -114 -125 10 -45 152 135 -30 -9 22 133 173 71 49 -84
4670 -84 -278 157 42 -110 -186 -161 66 -26 223 -54 -134 108 44 138 -82 80 104 -147 -31 7 90 -105 -270
4693 -270 144 -169 27 -263 158 24 31 -185 -92 -8 141 -84 80 -95 165 -7 113 1 -90 -106 168 -103
4715 -103 -15 -2 29 -135 -26 208 -57 -73 83 -34 -138 -19 71 87 -74 86 78 350 194 -128 -169 -145 119
4738 119 67 -187 99 -5 -127 162 144 -74 89 -16 143 22 127 -257 -64 -59 88 -134 -153 29 219 -127
4760 -127 21 202 5 -92 -92 -25 145 -102 -112 -59 41 265 39 -133 -203 -91 74 -76 -85 -88 89 -132 -151 19
4784 19 -122 -270 113 85 51 141 110 116 -114 116 87 96 -64 -33 -62 -130 -99 42 45 -85 143 173 -121 -222 -65 224
4810 224 56 84 -52 120 -85 53 120 -177 -55 -26 -56 76 137 179 99 16 -203 75 -171 125 -173 -244 156
4833 156 220 121 90 180 22 -128 -81 -14 -23 -250 -6 -16 8 -32 -85 73 -337 163 28 102 49 268 175 -283 -111
4858 -111 -256 -195 116 3 130 309 -54 13 -106 157 12 -140 7 21 -19 -229 -212 256 18 58 -158 -177
4880 -177 241 -87 58 73 15 142 -86 -65 131 51 69 -66 263 -63 -107 6 102 -34 178 -392 -10 86 -175
4903 -175 -148 -147 124 202 -99 -48 -228 221 96 -66 -75 -129 1 -18 73 38 127 59 -55 -111 -42 66 61 -213 78 108
4929 108 -14 -70 50 -192 -54 150 -71 -84 46 6 -72 -139 -285 -13 287 -168 -81 316 88 21 214 233 -161
4952 -161 168 -70 55 -208 -145 -238 59 8 -32 -33 95 116 103 -118 -1 95 -68 -100 34 219 172 367 -175 -176
4976 -176 28 -16 -424 -32 -48 -411 -188 130 -205 -21 -82 116 -100 -157 -218 -28 -59 -53 274 -52 -111 20 35
4999 35 -156 111 -88 87 35 113 -193 -298 113 3 40 54 149 -27 139 144 -13 82 158 -78 -217 118 196 84
5023 84 -16 -232 -294 -67 141 -46 -71 -19 -108 -109 -31 -26 -126 45 -133 78 -27 103 0 56 278 41 115 -37
5047 -37 55 88 -87 -170 53 -93 -179 -92 47 190 263 77 -57 -67 -134 -238 -207 78 -100 -89 -283 -81 31 -230
5071 -230 391 -94 170 84 142 390 -165 -164 -26 -215 -93 -145 23 173 -306 -114 36 129 77 7 78 -125 -104
5094 -104 -21 6 59 70 6 172 162 -146 100 -84 55 -164 0 115 228 -122 348 128 -37 -152 -126 -184 -125
5117 -125 172 23 19 -185 -14 56 -55 147 53 -185 97 -272 105 199 148 -24 256 -104 -125 -26 108 320 -229
5140 -229 165 54 -72 -62 143 -51 -3 73 -31 -54 145 -14 20 130 52 45 -118 -17 141 14 -5 168 192
5163 192 -261 -10 -78 -22 102 -128 119 -55 -383 -79 4 22 73 -1 8 77 -32 368 101 -128 93 274 -95
5186 -95 85 -10 -26 -4 -147 -162 114 -114 -69 27 -204 96 -76 174 145 145 207 -6 -1 -159 44 -306 -28 193
5210 193 -47 18 25 -31 -317 30 -110 319 -191 31 49 -81 137 247 19 -176 31 102 389 137 192 -50
5232 -50 -41 281 50 62 -150 -162 229 49 -153 -46 -222 62 196 37 58 -103 222 -86 178 -44 -305 -57
5254 -57 37 52 -59 10 93 149 74 -131 72 -165 -110 -71 120 -120 3 -147 -61 -123 144 50 -22 -4 57 214 -139
5279 -139 321 85 216 -308 -182 -157 -73 22 -63 223 -25 -158 -28 -283 81 87 -179 -268 229 18 98 -19 67
5302 67 177 172 -58 -34 -9 -120 89 -260 -112 -179 -48 75 -348 -146 -196 122 -1 225 -33 -17 -176 66 45
5325 45 33 -115 -59 -4 105 -15 69 96 -27 -125 97 -26 -133 48 -215 -33 -24 35 -188 25 166 122 115 -121
5349 -121 -69 104 25 38 136 -110 52 -160 205 -11 110 46 12 157 -72 21 -131 -4 23 99 -45 318 -53
5372 -53 -6 27 127 156 36 -128 -145 9 -137 -156 -139 -134 -66 9 -36 -19 84 134 178 -84 -85 52 -270 -3 78 82 -132
5399 -132 106 113 158 22 -136 -93 -24 54 133 56 -82 -74 -2 -160 -180 -58 -12 9 50 92 31 -26 24 49 181 78 -106
5426 -106 72 293 -229 80 -208 -47 109 284 -48 -146 52 -224 133 92 148 -234 -188 -62 -154 62 -64 299
5448 299 -189 81 132 335 23 93 106 -131 273 -164 54 -103 -95 74 -236 192 -76 -210 -29 -123 157 -12
5470 -12 227 -132 16 -189 -25 102 75 7 70 -17 -217 -26 -156 63 -171 44 -80 -216 182 28 144 -166
5492 -166 4 -39 -24 141 26 68 -38 -220 127 230 -142 120 -14 97 133 32 62 281 82 3 143 113
5514 113 120 -71 37 -52 -243 16 215 66 206 -125 -122 -69 299 88 37 150 -43 -145 -35 -167 -188 -62 -93
5537 -93 -268 -162 -83 -169 39 79 -287 56 -77 33 66 -117 11 -47 -86 58 65 -153 68 -73 102 21 -54 -10
5561 -10 -89 123 7 -79 52 39 -93 -94 31 -146 -12 -45 135 120 89 -221 -39 -128 162 274 -87 -43 24 111
5585 111 132 48 -36 164 293 226 26 -44 -180 -120 9 -135 103 48 -133 -56 -128 -60 -27 -107 -116 52 266 24 -65
5610 -65 42 -69 20 28 2 129 -166 42 -139 223 133 -33 -176 165 -163 -183 205 -53 81 121 -130 -67 -140
5633 -140 -138 -167 -100 60 177 36 -72 193 -39 -59 -96 154 -159 152 -52 31 141 -7 -106 -88 50 -148 124
5656 124 77 123 -158 181 184 12 -241 219 -6 24 -8 -119 -84 43 39 157 8 -32 150 4 -101 -51 -79 88
5680 88 112 -66 104 30 -18 11 -34 -88 132 -89 138 -203 -27 -31 -9 231 11 88 -9 -237 256 141 47 -105
5704 -105 135 17 183 -102 -253 -195 -42 -75 -3 171 106 -210 36 -81 -62 226 -190 43 -43 58 56 223 -31
5727 -31 -63 -84 -221 58 123 -48 -36 -80 -367 -122 -196 7 -63 40 -24 73 39 -7 156 68 -58 -102 -99 171 -94
5752 -94 -209 -39 82 -55 -347 -93 -241 -62 43 97 -95 -191 297 100 -47 -15 -38 -153 -22 -8 110 -169
5774 -169 -129 -48 26 -5 -180 -98 26 -94 27 -168 153 112 -42 131 -146 121 -291 -44 -118 34 233 -242
5796 -242 1 -15 8 2 24 203 -158 -184 -189 184 88 -26 -204 119 -73 -90 12 39 97 -20 89 -62 -31 199
5820 199 177 -8 -176 223 86 200 -57 -59 71 -144 -3 149 -12 -135 116 -180 -82 51 50 141 -85 -185
5842 -185 -209 -171 43 -64 131 287 -93 -108 267 164 -175 66 188 -28 -31 -47 31 -11 65 -239 34 -43 101
5865 101 -3 152 -118 -42 -34 -79 -237 -56 -21 -14 -109 75 -85 -4 -225 -2 -1 23 174 192 -18 97 45 -159 -91
5890 -91 158 21 -31 17 -46 129 -213 46 53 115 131 0 -113 121 -253 69 80 -60 -196 161 -104 -184 -86 8
5914 8 198 174 -15 -119 -123 -61 62 6 124 78 94 302 -120 61 162 24 117 49 -41 -154 170 84 61 -139 -139
5939 -139 -62 -96 24 -91 231 -181 -66 64 8 103 274 -128 -184 -132 12 -55 -40 -99 -195 133 -326 267 -64
5962 -64 7 -26 -10 53 -221 65 120 -85 -101 -79 93 -50 -150 253 -106 -30 -177 -25 -70 5 -72 99 -19 -46
5986 -46 78 126 93 -176 -112 -192 -131 115 127 -14 17 39 -62 -83 -116 -20 32 19 -62 -299 21 4 52 32 -2 11 -54
6013 -54 159 -29 38 150 -79 -194 59 65 -338 181 152 -23 -29 139 52 -186 -29 -92 1 -5 -69 -128 283 94 55
6038 55 154 -120 -73 72 197 -181 -148 -288 262 358 118 -29 85 -225 122 -117 -85 251 -60 -85 -31 116 -275
6061 -275 -119 -74 20 -88 -133 1 -168 102 -56 -128 14 -159 -1 103 85 114 54 -25 96 -4 -260 113 154
6084 154 178 -20 -155 312 88 -306 76 115 -348 70 55 -45 -127 -117 -169 25 82 248 191 -276 190 4 0
6107 0 67 178 -93 92 118 -177 -23 -89 -193 -26 -159 -200 102 -186 296 6 181 -6 -112 -285 11 38
6129 38 124 259 -194 110 122 -194 -100 139 -206 85 -37 92 -81 -316 113 121 68 141 39 -229 153 0 63
6152 63 24 -95 -48 -44 28 22 148 28 263 -187 83 -138 -267 -197 -93 212 -55 232 -90 61 -81 -174 68
6175 68 26 20 -179 -65 -152 3 -198 -22 98 246 -85 -233 -122 -257 204 -247 -41 76 -162 169 73 70 128
6198 128 -43 0 339 -102 238 -37 -37 -58 -108 -195 -172 -66 -140 -60 101 -188 -8 156 -213 -131 67 -17 -116 161
6222 161 85 -97 326 79 16 -131 29 -67 50 131 -43 28 -21 -22 71 -81 -9 -34 -174 46 293 -272 105 3
6246 3 89 10 125 -189 -6 -8 228 48 -143 -131 -96 -53 -41 -85 -157 148 -56 -197 79 112 122 43 -64 147 -184
6271 -184 208 131 -192 -90 27 -108 -3 138 157 -141 -11 -10 -29 267 -235 -13 11 -182 -93 80 157 54 -231
6294 -231 69 -79 -9 328 -263 -100 10 25 -35 -10 92 166 -14 -162 70 -137 112 74 -6 -74 -143 73 -292
6317 -292 -150 -318 52 -97 -218 -264 -141 -166 -159 221 92 -49 -205 68 -14 28 -66 -2 86 -88 143 87 108 -110
6341 -110 2 87 -35 -2 -140 -22 72 36 62 176 142 -85 -99 -108 -52 93 -197 -164 136 -47 -81 -119 48 287
6365 287 -146 -129 -32 89 162 206 -1 -202 -126 -87 -154 128 206 -14 44 32 -212 -112 137 57 -150 123 84 124
6389 124 -97 160 -114 -163 12 145 128 32 63 131 -41 -20 -19 -163 -214 -229 47 113 -60 -35 -44 75 -5 -75 -159 18
6415 18 -63 44 -125 -338 13 41 126 147 157 4 -324 9 -70 -170 160 193 -153 87 -112 45 20 63 -19 63
6439 63 59 -72 -10 54 -37 -36 -193 20 170 -6 194 -109 -123 171 55 -186 -223 -155 42 96 -72 -63 -95 -43 132
6464 132 135 13 -138 28 -136 -36 137 -103 -110 -161 -115 66 -23 62 -65 219 116 95 185 65 71 -200 186 -38
6488 -38 -311 20 79 -136 -251 -197 96 -33 -8 119 200 -106 -252 -18 362 26 -249 -1 199 -43 -212 -121
6510 -121 115 0 126 79 -70 133 100 -146 -192 130 88 -160 -90 -50 -3 -161 24 -152 -345 9 53 -55 -284
6533 -284 44 34 75 -54 21 8 122 67 -261 104 -21 17 -251 21 55 238 -115 -129 67 -15 154 -73 248
6556 248 0 103 200 21 -103 287 -117 -71 1 -82 89 -62 138 45 37 187 13 -91 -174 -65 147 144 -240
6579 -240 51 31 -63 213 -84 81 39 -13 40 87 -241 92 67 113 36 92 151 -206 83 103 -123 69 -44 29
6603 29 172 -67 -161 137 -205 216 -28 39 190 -183 74 165 117 0 32 35 72 -31 98 -35 80 12 71 129
6627 129 -119 -389 84 -186 -37 -151 -99 -24 -167 -48 -44 -175 -53 147 131 14 -97 39 -63 -197 -107 11
6649 11 27 -66 51 -28 -72 130 -6 -7 39 203 5 -32 221 34 112 2 11 72 11 -158 156 -53 92 160 51
6674 51 46 169 -33 -141 94 -111 -94 -225 62 -155 -67 -138 -167 -175 -59 206 -216 -7 4 75 -138 -154 -255 -45
6698 -45 133 -105 135 -54 97 -22 101 104 61 72 -88 245 -122 -187 37 -224 -147 -44 -48 210 -195 -9 -112
6721 -112 -124 71 161 -301 -79 -270 -58 94 117 -66 174 -45 -8 -177 91 286 117 17 -5 63 -104 173
6743 173 -64 -277 -22 -35 329 33 -92 -55 -283 -22 -101 220 -62 13 79 -66 2 106 79 126 -117 -159 -263
6766 -263 39 -65 170 -270 -103 212 71 -119 -187 119 -14 42 185 -14 -203 -131 55 60 -2 140 87 -113
6788 -113 33 -55 75 65 179 200 96 126 112 -53 4 51 -314 -12 60 -161 103 31 -81 -107 202 -77 119
6811 119 -77 52 12 -50 8 -45 241 255 33 81 -67 140 152 -29 -187 167 40 -52 -81 -2 269 79 -36
6834 -36 50 131 -50 128 -95 97 7 -34 95 81 -74 -59 35 23 53 2 -61 231 -152 70 347 344 -41 -54 183
6859 183 204 -14 -54 198 -176 -141 84 -124 -66 16 -232 -15 105 101 128 -101 153 -19 -286 304 -101 -82 -77 76
6883 76 -60 -116 -156 -26 -71 4 -144 41 320 -85 98 -8 -361 -49 397 207 -111 -258 102 112 -215 -209 -137
6906 -137 78 14 176 47 15 -4 35 -170 -158 28 176 -36 -114 -241 -178 -186 141 134 38 109 138 105 129 -113 -110 -311
6932 -311 97 -104 -243 231 76 -151 -51 -34 53 -5 -100 145 -37 167 -6 -3 314 149 84 -104 -162 -38 -104
6955 -104 -215 165 74 183 -24 52 109 -43 136 -115 184 118 62 -60 -261 -4 78 -13 -114 -137 138 -167 -175
6978 -175 16 -3 154 -60 -75 -47 -76 -96 -128 43 -294 146 -76 115 6 -163 -53 107 -61 61 -142 5
7000 5 34 58 187 144 46 307 -4 -69 71 263 123 70 212 -254 66 100 -19 -14 -160 -78 67 83 -149 118
7024 118 33 201 81 68 -302 -315 -51 -172 -231 -95 49 201 317 33 -34 156 -4 -100 -253 -229 6 114
7046 114 -134 -203 236 98 92 129 58 16 -67 69 -161 179 -135 124 -199 -103 -112 -289 -206 -54 46 -58 -119 150
7070 150 152 -83 153 -95 -27 -63 204 8 -86 -71 -16 -311 187 68 5 -93 -79 -102 88 185 -98 -303 158 -132
7094 -132 -137 -133 -215 -52 74 -146 -69 -2 36 139 -144 119 -106 -108 -186 347 116 -33 -51 358 230 -29 -242 66
7118 66 27 -115 -60 145 17 -122 -155 33 239 166 -74 -102 78 -42 -29 93 65 -117 238 -57 -43 -18 3 12
7142 12 -185 101 96 13 -89 -113 -30 128 116 -23 -32 151 -212 5 142 -12 -148 -101 167 -41 -193 -107 -118 -46
7166 -46 113 -112 -31 -64 126 -74 46 16 33 39 -71 -142 -97 98 -144 -37 -27 -205 291 -93 -26 -144 -51 9
7190 9 -13 -38 275 -2 -6 147 -86 198 274 -260 37 66 -20 158 66 79 -221 -84 89 12 67 76 -83 38 168
7215 168 260 49 -165 -24 -201 -194 -44 -200 19 -182 47 24 85 -86 70 91 -266 -214 -156 25 -13 117 43
7238 43 -50 -188 91 117 215 -84 167 50 -217 28 -127 152 44 -330 -8 5 283 -73 -130 109 14 96 -141
7261 -141 -164 97 -24 323 -84 -7 96 111 40 -123 127 -233 17 33 -23 17 89 -188 80 267 -14 -84 -16
7284 -16 -215 47 -146 -52 38 27 -291 84 -3 -223 -82 178 69 10 125 134 -142 -33 155 -266 -13 201 -117
7307 -117 182 -78 14 -153 95 -11 15 79 -23 -103 -246 16 69 -209 -14 -9 48 222 -131 -287 -60 246 79
7330 79 124 -30 82 -242 46 13 -87 96 72 -25 204 -84 -86 -66 42 105 -89 -168 -23 -28 136 152 150 -20 -12 -172
7356 -172 136 58 3 -150 89 111 271 221 -48 -123 25 100 -18 -85 27 -71 -58 54 -81 -98 -170 -89 25 -122
7380 -122 -139 4 0 229 -113 -255 -191 121 -349 -268 -73 -154 16 180 16 41 49 -138 63 -280 -136 -144 184 -100
7404 -100 -118 -237 -5 239 -47 -36 -45 -54 49 219 223 25 -110 308 -102 83 67 -61 -220 -62 38 -87 -106
7427 -106 -151 91 73 98 -40 -78 114 -17 -62 -196 56 72 -96 -184 68 -18 40 191 -23 45 -109 -251 -68
7450 -68 66 47 197 67 -107 172 19 90 -20 282 48 -25 -164 -141 -166 108 17 138 107 -220 -9 77 28
7473 28 -36 -93 32 106 -65 8 -58 25 75 161 -251 28 -170 -85 270 -120 463 -247 0 -102 -42 -269 -60 188
7497 188 233 -28 197 214 29 41 -73 131 -106 -79 308 19 115 134 -69 -19 191 167 -171 -298 -23 44 -165
7520 -165 -19 74 -98 416 11 28 -252 134 215 20 -7 -16 -11 -284 87 243 237 177 116 -79 38 -137 136 -59
7544 -59 37 -90 74 -100 -220 115 -173 7 -176 -97 110 -88 -140 111 -117 181 -22 79 37 -143 53 -111
7566 -111 -115 -33 -483 -297 166 85 -133 130 45 -187 -297 -77 125 -177 -101 170 166 23 -128 69 -133 -325 -127
7589 -127 -191 143 21 -37 -73 24 -184 -234 89 150 -98 -23 -206 51 164 250 220 -116 277 221 -130 38 -79
7612 -79 -111 -126 -26 19 150 7 3 -52 -270 -70 179 -35 -114 -208 -166 151 -7 66 -215 -168 -9 -111 -60 121
7636 121 44 49 60 -73 126 -62 -184 195 -441 54 84 -15 -10 190 -178 -99 200 141 -149 -55 18 -35 -61 -70 26 216
7662 216 63 -161 133 36 7 -139 -77 -38 -38 -16 -166 22 329 137 88 -98 129 8 191 38 74 78 -121 65
7686 65 -109 180 -119 -20 118 151 -233 49 -104 -157 154 -7 -5 255 -131 -58 275 -95 25 -58 89 -143 122
7709 122 -47 -220 -169 79 30 92 148 180 37 116 83 -138 -46 -117 151 27 -100 -107 2 92 -224 128 -18 42
7733 42 13 12 140 146 -184 -67 -10 72 295 268 130 283 50 69 -74 143 80 -22 205 65 -127 168 -96 48
7757 48 -106 -169 14 35 -10 -23 -3 57 -94 10 -278 -263 -10 -18 44 -30 -28 113 21 96 163 70 41 78 -19 116 -95
7784 -95 -179 -41 30 75 -191 -238 -106 -81 32 279 115 2 -121 -180 8 -254 48 16 -328 -198 -77 91 122
7807 122 8 -143 44 -79 -71 -236 -134 44 -163 -179 9 41 -105 14 -24 -5 98 -152 11 -9 -39 114 -149
7830 -149 120 -278 -201 -78 -26 21 14 141 392 -132 -89 274 102 104 124 291 -55 -164 -29 -176 171 -61 -177
7853 -177 33 -40 -155 -59 176 -81 93 -35 -31 165 144 -64 -136 -55 73 208 31 -35 -27 291 -55 -16 188 -95
7877 -95 140 -94 -70 178 -16 -97 18 -103 77 86 -76 87 -23 -70 76 -93 -346 53 -6 52 -44 169 -76
7900 -76 16 70 28 258 129 -52 -140 51 37 17 153 138 135 -98 -26 -81 -261 238 53 -264 98 232 96 -60
7924 -60 -14 -1 266 26 123 143 -132 69 -237 -145 27 29 -61 121 8 33 252 113 -144 48 -75 -14 149 117
7948 117 93 63 -32 -75 30 -39 107 2 23 181 129 -127 269 -47 47 56 93 -19 99 257 74 6 -136 211
7972 211 -178 -80 33 -185 90 -47 -48 -25 -38 -93 -120 -69 166 -5 -96 143 -107 111 -40 124 -293 174 76
7995 76 72 80 -75 -44 150 -74 83 -279 -15 -183 102 40 -256 -302 16 87 -197 32 431 159 -101 57 -223
8018 -223 31 61 -361 -68 173 65 -67 209 -151 -203 -115 -51 216 64 7 89 80 72 -113 28 -116 112 -17
8041 -17 98 -170 19 116 31 -52 52 -45 -302 53 30 135 90 -48 -114 320 121 160 -42 -135 33 245 -90
8064 -90 -55 -75 -67 89 -116 -35 -101 33 1 42 -88 -13 70 5 -218 16 130 21 84 136 241 81 103 -379 90
8089 90 -139 40 -23 34 -45 -26 -72 191 -34 155 -87 -57 -132 -98 0 121 -34 -326 -95 -267 -30 74 86 107
8113 107 -59 69 24 -69 -249 267 52 -275 15 -63 122 92 -164 33 215 -162 160 168 -164 -30 44 11 167
8136 167 198 115 -31 -4 -116 -90 33 -77 46 139 41 -141 -49 -70 -133 -217 70 70 194 -57 17 -46 -177 -51 -179
8161 -179 -287 -20 374 10 297 168 -30 32 -125 -188 -36 170 -63 34 51 42 126 274 -51 -96 40 -20 205
8184 205 -215 103 41 49 8 -130 278
8191B78
$$ Imaginary data points
##PAGE= N=2
##DATA TABLE= (X++(I..I)), XYDATA
0 0 0 0 0 0 0 0 0 0 0 0 0 0 0 -5 8 -8 8 -8 10 -16 16 -24 24 -29 32 -40 45 -51 58 -66 77 -86 98 -110 125 -141
36 -141 158 -175 194 -217 241 -269 297 -327 361 -399 440 -486 534 -589 648 -714 789 -871 963
55 963 -1068 1188 -1332 1498 -1698 1943 -2249 2644 -3180 3940 -5106 7083 -11063 22016 -111174
70 -111174 -315880 121571 195954 -107159 -33493 128183 -56273 -41226 163576 6481 -173818
81 -173818 53165 134680 -84608 -68460 85595 -2088 -52358 38376 -22675 -81159 69698
92 69698 80356 -96891 -65448 69631 -1562 -53600 35546 4495 -66645 36070 85483 -28908
104 -28908 -42092 41831 13180 -20097 39981 22746 -52339 -6380 45871 -25229 -55079 20003
116 20003 31067 -31321 -24463 32033 23359 -20308 -8781 18857 -1092 -11038 24787 21144 -36997
129 -36997 -28357 34433 9325 -44670 629 37283 -16308 -24105 29688 14250 -24921 -198
141 -198 9686 -11514 15519 22023 -33242 -20261 37063 492 -34393 20724 23868 -27961 5592
154 5592 35138 -25714 -21981 43575 -3035 -53515 25890 42616 -46219 -25604 41108 -14328
166 -14328 -36900 37705 14894 -50841 13112 47970 -38137 -27541 56004 982 -54132 30346
178 30346 47561 -36284 -14599 41624 -11684 -26038 39777 11062 -46914 11021 36069 -35887
190 -35887 -25965 32799 -8391 -36836 20651 15753 -33627 4694 33274 -23787 -20005 41984 11956
203 11956 -34228 12364 27854 -22915 -10907 28868 -5632 -25749 18545 17071 -22287 -1660
215 -1660 21336 -11805 -15863 19433 6392 -21874 -672 13406 -12299 -12592 11018 1173 -14120
228 -14120 4260 11942 -6838 -3795 11607 1268 -9392 6294 12258 -6297 -7755 9428 2517
241 2517 -10682 1656 8796 -6023 -4181 10248 -752 -10814 7286 9541 -14083 -5642 16752
254 16752 -1820 -16422 6970 7782 -14357 -766 14382 -9932 -11923 17864 4831 -21539 4918
267 4918 18980 -13252 -9769 19059 -173 -16777 12559 12305 -18786 -200 22567 -8102 -15892
280 -15892 18099 6126 -20918 4943 15417 -16555 -9201 18674 -4171 -19395 11564 9791
292 9791 -19604 175 18847 -10674 -12326 18566 3831 -18446 7527 15229 -13647 -5029 18626
305 18626 -3134 -14244 13255 8851 -16524 807 16250 -8088 -10623 12448 2265 -14440
317 -14440 3636 9514 -11401 -5751 11635 -2632 -11807 6883 6624 -10269 -1243 10175 -3131
330 -3131 -6473 8015 4144 -8086 1939 8606 -4294 -4337 7760 1967 -7214 2390 6585 -5067
344 -5067 -3966 6953 676 -7467 2119 5238 -6273 -3806 6219 -1150 -8021 3309 5370 -7406
358 -7406 -3058 8274 -1073 -7403 5697 5687 -7238 154 9636 -3064 -6452 8554 4527 -9141
372 -9141 1764 9198 -5942 -4851 8928 -39 -10304 4867 6699 -9752 -3497 9676 -3533
385 -3533 -9494 7159 2969 -11135 1612 9489 -7544 -6137 10930 1738 -9667 5066 7826
398 7826 -8149 -1132 10833 -3795 -8259 9296 4906 -10369 674 9311 -6017 -5409 7908
411 7908 -556 -8960 4980 5519 -9545 -2304 9049 -2791 -8008 5382 3363 -7693 827 7324
425 7324 -5014 -4115 7933 1904 -6497 3196 5566 -4273 -1783 6076 -688 -5189 3630 3008 -5311
440 -5311 -474 5419 -2552 -4283 4234 1755 -5722 34 4761 -3076 -4203 3666 833 -5297 1054
455 1054 4024 -3455 -2327 5506 1150 -4942 1676 4653 -2533 -1159 4186 -1141 -3110 4101 2175
470 2175 -5955 21 6311 -2025 -4999 3964 1640 -5464 810 4013 -5320 -3712 5719 355 -7008
485 -7008 1308 4579 -3861 -1969 4773 -729 -3304 5017 2181 -5466 1529 6539 -2951 -4121 4865
500 4865 1842 -4630 2051 3268 -5519 -1537 6964 -1347 -7035 2597 4146 -4300 -1787 3219 -2488
515 -2488 -3069 4059 126 -5351 2551 4742 -4163 -2229 5701 489 -3838 2987 2550 -4702 1108 6225
531 6225 -3371 -5719 4988 3751 -4550 -876 3728 -2351 -2482 3929 245 -4485 1493 2643 -3414
546 -3414 -1195 3280 -1603 -2949 2750 1650 -3444 816 3788 -2504 -2653 3776 1586 -2948 995
561 995 2951 -2226 -1113 3604 112 -3470 709 2742 -1058 -1170 1195 -1315 -1718 2364 386 -4049
577 -4049 -326 3011 -1307 -2765 1731 961 -2802 990 3001 -2024 -2323 3599 1201 -3529 257 3390
593 3390 -892 -1488 2337 -19 -2282 2321 1907 -2914 -858 3478 -664 -2491 1522 94 -3104 1478
609 1478 2557 -3976 -2372 4190 219 -4293 1121 2563 -2387 165 3236 -1710 -2348 3638 1594
624 1594 -3830 643 3684 -1597 -1503 3137 -337 -3059 1987 1718 -3136 -473 3317 -1624 -3198 2410
640 2410 879 -3327 -300 2260 -1599 -1744 2186 103 -2125 1306 1632 -1993 -66 2325 -539 -1831
656 -1831 1465 1214 -1615 73 1577 -1200 -900 2207 488 -2407 125 2147 -1015 -1432 1541 41
672 41 -1828 514 1369 -1819 -1320 1601 56 -1721 839 1132 -1548 -339 1925 -530 -1101 1741 1335
689 1335 -2021 85 2425 -453 -1238 1402 365 -1874 626 1522 -2108 -1110 1957 -240 -2230 868
705 868 1005 -1752 -306 1758 -1029 -1802 1801 230 -2072 379 2070 -1257 -960 2211 421 -1617
721 -1617 1184 1513 -1980 -37 2211 -759 -1698 1653 924 -1968 121 1302 -1315 -1034 1471 -104
737 -104 -1790 494 1107 -1398 -701 1482 -416 -1713 1458 1020 -1373 23 1451 -587 -1012 1659
753 1659 404 -1381 587 1431 -961 -452 1381 -183 -1517 895 1055 -1505 -566 1409 -399 -1037
769 -1037 811 515 -1468 -101 959 -864 -1188 945 383 -1181 590 1163 -785 -477 1353 -165
785 -165 -1070 1182 1019 -736 -99 1232 -139 -913 953 402 -1141 242 899 -612 -934 895 -129
802 -129 -1293 231 946 -1218 -827 1131 -236 -1163 639 649 -722 -70 1242 -391 -617 1173 455
819 455 -1177 201 1212 -749 -546 823 -162 -1106 205 775 -915 -338 1082 -543 -1003 735 690
836 690 -1188 75 1050 -735 -782 1118 273 -1207 537 972 -730 -512 1116 -36 -872 665 583 -561
854 -561 -57 1105 -532 -676 666 231 -1065 80 719 -1014 -359 864 -211 -818 556 605 -740
871 -740 -65 1016 -337 -663 791 406 -1231 254 976 -275 -473 871 345 -912 187 623 -670
888 -670 -577 1051 9 -697 326 527 -969 -172 696 -537 -697 461 239 -960 -96 518 -556 -597
906 -597 742 238 -921 622 610 -517 -253 962 85 -545 375 310 -516 -189 743 -315 -553 408 287
925 287 -521 -279 512 -491 -402 587 -234 -944 227 441 -497 -416 759 -222 -426 407 640 -551 199 944
945 944 -199 -411 615 240 -583 312 549 -309 -202 601 -290 -543 297 532 -818 -160 657 -179 -553
964 -553 470 37 -752 189 846 -466 -507 428 -186 -378 182 611 -260 9 717 42 -245 381 497 -386
984 -386 252 536 -428 -361 302 63 -802 180 558 -504 -424 273 84 -672 258 328 -479 -105 541 -260 -480
1005 -480 396 467 -142 100 406 -383 -403 771 226 -490 -40 730 -31 -387 518 -13 -674 196 484 -494
1025 -494 -183 291 -219 -577 865 296 -446 164 60 -493 -311 571 -1 -540 466 291 -615 -31 530
1044 530 -144 -521 457 262 -468 -168 428 0 -394 211 111 -497 188 239 -197 -82 293 -253 -485 88
1064 88 113 -656 -259 473 129 -245 316 137 -253 136 519 -151 -299 211 229 -321 366 464 -386 -138 625
1085 625 17 -237 252 398 -383 -204 473 -233 -384 226 81 -339 63 387 -454 -186 257 69 -454 99
1105 99 597 39 13 660 110 -346 378 255 -284 -138 174 -443 -303 308 -144 -483 379 109 -392 -430 -38
1126 -38 7 -421 361 123 -245 71 188 -286 -252 296 416 -294 15 372 -115 -79 345 161 -263 -212 237 -118
1148 -118 -251 114 63 -329 188 233 -350 -51 271 26 -116 64 73 -281 -145 306 -86 -181 346 -128 -419 35
1170 35 311 -331 -58 595 90 -389 196 377 -248 -111 176 -253 -120 233 105 -420 143 160 -306 -250 384
1191 384 -94 -201 27 269 -303 -150 34 124 -77 269 16 -395 166 281 -83 -2 301 103 -514 183 196
1212 196 -89 -3 397 -11 -295 159 212 -181 -155 178 -227 -312 75 -105 -430 248 50 10 47 373 93 -149
1234 -149 204 292 -131 -79 275 131 -88 279 -34 -295 -61 75 -255 -235 488 92 -221 -92 105 -273 -243
1255 -243 155 61 -182 94 148 -27 -11 494 9 -202 373 242 -73 86 116 65 -39 370 -58 -203 270 143
1277 143 -37 14 244 -93 -239 641 101 -234 -29 187 -149 -113 -57 148 -268 37 247 -217 -218 357 -50 -434
1299 -434 402 117 -251 69 414 335 -245 216 111 6 -37 83 -49 -17 245 -66 -402 109 145 -362 -124
1320 -124 -41 98 -5 115 90 -359 -273 204 -190 -154 304 -50 -189 -83 254 50 -8 -79 102 -234 -58 -15
1342 -15 -135 -42 -10 -86 -319 29 -98 -331 -8 285 -74 -63 217 238 -133 -44 112 -136 16 44 -3 -244 231
1365 231 260 -155 152 244 -111 -49 77 -170 -134 -94 309 32 -43 224 -84 -245 24 233 -263 -175 214 -151
1387 -151 -180 15 167 -322 29 201 234 -187 312 80 -295 341 195 -137 -194 369 -93 -176 96 -4 -161
1408 -161 -70 106 -197 -56 307 290 -111 19 421 -189 -436 250 -116 -416 58 1 -232 -155 -7 39 -193 223
1430 223 -205 -243 163 58 -24 -45 141 -82 -258 6 6 10 -47 -62 34 -197 103 1 -56 123 182 -227 -226 -105 -50
1455 -50 -277 -206 -24 -23 110 103 -41 32 107 261 -177 81 -21 132 -150 -70 258 -31 -171 -82 7 -77 98 207
1479 207 144 -13 30 -155 -150 30 -104 120 68 143 32 -238 68 -171 -352 163 219 -186 -90 384 -58 115 107
1502 107 122 -207 -30 152 102 74 177 -73 -38 107 -90 63 250 59 -135 158 -16 -3 -418 74 84 -279
1524 -279 317 342 142 74 -121 138 -355 134 -221 -34 -288 146 214 130 403 39 97 -205 340 -66 -140 -42
1546 -42 147 124 -362 -77 -6 44 62 29 -3 -204 146 120 -45 283 191 -83 115 187 -95 -59 130 211 -343 94
1570 94 326 -74 -189 126 -196 13 54 147 -416 -141 97 -161 77 54 128 27 12 137 -220 -83 -11 116
1592 116 -334 -112 86 -43 -11 187 -279 -361 84 37 -330 -36 146 -27 86 -79 96 -94 51 159 65
1613 65 -191 -51 -82 -145 193 149 -272 -128 206 89 -73 40 115 108 -21 -76 106 -108 -75 -21 -110 29 -7 -92
1637 -92 28 161 176 -170 195 106 -195 -230 132 -25 -51 144 -30 31 44 -104 -194 135 -86 -16 -149 284 -29
1660 -29 -14 -59 238 71 -203 48 159 -288 185 187 -123 211 235 15 -160 147 -95 195 -10 31 -98 -43 -128
1683 -128 36 -3 -20 150 80 -36 195 123 -39 -188 182 -170 -194 -65 -103 69 9 -128 -214 9 174 261 -213
1706 -213 -7 -176 -88 -92 103 107 203 -55 -151 -34 232 242 102 -165 16 189 -65 -63 47 -83 25 42 -95 96
1730 96 -17 276 -112 6 -119 76 -41 -16 48 22 -168 53 53 64 107 -257 -264 11 -98 -19 -123 -25 14 -28 20
1755 20 92 4 22 -32 -96 3 21 90 73 64 -187 -34 -353 203 32 -45 -26 -176 -55 2 54 61 -223 383 -31 -139
1781 -139 68 2 -21 231 15 -5 178 28 -75 -44 110 -123 200 -66 -164 119 -112 -80 -304 -185 181 148
1803 148 57 -117 256 45 -76 119 -26 -58 -476 156 -27 -275 -63 384 169 26 6 138 -176 66 -31
1824 -31 -126 14 202 -66 -173 0 198 -103 28 182 -112 34 -4 41 125 290 26 -93 -114 -86 -344 18
1846 18 -148 67 43 150 133 35 90 106 -89 6 -9 133 -17 196 70 1 -112 35 159 -38 -12 -238 -1
1869 -1 -278 53 213 147 -26 209 -240 254 -94 110 124 62 291 97 107 -15 45 -98 129 180 -135 -41 -79
1892 -79 -216 -112 -142 76 -4 -97 154 -78 -265 -62 -59 22 -57 -74 -7 -173 120 -118 -18 129 5 58 127 45
1916 45 -104 78 -43 62 121 -30 93 -90 -59 105 64 96 50 -199 -187 -79 178 -28 153 -113 25 -45 -54
1939 -54 110 288 -4 -56 -21 -53 53 -57 -66 -326 -15 217 113 274 -6 -211 113 92 -67 195 -385 197
1961 197 23 -88 -190 100 -19 73 27 -279 -57 -187 -40 164 92 13 -29 99 47 115 -1 178 194 105 -20
1984 -20 122 49 123 77 -104 -222 30 102 -38 -141 54 -23 229 229 -140 -204 119 246 94 -66 -194 -92 -28
2007 -28 63 -125 -120 37 195 -56 173 -171 273 -82 -21 7 -134 107 -115 35 156 -143 -46 -2 98 189 79
2030 79 -149 171 176 5 280 28 122 -52 285 94 -315 -129 219 90 -142 -97 157 -118 -81 -224 85 -127
2052 -127 24 -30 -181 51 -29 -162 -35 21 83 -30 2 52 -8 87 59 100 -5 16 135 -7 -120 -99 -220 178
2076 178 142 11 94 -79 -156 -195 -64 -68 156 115 10 -237 33 83 54 106 -263 -139 88 -8 162 -100 109 147
2100 147 219 -175 101 79 -138 53 -12 -239 266 -20 152 -164 35 -25 130 85 77 151 178 -195 -71 -12 -333
2123 -333 145 87 29 253 219 19 -84 9 -113 139 57 -62 182 47 -6 0 -117 -54 67 -247 -77 -168 111
2146 111 -340 -300 65 -146 219 56 -16 -36 -106 126 13 -91 -160 6 -320 125 -180 -174 -116 4 44 5 176
2169 176 -22 316 -65 -213 251 232 -10 -115 -179 -277 -6 -26 -249 19 -276 132 162 -14 -139 31 -44 -107
2191 -107 -310 303 -89 89 55 -34 -149 -124 103 75 80 -31 -95 -134 -152 128 60 127 -98 414 85 97 47 -105
2215 -105 -7 -60 149 -178 86 -129 29 145 1 -8 96 -120 -125 97 157 -43 6 -313 -340 -45 -58 -86 -195 151
2239 151 -9 101 105 117 -9 -13 33 -78 140 -89 -9 -126 -290 -235 -59 -59 -149 67 69 185 -68 102 -179 129
2263 129 138 -114 -196 200 73 189 59 -41 84 -103 -135 -61 -171 181 -95 248 33 -255 -84 -111 -102 -141 171
2286 171 77 129 33 -31 202 61 54 280 12 104 -128 0 184 -116 91 100 2 -120 -278 39 124 61 55 -7 210
2311 210 -94 193 -112 123 81 84 84 -102 -3 38 -2 142 -141 178 258 198 -250 -66 93 48 162 77 149 -56
2335 -56 106 -112 -93 -108 85 49 -88 43 -96 57 59 123 5 131 -68 112 -1 33 113 131 -248 72 -380
2358 -380 106 146 132 144 155 -24 146 74 -113 48 -192 42 128 -23 -1 -79 137 -113 -202 13 -81 240 209 8
2382 8 -84 -51 -96 -275 4 105 -239 -215 -173 111 -328 139 -6 49 -170 -143 8 160 78 117 17 272 244 187
2406 187 8 220 213 57 -90 107 128 -40 396 -30 12 137 -156 156 -46 -150 30 212 -123 -114 114 60
2428 60 194 -19 26 83 16 37 -62 107 41 -208 142 131 -47 -79 117 -86 126 103 274 46 -78 118 -9
2451 -9 -205 136 152 49 420 22 -335 296 230 -65 158 -128 -116 -82 222 -101 44 -32 -90 -126 120 85 156 25
2475 25 179 -78 -102 -78 -29 -255 139 24 187 44 -93 -102 5 111 -119 -41 -122 -282 -58 44 -34 122 -101
2498 -101 -17 -226 146 29 147 -140 -64 6 -162 3 -95 38 -44 244 -41 57 225 64 -143 -85 124 73 256
2521 256 94 126 -202 112 187 134 -105 24 -100 -65 -70 -112 38 427 -80 -67 -6 105 158 -245 -155 -2 -128 -50
2545 -50 52 -10 -169 175 -233 102 16 -177 211 100 118 11 74 167 -185 34 -10 39 43 263 26 -153 -57 114
2569 114 155 -150 -104 20 -129 6 -158 -68 131 -62 268 -43 -258 -75 -101 6 241 -99 80 -42 139
2590 139 -13 96 41 116 -98 216 -71 -130 -35 -18 -113 -57 6 -2 219 -66 -189 -110 60 78 274 81 -165 -163 -268
2615 -268 187 -56 55 -41 -10 -219 -14 -162 30 335 -80 -153 -120 62 -131 -189 -212 13 138 237 -244 140
2637 140 -68 -149 11 22 140 -148 51 -74 100 -41 56 -228 -39 135 26 -27 316 25 -22 17 309 7
2659 7 -67 -168 55 197 72 57 66 141 -92 -193 122 -37 19 110 21 0 33 270 -30 -63 -159 -78 118 52 42 145
2685 145 155 136 -36 38 13 193 5 -32 -34 -177 178 194 69 -180 138 227 -10 143 -104 42 -203 119 -134
2708 -134 58 -38 211 204 59 58 -167 -9 -13 -87 206 195 -153 -20 31 -211 -94 67 295 43 23 -119 -134 -452
2732 -452 143 -130 -97 44 -107 158 0 39 29 -401 -160 75 -59 32 -89 -100 114 332 1 145 -151 -201
2754 -201 17 154 -47 -173 135 67 -74 -52 -108 83 -145 -195 49 -39 -9 -10 34 -20 -48 2 240 84 -99 17
2778 17 44 222 5 275 -154 3 99 72 -43 81 149 219 75 51 -87 107 -235 35 52 60 152 -31 -40 105
2802 105 40 -177 64 -300 26 32 -34 31 -25 -202 338 125 -62 361 -2 -169 -76 -72 160 -61 -134 -113 -7 -76
2826 -76 -57 104 121 -214 -123 -185 33 190 -106 149 72 355 -165 130 125 -25 -120 88 18 144 -11 24 -7 -51
2850 -51 -166 -64 382 99 -54 128 154 23 -185 -84 -85 -65 127 302 -26 7 21 -70 84 -182 8 -125 -86
2873 -86 -85 -40 214 -211 -22 -73 232 251 -348 -45 -2 -10 -175 -247 -54 -211 -37 -149 -148 -154 178 -91 183 25 -50
2898 -50 1 -171 -59 26 -150 -166 -179 -175 -141 27 114 -186 307 302 179 128 138 -157 129 166 52 -16 -69 226 -25
2923 -25 -80 -174 130 -99 133 31 84 -54 -21 151 124 254 -147 -73 98 64 -204 56 275 -134 1 170 -91
2946 -91 241 -63 160 -205 -71 35 63 94 -80 95 -47 -124 -304 48 -274 -235 142 -163 -82 -225 -63 -31
2968 -31 -115 86 237 -17 139 62 -119 -16 -54 160 68 15 216 232 -49 51 -183 -122 -72 -143 43 48 58 280
2992 280 -61 -225 21 1 11 15 124 278 -73 -57 -124 42 -7 15 29 264 -230 -95 -14 65 8 46 202 -159
3016 -159 62 326 173 214 123 -38 -60 101 -274 59 81 -87 87 -33 83 -61 64 -152 163 -247 102
3037 102 196 -53 -140 54 84 229 -96 -132 42 -98 -121 127 -120 142 79 47 167 -170 182 73 57 -94 -246
3060 -246 1 17 22 -84 -183 37 32 302 -22 4 99 187 -105 240 30 120 -159 104 121 64 91 44 -205 -17 -293
3085 -293 133 141 -125 -188 97 23 -18 -38 202 316 -36 -45 44 -83 97 73 73 -25 -14 312 126 44 -415 138 63
3110 63 22 -135 -156 -214 56 204 -142 138 -3 -62 -285 34 -77 -478 -158 25 -9 258 69 -216 -146 130
3132 130 42 -58 267 -55 135 -136 -80 -173 131 147 113 121 144 -131 157 -45 -71 68 216 -34 -103 -54 -270 -212
3156 -212 -133 14 68 -72 -20 304 -205 75 -233 -72 -103 -25 -154 121 184 254 -2 49 136 -84 144 -333 -65
3179 -65 -80 38 1 162 -70 -202 -333 -203 126 -129 -64 -2 56 130 -59 -160 -158 -86 71 321 -173 -14 167
3202 167 -7 162 -179 198 -196 -45 59 -223 -110 -2 150 201 40 -110 -120 70 -92 -41 278 10 305
3223 305 130 218 225 -119 -297 163 -99 152 -34 -281 41 -152 109 42 166 -124 -386 -175 191 48 -77
3244 -77 59 -155 106 197 -30 -69 210 115 310 103 55 251 177 118 -135 -15 -158 154 11 -103 215 -161
3266 -161 111 47 -39 -130 144 178 -247 -33 80 143 -248 130 -2 -19 122 82 42 -192 102 133 -73 -142 51
3289 51 85 52 94 47 124 -11 -87 -77 163 12 -103 -24 -149 119 -45 35 219 -181 -30 22 41 -131 -43 -382
3313 -382 -167 -96 -69 143 45 4 -197 -70 104 211 126 189 118 33 -162 -83 -74 -23 -188 7 38 252 -214 19
3337 19 -92 -59 -57 107 116 190 -107 78 -219 153 -97 -107 -164 -123 20 -127 -232 -111 99 -24 70 -4 -164 102
3361 102 -100 -72 143 156 36 -339 -191 100 150 99 95 72 48 131 47 28 132 0 58 222 -11 3 -81 173 -8
3386 -8 120 88 -8 -96 -30 -117 -86 -172 42 -68 14 -134 -208 -178 -118 -56 -54 -16 -95 -57 -132 111 -36 -82 86 17 4 -18
3414 -18 -225 17 207 -139 -88 57 -80 31 169 220 50 -88 10 -18 164 -148 -86 -165 -132 36 71 93 232
3437 232 76 215 200 -41 -139 -95 238 49 26 -87 120 63 -35 107 111 -53 -18 -7 -107 298 -10 65 96 36
3461 36 59 -181 112 -42 -196 -177 -49 71 -276 -36 137 36 63 301 -6 -100 -148 205 -49 -98 176 40
3483 40 125 211 -74 -5 46 300 -239 172 3 -280 120 -3 -58 -168 -23 90 3 -195 274 -166 -79 86 -41
3506 -41 374 -28 56 -202 78 -66 51 -170 -289 -166 -39 40 -43 89 323 154 -154 134 -88 -4 6 -271
3528 -271 67 -22 -71 13 110 -70 40 -59 -122 -165 -10 146 2 104 85 171 73 -115 -164 -15 -141 107 145 -208
3552 -208 238 197 -92 145 -129 229 76 -183 81 -76 162 113 1 -10 -193 -47 90 45 100 217 -168 25
3574 25 29 0 -31 -57 -40 -41 133 39 251 -98 -60 124 37 -153 -41 -104 -73 -127 112 -150 -108 12 28 227 -4 -91
3600 -91 109 -163 -232 144 60 68 0 -27 -123 41 -110 -124 -53 0 111 -63 -136 33 15 52 -129 -2 -219 -183 -168
3625 -168 8 7 88 67 46 -37 -263 174 28 -147 20 10 257 -172 -183 -240 -82 57 -93 -319 284 256 -1
3648 -1 -128 -342 213 -187 301 -17 112 -19 34 -130 52 111 -32 -77 112 304 218 -47 -306 -152 -60 -106 73
3671 73 304 3 26 22 66 9 78 -185 -163 -61 -55 -150 -200 -131 -77 235 -259 68 -36 -252 31 4 -83 -192 -10
3696 -10 -62 73 -150 164 117 69 -8 -112 -78 -27 -18 -75 -232 52 99 50 -90 58 -94 26 -125 -183 179 -125
3720 -125 -179 32 47 73 407 126 -135 -118 -62 -169 -132 38 -67 -132 120 -61 47 17 4 -128 -54 122 17
3743 17 -127 -52 100 192 -120 164 30 62 114 24 261 -31 67 93 -27 177 91 -53 -162 -109 57 -60 -105 46
3767 46 -69 45 106 -8 146 146 138 31 83 -5 24 46 -3 -144 -66 361 66 -128 -225 -18 -9 60 -209 254 -90
3792 -90 64 120 -197 126 -207 81 -244 -170 -3 -119 95 -120 -201 -90 -190 24 66 -69 88 220 122 -119
3814 -119 -333 -254 73 134 59 -201 97 -261 -159 -81 -32 -55 -30 30 -32 94 114 151 -81 -98 19 -65 294 74
3838 74 -102 88 -76 -56 -102 98 71 25 145 -62 94 52 28 33 106 111 137 28 63 -102 49 161 -65 272 -316
3863 -316 29 -31 -82 -106 65 53 54 36 -87 22 -71 209 -231 110 124 100 26 72 -102 -92 127 -239 93 43 -28
3888 -28 100 170 250 46 -60 -203 148 -144 67 -47 -31 136 -136 -98 122 100 108 -299 79 -51 -41 153 43
3911 43 349 -305 -294 -25 -106 72 -184 -21 31 -73 162 -5 -42 51 -11 -161 -246 -90 137 54 -141 -10 104
3934 104 46 220 70 77 -1 -44 -153 -139 29 -110 -56 -80 2 -27 18 -142 116 125 -143 -9 41 197 -93 37 -28
3959 -28 -204 -99 -25 -20 -152 -50 -42 50 -38 -73 -40 169 56 33 248 107 99 -178 -221 223 106 -132 31 85 24
3984 24 -3 100 15 -33 -236 112 -19 161 -123 280 4 153 265 -218 260 11 178 143 19 -57 23 -5 60
4007 60 71 55 -86 244 -14 118 -57 -41 147 -67 159 -135 -107 61 -389 184 -28 36 15 -194 46 44 180
4030 180 -197 -161 -338 69 185 190 37 -93 84 30 -155 -60 -81 48 -178 97 24 -57 113 -10 -58 260 -68
4053 -68 120 42 -101 94 -11 163 76 174 -145 15 102 105 19 13 -15 -61 53 2 19 -212 183 -107 -200 -21 -61
4078 -61 57 75 -88 -110 -36 -38 -51 -4 71 -103 329 98 -3 -132 -128 -72 -83 -1 123 -108 -175 130 -42 -170 67
4103 67 210 13 205 239 147 18 31 97 -88 204 121 -110 -70 100 -218 -7 -1 127 -176 -5 39 162 160 -177
4127 -177 -57 44 -164 -45 0 2 126 -31 241 75 -197 -35 -80 50 -187 145 40 64 113 -139 103 -153
4149 -153 -323 43 -206 -52 -83 -265 -136 89 15 -110 102 -44 -95 -2 114 -129 75 8 -23 75 329 -415
4171 -415 -72 87 -149 354 130 211 -12 -262 135 -20 231 -9 -124 131 67 -71 -108 -13 233 -69 -108 -261
4193 -261 163 148 -180 -49 -14 168 215 249 16 -138 83 -9 238 -130 -222 -25 211 44 -165 182 -87 16
4215 16 71 -188 48 -56 -164 329 -235 158 83 -122 4 123 -223 147 13 64 -67 -222 -266 281 139 -65
4237 -65 7 -101 -136 124 -67 -85 131 -71 195 98 -47 136 190 20 -218 -214 -67 -262 115 -80 109 345 -428
4260 -428 39 19 -141 -12 -115 -23 -32 -41 17 -26 216 25 -18 251 244 9 84 -353 206 93 79 323 -138 6
4284 6 -62 86 -136 -204 -34 -265 62 -97 -55 92 -279 16 -256 -6 39 -42 213 -189 7 50 -177 33 -49
4307 -49 88 -120 -353 -184 142 -166 148 -55 136 145 80 -4 -158 8 -108 -169 -226 7 116 -42 80 147 2
4330 2 -87 -52 96 -159 -267 -75 165 -209 -58 -4 -488 216 -224 63 -110 -63 91 173 -104 -68 61 145 -55
4353 -55 97 -91 36 -64 54 -153 137 323 139 116 148 -102 99 112 -152 -65 285 -187 69 -201 -146 256
4375 256 -145 46 -221 54 36 -188 34 139 -58 -41 -342 7 -50 -31 4 -120 -13 -204 -75 -52 25 136
4397 136 63 48 -200 144 14 103 304 0 41 -45 -68 -48 77 30 18 2 -90 -66 101 148 21 58 51 -204 -95
4422 -95 -112 134 -271 -186 94 186 -93 90 -79 83 192 12 -83 -57 4 167 10 -99 -7 -158 86 -48 -47
4445 -47 -32 -89 114 123 185 164 170 12 189 -38 168 124 -74 -50 -210 258 -175 -13 -42 -6 -175 -105 -75 -22 72 51
4471 51 69 -113 0 -56 -35 -97 13 66 -10 -122 35 -3 158 134 77 -94 -136 -17 -95 -13 67 -64 -123 1 224
4496 224 171 55 -56 -138 195 141 -64 130 162 118 -144 -75 -181 -86 24 123 -53 -79 146 291 11 48 134 9
4520 9 -36 147 110 -17 -6 -80 -41 -163 137 154 -64 58 -58 -64 -59 243 -74 22 135 -155 117 60 94 -117 110
4545 110 103 45 -162 100 -86 -198 142 -18 7 -78 -55 -13 91 53 10 24 99 -62 -1 -75 -138 -247 -136 -104 -111 37
4571 37 -86 177 303 182 -77 -105 163 244 -51 84 46 18 62 -81 74 25 125 131 -67 158 95 -54 250
4594 250 -10 -106 88 79 -228 -280 -146 -64 93 -60 -74 25 17 35 103 -18 -47 25 46 -99 -42 20 28 274 30 116
4620 116 12 -7 -30 125 201 134 51 -9 78 6 -184 26 129 -126 100 49 -83 139 -175 130 59 -168 34
4643 34 -83 67 -128 154 234 54 103 -84 -125 -379 157 -224 -120 35 94 -130 22 8 -80 -122 -174 20 -91
4666 -91 -291 6 -94 200 251 -45 -25 -42 56 16 46 292 -61 71 32 132 30 7 -124 1 100 136 -293 1
4690 1 146 -229 -33 221 43 -149 111 -60 221 34 69 217 26 -54 -170 7 -42 55 42 -96 -84 2 10 -107
4714 -107 105 -123 18 -4 -50 152 -28 224 50 27 94 -15 104 -49 -93 -63 -125 208 90 208 137 -153 74
4737 74 -72 13 -34 -41 23 -164 -45 30 135 123 -217 35 95 -198 -52 -187 191 -27 -229 -132 157 -44 -147
4760 -147 -242 -119 256 -89 290 -84 124 -45 4 -4 -204 -120 74 338 -221 17 67 304 187 68 -44 192
4782 192 221 -80 110 66 -86 58 74 65 -124 50 -82 -23 -73 -90 -78 -82 142 -96 328 271 -130 103 -66 -72 -132
4807 -132 -49 -26 10 57 -44 71 14 270 -4 30 52 -18 14 262 15 -327 -10 13 -15 -249 60 136 -174 213
4831 213 -261 -55 -43 -254 -42 32 -162 -185 182 137 -39 -28 -53 -186 -137 89 54 149 -17 247 267 250 85 -45
4855 -45 92 193 -240 7 -53 -41 -139 11 19 -84 104 -24 -130 102 -223 -24 69 -32 65 111 9 -67 -61 4
4879 4 72 -24 197 153 -203 203 -132 116 62 163 -80 97 210 -34 217 -168 328 258 -32 -212 96 -47
4901 -47 -150 -23 55 49 -162 -238 144 -41 -135 228 42 335 -111 105 -192 -75 -31 -94 101 -259 226 37 -186
4924 -186 142 101 182 -35 -60 -286 37 -41 -155 115 -102 -161 47 152 287 21 123 189 237 109 258 254 -90
4947 -90 -19 87 -81 -178 97 -111 -205 -102 -9 -146 129 272 -279 -41 53 134 -7 -183 8 112 42 79 -249
4970 -249 -58 113 -60 -92 -20 -19 -3 -308 -114 -13 -28 -74 -5 -17 -224 -119 113 -140 -67 -132 -202 73 65 44 80
4995 80 -130 173 68 -6 162 -47 100 294 69 -105 361 69 135 27 151 106 50 -189 103 -186 -193 -182 -45
5018 -45 175 -154 100 -130 127 -73 -1 -95 231 314 57 270 48 344 -85 208 -49 38 -226 -138 -285 -148
5040 -148 120 -167 180 197 139 -145 1 -36 -58 -162 50 5 -16 -68 29 -107 -124 38 17 3 52 127 128 -154 -33
5065 -33 -81 -109 85 134 -38 129 126 -102 -26 -34 108 73 -137 104 12 42 308 84 194 147 -47 -132 4 79 -170
5090 -170 10 62 -24 10 25 63 -36 -113 60 149 -154 -49 -26 -98 189 -28 30 62 -48 -36 72 -43 -205 -68
5114 -68 -51 143 9 221 -87 80 -126 -28 -297 44 19 -10 -70 33 -152 54 45 143 37 -221 -6 60 -165
5137 -165 27 146 -382 -41 137 24 -210 -29 -17 -141 119 -69 224 -105 98 -24 48 111 -68 26 -18 38
5159 38 36 101 0 9 -108 -138 39 232 -36 253 -47 293 -22 84 29 -101 -119 133 41 -36 -120 55 -127 -237
5183 -237 439 -8 85 119 -127 49 114 -98 74 -139 26 -54 133 -5 30 -43 86 -41 123 -29 -66 -24 -60
5206 -60 253 -154 -47 195 -159 -183 -370 -114 19 39 -29 122 181 -198 -62 -156 38 -103 -239 -38 -10 202
5228 202 -74 -138 -36 18 -24 -161 -45 -49 82 -18 -142 -20 183 52 -197 -16 -143 -213 -86 165 37 -290
5250 -290 9 -180 -35 198 -221 45 -81 110 -34 101 -208 88 -57 -121 -140 51 -150 243 16 -226 -198
5271 -198 -7 -18 156 28 -168 -94 -27 337 -87 14 -65 -66 95 -56 -131 -14 197 109 44 139 -30 15 -77 -39
5295 -39 129 29 101 -84 -99 172 8 -55 -220 -46 -10 22 -143 -36 30 372 -99 -41 267 -116 196 58 -117
5318 -117 -13 9 63 47 -63 48 86 28 139 -88 205 124 -143 23 131 -144 -76 50 -69 -20 140 53 -160
5341 -160 86 -12 -50 -386 -31 -203 39 234 -75 -80 59 -203 -183 -75 80 -62 26 41 -19 -14 -215 173 56
5364 56 -73 63 -79 14 168 -34 183 141 44 59 -75 60 -153 18 -57 -37 205 92 -4 147 -151 36 177
5387 177 143 -78 248 32 -152 -165 165 128 176 129 198 37 51 -106 -232 -78 -30 215 -116 -131 189 50 75
5410 75 -19 -38 -92 111 214 130 -85 -168 122 -210 21 -69 -233 107 -264 -125 112 -170 -69 -116 -20 63 -44
5433 -44 -63 169 -82 198 -36 88 7 -69 59 -336 -35 -313 293 146 -154 301 -318 134 -8 -28 -27 20 15
5456 15 27 -56 27 95 -34 50 99 -85 129 15 -98 -147 -198 -191 -14 -106 -36 -191 134 18 442 -118 153 21
5480 21 -44 255 -101 87 -35 129 -1 -43 -183 262 6 -266 -323 160 -252 -161 -215 280 48 23 208 -61
5502 -61 -131 -47 347 78 -143 144 68 -14 -37 -41 82 -18 -259 337 -64 23 -142 105 -74 33 197 -213 136
5525 136 -206 -180 -78 -169 -324 -131 167 9 7 127 142 41 -33 -47 122 81 -19 296 -178 213 -3 -44 -292
5548 -292 -186 90 148 -88 30 201 -36 -98 -88 -26 134 60 14 -68 -117 118 -70 -280 22 12 -95 -101 -29 173
5572 173 64 -3 -76 -245 11 44 -7 -118 200 -122 -6 178 -44 120 25 141 87 60 5 50 11 -111 23
5595 23 31 146 137 12 -137 -32 4 -24 349 102 -4 48 331 -22 -33 92 -141 30 146 202 120 -19 -23 116
5619 116 -100 72 -149 -19 114 -6 -159 84 -61 41 52 101 -99 181 -67 9 -13 -42 -80 -219 191 -281
5641 -281 75 -221 -151 213 -271 -80 54 -143 8 224 -12 63 -189 109 -49 -72 -37 7 -144 -210 186 -101
5663 -101 228 2 140 -95 74 36 125 -10 -23 184 -39 21 99 349 -5 -146 -81 -50 -80 -116 -77 -52 -151 272
5687 272 -85 -174 40 -62 -91 287 257 144 -133 54 107 -152 -165 -224 -261 -5 77 -3 169 -9 -235 27 -106
5710 -106 18 -139 -70 -64 59 -85 -145 -198 -198 154 77 -29 37 1 100 -102 -113 8 -45 -69 52 -304 8 110 -220
5735 -220 -39 -136 78 245 -15 124 164 231 178 40 -20 99 -159 467 232 -30 86 -70 -35 27 -68 69 206
5758 206 149 237 81 -4 9 163 -68 268 3 -61 -50 -39 168 101 -126 -41 -67 174 147 -5 164 -24 21 -237
5782 -237 -16 186 157 64 46 156 115 -8 0 -143 135 221 -223 60 211 -9 -34 -54 88 24 42 -104 -147 -241
5806 -241 50 100 104 -103 38 106 -48 80 144 -226 35 354 -165 68 34 -30 -116 58 30 -145 -160 232 -74
5829 -74 89 6 -98 57 -21 28 -87 25 40 -6 160 197 -275 237 -39 -39 -127 -56 133 -75 -125 237 231 -72 217
5854 217 306 -249 -21 106 -74 134 -30 139 -36 51 103 90 -31 237 242 -132 137 144 92 49 205 3 40 15
5878 15 -117 150 -267 -29 143 61 9 -52 -112 -9 27 -157 -148 -71 -225 -130 -102 -28 20 -186 181 13 131 168 116
5903 116 -25 0 51 21 84 81 133 -109 11 242 65 -27 -51 -186 -189 84 -129 96 23 -31 -140 -298 -33 -61 143
5928 143 44 -169 -90 124 -190 13 -182 -93 210 -23 130 149 -161 104 155 -134 201 10 -117 134 70 -2
5950 -2 119 -143 166 81 33 -355 -25 85 110 227 -45 126 62 -213 99 99 -122 -68 125 172 184 -121 -135 51
5974 51 127 289 -124 -84 -19 78 153 141 -93 82 -76 -12 45 36 17 250 168 51 113 -114 271 51 127 10 -52
5999 -52 -228 -58 -196 -124 -98 -65 -453 151 -218 -269 -259 -9 -84 -32 52 -60 53 -166 138 171 -213 -31 -49 -96
6023 -96 67 -181 116 62 339 -317 -229 -210 -169 7 165 38 -32 365 -15 -132 7 41 89 -91 35 -108 -95
6046 -95 -86 75 27 3 127 -238 212 26 86 93 212 -14 38 -48 90 29 256 125 -139 -94 113 42 12 102 -213
6071 -213 -72 133 4 -166 -28 73 -220 78 232 35 -106 -68 0 -23 -139 46 120 -133 -16 135 12
6092 12 50 -22 115 -72 187 138 -104 12 -236 -21 -239 101 -63 -37 -217 -55 -246 92 -205 153 -181 107
6114 107 -249 -8 133 44 -82 83 134 15 59 141 -177 60 60 -1 44 78 -27 -27 -33 128 9 -153 -99 125 237
6139 237 -77 116 -23 -21 195 -295 -17 -10 -228 -112 231 71 83 -21 128 6 -88 88 -4 238 3 -290
6161 -290 -116 157 89 297 -304 6 -47 -59 47 -272 -1 87 -34 -74 69 -200 134 31 -115 -185 -142 9
6183 9 48 -285 -5 176 -90 149 81 -143 10 139 -182 81 -248 148 -26 -129 -41 -247 -6 138 315 -82
6205 -82 30 -244 175 -7 235 -23 328 36 59 91 -74 122 -46 7 55 -19 2 -56 220 242 -136 -118 -205 73
6229 73 -2 76 -7 -187 68 113 16 15 53 108 16 -87 4 117 68 -98 -159 -225 -126 -109 172 9 285 182 -25 -112
6255 -112 -73 246 -201 67 -144 -26 -24 -8 -88 -161 -28 -36 120 -190 182 397 -19 -71 -92 62 -275 75 -238
6278 -238 33 39 213 237 -38 -217 56 196 60 424 -79 146 -242 -9 -288 -7 69 -103 -243 -46 51 -18
6300 -18 255 -93 -10 102 -87 -152 -123 -355 42 -104 -78 298 -114 -6 -70 97 233 -122 7 4 229 -17 1
6323 1 -22 23 61 17 -96 1 -150 -143 -44 -22 -48 30 17 72 -88 116 213 87 120 78 -4 -62 -339 -44 -124 96 -97
6350 -97 1 197 5 57 -8 -190 105 -238 89 6 -180 177 -69 -3 -55 194 246 -101 -172 -108 -22 243 -183 42
6374 42 119 -52 163 2 56 55 117 130 97 -275 -27 37 -65 34 -71 229 97 -277 -217 -102 -136 -286 -8 -103
6398 -103 -52 239 -84 25 95 -131 76 37 14 -11 -32 33 18 179 -60 -61 98 88 -14 319 5 -147 77 198
6422 198 -45 -170 44 42 104 -66 -41 -186 52 50 -62 -145 -5 -39 -189 1 -236 -142 -5 141 6 -186 -106
6445 -106 102 65 74 15 176 -64 196 -51 -40 83 94 -20 111 52 73 204 22 -136 -34 146 -54 -32 91
6468 91 -58 37 -7 113 115 112 85 -176 48 60 220 150 47 19 -187 -127 -246 -152 -155 -377 -58 -140 -6 210 -66
6493 -66 -118 29 267 -5 -5 150 69 -158 30 -179 44 99 -303 -16 91 -17 -130 -78 120 108 13 16 91 3
6517 3 -46 97 -214 -91 151 48 -125 -80 51 -94 119 -119 203 105 -128 15 -110 124 45 90 -44 39 -212
6540 -212 171 -67 154 46 71 -28 111 55 -3 172 316 438 -136 128 17 -4 46 331 -178 -206 112 -57
6562 -57 -104 -79 173 -142 6 69 -192 -54 75 85 49 34 -55 -191 -73 68 -62 144 -13 20 153 74 -24 -106
6586 -106 178 -49 54 -150 69 97 4 -229 111 -1 41 -209 -33 -184 117 -90 25 -109 -82 80 -110
6607 -110 -95 26 168 -20 -67 -127 -101 -124 -65 -109 25 -103 190 -67 45 -41 -113 -322 -9 168 9 108 -135
6630 -135 -105 41 -79 -42 146 -5 77 3 159 98 -119 185 -52 45 168 155 280 29 -95 37 -134 -116 161
6653 161 -250 -331 -111 226 -45 -42 -195 -2 190 -95 -172 -243 -206 34 -60 91 202 152 -226 82 217 -152 -165
6676 -165 -85 -96 272 243 -52 24 39 2 -39 -134 188 -97 -47 -99 320 -12 -211 7 118 -125 124 -144 -113 24
6700 24 71 144 -179 18 112 208 74 132 41 152 225 -68 -375 174 -64 -100 159 56 -166 60 140 -229 32
6723 32 -117 -36 69 36 -131 -7 -291 -132 21 1 -130 88 -38 -398 -93 -22 -44 -394 204 55 -70 61
6745 61 55 50 168 92 85 70 -127 -23 49 23 102 55 -135 -253 -56 -121 126 -75 -192 -129 245 -260 64 119 35 186
6771 186 315 41 -2 -145 -40 -100 4 68 -325 25 -13 64 -79 65 106 -96 -318 -127 -252 -68 73 165
6793 165 -37 -251 -175 8 -54 -22 61 -98 242 97 63 -63 -104 67 -30 -340 39 -46 -95 94 154 -69 -167 -197
6817 -197 33 90 -9 227 96 -61 -121 57 78 -225 77 269 -274 5 -130 16 -14 104 63 60 -138 -4 106
6840 106 -147 -154 -29 244 131 -84 37 -80 1 -227 33 250 97 -200 -72 -132 171 -168 48 -57 -154 -262
6862 -262 -103 -23 263 48 -74 -111 -78 -305 50 104 27 98 -215 -95 217 106 -115 -41 -159 41 40 7 -70 219
6886 219 -69 210 55 113 121 60 -149 -84 -121 -38 3 -74 -23 13 -59 146 -161 18 67 -129 21 174 231 -70 7
6911 7 64 -44 217 329 -200 -32 288 -44 -40 -209 31 -205 274 -85 -178 298 -77 106 -22 -217 13 180
6933 180 15 -153 -115 38 43 -145 -61 268 -110 -45 -215 -99 -259 11 147 34 -120 -67 27 -110 121 -99
6955 -99 59 62 -32 -131 -221 -192 39 22 105 80 222 129 187 281 99 -272 -201 -76 -173 150 57 24 -186 58 -245 111
6981 111 -44 -6 -98 -94 -48 -175 83 246 168 113 -292 14 121 -22 -239 -176 -191 -167 5 -288 191 -112 502
7004 502 -7 87 -38 -60 53 167 -157 81 -148 -47 -27 223 -108 45 -101 -189 99 -131 -19 -69 -7 -93
7026 -93 80 117 72 -120 193 -187 204 -157 -2 -110 37 -230 -174 -62 -12 -217 58 127 29 183 -160 35
7048 35 4 49 193 206 -45 211 118 -60 60 185 159 -42 160 47 -203 -31 139 215 69 27 119 104 -211
7071 -211 -78 139 44 -115 -386 -118 148 -269 51 -80 -196 -101 285 175 -66 -196 78 115 85 -266 -208 188
7093 188 59 -24 -201 12 -83 -70 98 -102 87 167 -208 220 -267 166 67 -78 43 23 -94 -172 -60 -38 185
7116 185 -155 218 -72 108 59 60 15 -104 123 132 -15 -66 174 13 -83 34 -23 -52 236 216 38 31 -98 82
7140 82 254 -78 21 -123 -44 196 102 340 -147 0 139 -59 19 87 59 100 107 -129 132 -11 221 26 241
7163 241 -11 -192 -78 -46 -29 -54 39 -8 37 246 96 -42 26 37 -104 134 51 53 118 137 -229 197 125 37 21
7188 21 -160 -109 -45 24 86 249 42 8 11 10 98 -22 150 -87 44 171 127 101 66 -206 4 -110 -146 -7 2 144
7214 144 137 -101 116 171 7 122 96 -113 -199 -54 72 -229 -111 -20 19 208 15 -28 134 75 -195 138 -106
7237 -106 -160 -105 -243 22 61 70 8 7 30 7 8 -148 -139 -107 -51 188 -166 67 -87 15 -68 -14 12 -86 25 48 75
7264 75 -182 -105 36 165 -70 379 131 -68 190 26 -79 155 -161 -125 262 74 91 98 159 191 28 10 5 42
7288 42 -13 -241 -170 -113 -38 -154 184 -196 -183 -128 -78 -68 -50 189 82 23 -64 -109 52 65 3 111 -67 -6 1 -1 -63
7315 -63 122 -91 -19 -58 -280 -301 108 -181 -22 -87 -127 -97 -192 -160 36 156 282 -275 282 -260 -48 -28 204
7338 204 -42 -108 119 46 -179 -32 178 90 -237 -116 -97 -67 -264 -236 184 -220 -8 -173 122 108 -205 -38
7360 -38 134 228 -45 209 236 -65 100 -92 254 -8 -196 -23 -61 -208 -110 90 96 184 29 -180 -187 -11 80 -313
7384 -313 -99 -171 -11 181 -175 -211 220 -3 198 185 -108 84 -98 -67 -111 71 119 256 -134 140 29 -23
7406 -23 -310 -87 102 5 162 85 329 -119 -95 77 -71 -79 15 -107 -97 -143 128 -166 -147 3 -243 17 -7 -110
7430 -110 -14 176 22 146 48 237 -167 -30 -263 117 16 75 -60 80 136 53 -62 108 29 7 29 136 55
7453 55 7 10 -233 107 5 -299 -332 11 126 124 175 -200 17 218 -259 -89 19 206 -222 38 -39 18 -20 22
7477 22 112 12 21 -193 55 66 177 -46 92 287 9 -73 59 -44 -73 -130 140 -95 -187 -108 42 115 3 -186
7501 -186 30 197 -167 -166 -104 186 54 13 -186 60 169 -48 -164 85 208 62 -58 -70 249 -190 -140 -246
7523 -246 13 184 189 -344 -16 138 -137 202 263 -166 -289 27 235 -39 104 -37 151 -44 -138 -291 -139
7544 -139 60 66 -200 -41 -136 -5 -12 99 -194 -150 193 74 -153 -150 134 81 -132 235 16 -226 -69 -85 173
7567 173 36 93 -208 -166 85 -127 -64 71 -305 -110 -13 159 -121 -223 17 90 56 -9 -24 131 161 42 32
7590 32 -288 19 159 -125 183 89 -192 -83 30 18 116 -239 28 96 79 -110 83 -178 129 61 30 88 -23
7613 -23 13 30 -180 -104 -163 56 -46 -86 -81 37 73 22 -181 179 252 144 -84 -162 206 275 16 112 -68 6 203
7638 203 -276 225 -352 233 192 -35 -357 116 -170 16 -12 293 47 264 -118 -16 -130 -204 -254 146 144 -65
7660 -65 -26 214 35 -12 -270 -250 -269 -174 -26 57 84 74 86 149 -99 -76 288 19 36 18 -31 -8 -16 230 35 -75
7686 -75 -11 -125 -59 -136 -280 -41 -149 -66 -110 -99 -108 71 10 -83 111 314 132 135 -208 2 6 -87 140 168 87 101
7712 101 51 -19 169 -3 124 -12 104 -86 44 249 -58 314 -54 -33 23 -99 -155 -160 -98 22 143 -133 80
7735 80 4 -181 -17 72 -56 247 -47 -217 138 93 169 -4 0 186 67 -93 141 -270 -126 134 282 -22
7757 -22 11 260 13 60 -220 -135 21 59 -35 -200 -234 82 200 -18 43 -210 206 -213 144 -57 138 -330 114
7780 114 -214 47 -146 -256 29 73 203 210 -44 -14 147 -200 -95 186 -49 163 -142 162 129 -152 98 83
7802 83 116 33 80 411 151 6 -298 313 217 -20 126 88 -25 150 -155 -152 -130 52 -144 57 -19 223 126 -103
7826 -103 67 -75 -69 193 61 139 -27 -135 107 2 -60 -103 -171 -52 126 -89 106 -257 140 96 51 -250 -129
7849 -129 -94 -123 61 126 66 -15 14 24 -41 128 -129 -114 -271 39 -177 47 -64 -39 104 -54 125 96 -53 235
7873 235 177 -1 -172 -335 5 56 -65 -120 76 189 8 -211 -129 15 9 -77 -120 -93 119 0 184 -228 -135
7896 -135 -20 93 -179 -116 -300 243 -71 -22 5 115 -29 44 -123 286 41 -164 -82 125 231 204 -100 115
7918 115 300 -81 31 -51 -62 -9 -311 -104 -32 22 134 72 -117 -164 82 -4 77 -136 -105 99 -20 228 71
7941 71 37 167 -25 -16 25 139 175 53 -164 -259 -146 -105 134 -326 -97 -56 -131 75 245 104 5 -92 85 100
7965 100 -96 135 99 56 -45 164 149 -240 -71 21 40 374 -128 -23 118 -147 146 227 186 -186 -150 157 -296
7988 -296 211 -34 129 164 -40 -19 -199 -38 124 105 26 102 -97 187 -114 100 88 217 357 258 47 -35 -54
8011 -54 33 -176 1 -39 -26 18 70 23 12 28 -132 231 -6 71 43 -241 63 52 -66 14 50 220 146 -74 -14
8036 -14 116 17 -29 -262 93 -134 257 77 -25 -148 160 296 43 -162 -99 242 2 -1 -289 -37 237 -226
8058 -226 -194 -65 -95 -174 -151 -6 -110 187 152 141 109 117 84 -35 -87 53 100 129 225 -93 -83 36 195 -179 -62
8083 -62 -68 -40 -20 24 -221 380 134 -67 125 -222 105 -84 97 86 196 -8 -226 93 -4 -3 34 -149 -62 56
8107 56 351 -137 -64 -100 -194 -13 70 -152 -14 -3 -179 -26 98 170 -49 -265 -183 10 16 -110 231 -32 89
8130 89 -82 146 -50 110 -135 184 6 -142 -26 -14 47 -208 -66 256 142 196 98 -120 -211 -76 58 -121
8152 -121 105 -174 68 -85 70 134 301 34 27 -75 170 110 -39 -169 25 13 79 68 24 -77 -186 -85 16
8175 16 -47 108 53 61 5 -110 -126 409 -129 187 143 87 -68 -48 87 104
8191A04
##END NTUPLES=NMR FID
##END=
