##TITLE=1H_Pr 4773
 CDCl3, 8 sc, 
 6.5.2019
##JCAMPDX= 6.0         $$ Bruker NMR JCAMP-DX V2.0
##DATA TYPE= NMR FID
##DATA CLASS= NTUPLES
##ORIGIN= UXNMR, Bruker Analytische Messtechnik GmbH
##OWNER= root
$$ XWIN-NMR		Version 3.5
$$ Mon May  6 17:00:45 2019 Russian Standard Time (UT+4h)  she@DPX200
##.OBSERVE FREQUENCY= 200.1315
##.OBSERVE NUCLEUS= ^1H
##.DELAY= (6, 6)
##.ACQUISITION MODE= SIMULTANEOUS
##.ACQUISITION SCHEME= undefined
##.AVERAGES= 8
##.DIGITISER RES= 18
##SPECTROMETER/DATA SYSTEM= spect
##.PULSE SEQUENCE= zg30
##.SOLVENT NAME= CDCl3
##.SHIFT REFERENCE= (INTERNAL, CDCl3, 0, 15.7039)
##AUDIT TRAIL= $$ (NUMBER, WHEN, WHO, WHERE, WHAT)
$$ ##TITLE= Audit trail, XWIN-NMR		Version 3.5
$$ ##JCAMPDX= 5.01
$$ ##ORIGIN= Bruker BioSpin GmbH
$$ ##OWNER= she
$$ F:/spectra/data/she/nmr/H-F/1/audita.txt
$$ ##AUDIT TRAIL=  $$ (NUMBER, WHEN, WHO, WHERE, WHAT)
(   1,<2019-05-06 16:59:19.54 +0400>,<she>,<DPX200>,
      <created by zg, POWCHK disabled, PULCHK disabled
       configuration hash MD5:
       00 E9 B6 7A A2 85 ED C7 34 08 36 98 17 FE 4E 26
       data hash MD5: 16K
       F8 B0 CC ED 88 AF 2A 34 3F 50 46 1E 20 F3 05 ED>)
$$ ##END=
$$ 
$$ hash MD5
$$ A6 06 98 50 4D FB FA 61 FA D3 AB FB CA CC F6 38
##$RELAX= 
##$RELAX= 
##$RELAX= 
##$RELAX= 
##$RELAX= 
##$RELAX= 
$$ Bruker specific parameters
$$ --------------------------
##$DU= <F:/spectra>
##$EXPNO= 1
##$NAME= <H-F>
##$PROCNO= 1
##$TYPE= <nmr>
##$USER= <she>
##$AMP= (0..31)
100 100 100 100 100 100 100 100 100 100 100 100 100 100 100 100 100 100 
100 100 100 100 100 100 100 100 100 100 100 100 100 100 
##$AQSEQ= 0
##$AQ_mod= 1
##$AUNM= <au_zg>
##$AUTOPOS= <>
##$BF1= 200.13
##$BF2= 200.13
##$BF3= 200.13
##$BF4= 200.13
##$BF5= 200.13
##$BF6= 200.13
##$BF7= 200.13
##$BF8= 200.13
##$BYTORDA= 1
##$CFDGTYP= 0
##$CFRGTYP= 5
##$CHEMSTR= <none>
##$CNST= (0..31)
1 1 145 1 1 1 1 1 1 1 1 1 1 1 1 1 1 1 1 1 1 1 1 1 1 1 1 1 1 1 1 1 
##$CPDPRG= <>
##$CPDPRG1= <>
##$CPDPRG2= <>
##$CPDPRG3= <>
##$CPDPRG4= <mlev>
##$CPDPRG5= <mlev>
##$CPDPRG6= <mlev>
##$CPDPRG7= <mlev>
##$CPDPRG8= <mlev>
##$CPDPRGB= <>
##$CPDPRGT= <>
##$D= (0..31)
0 1.2 0 0 0 0 0 0 0 0 0 0.03 0 0 0 0 0 0 0 0 0 0 0 0 0 0 0 0 0 0 0 0 
##$DATE= 1557147558
##$DBL= (0..7)
120 120 120 120 120 120 120 120 
##$DBP= (0..7)
150 150 150 150 150 150 150 150 
##$DBP07= 0
##$DBPNAM0= <>
##$DBPNAM1= <>
##$DBPNAM2= <>
##$DBPNAM3= <>
##$DBPNAM4= <>
##$DBPNAM5= <>
##$DBPNAM6= <>
##$DBPNAM7= <>
##$DBPOAL= (0..7)
0.5 0.5 0.5 0.5 0.5 0.5 0.5 0.5 
##$DBPOFFS= (0..7)
0 0 0 0 0 0 0 0 
##$DE= 6
##$DECBNUC= <off>
##$DECIM= 24
##$DECNUC= <off>
##$DECSTAT= 4
##$DIGMOD= 1
##$DIGTYP= 9
##$DL= (0..7)
0 120 120 120 120 120 120 120 
##$DP= (0..7)
150 150 150 150 150 150 150 150 
##$DP07= 0
##$DPNAME0= <>
##$DPNAME1= <>
##$DPNAME2= <>
##$DPNAME3= <>
##$DPNAME4= <>
##$DPNAME5= <>
##$DPNAME6= <>
##$DPNAME7= <>
##$DPOAL= (0..7)
0.5 0.5 0.5 0.5 0.5 0.5 0.5 0.5 
##$DPOFFS= (0..7)
0 0 0 0 0 0 0 0 
##$DQDMODE= 0
##$DR= 18
##$DS= 0
##$DSLIST= <SSSSSSSSSSSSSSS>
##$DSPFIRM= 0
$$ [...]
##$SUBNAM2= <"">
##$SUBNAM3= <"">
##$SUBNAM4= <"">
##$SUBNAM5= <"">
##$SUBNAM6= <"">
##$SUBNAM7= <"">
##$SUBNAM8= <"">
##$SUBNAM9= <"">
##$SW= 24.9337058887773
##$SWIBOX= (0..15)
0 0 2 0 0 0 0 0 0 0 0 0 0 0 0 0 
##$SW_h= 4990.01996007984
##$TD= 16384
##$TD0= 1
##$TE= 0
##$TE2= 300
##$TE3= 300
##$TEG= 300
##$TL= (0..7)
0 120 120 120 120 120 120 120 
##$TP= (0..7)
150 150 150 150 150 150 150 150 
##$TP07= 0
##$TPNAME0= <>
##$TPNAME1= <>
##$TPNAME2= <>
##$TPNAME3= <>
##$TPNAME4= <>
##$TPNAME5= <>
##$TPNAME6= <>
##$TPNAME7= <>
##$TPOAL= (0..7)
0.5 0.5 0.5 0.5 0.5 0.5 0.5 0.5 
##$TPOFFS= (0..7)
0 0 0 0 0 0 0 0 
##$TUNHIN= 0
##$TUNHOUT= 0
##$TUNXOUT= 0
##$USERA1= <user>
##$USERA2= <user>
##$USERA3= <user>
##$USERA4= <user>
##$USERA5= <user>
##$V9= 5
##$VALIST= <valist>
##$VCLIST= <CCCCCCCCCCCCCCC>
##$VD= 0
##$VDLIST= <DDDDDDDDDDDDDDD>
##$VPLIST= <PPPPPPPPPPPPPPP>
##$VTLIST= <TTTTTTTTTTTTTTT>
##$WBST= 1024
##$WBSW= 4
##$XGAIN= (0..3)
0 0 0 0 
##$XL= 0
##$YL= 0
##$YMAX_a= 162695
##$YMIN_a= -199311
##$ZGOPTNS= <>
##$ZL1= 120
##$ZL2= 120
##$ZL3= 120
##$ZL4= 120
##$ABSF1= 10
##$ABSF2= 0
##$ABSG= 5
##$ABSL= 3
##$ALPHA= 0
##$AQORDER= 0
##$ASSFAC= 0
##$ASSFACI= 0
##$ASSFACX= 0
##$ASSWID= 0
##$AUNMP= <proc_1d>
##$AZFE= 0.1
##$AZFW= 0.1
##$BCFW= 1
##$BC_mod= 2
##$BYTORDP= 1
##$COROFFS= 0
##$CY= 11.3945322036743
##$DATMOD= 1
##$DC= 2
##$DFILT= <>
##$DTYPP= 0
##$F1P= 18.9103706918063
##$F2P= -1.10871071338519
##$FCOR= 0.5
##$FTSIZE= 0
##$FT_mod= 4
##$GAMMA= 1
##$GB= 0.15
##$INTBC= 1
##$INTSCL= 1
##$ISEN= 128
##$LB= 0.24
##$LEV0= 0
##$LPBIN= 0
##$MAXI= 10000
##$MC2= 0
##$MEAN= 0
##$ME_mod= 0
##$MI= 1.114404
##$NCOEF= 0
##$NC_proc= 0
##$NLEV= 6
##$NOISF1= 3.799351
##$NOISF2= 2.8
##$NSP= 1
##$NTH_PI= 0
##$NZP= 0
##$OFFSET= 15.70392
##$PC= 1
##$PHC0= -8862.243
##$PHC1= 24.40026
##$PH_mod= 1
##$PKNL= yes
##$PPARMOD= 0
##$PSCAL= 0
##$PSIGN= 0
##$REVERSE= no
##$SF= 200.130013532006
##$SI= 16384
##$SIGF1= 3
##$SIGF2= 2
##$SINO= 400
##$SIOLD= 16384
##$SREGLST= <1H.CDCl3>
##$SSB= 0
##$STSI= 0
##$STSR= 0
##$SW_p= 3612.71676300578
##$SYMM= 0
##$S_DEV= 0
##$TDeff= 0
##$TDoff= 0
##$TI= <>
##$TILT= no
##$TM1= 0
##$TM2= 0
##$TOPLEV= 0
##$USERP1= <user>
##$USERP2= <user>
##$USERP3= <user>
##$USERP4= <user>
##$USERP5= <user>
##$WDW= 1
##$XDIM= 8192
##$YMAX_p= 0
##$YMIN_p= 0
$$ End of Bruker specific parameters
$$ ---------------------------------
##NTUPLES= NMR FID
##VAR_NAME=  TIME,          FID/REAL,        FID/IMAG
##SYMBOL=    X,             R,               I
##VAR_TYPE=  INDEPENDENT,   DEPENDENT,       DEPENDENT
##VAR_FORM=  AFFN,          ASDF,            ASDF
##VAR_DIM=   8192,          8192,            8192
##UNITS=     SECONDS,       ARBITRARY UNITS, ARBITRARY UNITS
##FACTOR=    0.0002004,     1,               1
##FIRST=     0,             0,               0
##LAST=      1.6414764,     0,               0
##MIN=       0,             -199311,         0
##MAX=       1.6414764,     162695,          0
$$ Real data points
##PAGE= N=1
##DATA TABLE= (X++(R..R)), XYDATA
$$ [...]
160 -61865 106422 7298 -106664 52342 67118 -96029 -5773 108898 -45356 -69801 86609
171 86609 6515 -96555 58799 75362 -94630 -17326 103921 -37507 -65934 92011 18747
182 18747 -101718 39669 76027 -77948 -14422 97004 -43396 -72803 91809 27420 -104407
193 -104407 26319 73481 -78266 -25543 93489 -36938 -79816 78713 28575 -99580 22532
204 22532 69961 -82410 -30198 99883 -28623 -88343 70278 40012 -89587 20137 71718
215 71718 -77210 -35782 97014 -19540 -81406 71330 38527 -97823 15501 86418 -65512
226 -65512 -48402 83875 -15029 -78732 66351 40629 -93711 11724 82086 -68717 -52082
237 -52082 90999 -5083 -88024 51033 46189 -81188 9344 78317 -65662 -52595 88170
248 88170 -3642 -89492 49859 52726 -82416 -3980 77847 -52604 -52185 78391 -5747 -89368
260 -89368 47717 54900 -82976 -9015 82091 -45577 -59764 71062 5039 -79819 43922
271 43922 50933 -83130 -7301 92282 -35848 -64924 67981 14675 -75764 39177 55916
282 55916 -74225 -9019 88230 -34422 -61055 75941 21946 -83849 28737 65838 -61737
293 -61737 -14566 80818 -29105 -55176 77624 23110 -85932 30265 74759 -60505 -25286
304 -25286 82223 -15440 -55051 68437 24968 -77844 31195 72326 -64439 -28564 87832
315 87832 -9819 -65026 58529 33429 -70951 22749 66170 -62430 -30339 85235 -10711
326 -10711 -69500 57096 39778 -73561 10058 67357 -50773 -32522 74374 -13265 -68301
337 -68301 59502 44045 -76867 1258 70622 -42711 -38914 67204 -7321 -66429 51174
348 51174 41664 -74429 1797 73118 -44345 -48725 66115 2880 -67250 39147 40836 -67446
360 -67446 920 69854 -44681 -49808 68453 6569 -74310 32114 48170 -60678 -6191
371 -6191 65501 -39128 -48139 65740 5860 -75979 31420 52956 -62206 -14702 68047 -29691
383 -29691 -49877 58774 8137 -73363 29671 53956 -63113 -19279 70660 -23936 -53800
394 -53800 55338 14887 -70104 23839 52425 -59815 -19273 72196 -21476 -58632 53084
405 53084 23150 -67537 15799 51719 -54308 -20945 68441 -19295 -59163 52566 27376 -68558
417 -68558 10125 55138 -47811 -26140 63882 -14079 -55981 50592 28940 -66615 9400 59211
429 59211 -44546 -31679 62833 -5284 -53879 45123 31132 -62055 9426 61319 -41863 -34336
441 -34336 63309 -177 -55399 41096 35933 -57270 5438 59450 -39196 -35519 62891 1953
453 1953 -59767 36313 40222 -54930 -869 57744 -36034 -38200 58838 2018 -62487 33037 42411
466 42411 -57060 -8736 58429 -30565 -41846 52217 2943 -61961 30064 42181 -58153 -11739
478 -11739 60999 -27008 -47455 48794 9901 -59351 24417 41798 -54640 -11547 62364 -24215
490 -24215 -49193 48724 15461 -59456 18666 44787 -47726 -14190 59381 -21045 -48029 48891
502 48891 18735 -61585 13442 47426 -43954 -19883 54969 -16918 -47887 44148 17735 -62087
514 -62087 10483 48793 -44526 -28125 52788 -11088 -49461 37275 18476 -59746 7369 46959
526 46959 -44590 -30556 54088 -7316 -53133 33076 25080 -54607 3699 46248 -40838 -29098
538 -29098 55350 -4091 -52998 35071 32418 -52023 423 50321 -31395 -28433 53653 -578
550 -578 -49777 38036 37757 -49979 -724 55627 -25562 -30885 52092 5470 -47595 34274 38297
563 38297 -47985 -1060 57931 -24261 -36313 49579 10312 -47857 27922 38141 -45474 -3985
575 -3985 54999 -24267 -38954 48609 12247 -52338 20263 40133 -41647 -8678 51206 -22078
587 -22078 -39269 45668 12500 -53874 17858 42294 -40851 -15113 49902 -16053 -39147 40144
599 40144 11955 -52884 16124 43030 -40812 -18759 50479 -11485 -42278 36256 16637 -49604
611 -49604 12069 40818 -39737 -19526 51712 -9272 -45439 33738 21389 -48510 6104 40018
623 40018 -36364 -21273 48809 -9019 -46588 33527 24204 -50296 1147 42192 -32337 -25150
635 -25150 45179 -6412 -45156 32025 24686 -50727 307 45668 -30535 -30105 43709 -659 -43490
648 -43490 28790 25576 -47639 -271 46348 -29014 -31759 44879 3592 -45795 24502 30066 -41946
661 -41946 -2356 44464 -26885 -31236 45142 6381 -46699 22311 33687 -39371 -5549 44727
673 44727 -21437 -31019 41837 7821 -45055 22550 36679 -38275 -9429 45679 -16011 -32245
685 -32245 38451 9538 -44047 19374 36846 -37292 -11280 46327 -13681 -35923 35213 12729
697 12729 -42556 14895 35059 -36322 -12763 46820 -12313 -38935 33220 16161 -43534 9349
709 9349 35325 -33031 -14934 43603 -12128 -39069 33157 17314 -46809 5374 38058 -30817
721 -30817 -20128 40409 -8231 -37517 30680 16970 -46890 5101 40169 -30478 -23042 41681
733 41681 -3343 -38923 27014 20251 -41565 3936 38797 -29842 -23557 43375 -209 -40974
745 -40974 24266 23995 -39612 -135 38206 -26418 -25893 39489 97 -41075 23019 25858 -40938
758 -40938 -5909 37409 -22684 -27498 35936 661 -42565 20472 28185 -38863 -9257 37045
770 37045 -20384 -29694 33854 4431 -40967 17277 27876 -37682 -9035 40167 -17533 -33556
782 -33556 31971 9298 -38306 14723 29421 -34108 -8738 40904 -14990 -32668 34134 13331
794 13331 -39363 12957 34036 -28042 -9750 40021 -11328 -29777 35248 15053 -39799 12089
806 12089 37645 -26323 -13300 40038 -6671 -30615 31078 15572 -38722 10453 36905 -28084
818 -28084 -16416 41128 -3656 -34019 26552 17553 -36397 7416 35138 -27161 -17184 41188
830 41188 -2756 -35712 25555 21739 -36285 2624 35045 -22642 -17867 38467 -1877 -36025
842 -36025 24968 24178 -35839 -998 35729 -19976 -20447 36451 1450 -34226 22720 24071 -35007
855 -35007 -1306 37976 -18681 -24240 34335 5468 -33075 19999 23919 -34120 -3169 37681
867 37681 -17756 -26660 32940 6787 -35421 15959 25758 -31741 -6592 34573 -17920 -27786 32751
880 32751 7434 -39048 12847 27946 -30267 -9640 33860 -15145 -28752 29942 8275 -37560
892 -37560 12544 29331 -31296 -12647 36153 -10667 -30582 26550 9831 -35835 11710 29693
904 29693 -30573 -14163 36919 -8725 -32434 25310 13214 -35887 7137 30204 -27061 -14105
916 -14105 35779 -7835 -32766 25442 16697 -35546 4176 31210 -23605 -15491 34865 -5063
928 -5063 -32258 24165 17783 -35677 2350 32998 -21500 -18776 33154 -1315 -31124 21696 17855
941 17855 -34840 1230 34286 -20494 -21228 32921 2031 -31415 19717 20192 -32155 -288 33419
954 33419 -18659 -21152 33841 4460 -32871 18036 23784 -29749 -3282 33193 -16728 -22158 32781
967 32781 5957 -33589 16705 25764 -29688 -5942 34148 -13751 -24060 30200 6569 -32955
979 -32955 16204 27595 -29615 -8952 34728 -10843 -25368 28308 9188 -33050 13113 27464
991 27464 -28050 -9412 35056 -10874 -28913 26779 11998 -32935 8716 27290 -26057 -10769
1003 -10769 33128 -10014 -30016 25157 12842 -33904 6028 28475 -24055 -14128 31246 -7687
1015 -7687 -29814 23456 13586 -34324 4100 29557 -22420 -16852 30273 -4810 -30180 20810
1027 20810 14374 -33302 2180 29962 -21813 -18735 30586 -2041 -31082 18068 16415 -31336
1039 -31336 133 29221 -21047 -19113 31655 363 -32432 16519 19639 -30100 -1909 29497
1051 29497 -17573 -19628 30179 1965 -31802 17268 21925 -30304 -5238 31463 -14053 -21143
1063 -21143 28265 3987 -30641 16091 23139 -29046 -5408 32797 -12591 -23108 28004 8330
1075 8330 -29726 13910 24123 -27252 -6218 33364 -11265 -24880 27223 11050 -29778 11036
1087 11036 25650 -24257 -8006 31553 -9683 -25140 26582 11875 -30991 8647 27589 -21719
1099 -21719 -11126 30240 -7077 -25267 24337 12170 -30348 7371 28643 -21750 -13688 30672
1111 30672 -3670 -26642 20949 13150 -29028 5933 28030 -21132 -14586 30581 -2812 -28702
1123 -28702 19284 16019 -28575 2534 27367 -19666 -15111 30487 -2350 -29455 18446 17172
1135 17172 -29371 -196 27870 -17487 -16875 28186 -1484 -29422 17727 17872 -30200 -2734 29014
1148 29014 -16316 -19670 26453 591 -29454 14978 17473 -29815 -3521 29316 -16088 -21929
1160 -21929 26365 4166 -29677 12416 18807 -27843 -4703 28860 -14357 -22029 26655 6232
1172 6232 -30136 11132 22566 -24299 -7006 28246 -11509 -21667 26027 8034 -29475 10584
1184 10584 24159 -23583 -8991 28821 -8232 -22552 23460 9364 -28537 9644 25132 -22580
1196 -22580 -10800 28983 -6380 -24277 21306 11519 -27452 6905 24931 -21368 -11700 29510
1208 29510 -5249 -26159 20194 13327 -27274 4442 25597 -19360 -12689 28196 -4061 -26099
1220 -26099 19499 14891 -27937 2466 27388 -16768 -14326 27693 -1820 -25844 19074 16060
1232 16060 -27342 1653 28459 -15747 -16289 27395 1002 -26433 16475 17038 -26018 -153 28496
1245 28496 -15023 -18014 27092 3036 -26999 13552 18234 -25268 -2892 27416 -13796 -19097
1257 -19097 25895 4034 -28899 11552 19608 -24550 -5807 26385 -12434 -20338 24027 5295
1269 5295 -28554 10097 20893 -24274 -8486 26554 -9450 -21328 22157 6581 -27728 9313
1281 9313 21339 -23436 -9708 27254 -7999 -23071 20866 9294 -26482 6925 21918 -21776
1293 -21776 -9670 27287 -6916 -24414 20142 11347 -26490 5130 23099 -19794 -11651 26116
1305 26116 -5857 -24414 19841 12481 -27791 3409 24436 -18493 -13312 25619 -3718 -24891
1317 -24891 17656 12901 -26931 2302 25491 -17592 -15717 25352 -1047 -25320 15543 13773
1329 13773 -26040 1249 25751 -16526 -16203 25838 1143 -26031 13950 16504 -23980 -1106
1341 -1106 25106 -14483 -16019 25589 2138 -26623 13598 18481 -23345 -2985 25663 -11431
1353 -11431 -16947 23732 3192 -25405 13140 19263 -23662 -4941 26680 -9748 -18325 22526
1365 22526 5715 -24901 10320 19219 -22304 -5360 26827 -9321 -20319 21753 8239 -24829
1377 -24829 8073 19656 -21049 -6886 25830 -8781 -21086 21044 9285 -26010 6522 21861
1389 21861 -19609 -9690 24615 -6913 -21140 19997 9640 -26420 5631 22978 -19328 -11616
1401 -11616 24737 -4495 -22687 17867 10431 -25180 4714 23032 -18976 -13246 25115 -3314
1413 -3314 -24062 16321 12985 -24594 2143 22412 -17265 -13535 24559 -2016 -24998 15139
1425 15139 14632 -24303 -187 22915 -15097 -14655 23095 -842 -24624 14293 15005 -24068 -1778
1438 -1778 24249 -12990 -16152 21867 1367 -23892 12758 15928 -23165 -2956 24833 -11615
1450 -11615 -17244 22258 3902 -24012 10759 16901 -21446 -3584 24569 -10339 -17788 22216
1462 22216 5620 -24742 9331 18844 -20097 -5149 24238 -9086 -18063 21598 6981 -24274
1474 -24274 8675 20062 -19737 -7178 24765 -6861 -19094 20337 8577 -23821 7706 20880
1486 20880 -19186 -8595 24974 -5176 -19675 18826 9622 -23492 6067 21516 -18016 -9567
1498 -9567 24725 -4017 -20868 18123 11626 -23112 3831 21499 -16632 -10962 23925 -2899
1510 -2899 -22237 16381 12822 -23030 2085 21516 -15359 -12477 22702 -1945 -22212 14817
1522 14817 13356 -23130 -29 22192 -13643 -13988 21386 -617 -22694 13048 13844 -22325 -1033
1535 -1033 22457 -13212 -15903 21015 1707 -22973 10727 14029 -21930 -2513 22227 -12001
1547 -12001 -16501 20384 2828 -23790 9381 15568 -20703 -4011 21814 -10774 -17095 19874
1559 19874 3532 -24037 8779 16995 -20059 -5961 22074 -8846 -17495 18884 4903 -23147
1571 -23147 8301 17727 -19520 -7039 22876 -6703 -18075 18379 6755 -22251 7047 17912
1583 17912 -18525 -7734 23292 -5800 -19205 17135 9108 -21513 5457 18576 -16848 -8009
1595 -8009 22721 -4704 -19239 17309 10071 -22299 3894 20554 -14732 -9448 21492 -3078
1607 -3078 -19099 16456 11060 -21613 3080 20956 -13673 -10781 21295 -953 -19274 14247
1619 14247 11540 -20390 2100 21208 -13333 -12084 21470 743 -20071 12665 13075 -19485 461
1632 461 20560 -12031 -12667 20833 1075 -21212 11346 14298 -19088 -1727 20152 -10775 -13993
1645 -13993 19238 1527 -21355 10405 14933 -19635 -3775 21054 -9310 -15217 17871 2984
1657 2984 -21311 8894 14721 -19264 -4677 21311 -8694 -16633 17521 4891 -21068 6971
1669 6971 14974 -17744 -5173 20683 -7998 -17094 16929 5817 -21563 5341 16514 -16592
1681 -16592 -7119 19625 -6527 -17263 16105 7037 -21443 4190 17281 -15507 -8563 19872
1693 19872 -4592 -17462 14538 7934 -20260 3674 17692 -15052 -9625 19905 -2334 -18033
1705 -18033 13334 9460 -19488 3041 17993 -13856 -10050 19405 -1270 -18014 12875 11162
1717 11162 -18489 1076 18129 -12008 -10211 19512 -348 -18416 12325 12607 -18418 -113
1729 -113 19489 -10875 -11420 18718 1053 -18172 11391 13149 -18088 -717 19676 -9630 -12877
1742 -12877 17942 2539 -18698 9772 13555 -17064 -1625 19824 -8773 -13508 17768 3796
1754 3796 -18653 8636 13919 -16472 -2986 19419 -7631 -14026 16868 4739 -19211 7195
1766 7195 14768 -15447 -4720 18925 -6517 -14715 15647 5556 -19193 5741 15504 -14940 -6004
1779 -6004 18715 -4836 -15233 14339 5869 -18751 4809 15799 -14444 -7695 18067 -3736
1791 -3736 -16270 13293 7271 -18387 3242 15287 -13751 -8451 17935 -3428 -17231 12281
1803 12281 8543 -17930 1544 15704 -12844 -9314 17704 -2376 -17043 11603 9223 -18416
1815 -18416 382 16240 -12099 -10629 16493 -1358 -17200 11151 10070 -18005 -247 16711
1827 16711 -10767 -11779 16469 185 -17475 9332 10574 -17305 -810 17122 -10491 -12839
1839 -12839 16123 2155 -17661 8439 11813 -15758 -2389 17032 -8641 -12185 16034 2772
1851 2772 -17901 7746 13209 -14718 -3377 17246 -6915 -12491 15141 3638 -17389 6937
1863 6937 13959 -14309 -4576 17600 -5211 -13089 14064 4820 -16282 6108 14225 -13696 -5049
1876 -5049 17828 -4451 -14015 13709 6629 -16478 4577 14157 -12470 -5322 17768 -3494 -14525
1889 -14525 13086 7425 -16453 3317 15239 -11454 -6833 16790 -3047 -14133 12711 8006
1901 8006 -16670 2342 15532 -11238 -8085 16459 -1783 -14779 11325 8343 -16085 1856
1913 1856 15605 -10928 -9242 16168 -800 -15601 9523 8891 -15830 481 14884 -10318 -9846
1926 -9846 15628 32 -16367 8846 10157 -15338 -1256 14993 -9551 -10866 14706 883
1938 883 -16496 8402 10619 -15259 -2502 15275 -7830 -11455 13608 1860 -15900 7057 11113
1951 11113 -14988 -3553 15893 -6577 -12080 13176 2782 -15889 5728 11430 -13180 -3919
1963 -3919 15667 -5734 -12881 12470 4757 -15731 4970 12070 -12701 -4344 15502 -4928 -13000
1976 -13000 12480 5270 -15498 4128 13384 -11483 -5379 15259 -3838 -12566 12181 6051 -15303
1989 -15303 3643 13579 -10970 -5865 15481 -2287 -12854 11200 6905 -14816 3440 13982
2001 13982 -10676 -6897 15751 -1236 -13319 10609 8096 -14208 2039 14110 -9354 -7419
2013 -7419 15449 -269 -13484 9916 9085 -13642 629 14444 -8517 -8030 14629 520 -13510
2026 -13510 9220 9213 -13815 -541 14586 -7572 -9533 13644 1147 -13950 7758 9345 -13382
2039 -13382 -1742 14518 -7112 -10024 12656 2011 -14220 6385 9806 -12889 -2504 14193
2051 14193 -6171 -11181 11948 2859 -14610 5313 10392 -12564 -3741 13516 -6122 -11191 11355
2064 11355 3283 -14979 4447 10955 -11967 -4847 13704 -5177 -11923 10893 3580 -14887 3590
2077 3590 11624 -11714 -5655 13465 -3790 -12038 9870 4993 -14604 2626 11800 -10843 -6103
2090 -6103 13682 -3044 -12709 9485 6028 -13770 1638 11835 -9653 -6439 13527 -2016 -13112
2103 -13112 9213 7251 -13326 1022 12512 -8667 -7169 12936 -832 -12410 8963 7856
2115 7856 -13225 311 13268 -7886 -8167 13128 482 -12301 8205 8372 -12499 132 13680
2128 13680 -7311 -8637 12924 1970 -12570 7092 9054 -11520 -850 13441 -6547 -8667
2140 -8667 12531 2382 -13019 6385 9747 -10840 -2034 12842 -5699 -8982 11698 2960 -12914
2153 -12914 5505 10504 -11270 -2773 13131 -4425 -10022 10836 3074 -12986 4659 10516 -11527
2166 -11527 -3858 13335 -4177 -10804 9803 3949 -12977 3419 10318 -10517 -4424 13209 -3710
2179 -3710 -11165 9573 4804 -13017 2505 10707 -9614 -5439 12219 -2736 -11470 9247 5178
2192 5178 -12654 1587 11163 -8795 -6100 11951 -2015 -11377 8603 5722 -12658 907 11109
2205 11109 -8710 -6844 11888 -803 -11588 7548 6633 -11824 265 11358 -7766 -7390 12241
2218 12241 -55 -11578 7110 7606 -11608 -454 11622 -6977 -7671 11594 515 -12132 6648
2231 6648 8363 -11376 -949 12035 -6083 -8081 11103 1480 -11488 6470 8573 -10638 -1586
2244 -1586 12686 -5129 -8350 10904 2754 -11966 5688 9523 -10329 -1763 12471 -4756 -8905
2257 -8905 11067 3414 -11528 4607 9913 -9358 -2669 12467 -3859 -9085 9800 4333 -11785
2270 -11785 4049 10333 -8902 -3503 12376 -3157 -9688 9747 4688 -11413 3079 10522 -8793
2283 -8793 -4340 11822 -2129 -10040 8976 4823 -11595 2325 10114 -8065 -5524 11387 -1410
2296 -1410 -10514 8020 5082 -11472 1486 10294 -7740 -5971 11135 -1118 -10962 7275 5979
2309 5979 -11421 237 10282 -7707 -6573 11024 -635 -11405 6812 6267 -11555 -531 10611
2322 10611 -6895 -7271 10259 40 -11263 6080 6839 -11217 -1447 10878 -6423 -7881 10173
2335 10173 725 -11185 5274 7351 -10575 -1558 10851 -5922 -8642 10044 1874 -11478 4453
2348 4453 7797 -10143 -2162 11189 -5102 -8662 9591 2310 -11404 3998 8919 -9587 -2782
2361 -2782 10772 -3771 -8433 9062 3121 -11294 3441 8890 -8849 -3619 11056 -3207 -8904
2374 -8904 8795 3873 -10538 3406 9351 -8258 -3880 11591 -2137 -9390 8246 4733 -10292
2387 -10292 2547 9589 -7585 -4185 11459 -1609 -9596 7886 5244 -10296 1679 9865 -6990
2400 -6990 -5231 10766 -974 -9783 7495 5721 -10334 773 10481 -6581 -6048 10704 -555
2413 -555 -9829 7033 6062 -10254 24 10576 -6410 -6337 10539 501 -10328 5665 6385 -10175
2427 -10175 -425 10230 -6064 -6928 9586 605 -10345 5485 6579 -9822 -1349 10071 -5386
2440 -5386 -7055 9553 1076 -10627 4887 7334 -9792 -2045 10127 -4969 -7892 8750 1847
2453 1847 -10645 4219 7529 -9430 -3171 10367 -4124 -8402 8083 2299 -10158 3248 7594
2466 7594 -9121 -3430 9997 -3519 -9029 8048 2970 -10489 2398 8197 -8396 -3780 10248
2479 10248 -3083 -8950 7694 4033 -10440 1870 8985 -7489 -4582 10096 -1867 -8980 7764
2492 7764 4414 -10017 1921 9360 -6816 -4611 10155 -1008 -9055 7148 5214 -9654 1147
2505 1147 9409 -6404 -4977 10068 -534 -9054 6542 5922 -9277 661 9803 -5706 -5409 10149
2519 10149 285 -9320 6267 6731 -9069 160 9895 -4802 -5436 9766 1026 -9553 5592 7054
2533 7054 -8976 -608 9926 -4291 -6474 8956 1530 -9278 5085 7217 -8515 -1564 10199
2546 10199 -4087 -7066 8543 1946 -9429 4026 7375 -8225 -2248 9615 -4027 -7744 8381
2559 8381 2229 -9960 3381 7026 -7691 -2842 9321 -3657 -7976 7640 2630 -9997 2788
2572 2788 7302 -7945 -3818 9228 -2875 -8470 7052 2864 -9991 1989 7849 -7794 -4318
2585 -4318 9090 -2475 -8673 6645 3615 -9648 1604 8221 -7225 -4807 9100 -1847 -9059
2598 -9059 6520 4357 -9423 957 8645 -6826 -4739 9435 -1338 -9125 5858 4928 -9041
2611 -9041 412 8581 -6132 -5473 9065 -421 -9181 5547 5815 -9206 -137 9247 -5096 -5821
2625 -5821 8478 532 -8927 5174 5868 -8936 -676 9596 -4760 -5986 8682 1135 -8873
2638 -8873 4572 6291 -8266 -1078 9576 -4130 -6388 8697 1640 -9035 4354 7010 -7908
2651 -7908 -1650 9610 -3472 -6638 8230 2394 -9004 3463 7116 -7197 -2240 9275 -3184
2664 -3184 -6899 7997 2663 -8927 3302 7531 -7223 -2357 9480 -2484 -7403 7306 3110
2677 3110 -9167 2556 7523 -6951 -3524 8882 -2365 -7867 6857 3624 -8736 1654 7831
2690 7831 -6512 -3996 8920 -2116 -8354 6077 3837 -9255 808 8134 -6430 -4716 8340
2703 8340 -1219 -8540 5807 4345 -8915 618 8148 -5798 -5194 8354 -536 -8374 5252 4890
2717 4890 -8740 217 8338 -5740 -5510 8283 240 -8624 4779 5456 -8487 -501 8790 -4463
2731 -4463 -5685 7981 442 -8868 4129 5969 -8048 -998 8660 -4263 -6093 8009 1080 -8982
2745 -8982 3823 6470 -7886 -1611 8614 -3693 -6446 7714 1804 -8475 3629 6778 -7516
2758 -7516 -1871 9050 -2766 -6302 7590 2564 -8582 3052 7671 -6819 -2174 9238 -2614
2771 -2614 -6790 7330 3061 -8575 2691 7499 -6488 -2736 8899 -1612 -7099 6905 3647
2784 3647 -8620 2021 7970 -5928 -3213 8586 -1256 -7243 6398 4077 -8355 1444 7885
2797 7885 -5880 -4057 8674 -764 -7530 5980 4285 -8186 764 7816 -5494 -4761 8301 -363
2811 -363 -7643 5348 4671 -8111 348 8007 -5068 -5214 8198 -159 -8236 4854 5152 -7845
2825 -7845 -554 7835 -4419 -5311 7736 514 -8478 4173 5382 -8122 -792 8217 -4339 -5909
2839 -5909 7334 897 -8416 3483 5765 -7795 -1763 8042 -3873 -6209 7020 1411 -8567 2950
2853 2950 5995 -7440 -2281 8050 -3262 -6624 6468 1851 -8529 2639 6386 -6976 -2750
2866 -2750 7873 -2806 -6953 6382 2595 -8609 2180 7200 -6641 -3171 7932 -2140 -7308
2879 -7308 5995 3080 -8104 1588 7014 -6247 -3189 8107 -1496 -6979 5598 3668 -7851
2892 -7851 1223 7656 -5673 -3761 7835 -914 -7726 5329 4301 -7709 801 7427 -5113 -4191
2906 -4191 8139 -688 -7473 5128 4571 -7187 361 7610 -4671 -4652 7423 -133 -7402 4918
2920 4918 4961 -7231 57 7796 -4030 -4913 7626 528 -7683 3932 5401 -7247 -695 8010
2934 8010 -4028 -5240 7341 1077 -7817 3704 5534 -6815 -1214 7796 -3442 -5614 6672
2947 6672 1319 -7864 3278 5828 -6670 -1644 7668 -2938 -5988 6733 2144 -7563 2794 6077
2961 6077 -6216 -2801 7564 -2495 -6331 6339 2415 -7871 2048 5952 -6176 -3022 7796
2974 7796 -1762 -6811 5549 2721 -7843 1309 6298 -5675 -3150 7575 -1552 -6607 5080 3314
2988 3314 -7453 1038 6875 -5355 -3496 7070 -1079 -6970 5072 3508 -7489 825 6964 -4881
3002 -4881 -3809 7295 -440 -6666 4776 4071 -7203 465 7094 -4328 -4288 7196 337 -6965
3016 -6965 4755 4669 -6904 -23 7245 -4155 -4206 7028 754 -6961 4029 5087 -6609 -427
3030 -427 7390 -3039 -4981 6622 1374 -6845 3732 5316 -6170 -896 7148 -3037 -4929 6343
3044 6343 1801 -7096 3007 5385 -6222 -1488 7490 -2081 -5158 6317 2283 -6926 2444 5729
3058 5729 -5663 -1962 7166 -1972 -5759 5607 2480 -7166 2148 6212 -5566 -2271 7320 -1604
3072 -1604 -5812 5144 2674 -6931 1564 5995 -5252 -3248 6783 -1335 -6202 4960 3185 -6930
3086 -6930 848 6175 -5039 -3318 6579 -1150 -6349 4536 3276 -6971 362 6277 -4877 -3628
3100 -3628 6344 -262 -6671 4104 3794 -6406 -117 6612 -3977 -3802 6498 -10 -6450 3641
3114 3641 4235 -6542 -427 6195 -3755 -4002 5988 283 -6635 3445 4369 -6228 -1019 6408 -3156
3129 -3156 -4742 5904 780 -6495 3024 4514 -5599 -1392 6691 -2716 -5128 5804 1576 -6483
3143 -6483 2481 4920 -5490 -1602 6740 -2434 -5120 5584 2000 -6260 2155 5662 -5398 -2191
3157 -2191 6605 -1764 -5108 5575 2447 -6459 1625 5669 -4734 -2271 6527 -1538 -5544 5236
3171 5236 2689 -6000 1546 5906 -4387 -2862 6436 -1046 -5550 4759 2809 -6136 1225 5773
3185 5773 -4201 -2901 6064 -1002 -5371 4139 3417 -6347 516 5740 -4058 -3052 5922 -478 -6154
3200 -6154 4078 3387 -6004 197 5668 -3706 -3699 5881 206 -5938 3397 3420 -6028 -342 5341 -3380
3216 -3380 -3922 5415 459 -5836 2966 4138 -5512 -976 5826 -2918 -4317 5246 686 -5973 2499
3231 2499 4125 -5722 -1116 5806 -2987 -4852 4793 1137 -6056 1843 4234 -4987 -1690 5769 -2006
3246 -2006 -4847 4887 1665 -6249 1641 4529 -5004 -2158 5827 -1925 -4943 4807 1776 -5837 1723
3261 1723 4500 -4761 -1906 5815 -1127 -5117 4231 2362 -5713 1126 4856 -4223 -2305 5591 -1121
3276 -1121 -5078 4267 2822 -5354 921 5054 -4039 -2601 5699 -389 -4986 3816 2809 -5305 810
3291 810 5260 -3321 -2937 5712 -155 -5060 3703 3218 -5220 -33 5588 -2951 -3150 5326 345 -5216
3307 -5216 3272 3548 -4954 -110 5399 -2886 -3368 5183 690 -5387 2703 3550 -5094 -692 5427 -2505
3323 -2505 -3632 5296 667 -5318 2265 4080 -4574 -943 5166 -2274 -3948 4606 1106 -5539 2141
3338 2141 4107 -4245 -1442 5644 -1794 -4349 4284 1595 -5379 1900 3987 -4300 -1575 4991 -1936
3353 -1936 -4260 4112 1698 -5602 1529 4157 -4314 -1694 5237 -1446 -4411 4013 1883 -5184 764
3368 764 4317 -4099 -2335 4924 -1349 -4588 3553 2245 -5358 647 4344 -3630 -2698 4768 -908
3383 -908 -4768 3481 2578 -5057 -134 4689 -3029 -2695 4779 -415 -4697 2930 2832 -4858 112 4813
3399 4813 -2895 -2821 4681 103 -4638 2824 3046 -4400 -87 4680 -2666 -3158 4812 614 -4803 2643
3415 2643 3399 -4268 -347 4975 -2603 -3494 4278 790 -4715 2287 3683 -4360 -568 5148 -2200
3430 -2200 -3270 4093 1140 -4831 2129 3602 -4125 -1053 4742 -1911 -3507 4314 1680 -4662 1586
3445 1586 3730 -3980 -1378 4998 -1520 -3809 3924 1540 -4657 1464 3885 -3639 -1288 4767 -1045
3460 -1045 -4047 3728 1492 -4760 1033 4285 -3532 -2081 4475 -957 -4189 3041 1752 -4240 917
3475 917 3976 -3293 -2319 4466 -695 -4064 2841 1820 -4523 273 4121 -3257 -2483 4365 -328 -4209
3491 -4209 2946 2556 -4533 251 4288 -2882 -2793 4398 -593 -4454 1996 2278 -4493 -465 3933 -2751
3507 -2751 -2791 3796 299 -4321 1956 2581 -4292 -269 3885 -2316 -3129 4294 488 -4560 2061 3031
3523 3031 -3838 -947 4037 -2051 -2970 3611 974 -4637 1963 3070 -3900 -872 4111 -1800 -3429
3538 -3429 3599 1237 -4182 1500 3151 -3214 -810 4604 -1223 -3269 3757 1478 -4204 1367 3513
3553 3513 -3186 -1116 4285 -770 -3449 3238 1653 -4017 727 3677 -2902 -1570 4275 -484 -3821
3568 -3821 3029 1972 -4181 789 3991 -2933 -1621 4188 -387 -3828 2701 2162 -3756 391 3827
3583 3827 -2516 -2223 3979 8 -3754 2464 2280 -3708 301 3503 -2299 -2307 3185 17 -3632 2215
3599 2215 2477 -3703 42 3577 -2343 -2415 3686 -290 -4064 2223 2371 -3628 -357 3894 -2318 -2407
3615 -2407 3428 283 -3674 1560 2472 -3487 -501 3740 -1678 -2735 3420 880 -3988 1735 2715
3630 2715 -3517 -793 3490 -1775 -2953 3221 816 -3885 1383 2702 -3374 -1271 3745 -1223 -2972
3645 -2972 2970 843 -3805 924 2882 -2924 -1303 3578 -878 -3113 3244 1407 -3758 506 3067
3660 3067 -2469 -1432 3955 -872 -3011 2759 1491 -3590 413 3361 -2463 -1521 3593 -425 -3259
3675 -3259 2479 2057 -3595 651 3139 -2424 -1929 3360 -54 -3142 2746 1900 -3472 211 3163 -2327
3691 -2327 -1936 3480 -205 -3339 2193 1887 -3313 -136 3380 -2012 -1850 3351 102 -3431 2025 2116
3707 2116 -3076 -331 3707 -1800 -2236 3233 446 -2877 1829 2681 -3054 -339 3462 -1806 -2525 3103
3723 3103 527 -3489 1726 2518 -3120 -630 3201 -1494 -2010 2898 691 -3227 1463 2661 -2880
3738 -2880 -876 3030 -1311 -2729 2558 874 -3586 1040 2556 -3012 -1261 3335 -1254 -2927 2763
3753 2763 1322 -3660 681 2450 -2517 -1223 3366 -529 -3006 2720 1190 -2777 765 2517 -2154
3768 -2154 -1331 2932 -654 -3022 2308 1431 -3128 375 2516 -2333 -1594 3132 -361 -3022 2098 1632
3784 1632 -2850 239 3099 -2150 -1564 2941 -263 -2880 1779 1743 -2856 174 3253 -1681 -1718 2802
3800 2802 -59 -3194 1943 1878 -2901 -81 3326 -1431 -2110 2999 455 -2667 1714 1948 -2698 -267
3816 -267 3020 -1696 -2159 2669 578 -2898 1490 2403 -2756 -115 3109 -906 -1993 2861 854 -2949
3832 -2949 1417 2357 -2624 -381 3334 -1186 -2072 2646 844 -2850 1143 2437 -2339 -583 3380
3847 3380 -1055 -2407 2367 562 -3290 1052 2699 -2334 -1100 3088 -908 -2561 2442 1195 -2975
3862 -2975 816 2534 -2269 -1521 2812 -588 -2404 2204 1087 -2949 216 2359 -2264 -1294 2888
3877 2888 -336 -2931 2156 1646 -3168 505 2561 -2102 -1624 2875 -536 -2624 1838 1296 -3107 63
3893 63 2620 -1919 -1547 2544 -3 -3062 1577 1582 -2655 -200 2901 -1863 -2153 2392 -39 -2672 1390
3910 1390 1708 -2500 0 2771 -1393 -1947 2463 207 -2579 1678 1912 -2371 -380 2654 -1152 -1778
3926 -1778 2796 365 -3013 993 1917 -2609 -559 2793 -847 -2005 2371 614 -2510 1310 2282
3941 2282 -2315 -993 2896 -943 -1794 2427 839 -2414 1151 2191 -2020 -678 2914 -620 -2243
3956 -2243 2282 1046 -2677 794 2217 -2378 -1009 2610 -469 -2402 1801 931 -2607 709 1980
3971 1980 -2028 -1139 2724 -260 -2010 1836 1210 -2412 94 2341 -1579 -1437 2670 -343 -2291 1738
3987 1738 1395 -2250 217 2037 -1673 -1489 2769 -121 -2661 1401 1143 -2755 -48 2042 -1463 -1362
4003 -1362 2472 -320 -2280 1501 1458 -2557 -321 2469 -1391 -1805 2389 268 -2497 1188 1458 -1974
4019 -1974 -262 2395 -1032 -1648 2185 -46 -2457 983 1750 -2391 -614 2497 -1172 -1833 2074 370
4035 370 -2333 1088 1673 -1798 -507 2716 -892 -1911 1831 304 -2349 856 2088 -2282 -606
4050 -606 2432 -738 -1636 1963 835 -2347 756 1812 -1793 -771 2392 -515 -2257 1883 822
4065 822 -2417 550 2010 -1664 -1066 2526 -458 -2081 2082 1296 -2303 486 2173 -1494 -1029 2357
4081 2357 -138 -1881 1620 1336 -2165 298 2310 -1521 -1106 2238 101 -2013 1670 952 -2396 247
4097 247 2381 -1570 -1214 2416 -154 -1969 1678 1165 -2253 -339 2064 -1271 -1346 2214 -30 -2295
4113 -2295 1499 1142 -2229 -311 2250 -1271 -1426 2159 245 -2286 979 1687 -2147 -426 2122 -1225
4129 -1225 -1969 1908 147 -2417 1025 1467 -2270 -481 2147 -1117 -1731 1906 464 -2655 578 1593
4145 1593 -1791 -500 2201 -775 -1948 1857 631 -2522 565 1675 -1926 -801 1909 -747 -1829
4160 -1829 1957 1060 -2269 566 1968 -1564 -849 1908 -487 -1527 1446 950 -2242 564 1927 -1643
4176 -1643 -848 1883 -323 -1917 1722 789 -2381 362 1760 -1442 -1118 2285 -352 -2024 1316 1291
4192 1291 -2029 311 2313 -1391 -1109 1761 -190 -1952 1457 1265 -2202 9 1824 -1286 -1285 2267
4208 2267 -30 -1971 1308 1253 -2257 73 2368 -1248 -1442 2091 305 -1849 1356 1295 -1566 -417
4224 -417 1856 -998 -1506 1923 239 -1914 593 1552 -1859 -698 2053 -968 -1638 2060 292 -1870
4240 -1870 1126 1480 -1757 -728 1971 -698 -1554 1752 514 -2083 649 1547 -2008 -612 1856 -955
4256 -955 -1704 1645 603 -2123 501 1554 -1928 -752 2228 -599 -2031 1444 591 -2031 441 1994
4272 1994 -1648 -782 2106 -510 -1944 1426 654 -2001 433 1526 -1402 -849 2070 -566 -1481 1335
4288 1335 897 -2154 225 1632 -1133 -1267 2005 -413 -1954 1536 808 -2050 140 1786 -1149 -1049
4304 -1049 1902 24 -1925 1407 1137 -1790 174 1893 -1292 -982 2066 -118 -1940 1137 1178 -1703
4320 -1703 312 1885 -1009 -1385 2020 325 -2194 874 1360 -1751 -186 2163 -875 -1434 1706 471
4336 471 -1913 1200 1375 -1790 -602 2070 -545 -1179 1493 526 -1823 812 1219 -1698 -377 2183
4352 2183 -388 -1642 1346 617 -2008 724 1610 -1614 -481 1860 -373 -1702 1514 735 -1991 481
4368 481 1700 -1093 -761 1528 -297 -1549 1361 739 -1596 693 1337 -1354 -972 1893 -129 -1796
4384 -1796 1356 894 -1871 396 1697 -1305 -700 1843 -119 -1656 1487 689 -1766 349 1433 -1159
4400 -1159 -965 1657 -13 -1675 1019 949 -1460 45 1781 -1036 -820 1853 37 -1720 1028 960
4416 960 -1712 39 1683 -990 -1020 1425 -244 -1566 685 1177 -1492 89 1480 -925 -1340 1527
4432 1527 117 -1428 848 1264 -1379 -338 1790 -836 -1053 1466 233 -1326 744 1222 -1158 -369
4448 -369 1802 -540 -1320 1505 455 -1597 504 1272 -1420 -287 1554 -514 -1230 1238 650 -1551
4464 -1551 501 1630 -1457 -557 1716 -533 -959 1411 210 -1612 604 1241 -1269 -514 1386 -108
4480 -108 -985 1458 1080 -1669 384 1487 -1103 -635 1669 -404 -1623 934 715 -1355 272 1364
4496 1364 -878 -616 1479 -481 -1463 1235 487 -1546 -234 1459 -782 -895 1486 -177 -1353 1041
4512 1041 785 -1400 -60 1336 -1070 -1021 1418 87 -1408 917 952 -1266 -73 1496 -817 -1083
4528 -1083 1111 -86 -1630 874 1132 -1477 -348 1061 -702 -908 1550 213 -1216 596 778 -1374
4544 -1374 -291 1521 -693 -1050 1131 456 -1503 650 1066 -1433 -309 1323 -589 -1016 1179 200
4560 200 -1419 384 1246 -1215 -397 1231 -567 -1083 1202 349 -1547 516 1512 -1043 -303 1256 -600
4577 -600 -1388 1000 446 -1144 359 1258 -838 -402 1254 -354 -979 939 599 -1152 217 1261 -1202
4594 -1202 -398 1474 -46 -1318 930 709 -1338 293 1210 -1055 -833 1298 -216 -1147 786 692 -1304
4611 -1304 74 1731 -666 -734 1319 -314 -1194 853 955 -1337 335 1037 -903 -1089 1190 -104
4627 -104 -1271 1037 620 -1403 218 1587 -727 -853 1222 135 -1282 802 840 -1368 -123 1255
4643 1255 -447 -1117 1154 100 -1139 490 938 -1220 -297 1239 -479 -1264 1221 -136 -1346 440
4659 440 961 -1333 -475 1324 -654 -791 987 258 -1228 185 1066 -1146 -476 1322 -596 -1100 1106
4676 1106 268 -1429 336 1090 -1070 -535 1202 -413 -1115 1018 458 -1471 317 1022 -629 -351 1264
4693 1264 -270 -1076 841 557 -931 163 1129 -856 -683 1110 -334 -885 993 828 -1266 6
4709 6 993 -702 -674 1369 -117 -1155 835 442 -728 -183 1443 -536 -566 1069 61 -1153 692
4726 692 702 -1169 65 1330 -516 -551 1208 134 -1060 813 841 -812 -2 1180 -533 -685 713
4743 713 30 -622 534 771 -979 -77 1058 -530 -945 849 -46 -935 428 1198 -875 -180 775 -360
4761 -360 -707 783 394 -997 200 824 -741 -170 776 -845 -865 812 363 -1117 280 996 -1072
4778 -1072 -535 1394 -122 -961 748 451 -1293 276 1002 -742 -175 1169 -538 -860 892 174 -1190
4795 -1190 173 628 -641 -543 1161 -201 -870 877 385 -979 199 546 -831 -237 977 -212 -695
4812 -695 609 379 -631 54 1067 -609 -464 1082 -144 -984 585 276 -1055 179 860 -595 -637
4829 -637 991 -14 -939 771 626 -654 -60 1063 -629 -573 781 148 -1009 204 570 -726 -179
4846 -179 835 -326 -619 677 -42 -967 464 1068 -743 -16 915 -396 -680 835 287 -754 388
4863 388 656 -788 -145 891 -692 -694 1126 85 -760 339 729 -470 -348 854 -181 -640 831
4880 831 229 -788 196 726 -657 -24 1049 -641 -780 758 522 -648 88 931 -585 -295 615 -398
4898 -398 -705 754 508 -748 532 424 -721 -259 596 -264 -747 682 430 -607 13 522 -627 -515
4916 -515 891 -43 -687 399 109 -774 -195 783 -713 -251 764 -87 -734 407 483 -666 37 838
4934 838 -174 -514 981 112 -613 462 490 -995 345 859 -422 -1011 628 114 -744 155 645 -688
4952 -688 134 525 -623 -445 431 23 -812 236 538 -446 72 605 -341 -429 554 32 -744 222 363 -461
4972 -461 -323 429 -327 -823 655 103 -572 371 444 -410 -138 735 -364 -469 628 327 -1040 375 164
4991 164 -323 -98 477 -324 -472 489 260 -670 84 522 -476 -26 305 -202 -237 553 344 -645 73 575
5011 575 -274 -408 642 -28 -492 390 336 -693 191 640 -312 -298 699 -268 -265 677 487 -680 22 620
5031 620 -529 -266 448 -186 -585 556 138 -589 -40 236 -373 -439 450 -149 -710 404 114 -468 -51
5050 -51 578 -388 -226 373 294 -458 478 522 -446 -50 517 -381 -292 607 328 -467 111 403 -551 -89 371
5071 371 -211 -206 613 195 -595 440 430 -585 193 486 -284 -428 472 44 -563 323 370 -448 -238 260 -84
5092 -84 -571 454 232 -729 604 443 -646 -435 680 -141 -220 479 273 -396 207 425 -423 159 548
5111 548 -235 -362 574 66 -386 55 518 -259 50 628 -178 -414 577 323 -477 325 698 -260 197 590
5131 590 -52 -418 394 107 -412 49 257 -548 -388 394 -362 -218 777 247 -324 384 300 -216 -402 517
5151 517 -112 -427 503 45 -558 88 526 -332 -249 547 -289 -585 373 296 -373 225 379 -421 -78 328 92
5172 92 -273 395 364 -443 256 476 -217 -289 601 -429 -438 336 499 -362 173 306 -199 -505 225 294 -677 369
5194 369 375 -439 -43 156 -387 -535 441 4 -594 165 469 -541 -308 170 -24 -104 599 15 -387 186 544
5215 544 -247 -5 561 -327 -361 542 281 -377 303 229 -416 -103 196 -201 -497 626 -75 -441 145 92 -319
5236 -319 -118 428 -176 -51 526 100 -391 68 478 -168 -14 451 -314 -478 336 -128 -381 385 343 -422
5256 -422 -73 619 -125 -489 476 314 -245 269 323 -269 -20 208 -218 -275 227 293 -571 79 122 -393 18
5277 18 433 -41 -363 251 110 -504 375 414 -162 -81 489 102 -375 455 252 -187 103 206 -493 -131 460
5298 460 -138 -280 89 145 -304 -91 558 56 134 335 -15 -279 -18 184 -378 78 425 -91 -5 341 -197
5319 -197 -610 179 315 -403 -196 44 -71 -426 350 122 -334 181 341 -235 45 19 -139 -37 259 27
5339 27 -212 162 407 -397 -11 496 -274 -224 155 149 -307 64 171 -166 -119 172 -194 -187 334 -77 -637 -90
5361 -90 468 -370 -167 336 -178 8 138 65 -338 112 178 -41 -207 354 -174 -385 284 -25 -412 146 189
5382 189 -243 124 213 108 -326 69 404 19 -112 332 -84 -337 360 -111 -375 115 104 -579 -53 272 45
5403 45 -45 54 82 -285 304 170 -349 -119 80 41 126 267 -171 -378 117 158 -344 95 244 -294 -103 179
5425 179 -15 -322 117 334 -297 -144 100 -86 -221 102 -249 -496 199 516 -214 -185 168 73 -49 164 52
5446 52 90 427 -466 -336 -75 266 -166 -363 269 -289 -106 -36 131 -264 -134 48 -127 -339 368 -416 -209
5467 -209 261 307 -209 -102 250 -143 -131 95 -24 -445 -91 132 -445 -24 193 12 71 236 -14 -324 260
5488 260 139 5 -4 169 -225 -346 396 173 -108 92 -55 86 -90 156 -261 -69 184 50 -151 60 42
5509 42 -151 -99 249 -249 -235 229 18 -120 281 240 -487 -87 251 13 -59 84 -182 -112 172 372 -26 39
5531 39 37 -57 -174 195 91 -424 88 478 -248 80 90 -104 -64 143 -381 -256 -98 122 -217 -91 303 -400
5553 -400 -328 309 -5 -92 315 211 -280 100 94 -318 -351 267 149 -393 189 565 -31 -202 184 -73 -395 340
5575 340 103 8 -74 353 -431 -247 376 9 -15 87 229 -331 175 274 80 -17 360 82 -387 343 238 -57
5597 -57 126 -82 -225 -311 245 -85 -214 358 -11 -127 60 314 -294 -294 433 -32 -202 94 224 231 117 177
5619 177 -308 -48 147 -116 -348 -45 103 -292 -272 202 -275 -111 193 59 -207 334 -1 -274 114 303
5639 303 -394 71 412 -137 -289 35 151 -218 -35 197 -60 -10 317 -159 -361 358 -91 -40 -16 284 -151
5660 -151 -91 -4 -37 -460 274 101 -476 137 87 -272 -39 418 228 -250 394 288 -426 210 73 35 -75 92
5682 92 -156 -349 63 141 -512 -119 445 -326 -232 260 2 -57 216 157 -375 -249 225 -208 -147 408 101 -318
5704 -318 357 -126 -334 -291 379 3 -114 -18 108 -287 112 364 -598 129 160 -81 -215 399 -67 -501 -262
5725 -262 76 -417 65 264 -82 -201 113 133 -285 1 313 -161 -26 648 -65 -354 -80 -33 -78 182 200
5746 200 -671 21 385 -164 -384 103 -60 -277 177 239 -207 229 293 4 -255 223 161 -455 139 393 -195
5767 -195 54 464 -339 -527 64 80 -245 384 270 -13 -234 660 45 -314 536 -30 -158 19 250 -404
5787 -404 126 530 -39 -221 338 277 -552 -62 234 -70 -23 357 287 -308 101 154 -368 230 275 -358 -87 615
5809 615 -248 -302 680 67 -293 -55 379 -349 -66 532 -144 -560 272 102 -221 166 -94 31 -55 305 -339
5830 -339 -361 381 331 -88 320 372 -375 -145 279 -203 -225 262 114 -591 -153 185 -241 217 281 241 -466 110
5852 110 110 -28 265 368 -63 -110 345 84 -480 192 166 7 154 151 -279 8 471 -200 -398 196 461 -332
5874 -332 -408 206 65 -66 503 168 -264 410 549 -448 -92 793 -115 -130 106 129 -453 -169 364 -316 -164
5895 -164 281 -279 -136 118 -204 -557 64 303 -367 -175 303 -297 -255 299 57 -475 -22 116 -374 -83
5915 -83 652 -445 -237 183 -137 -393 170 623 -320 -234 463 32 -203 480 166 -732 -162 348 -457 -404 387
5936 387 -148 -135 291 81 -531 96 507 -257 -286 362 -110 -327 280 78 -597 -9 502 -290 -303 434 -39
5957 -39 -438 284 -142 -390 -288 166 -410 -318 528 148 -332 261 -280 -253 -127 359 -253 -144 405 -18 -227
5978 -227 102 230 -465 -253 478 -95 -218 464 -154 -401 243 305 -352 100 358 70 -102 222 125 -576 225
5999 225 397 -419 -63 359 -192 13 387 102 -589 367 293 -673 -136 485 108 -309 103 51 -500 136 183
6020 183 -587 290 585 -184 -117 311 -39 -131 318 271 -267 -378 184 -502 -257 439 -42 -397 -58 81 -362
6041 -362 -354 436 217 -217 171 -31 -488 -46 291 -454 -183 626 -404 -576 416 124 -567 235 635 -427
6061 -427 -339 674 -360 -554 398 88 -538 -128 605 -212 34 540 -7 -401 182 178 -364 237 170 -511 -14
6082 -14 310 -77 -483 400 269 -434 114 396 -230 -522 568 86 -445 -10 342 -194 70 414 -106 -441
6102 -441 314 -27 -262 357 437 -482 -225 285 -551 -310 510 200 -410 124 294 -285 223 705 -121 -465
6122 -465 382 130 -497 282 297 -426 -197 529 -206 -359 629 82 -428 152 446 -391 -110 401 -183 -323
6142 -323 177 22 -227 -9 221 -197 -76 396 -315 -318 395 8 -343 -115 111 -208 -248 343 -287 -524 179
6163 179 267 -462 -22 371 -290 -120 348 47 -238 593 -13 30 -98 345 -386 -81 447 -176 -472 408 501
6184 501 -379 161 379 -438 -113 76 -58 -51 265 -88 -597 53 403 -383 -456 371 -79 -470 330 272 -379
6205 -379 -211 440 -316 -91 310 -179 -425 532 406 -324 228 414 -292 -386 372 -85 -354 447 388 49 -157
6226 -157 400 -280 -147 643 25 -274 173 401 -504 -390 628 -266 -312 481 -20 -505 43 489 -539 -147
6246 -147 472 -84 110 274 135 -343 555 350 -361 -16 465 -263 -756 275 4 -623 187 123 -237 7
6266 7 543 -382 -580 416 118 -426 303 220 -557 -224 584 84 -684 183 85 -310 127 123 -129 -55 254 -107
6288 -107 -349 272 253 -466 146 188 -504 -244 847 -70 -789 286 509 -550 73 528 -174 -299 276 -183
6308 -183 -470 296 545 -478 14 662 -301 -299 459 -316 -393 377 137 -566 -179 544 -172 -344 513 95 -581
6329 -581 243 421 -451 -161 581 0 -102 271 468 -642 146 391 -313 43 395 2 -718 505 223
6348 223 -174 287 103 -534 -281 464 -205 -473 490 -13 -519 6 159 -353 237 647 -66 -351 154 436
6368 436 -571 100 459 -385 -275 549 -88 -446 250 174 -574 392 455 -459 138 470 148 -393 239 112
6388 112 -624 245 490 -278 -183 308 -233 -585 436 282 -296 -162 432 -705 -307 700 26 -337 87
6407 87 53 -498 -27 739 -28 -209 640 77 -394 523 112 -492 -14 599 96 -118 671 -11 -381 277 401
6428 401 -296 11 211 -160 -21 445 218 -283 335 318 -756 173 502 -286 -288 621 -65 -549 437 536 -199
6449 -199 -379 489 -256 -493 170 -47 -877 352 493 -342 -558 700 -371 -559 272 181 -615 81 555
6468 555 -265 110 632 -55 -520 323 373 -578 417 417 -801 12 335 -189 -529 450 145 -504 98 639 -608
6489 -608 -328 558 -298 -479 588 -89 -443 -140 386 -607 1 497 -114 -649 563 259 -411 -123 438
6508 438 -250 -275 527 -270 -542 496 200 -220 201 438 -285 -240 618 59 -409 168 151 -716 -97 350 -371
6529 -371 -265 366 14 -367 213 427 -510 -84 796 -436 -374 528 234 -517 239 248 -288 87 371 -643
6549 -643 -202 753 -62 -444 464 119 -645 -98 402 -369 -365 382 128 -466 304 198 -603 -350 462 -322 -151
6570 -151 462 50 -478 160 495 -548 -56 636 -409 -577 463 411 -827 226 253 -523 -95 475 -284
6589 -284 -625 560 113 -553 252 768 -173 -312 444 84 -234 288 242 -351 -70 372 -207 14 477 151
6609 151 -412 131 269 -463 -29 86 -350 -211 634 -194 -854 426 413 -342 -84 396 -298 -161 585 155
6629 155 -113 258 203 -530 467 413 -314 -103 627 310 -412 195 630 -613 68 659 -200 -344 723 136
6649 136 -919 245 565 -348 -112 625 -150 -473 325 271 -839 105 380 -697 -278 307 -386 -448 673
6668 673 -65 -555 204 470 -321 -523 309 -308 -411 773 219 -579 161 500 -461 -180 781 -506 -328
6687 -328 544 -26 -673 -217 335 -403 -104 519 -175 -160 474 9 -328 -122 513 -254 -484 183 -116 -411
6707 -411 240 281 -460 -156 635 -603 -324 563 -124 -437 310 405 -438 376 198 -462 -429 357 -29 -376 231
6728 231 204 -471 228 685 -96 -168 311 -52 -577 232 264 -597 -86 511 -274 -332 493 106 -399 224 330
6749 330 -683 -237 479 -69 -548 388 181 -353 58 132 -574 -163 681 -367 -575 653 225 -654 1
6768 1 338 -363 173 651 -275 -427 782 178 -402 -20 449 -168 87 365 -115 -552 268 220 -275 -106 270
6789 270 -596 -231 386 -99 -271 663 311 -441 242 288 -402 -279 624 -350 -575 290 63 -329 55 236
6809 236 -788 -20 524 185 -611 479 457 -664 -103 182 -296 -138 476 51 -535 712 424 -568 229
6828 229 225 -266 -304 313 -22 -360 220 408 -527 355 600 -313 -396 478 118 -634 668 432 -623 142 634
6849 634 -338 -292 467 200 -533 88 171 -579 -368 487 -92 -259 665 -127 -600 139 535 -374 -173 536 -241
6870 -241 -206 325 174 -538 333 535 -583 29 488 -291 -443 400 -36 -384 213 345 -729 -272 568 165
6890 165 -447 460 262 -626 136 622 -128 -62 590 -163 -531 688 370 -192 248 535 -103 147 706 -106
6910 -106 -623 317 401 -192 320 405 -283 -367 306 83 -532 1 294 -529 -155 775 -364 -606 560 -140
6930 -140 -338 195 449 -608 -25 610 -300 -344 501 108 -439 251 200 -838 -148 562 -402 -358 669 -66
6950 -66 -623 -24 391 -373 -286 846 -74 -561 421 272 -609 386 311 -173 -135 378 -356 -561 526 326 -489
6971 -489 -63 625 -238 -59 790 -82 -744 525 21 -323 -38 292 -60 227 337 80 -166 520 446 -843
6991 -843 117 545 -437 12 475 -129 -576 346 252 -444 449 482 -278 -253 382 177 -607 386 186 -358 325
7012 325 274 -427 -280 672 0 -153 526 484 -529 69 586 -280 -137 590 -35 -307 147 210 -547 -100 350
7033 350 -236 -514 578 52 -663 25 120 -461 172 235 -534 -330 440 31 -720 51 380 -417 27 443
7053 443 -426 -116 541 65 -368 135 609 -467 -2 521 -225 -272 313 -77 -531 242 229 -441 -305 639
7073 639 -234 -647 566 -59 -521 62 533 -381 -71 693 -406 -431 386 695 -481 84 434 -518 -499 521
7093 521 -332 -531 646 128 -529 105 605 -436 -375 772 -312 -137 486 146 -314 -162 650 -263 -68
7112 -68 752 -89 -570 422 224 -435 187 538 -113 -127 700 138 -459 265 66 -481 244 459 -411 -276 596
7133 596 131 -431 96 130 -323 -149 287 -95 -331 477 181 -422 8 445 -399 -142 551 -442 -616 576
7153 576 -139 -576 -241 538 -409 60 456 -73 -452 57 27 -546 103 471 -449 -209 331 -266 -401 313
7173 313 224 -443 363 372 -656 -101 706 8 -450 342 472 -441 -170 186 -143 -452 711 -191 -380 335
7193 335 -4 -514 -33 454 -506 53 650 -32 -793 179 361 -648 119 342 -514 -354 799 42 -596
7212 -596 191 31 -733 -33 543 -454 -150 564 -25 -441 336 463 -399 -96 614 -169 -190 624 -111 -648
7232 -648 518 112 -693 98 836 -414 -268 449 379 -561 321 697 -660 -34 291 -210 -68 552 38
7251 38 -529 229 464 -396 -213 361 -261 -387 490 71 -485 134 403 -414 -82 602 -277 -237 273 172 -640
7272 -640 -70 416 -329 -109 758 -299 -83 586 -134 -212 127 282 -484 -335 476 -127 -513 630 276 -374
7292 -374 193 512 -279 -20 900 -49 -495 688 179 -864 87 357 -239 -217 728 -157 -691 606 342
7311 342 -463 271 731 -478 -395 557 -200 -305 257 346 -720 211 599 -493 -518 487 -241 -567 380 402
7331 402 -588 -81 443 -419 -427 552 -212 -446 430 469 -607 -396 732 -312 -263 630 93 -586 473 77
7351 77 -584 -30 634 -135 -383 239 -50 -685 369 568 -710 -235 352 -247 -625 644 100 -784 112
7370 112 456 -733 123 536 -226 -582 287 158 -585 106 557 -707 31 597 -309 -416 336 321 -621 236
7390 236 492 -578 -357 529 -124 -314 502 173 -570 146 687 -396 -299 740 -462 -617 415 416 -484
7409 -484 -256 357 -617 -294 604 -202 -317 450 121 -462 -156 512 -597 -413 713 -2 -687 530 438
7428 438 -934 89 589 -274 -327 723 174 -779 368 98 -281 -61 461 -156 -346 721 52 -805 228
7447 228 141 -504 84 312 -250 -674 516 62 -378 447 649 -472 -292 403 -337 -326 214 10 -548 381
7467 381 387 -670 -445 768 -240 -507 574 -58 -736 342 281 -623 -230 937 -367 -694 525 582 -677
7486 -677 108 280 -490 -44 284 -40 -610 711 196 -560 -166 706 -525 -307 597 75 -158 249 404
7505 404 -770 116 649 -312 -390 603 -287 -691 371 226 -790 314 177 -192 -442 787 -195 -764 510
7524 510 311 -910 244 936 -361 -647 456 663 -482 170 244 -497 270 623 -514 -603 278 -219 -502
7543 -502 394 472 -273 -14 261 -486 -405 475 4 -639 449 318 -504 -87 379 -394 -429 746 37 -846
7563 -846 233 194 -700 -179 590 164 -108 516 285 -695 182 357 -826 -155 433 -77 -487 476 370 -630
7583 -630 -1 601 -870 -38 802 -290 -442 729 449 -520 24 687 -733 -510 518 49 -420 417
7601 417 -39 -962 -124 764 -432 -326 527 -10 -807 413 463 -580 93 550 -410 -369 433 33 -518 441
7621 441 688 -611 -100 523 -271 -26 495 -24 -374 337 375 -363 31 789 -250 -514 403 -79 -572 530
7641 530 497 -578 46 713 -196 -390 464 119 -785 667 460 -715 -26 635 -183 -479 360 253 -642
7660 -642 77 590 -448 -13 423 -54 -356 678 282 -706 145 758 -520 331 712 -284 -92 344 136
7679 136 -334 168 449 -595 -274 441 -359 -723 418 316 -687 -57 533 -242 -451 671 -299 -386 439
7698 439 354 -663 55 556 -575 -254 646 149 -568 84 221 -484 289 624 -405 -661 652 -166 -974
7717 -974 512 40 -735 -216 659 -358 -434 637 -376 -819 375 473 -543 -82 692 -254 -262 367 -160
7736 -160 -336 236 409 -438 -10 692 -197 -144 305 103 -519 299 211 -348 -138 474 -443 -501 646 347 -474
7757 -474 301 601 -898 -171 485 -143 -346 514 -64 -462 333 718 -635 -122 589 -217 -168 287 230 -648
7777 -648 110 687 -512 -752 731 -295 -314 583 326 -576 176 288 -229 -542 825 42 -376 806 479
7796 479 -364 302 436 -377 -78 575 -6 -322 371 272 -479 62 733 -705 184 657 59 -582 374 366 -337
7817 -337 150 498 -304 -259 574 138 -694 459 374 -574 14 471 -678 -438 371 82 -445 396 384 -504
7837 -504 15 208 -95 -602 257 83 -643 340 691 -781 270 362 -507 -594 483 91 -910 230 577
7856 577 -577 -105 452 -357 -491 407 267 -584 66 246 -471 -227 323 8 -294 411 299 -625 99 669
7876 669 -429 -373 436 -121 -627 647 315 -734 219 157 -425 -202 609 -14 -448 473 311 -465 159 323
7896 323 -357 -260 607 -394 -449 442 610 -821 225 405 -456 -140 712 -164 -584 304 121 -763 -10 569
7916 569 -177 -102 427 -289 -740 110 660 -470 45 348 -232 -517 574 129 -509 172 273 -816 292
7935 292 846 -325 -274 725 -85 -676 533 244 -759 20 553 -522 -273 385 -261 -486 385 95 -345
7954 -345 -91 665 -52 -164 585 40 -777 313 413 -482 -307 488 -216 -286 456 205 -666 66 327 -714
7974 -714 -13 554 27 -578 598 191 -571 195 378 -500 -470 742 -224 -424 264 298 -773 179 615 -252
7994 -252 -360 316 173 -477 429 253 -483 12 724 -618 -244 394 76 -519 408 632 -612 313 457
8013 457 -522 -92 356 -369 -775 231 329 -435 -168 346 -326 -234 814 178 -479 289 486 -413 -34 589
8033 589 -76 -231 652 103 -566 419 640 -971 -62 803 -280 -289 494 -13 -622 268 424 -271 -126 713
8053 713 -146 -465 372 75 -294 -3 439 -886 -82 637 -281 -584 626 209 -630 437 356 -384 -250
8072 -250 536 -294 -438 476 256 -701 432 415 -640 -208 836 -2 -697 338 -3 -369 157 460 -625
8091 -625 117 802 -268 -657 934 429 -796 242 507 -321 -162 698 88 -551 313 231 -439 -280 252
8110 252 -523 -462 326 -241 -481 502 171 -881 -79 249 -394 -451 533 64 -567 370 457 -676 -273 434
8130 434 -295 -203 704 147 -574 687 648 -616 -60 701 -271 -567 491 30 -675 248 113 -413 -21 788
8150 788 -449 -579 365 -79 -567 233 275 -462 -203 672 -293 -437 508 561 -478 62 520 -686 -177 298
8170 298 -132 -178 582 108 -859 134 357 -718 -144 413 -429 -418 609 453 -679 372 421 -464 -453 224
8190 224 210
8191B10
$$ Imaginary data points
##PAGE= N=2
##DATA TABLE= (X++(I..I)), XYDATA
0 0 0 0 0 0 0 0 0 0 -7 8 -8 8 -8 10 -16 16 -16 24 -28 32 -36 41 -48 56 -64 72 -82 94 -106 121 -133 149
32 149 -169 190 -209 231 -258 285 -319 352 -390 429 -477 527 -586 650 -723 810 -908 1022
50 1022 -1160 1328 -1541 1815 -2182 2702 -3496 4839 -7521 14832 -71355 -199311 83500 87253
64 87253 -106084 -205 76583 -98780 -36018 111218 -55694 -108277 115374 34385 -171196
75 -171196 13293 139460 -85713 -87775 98175 -15724 -104560 72847 29122 -138397 19076
86 19076 110444 -106368 -80675 123735 -6475 -129625 55740 54007 -118404 4450 103694
97 103694 -90687 -77833 117661 132 -122589 58169 66056 -112510 -8684 98022 -80579
108 -80579 -73329 119525 5816 -127476 52564 74997 -110804 -18271 111685 -53826 -80707
119 -80707 91325 5850 -99207 76826 80913 -122079 -24948 130543 -33993 -85538 92824
130 92824 30309 -92706 55773 79161 -96426 -9223 123705 -46795 -90508 100269 37414
141 37414 -106028 42374 91210 -87874 -31474 106510 -34051 -78300 92398 23454 -117214
152 -117214 40971 105471 -77429 -40880 97726 -30258 -78519 93458 39399 -108726 26552
163 26552 94549 -73808 -33507 111069 -18675 -92103 70650 41920 -93773 30072 92496
174 92496 -78290 -47001 106127 -8360 -87645 69401 44673 -100577 12823 95873 -58752
185 -58752 -44398 95302 -12204 -85850 73684 55262 -100618 2029 96067 -51542 -48512
196 -48512 93093 -3995 -89223 61945 57406 -93936 -4114 88270 -55137 -52390 95311
207 95311 -423 -99739 50721 66074 -85357 -11891 83065 -52321 -56641 92684 9781
218 9781 -92770 48292 63216 -87802 -11208 97301 -41595 -69333 79904 19060 -83342
229 -83342 44579 63776 -83947 -15932 91726 -42649 -70356 83660 24177 -94144 29807
240 29807 70431 -69354 -19411 83030 -40184 -69134 80774 26701 -91588 29878 76299
251 76299 -67691 -27595 86017 -24248 -66342 70681 26501 -85384 31382 79225 -64988
262 -64988 -30274 89288 -16860 -72207 63546 36945 -76081 23683 72179 -62875 -27002
273 -27002 95675 -11671 -79154 57916 44794 -71465 17316 73927 -54830 -29719 89456
284 89456 -8936 -74789 61057 46384 -80568 7106 81470 -44673 -39485 77369 -5747
295 -5747 -70297 56447 41088 -85345 3725 84104 -47376 -52305 75062 4931 -72934 43028
307 43028 40950 -78127 1905 77937 -50249 -53025 79579 9250 -80992 35302 50201 -69745
319 -69745 -7104 70291 -46387 -51663 76171 9168 -82474 33598 54482 -71425 -17785
330 -17785 71413 -34878 -55225 63202 8178 -76650 35958 56308 -73779 -24935 74626
341 74626 -25750 -59805 55541 14318 -71808 29039 54630 -67701 -23298 74275 -27326
352 -27326 -66148 55850 24932 -71546 17695 54887 -58118 -23456 69523 -26275 -65133 56904
364 56904 27358 -76606 12019 62750 -50435 -30238 65185 -18696 -61607 53726 27333
375 27333 -75119 12516 66919 -49612 -35877 67838 -8549 -62669 45692 29824 -69599
386 -69599 11805 67044 -48224 -38102 70125 -2305 -64856 41526 36183 -65091 5675
397 5675 65724 -42336 -35817 70254 234 -67223 40336 44376 -62259 -2329 64189 -35095
409 -35095 -36109 66834 2204 -65745 39009 46135 -62632 -8323 65816 -29500 -41523 59859
421 59859 7225 -62400 34258 44475 -61514 -10679 65542 -28808 -47714 56764 13562 -61509
433 -61509 26326 43916 -57234 -12375 63252 -27888 -50555 54402 17792 -62403 21096 47533
445 47533 -52296 -16839 60425 -23882 -49932 53578 19919 -63804 18097 52961 -47832 -21936
457 -21936 58849 -18768 -50564 49566 21381 -63420 16250 55209 -47523 -27004 59861 -12694
469 -12694 -53458 42359 22842 -60552 13833 54191 -46891 -29529 60788 -10036 -58905 37863
481 37863 28256 -58346 6487 51341 -42838 -29547 59618 -8787 -60767 36134 31883 -58540
493 -58540 1030 53772 -36043 -31794 55405 -4513 -57034 36060 34302 -57922 -2373 57895
505 57895 -29147 -33996 53098 2866 -52957 33231 35719 -54249 -2456 59944 -26477 -37785
517 -37785 53662 11101 -51469 27675 37500 -48960 -3489 58876 -25056 -37892 54775 14765
529 14765 -53556 23814 43194 -44171 -8879 55196 -21071 -37016 53220 15567 -54595 23308
541 23308 47060 -43402 -14490 56002 -14798 -38780 47246 17769 -51703 22820 48271 -44139
553 -44139 -18237 57484 -10993 -42678 43715 22134 -49551 17570 47621 -41323 -18859 57329
565 57329 -10683 -47911 40283 25860 -49656 10634 46300 -37474 -21802 52796 -10943 -49571
577 -49571 37723 26394 -53533 3712 47805 -33558 -26819 47294 -8929 -49525 33581 25405
589 25405 -53941 1219 48766 -32285 -31576 45438 -2256 -48923 27209 24837 -50672 643 48996
602 48996 -31091 -33982 46287 2701 -49775 23553 29263 -46270 -3381 46821 -27192 -32116 47418
615 47418 4555 -51577 22016 34274 -43761 -8321 46716 -21874 -31940 44751 6560 -50154
627 -50154 22067 36762 -44125 -12111 48345 -17169 -34996 41397 10436 -47696 19934 36495
639 36495 -43412 -12804 50387 -15693 -39205 39526 16123 -45226 16068 36902 -39828 -13290
651 -13290 49965 -14405 -39720 39754 19442 -46338 12454 40564 -34506 -16625 45836 -12293
663 -12293 -39033 38676 20481 -47716 8305 41933 -32464 -20892 43758 -9024 -40535 32402
675 32402 19813 -46174 7205 42029 -33220 -25234 42468 -5130 -42384 27064 20432 -44475
687 -44475 4029 40918 -30937 -26568 42402 -3290 -44670 23976 23949 -42072 -436 39113 -28509
700 -28509 -26295 41950 -1865 -46547 22815 27566 -41303 -4233 40614 -23396 -27360 39195 513
713 513 -44384 22543 28538 -43198 -7214 43790 -20098 -31479 35924 4890 -42418 18972 26840
726 26840 -42665 -7998 43856 -20329 -35142 35856 8609 -44761 13512 28815 -38476 -11015
738 -11015 39950 -19609 -34291 37047 11045 -46032 11133 32606 -35150 -14023 40176 -14479
750 -14479 -34062 34448 13673 -42278 11912 35070 -33524 -16672 41223 -8248 -33731 31183
762 31183 15518 -40216 11379 37700 -30447 -18544 40722 -4718 -34011 29894 19613 -37704
774 -37704 8313 37626 -27652 -17927 42060 -3058 -36942 27533 24040 -35396 4678 37098
786 37098 -25043 -19009 40303 -2395 -37614 26187 25021 -37195 1039 39329 -20407 -22414 36396
799 36396 87 -35658 25364 24832 -38279 -73 41983 -18672 -25131 36364 4766 -35728 21272
812 21272 25520 -34818 -1143 41012 -19025 -26463 37522 7457 -39088 16155 27665 -32436
824 -32436 -5060 38186 -18193 -27259 35584 7582 -40438 14497 29103 -32974 -10068 37159
836 37159 -13406 -27687 32085 8027 -39390 13874 30634 -32803 -13639 36982 -10380 -30120
848 -30120 29226 10725 -37977 10151 29475 -31409 -13948 37140 -9814 -33114 27392 14855
860 14855 -35844 6961 28793 -29324 -14891 37385 -8158 -33752 26508 17456 -35571 4872
872 4872 32100 -25518 -17456 34235 -5996 -32888 26194 18350 -38008 2357 34556 -22925 -20514
885 -20514 33037 -4008 -33453 23420 19244 -36034 1876 34809 -23392 -22436 34642 767 -35202
898 -35202 19588 21585 -32266 1298 35053 -21564 -23031 35534 2845 -36130 18124 24387 -31922
911 -31922 -2229 34919 -17465 -22858 33142 3721 -36220 17929 26405 -31474 -6303 35692
923 35692 -13752 -23712 31148 6093 -34707 15993 26873 -30461 -7312 36979 -11499 -26437
935 -26437 29837 9446 -33231 12624 26443 -28948 -8232 36708 -10802 -28406 28569 12663
947 12663 -33221 9478 27365 -27220 -10702 35089 -9297 -28244 27666 13592 -34769 7277
959 7277 30040 -25022 -13998 33204 -7116 -28626 26623 14805 -34964 5376 30816 -24856
971 -24856 -16999 32987 -4444 -31065 22548 15486 -33884 4382 30823 -25087 -20157 32785 -2310
984 -2310 -32335 19869 17074 -33094 1374 30560 -22410 -19913 31802 -1856 -34309 19064 20760
997 20760 -32314 -2689 30434 -19173 -21119 30215 -650 -34260 17436 21429 -31908 -4432
1009 -4432 31875 -16365 -23302 28240 2538 -32860 15606 21971 -30809 -5117 33566 -14106
1021 -14106 -24748 27676 6284 -32045 13106 23352 -28246 -6166 33433 -12022 -24888 27714
1033 27714 8854 -32235 10924 25590 -25197 -8070 32892 -10197 -24855 28095 11183 -33090
1045 -33090 9116 27837 -23634 -10450 32253 -6962 -24495 26489 12031 -32011 8945 29116
1057 29116 -24249 -12918 33771 -4047 -26656 23435 14341 -30279 7339 28925 -23214 -14512
1069 -14512 33198 -3041 -28636 22538 17336 -29885 3520 28725 -20627 -15151 32152 -2081
1081 -2081 -29837 20891 19688 -29203 723 29451 -18145 -17104 29777 -338 -29254 19700
1093 19700 19900 -29837 -1604 30572 -16149 -20359 26946 1212 -29158 16262 19323 -28965 -2943
1106 -2943 30498 -16253 -22821 27014 4008 -30689 12199 20258 -27135 -4629 29058 -14957
1118 -14957 -23171 26598 5455 -31972 10627 22436 -25839 -7418 28745 -12399 -23127 25090
1130 25090 6057 -31911 10378 23640 -25477 -9448 29996 -8918 -23783 23699 8091 -30286
1142 -30286 9477 24600 -24885 -10615 31551 -7325 -25188 22733 11017 -29152 7542 24937
1154 24937 -23236 -10528 31203 -6625 -26524 22655 13707 -29411 4583 25594 -20928 -12438
1166 -12438 29615 -4740 -26434 21246 14926 -29622 2828 27345 -18864 -15102 28099 -1892
1178 -1892 -25804 20120 15932 -28433 1719 28562 -17125 -16988 28102 854 -26237 17403 17628
1191 17628 -25820 940 28930 -16445 -18084 27910 3245 -26727 15399 19778 -24822 -1602
1203 -1602 28143 -14208 -18600 26816 3418 -28669 14266 21202 -24673 -4438 27648 -12419
1215 -12419 -19988 25031 4469 -29013 12204 21188 -25380 -6658 28493 -10971 -22366 22741
1227 22741 5960 -28784 10105 21455 -24627 -8275 28938 -9622 -23779 22408 8406 -28860
1239 -28860 7484 22573 -22805 -9084 28621 -8095 -24637 22040 10954 -28784 5756 23858
1251 23858 -20836 -11385 27493 -5803 -24308 21047 11765 -29298 3578 25298 -19060 -13325
1263 -13325 26520 -3575 -24850 18750 13194 -28119 2349 25095 -18631 -15700 26635 -947
1275 -947 -25413 16199 14377 -26402 1056 25178 -17339 -16789 26162 630 -26677 15051 17047
1288 17047 -24953 -1394 25161 -15203 -16857 25793 1417 -26844 14382 19051 -24517 -3400
1300 -3400 26210 -13020 -18199 24335 3304 -26013 13992 20016 -24374 -4286 27563 -11018
1312 -11018 -19668 23404 5398 -25782 11716 20481 -22932 -5152 28188 -10095 -21366 22724
1324 22724 8035 -26289 8829 21035 -21284 -6521 27505 -8961 -21765 22142 9163 -26909
1336 -26909 7227 22897 -19859 -9119 26262 -6820 -21509 20813 9701 -27004 5958 23716
1348 23716 -18923 -11265 26260 -4290 -22596 18442 10836 -25779 4839 23663 -19263 -12655
1360 -12655 26520 -2246 -23745 17105 12880 -24847 2396 23013 -17138 -13186 25747 -1941
1372 -1941 -25149 15838 15089 -24782 -398 23076 -15781 -14401 24303 -948 -25143 15245 15269
1385 15269 -25523 -1969 24697 -14453 -16924 22740 976 -24400 13705 15692 -25066 -2510
1397 -2510 25511 -13296 -18772 22776 3405 -25566 11171 17039 -23390 -3719 24443 -12702
1409 -12702 -19426 22755 5078 -26002 10040 18855 -21487 -5868 24563 -10503 -19477 21806
1421 21806 5901 -26038 9457 20757 -20568 -7521 24973 -7889 -19605 19997 7596 -25356
1433 -25356 8158 21052 -20004 -8478 25757 -5369 -20998 18568 9282 -23908 6457 21259
1445 21259 -18505 -9288 25736 -4170 -21808 17986 11554 -23952 4078 21996 -16452 -10275
1457 -10275 25028 -3325 -21985 17441 12646 -24363 2210 22706 -14956 -12325 24083 -1444
1469 -1444 -21940 16403 12949 -23803 951 23213 -14442 -14010 23410 164 -22560 14395 14217
1482 14217 -23069 -358 23413 -14185 -15612 23039 1861 -23338 12690 15315 -22322 -2219
1494 -2219 23531 -12844 -16534 21899 2782 -24267 11107 17094 -21799 -4236 22999 -11179
1506 -11179 -17578 20739 3932 -25022 9565 17758 -20934 -5865 22685 -9546 -18896 19652
1518 19652 4993 -23902 8198 18167 -20311 -7673 23216 -7794 -19890 17667 6454 -23878
1530 -23878 6600 18546 -19123 -8461 23211 -6773 -20675 17222 8655 -23205 4799 18804
1542 18804 -17230 -8786 23016 -4935 -20768 17007 10075 -23214 3527 20631 -15601 -10331
1554 -10331 22589 -3134 -19976 16566 10920 -22716 2748 21470 -14698 -11633 22567 -1260
1566 -1260 -20387 14900 12030 -21360 2212 22113 -14305 -12485 22846 419 -21056 13407
1578 13407 13810 -20801 949 21804 -12868 -12545 22775 1294 -21568 12689 15321 -19973 -1477
1591 -1477 21702 -11144 -13525 21505 2325 -21623 11380 15426 -20329 -2896 22363 -9451
1603 -9451 -15060 19149 3512 -21050 10619 15730 -19594 -4368 22255 -8835 -16666 18284 5131
1616 5131 -21219 7798 16282 -18190 -5215 21476 -8553 -17702 17702 6542 -22141 6342
1628 6342 17235 -17229 -7130 20596 -7189 -17684 16848 6697 -22456 5206 18043 -16705
1640 -16705 -8986 20322 -5200 -18656 15189 7289 -21780 4179 18406 -16281 -10128 21143
1652 21143 -3442 -19524 13831 8889 -21363 2587 18558 -15300 -10840 20874 -2845 -20509
1664 -20509 13372 11035 -20570 645 18721 -13140 -10892 20249 -1110 -19898 13256 12371 -20199
1677 -20199 -307 20006 -11380 -12158 19339 614 -19011 12177 12968 -19557 -1055 20433 -10275
1690 -10275 -12786 18514 2944 -19101 10359 13792 -17745 -1836 19933 -9507 -13746 18842
1702 18842 4468 -19501 8756 14420 -16453 -2978 19935 -8008 -14466 17924 4964 -19630
1714 -19630 8312 16175 -16305 -4917 19486 -6687 -14915 16640 5379 -19619 7167 16539
1726 16539 -15717 -6343 19955 -5507 -16017 15521 6683 -19171 5623 16581 -15545 -7269
1738 -7269 19954 -4880 -16702 14436 7490 -19027 4043 16608 -14375 -8152 19383 -4268
1750 -4268 -17679 13565 9072 -19413 2342 16927 -13292 -9220 18656 -2679 -17750 12495
1762 12495 9615 -19256 754 17438 -11978 -10467 17732 -1185 -18193 11296 9976 -18973
1774 -18973 -410 17632 -11303 -11789 17288 -121 -18361 9680 10547 -17701 -1138 17420 -10757
1787 -10757 -12325 16831 1295 -18429 8302 11951 -17079 -2873 17667 -9092 -12707 16564
1799 16564 2396 -18561 7717 13004 -16413 -3776 17485 -7735 -13313 15648 3710 -18502
1811 -18502 7485 13959 -15717 -4460 18441 -6150 -14283 15044 5091 -17429 6618 14477 -14908
1824 -14908 -5420 18535 -5084 -14619 14775 6965 -17566 5381 15243 -13367 -5883 18075 -4222
1837 -4222 -15362 14182 7775 -17694 4039 16243 -12418 -6810 17776 -3254 -15040 13664
1849 13664 8329 -17316 3257 17141 -11156 -8095 17509 -1265 -15304 11837 9192 -16260
1861 -16260 2150 16755 -10831 -9330 17205 25 -15718 10446 9810 -16094 900 16573
1873 16573 -9831 -10159 16395 1177 -16255 9396 10742 -15511 -990 16530 -8896 -10595 15616
1886 15616 1077 -17033 8673 11351 -15728 -2206 16588 -7954 -11738 15115 1972 -16701
1898 -16701 7698 11397 -15685 -3276 16721 -7550 -12617 14069 3014 -16992 6266 11944
1910 11944 -14775 -3991 16052 -6977 -13636 13896 4283 -16990 5099 12536 -13800 -4841 15924
1923 15924 -6249 -13600 13354 5123 -17234 4750 13761 -12655 -6194 15772 -4392 -13556 12581
1936 12581 5533 -16734 3820 14288 -12311 -6827 15750 -2793 -14100 11206 7162 -15338
1948 -15338 2854 14323 -11192 -7201 16048 -1760 -14244 10801 8087 -14961 1702 14941
1960 14941 -9408 -7606 15702 -995 -14829 10198 9376 -14399 745 15093 -8957 -8468 15530
1973 15530 405 -14502 9439 9599 -14650 -323 15665 -8060 -9347 14524 1166 -14418
1985 -14418 8627 10397 -14097 -1061 15705 -7632 -10092 14648 2344 -15107 7207 10587
1997 10587 -13355 -1988 14977 -6984 -10784 13557 3075 -15165 6459 11135 -13315 -3271
2009 -3271 14624 -5970 -11310 12908 3199 -15120 4852 11586 -12522 -4863 14297 -5182 -12187
2022 -12187 11539 4464 -15235 4046 11664 -12224 -5540 14425 -4316 -12995 10407 4892 -14943
2035 -14943 3036 11853 -11752 -6553 13977 -3254 -13509 9888 6106 -14700 1594 11826
2047 11826 -10379 -6955 13967 -2732 -13713 9677 6952 -14407 589 12551 -9652 -7689
2059 -7689 13343 -1661 -13547 8669 7408 -14017 270 13145 -8678 -8455 13357 -123 -13347
2072 -13347 8374 8541 -13486 51 14024 -8059 -8559 13616 1329 -13563 7561 9274 -12370
2085 -12370 -483 13920 -7200 -9078 13254 2081 -13552 6742 10385 -11964 -1784 14078
2097 14078 -5368 -8781 12808 3070 -13539 6342 10947 -11375 -2828 14146 -4378 -10178 11814
2110 11814 3836 -13219 5340 11059 -11380 -3897 14089 -3767 -10997 11293 4856 -13038 4067
2123 4067 11203 -10293 -3962 13837 -3637 -11193 10589 5510 -13045 2697 11462 -9628 -5306
2136 -5306 13135 -2996 -11388 9565 5355 -13363 2120 11678 -9020 -6257 12590 -2070 -11941
2149 -11941 8964 6278 -13482 1510 11932 -9149 -7026 12520 -1319 -12619 7791 6618
2161 6618 -12648 268 11733 -8482 -7629 12264 -365 -12829 7435 7551 -12660 -685 11847
2174 11847 -7637 -7869 12059 35 -12934 6853 8485 -12007 -1517 11983 -6500 -8492 11440
2187 11440 1302 -12438 6197 8463 -11935 -1868 13051 -5413 -9027 10939 2478 -12118
2199 -12118 5548 9295 -11039 -2334 12887 -4840 -9488 10825 3148 -12196 4413 9752 -10022
2212 -10022 -2744 12365 -4333 -9552 10842 4330 -12075 3958 10293 -9457 -3809 12640 -3036
2225 -3036 -9910 10020 4518 -12033 3667 10925 -9121 -4400 12140 -2023 -10383 9150 5501
2238 5501 -11570 2565 11104 -8779 -5272 12411 -1772 -10907 8863 6069 -11571 1781 11022
2251 11022 -8224 -6023 12277 -1095 -11133 8137 6219 -11913 447 11131 -7472 -6815 11387
2264 11387 -668 -11280 7028 6746 -11707 -144 11346 -7210 -7453 11013 166 -11346 6481
2277 6481 7036 -11364 -876 11534 -6391 -8531 10234 925 -11847 5728 7498 -11397 -2102
2290 -2102 11476 -5847 -8798 10079 1543 -11901 4352 7699 -10853 -2649 11027 -4971 -9145
2303 -9145 9573 1852 -12010 3868 8518 -10114 -3557 10971 -4413 -8961 9280 2629 -11628
2316 -11628 3590 9083 -9587 -3825 11170 -3683 -9405 8780 3397 -11401 3076 9562 -8831
2329 -8831 -4372 11361 -2484 -9753 8459 4677 -11423 2663 10195 -7891 -4485 11737 -1853
2342 -1853 -10008 8571 5627 -10756 1870 10551 -7354 -5108 11304 -883 -9716 8041 6331
2355 6331 -10566 1602 10794 -6587 -5898 11127 -271 -9795 7487 6480 -10134 245 11181
2368 11181 -5989 -6218 10465 328 -10213 6200 6903 -9876 -253 10662 -5811 -6525 10423
2381 10423 1199 -10330 5740 7098 -9439 -968 10880 -4917 -7394 10144 1488 -10923 5134
2394 5134 7764 -9373 -1778 10646 -4575 -7780 9418 2013 -10630 4333 7893 -9262 -2332
2407 -2332 10909 -3825 -8185 8903 2783 -10769 3874 8304 -9079 -2883 10811 -3658 -8813
2420 -8813 8761 3446 -10995 2517 8227 -8405 -3603 10563 -3352 -9292 8151 3631 -10881
2433 -10881 1908 8710 -8070 -4542 10257 -2422 -9406 7387 4400 -10805 1377 9444 -7623
2446 -7623 -4994 10301 -1214 -9328 7171 4862 -10068 1054 9349 -6777 -5588 10214 -429
2459 -429 -9846 6591 5654 -9684 473 10280 -6150 -5733 10068 306 -9543 6186 6367 -9532
2473 -9532 -158 9974 -5226 -6239 9860 760 -9624 5692 6814 -9080 -641 10434 -5057
2486 -5057 -6611 9614 1297 -9708 5142 7288 -8514 -888 10538 -4082 -6842 9259 2415
2499 2415 -10175 4501 7687 -8415 -1548 10081 -3665 -7375 9227 2465 -9790 3854 7557
2512 7557 -7865 -2212 10197 -3293 -7897 8342 3016 -10628 3319 8255 -8067 -3401 9782
2525 9782 -2798 -8355 7722 3306 -10244 1908 8396 -7918 -4089 9800 -2327 -8711 7030
2538 7030 4137 -10046 1254 8503 -7824 -4782 9413 -1797 -9260 6089 4241 -10371 743
2551 743 8721 -6927 -5407 8911 -1127 -9498 5894 4981 -9834 -101 8423 -6593 -6067 8667
2565 8667 -869 -9406 5208 5361 -9518 -606 9330 -5864 -6228 8623 174 -9393 5223 6031
2579 6031 -8990 -752 9443 -5184 -6549 8994 1182 -9407 4924 6485 -8662 -946 9505
2592 9505 -4397 -6634 8776 1721 -9478 4451 6828 -8287 -1765 9341 -3938 -6587 8363
2605 8363 2467 -9401 3884 7789 -7986 -2283 9711 -2978 -7029 8058 2791 -9224 3147
2618 3147 7436 -7485 -2758 9536 -2242 -7676 7551 3441 -8744 2784 7474 -7141 -2929
2631 -2929 9538 -1864 -7729 7506 3911 -9244 1977 8095 -6668 -3790 9428 -1582 -8255
2644 -8255 6845 4475 -8901 1493 8377 -6354 -4561 9066 -1064 -8151 6268 4907 -9057
2657 -9057 838 8476 -6281 -5182 8512 -662 -8570 5357 4989 -8868 -102 8296 -5864 -5866 8633
2672 8633 -180 -8862 4919 5333 -8571 -573 8322 -5398 -6118 8107 -5 -8948 4285 5730
2686 5730 -8524 -1508 8948 -4786 -6241 8059 542 -9224 4177 6490 -8231 -1547 8725
2699 8725 -3939 -6688 7739 1655 -8935 3842 6485 -7596 -1929 9003 -3291 -6968 7379
2712 7379 2290 -8924 3001 7296 -7265 -2316 9282 -2840 -7264 7640 3153 -8939 2253
2725 2253 7292 -6675 -2813 8933 -2284 -7450 6952 3380 -8570 2375 7985 -6442 -3217
2738 -3217 8686 -1541 -7688 6483 3987 -8490 1779 8325 -5786 -3949 8972 -916 -8156
2751 -8156 6125 4706 -8288 880 8180 -5275 -4397 9381 -182 -7818 5745 5250 -8200 603
2765 603 8320 -5025 -4690 8335 195 -8332 5147 5484 -8249 -383 8375 -4403 -5650 8062
2779 8062 551 -8372 4643 5672 -7983 -662 8568 -4312 -6014 7717 855 -8403 3882 5850
2793 5850 -8053 -1511 8466 -3822 -6335 7314 1328 -8729 3126 6070 -7550 -2574 8283
2806 8283 -3466 -6961 6944 1902 -9013 2680 6274 -7492 -2534 7962 -2945 -6794 6402
2819 6402 2552 -8807 2479 6373 -6852 -3289 8028 -2369 -7190 6331 2807 -8451 1849
2832 1849 7124 -6619 -3371 8246 -1802 -7271 5986 3272 -8432 1238 7534 -6143 -3801
2845 -3801 8459 -1257 -7803 5591 3978 -8040 835 7580 -5169 -4361 8070 -595 -7819 5311
2859 5311 4584 -7700 49 7810 -4771 -4960 8033 56 -7694 5009 5283 -7993 -229 7711
2873 7711 -4245 -5267 8064 808 -7652 4187 5297 -7320 -603 8223 -3911 -5100 7700
2886 7700 905 -8101 3826 5861 -7169 -1038 8180 -3426 -5914 7318 1624 -8076 3315 6354
2900 6354 -6794 -1583 8121 -3149 -5888 6973 2102 -7919 2843 6145 -6824 -2340 7928
2913 7928 -2581 -6329 6676 2328 -7877 2446 6325 -6544 -2908 7976 -2423 -6877 5729
2926 5729 2721 -7982 1857 6623 -5971 -3241 7537 -2016 -6874 5622 3453 -7968 1037 7158
2940 7158 -5445 -3400 7465 -1363 -7226 5553 3841 -8238 730 7200 -5310 -4371 7234 -891
2954 -891 -6904 4726 3932 -7482 198 7009 -4834 -4613 7307 -16 -7620 4500 4175 -7184
2968 -7184 -126 7424 -4458 -4673 7080 257 -7548 4071 5120 -7069 -725 7410 -3491 -4524
2982 -4524 6955 900 -7481 3870 5384 -6982 -1176 7712 -3054 -5434 6830 1455 -7416 3360
2996 3360 6057 -6357 -1784 7709 -2720 -5631 6741 1981 -7331 3076 5813 -6156 -1766 7522
3010 7522 -2139 -5592 6296 2621 -7418 2432 6353 -5571 -2081 7749 -1904 -6043 5619 2774
3024 2774 -7210 1874 6288 -5178 -2804 7350 -1296 -6201 5261 2957 -7250 1105 6412 -5170
3038 -5170 -3201 7198 -932 -6519 5031 3390 -7287 634 6432 -4880 -4034 6987 -531 -6786
3052 -6786 4373 3733 -6798 -335 6862 -4510 -4440 6426 -434 -6980 3980 4174 -7122 -490
3066 -490 6412 -3959 -4818 6345 210 -7146 3269 4367 -6566 -728 6821 -3735 -4762 6210
3080 6210 886 -6916 3290 4754 -6702 -1093 6751 -2944 -5212 6048 1179 -7160 2751 5142
3094 5142 -5834 -1660 6614 -2501 -5270 5941 2029 -6790 2416 5706 -5417 -1792 6881 -2371
3108 -2371 -5427 5130 2193 -6951 2336 5691 -5311 -2289 6811 -1663 -5554 5336 2738 -6576
3122 -6576 1751 5828 -4793 -2619 6912 -803 -5884 5055 3037 -6225 1007 6002 -4354 -3060
3136 -3060 6638 -419 -5768 4795 3812 -6459 592 6395 -3948 -3265 6515 -221 -6044 4185
3150 4185 4124 -5883 221 6387 -3844 -3502 6258 115 -6255 3945 3945 -6400 68 6481 -3506
3165 -3506 -3896 6129 311 -6202 3395 4430 -5832 -531 6128 -3263 -3962 5348 842 -6257 2880
3180 2880 4755 -5536 -1183 6373 -2675 -4586 5773 1187 -6313 2627 4343 -5792 -1360 6136
3194 6136 -2398 -4744 5431 1472 -6438 2439 4897 -5470 -2027 5917 -2154 -5097 4731 1980
3208 1980 -5990 1618 5281 -5175 -2180 5890 -1566 -5636 4261 2155 -6199 1355 5098 -4611 -2457
3223 -2457 5541 -1126 -5420 4148 2519 -5840 677 5377 -4462 -3015 5892 -899 -5492 3942 3163
3238 3163 -5922 510 5312 -3816 -3178 6062 -304 -5629 3910 3221 -5702 244 5350 -3210 -3619 5649
3254 5649 192 -5485 3668 3520 -5281 -141 5738 -3340 -3546 5664 485 -5590 3221 4130 -5265 -575
3270 -575 5903 -2542 -3678 5659 1140 -5579 2804 4203 -4967 -608 5925 -2173 -4225 5310 916
3285 916 -5656 2679 4523 -4693 -1331 5955 -2204 -4447 4947 1541 -5341 1932 4366 -4615 -1735
3300 -1735 5457 -1590 -4531 4704 1745 -5681 1752 4592 -4476 -1883 5605 -1702 -4875 3930 2147
3315 2147 -5370 1035 4675 -4236 -2433 4973 -1378 -5098 3820 2441 -5530 772 4632 -3952 -2503
3330 -2503 5199 -833 -5033 3514 2661 -5135 372 4959 -3612 -3145 5443 -646 -5167 3393 2899 -5196
3346 -5196 -95 5110 -3292 -3374 4791 -60 -5120 3047 3195 -4941 -32 4847 -2749 -3248 4647 105
3362 105 -4991 2485 3337 -4630 -293 4916 -2483 -3652 4719 496 -5102 2352 3830 -4884 -685
3377 -685 5345 -2550 -3726 4503 1149 -4997 2204 3899 -4000 -971 5249 -1533 -3716 4326 1317
3392 1317 -4983 2293 3994 -4019 -1133 5158 -1388 -3978 4100 1716 -5079 1586 4065 -3887 -1182
3407 -1182 4887 -1058 -4273 3908 1895 -4803 1281 4184 -3664 -1737 5105 -845 -4207 3669 2219
3422 2219 -4925 891 4188 -3446 -2035 4847 -602 -4134 3007 2278 -4696 481 4586 -3298 -2705
3437 -2705 4618 -91 -4548 2970 2669 -4599 12 4478 -3104 -3254 4679 -183 -4484 2889 2808 -4233
3453 -4233 -232 4372 -2864 -3158 4145 -196 -4494 2400 3023 -4383 -481 4664 -2236 -3279 4340
3468 4340 273 -4577 2145 3139 -4230 -596 4524 -2205 -3538 3998 518 -4780 2159 3310 -3973
3483 -3973 -1303 4645 -1967 -3497 3713 1187 -4671 1780 3374 -3556 -1137 4173 -1562 -3652 3633
3498 3633 1756 -4399 1167 3470 -3485 -1256 4474 -1189 -3857 3557 1741 -3908 1171 3553 -3177
3513 -3177 -1497 4226 -836 -3520 3183 1933 -4194 1134 4099 -3056 -1533 4227 -479 -3837 3138
3528 3138 2346 -4041 839 3726 -2580 -2280 4186 -163 -3879 2984 2579 -3908 326 4193 -2512 -1994
3544 -1994 3838 121 -3863 2639 2617 -4016 -139 3829 -2116 -2339 4028 136 -4083 2219 2852 -3901
3560 -3901 -190 3838 -1774 -2886 3612 530 -4000 1990 2564 -3808 -597 3905 -1909 -3052 3289
3575 3289 514 -4247 1864 3017 -3495 -926 3881 -1583 -2999 3369 818 -4204 1226 2791 -3596
3590 -3596 -992 3927 -1453 -3336 3148 1030 -4369 1478 2828 -3618 -1493 3743 -1208 -3725 3099
3605 3099 962 -4393 618 3428 -3160 -1590 3846 -1045 -3626 2602 1393 -3773 555 3358 -2838
3620 -2838 -1995 3920 -625 -3306 2649 1830 -3717 504 3363 -2304 -1955 3663 -619 -3304 2604 2076
3636 2076 -3767 7 3588 -2636 -1968 3775 52 -3179 2065 2290 -3566 -23 3736 -2116 -2488 3977
3652 3977 -90 -3495 2243 2375 -3178 -248 3591 -1860 -2508 3477 563 -3571 1839 2726 -3303 -475
3668 -475 3536 -1942 -2447 3143 564 -3261 1497 2697 -3013 -415 3683 -1576 -2451 3087 1070 -3709
3684 -3709 1458 2686 -3126 -723 3606 -1279 -2941 3030 795 -3535 1071 2748 -3077 -1037 3345
3699 3345 -1245 -2803 2578 1011 -3812 722 2652 -2941 -1329 3503 -1015 -2953 2473 919 -3582
3714 -3582 948 2711 -2756 -1450 3527 -945 -2902 2552 1641 -3441 758 3153 -2624 -1738 3228
3729 3228 -146 -3172 1999 1607 -3283 240 2965 -2092 -1753 3375 -324 -2926 2337 1852 -3324 -90
3745 -90 3238 -2189 -1997 2903 79 -3379 1897 1959 -3205 -209 3080 -1939 -1806 2995 276 -3191
3761 -3191 1884 2188 -2916 -386 3139 -1498 -2222 2980 201 -3112 1804 2166 -2847 -366 3222 -1408
3777 -1408 -2264 2767 725 -3042 1383 2502 -2777 -711 3452 -871 -2531 2757 1037 -3045 1294
3792 1294 2753 -2365 -785 3158 -1207 -2271 2714 930 -3056 845 2756 -2669 -866 3253 -811
3807 -811 -2735 2316 1065 -3239 807 2628 -2543 -1106 2974 -792 -2501 2405 1115 -3323 868
3822 868 2534 -2342 -1288 2886 -456 -2914 2265 1329 -2948 504 2998 -2184 -1569 2744 -513 -2691
3838 -2691 2254 1487 -3141 53 2857 -1917 -2107 2786 -279 -2959 1802 1681 -2513 112 2807 -1592
3854 -1592 -1881 2773 -202 -3096 1530 1750 -3184 -183 2911 -1809 -1960 2634 178 -3145 1608 1980
3870 1980 -2578 -363 2661 -1629 -1829 2288 253 -2855 1376 2356 -2590 -864 2935 -1444 -2256 2199
3886 2199 493 -2916 1144 2272 -2413 -581 2889 -1144 -2022 2432 757 -2868 1194 2207 -2395
3901 -2395 -711 2781 -665 -2322 2525 959 -2816 1038 2580 -2103 -812 2808 -629 -2320 2195
3916 2195 1042 -2530 616 2689 -2019 -1106 2821 -594 -2348 1936 1558 -2659 383 2364 -1617
3931 -1617 -1323 2349 -382 -2393 1861 1508 -2648 389 2309 -1531 -1463 2891 -150 -2490 1537 1377
3947 1377 -2596 191 2431 -1875 -1583 3040 286 -2656 1642 1421 -2804 141 2695 -1194 -1572 2689
3963 2689 113 -2621 1464 1425 -2625 -379 2513 -1278 -1867 2400 125 -2435 1237 1797 -2383 -264
3979 -264 2619 -1156 -1521 1808 424 -2777 786 1761 -2555 -871 2584 -1156 -1863 2274 757 -2772
3995 -2772 503 1989 -2197 -644 2591 -668 -2258 1907 820 -2592 827 2130 -1975 -862 2567
4010 2567 -601 -2281 2249 1253 -2610 486 2207 -1793 -1165 2524 -572 -1933 1803 1078 -2665 587
4026 587 2051 -1866 -894 2398 -376 -2248 1907 1221 -2478 276 2360 -1478 -1109 2702 -10 -2427
4042 -2427 1495 1520 -2255 214 2223 -1322 -1630 2443 100 -2439 1566 1534 -2292 19 2419 -1382
4058 -1382 -1631 2634 -36 -2122 1414 1612 -2096 -126 2510 -1319 -1606 2415 198 -2293 1207 1898
4074 1898 -2087 -319 2692 -1118 -1910 2025 466 -2411 1104 1705 -2238 -53 2442 -1041 -1963 1964
4090 1964 470 -2227 1111 1804 -1897 -572 2324 -1023 -2239 1986 449 -2269 430 1947 -1982
4105 -1982 -821 2251 -754 -2213 1743 662 -2498 455 1828 -1766 -843 2280 -756 -1752 1614
4120 1614 1095 -2237 369 1701 -1865 -1042 2119 -517 -2058 1307 787 -2599 284 2167 -1551 -1203
4136 -1203 2159 49 -2370 1281 989 -2154 -60 1979 -1531 -1253 2191 171 -1924 1550 1265 -2252
4152 -2252 -17 2271 -1028 -1546 2384 63 -2081 1304 1543 -2073 103 2475 -1107 -1299 2220 152
4168 152 -2222 1002 1357 -1730 -34 2117 -686 -1537 2029 164 -2018 910 1679 -1996 -462 2097
4184 2097 -887 -1138 1778 219 -2030 1019 1631 -1568 -297 2426 -1080 -1457 1808 516 -2223 935
4200 935 1828 -1581 -749 1971 -840 -1875 1517 627 -2323 109 1668 -1949 -590 2025 -544 -2000
4216 -2000 1981 778 -2568 519 2014 -1634 -741 2032 -332 -2039 1535 1005 -2435 170 1774
4231 1774 -1541 -991 2124 -477 -1592 1547 948 -1889 123 2149 -1536 -1167 1875 -56 -2085 1244
4247 1244 1299 -1956 182 1967 -1464 -1344 2074 -198 -1985 1209 1251 -1980 -75 2024 -1319 -1198
4263 -1198 1974 -86 -1881 1255 1340 -1791 -51 2123 -1200 -1373 1881 37 -1782 1174 1098 -1841
4279 -1841 -236 1813 -1065 -1364 1771 403 -1914 718 1330 -1630 -398 1942 -616 -1384 2072 505
4295 505 -1883 622 1302 -1727 -174 2140 -330 -1587 1538 752 -1941 868 1679 -1599 -587 1993
4311 1993 -546 -1697 1597 885 -1785 453 1683 -1454 -704 1782 -399 -1745 1545 940 -1838 423
4327 423 1754 -1097 -875 2032 -93 -1534 1386 764 -1832 184 1603 -1366 -834 2051 -450 -1893
4343 -1893 897 819 -2245 155 1807 -1478 -810 1916 -184 -1925 1155 947 -2098 -17 1879 -1257
4359 -1257 -1017 1633 -148 -1866 967 978 -1858 -107 1768 -1316 -1011 1741 184 -1785 679 1187
4375 1187 -1558 -600 1872 -1097 -1258 1702 -13 -1940 852 988 -1903 -115 1559 -986 -1481 1527
4391 1527 311 -2094 602 1082 -1589 -531 1980 -551 -1310 1752 349 -1870 659 1370 -1269 -619
4407 -619 1757 -750 -1339 1440 937 -1812 495 1303 -1505 -526 1795 -220 -1521 1331 277 -1470
4423 -1470 621 1493 -1157 -516 1518 -419 -1422 1386 630 -1616 711 1558 -1133 -712 1343 -76
4439 -76 -1593 1293 891 -1369 238 1528 -970 -666 2017 -250 -1605 1170 623 -1471 390 1442
4455 1442 -838 -942 1416 -50 -1103 1022 815 -1444 -77 1535 -1032 -945 1504 -64 -1656 734
4471 734 1029 -1599 65 1473 -787 -1108 1334 180 -1728 904 1126 -1475 -123 1495 -540 -1059
4487 -1059 1455 133 -1617 993 961 -1628 -238 1458 -476 -1260 1498 275 -1434 748 1226 -1333
4503 -1333 -651 1448 -609 -1032 1386 -10 -1653 391 1380 -1636 -444 1479 -320 -1435 1378 470
4519 470 -1664 249 1380 -1209 -563 1498 -452 -1549 1137 496 -1656 699 1315 -1101 -268 1480
4535 1480 -258 -1265 1402 682 -1458 324 1738 -1062 -491 1356 -325 -1077 1256 566 -1659 3
4551 3 1466 -802 -781 1578 34 -1536 633 959 -1507 196 1151 -696 -922 1759 330 -1220 1018
4568 1018 1076 -1209 -13 1479 -925 -723 1259 60 -1644 647 936 -1154 231 1173 -627 -784
4584 -784 1221 -196 -1420 435 1309 -1233 60 1615 -450 -691 1329 382 -1471 724 1198 -1159
4600 -1159 -297 1079 -937 -1101 1454 383 -1846 691 1168 -1220 -222 1248 -716 -1057 1000 288
4616 288 -1373 575 726 -1322 -537 1119 -467 -1437 879 377 -1157 182 1121 -1139 -591 1297 -177
4633 -177 -1232 823 534 -1544 326 1116 -893 -646 1003 -94 -1330 1087 687 -1194 14 919
4649 919 -1056 -537 1122 -113 -908 977 640 -1513 350 1090 -694 -575 1068 -176 -1142 618 918
4666 918 -986 -79 1271 -592 -446 1329 -223 -1128 921 471 -885 -298 1105 -566 -905 1276 215
4683 215 -1326 847 788 -1182 43 1063 -489 -659 1039 92 -1067 408 866 -1330 -349 1170 -443
4700 -443 -856 1218 152 -1135 482 622 -1129 -293 1204 -407 -700 944 389 -1194 398 728 -1092
4717 -1092 -173 1074 -123 -1089 907 76 -1026 297 872 -647 -378 1352 -70 -855 723 322 -1173
4734 -1173 465 909 -698 -581 1219 -142 -852 781 67 -1153 302 1082 -1006 -805 1314 -239
4750 -239 -1015 562 458 -882 163 707 -848 -503 1047 -225 -1051 652 534 -1198 260 867 -688
4767 -688 -844 1084 -199 -807 821 518 -1083 -127 665 -623 -679 916 81 -884 586 858 -1100 44
4785 44 1032 -517 -492 1039 51 -977 493 527 -1108 191 1035 -638 -732 909 231 -896 217 560
4803 560 -1013 -311 1365 -688 -785 1209 445 -1039 399 690 -1036 48 1453 -660 -787 859 60
4820 60 -1106 209 651 -710 -296 754 -584 -665 673 326 -823 433 684 -782 -197 827 -423
4837 -423 -1162 794 773 -1008 247 648 -729 16 1117 -66 -538 636 688 -892 214 769 -662
4854 -662 -312 899 2 -815 875 101 -853 154 817 -1110 -150 967 24 -434 736 185 -1000 -188
4872 -188 588 -488 -572 899 -65 -803 365 597 -1022 22 713 -500 -749 830 -4 -883 677 335
4890 335 -1027 -124 928 -550 -466 955 15 -684 537 564 -522 -112 763 -566 -631 932 136 -1017
4908 -1017 406 533 -600 -71 777 -459 -765 530 65 -965 337 521 -927 21 988 -521 -865
4925 -865 794 323 -950 296 456 -1091 -186 634 -570 -262 489 89 -697 244 766 -562 -105 868
4943 868 -307 -784 777 53 -729 122 529 -670 -280 887 -186 -455 609 375 -460 207 584 -531
4961 -531 -176 500 -191 -471 768 271 -479 83 756 -595 -94 741 -373 -583 613 252 -682 498
4979 498 714 -123 -199 973 -10 -835 585 -48 -746 -128 446 -524 -399 839 -68 -363 579 434 -918
4998 -918 -6 714 -685 -765 532 -122 -368 448 453 -723 -354 472 -445 -392 446 -183 -600 108 260 -553
5018 -553 9 692 -704 -466 379 128 -734 293 630 -608 88 406 -419 -412 458 220 -368 455 272 -643
5038 -643 -238 431 -488 -702 291 387 -495 45 529 -363 -67 545 -458 -487 435 75 -517 540 672 -704
5058 -704 -43 696 -43 -655 328 193 -604 420 457 -386 -69 684 -191 -343 453 381 -530 -142 381 -451
5078 -451 34 365 -15 -411 394 502 -543 82 459 -736 -84 787 15 -562 467 154 -454 -112 652
5097 652 -195 -413 660 -147 -380 80 266 -537 -258 894 -107 -78 720 -272 -741 13 378 -507 -111
5116 -111 314 -141 -237 527 283 -384 195 252 -747 -135 530 -344 117 488 -77 -618 -56 333 -599 -2 464
5137 464 -196 -490 343 -101 -625 344 561 -329 106 396 -196 -245 569 -79 -152 41 393 -381 -342 587 -31
5158 -31 -400 275 405 -619 330 411 -222 -97 513 112 -470 265 50 -678 232 291 -275 -418 261 -158 -539
5179 -539 530 119 -474 174 285 -399 147 610 60 -367 444 -98 -555 75 429 -459 -138 334 -235 -246
5199 -246 239 -37 -334 175 557 -245 -525 433 -113 -202 382 178 -277 309 424 -224 -375 334 -59 -779
5219 -779 246 115 -528 151 170 -312 122 396 35 -338 317 309 -221 109 669 -165 -214 85 -168 -300 227
5240 227 38 -502 -145 295 128 -360 456 303 -244 363 132 -445 -69 323 -552 -324 -11 -481 -412 88
5260 88 391 -479 -189 552 -186 -293 385 -220 -362 201 156 -175 -187 207 -57 -511 458 -15 -400 336 342 -533
5282 -533 140 292 -186 -536 105 48 -153 -203 114 -61 -89 357 -99 39 360 257 -242 482 -9 -334 -135
5303 -135 430 -185 -327 129 -221 -119 130 291 -210 -57 282 -278 -323 583 487 -114 355 291 -204 314 584
5324 584 -55 -414 109 264 -457 204 571 -288 -41 664 -193 -213 473 518 -43 56 215 -332 -233 234 -123
5345 -123 -391 377 -31 -406 -222 134 -239 319 319 -41 -114 414 89 -403 -2 502 -276 -154 555 -324 -588
5366 -588 416 190 -176 150 428 -449 -259 237 244 -295 143 261 -305 279 330 -174 35 562 42 -288 191
5387 191 294 -357 87 236 43 -189 143 47 -457 155 162 -221 177 178 -322 -463 222 -47 -242 203 332 -146
5409 -146 -196 327 -134 -224 214 40 35 33 165 -142 144 -100 -187 -191 -18 84 -140 294 128 -190 130 621 -209
5432 -209 -137 416 -75 -551 88 440 -76 91 163 -115 -143 104 -62 -472 316 369 -325 -211 426 -28 121
5453 121 295 361 -233 219 162 -216 -45 439 -108 -352 107 -18 -672 -42 93 -479 86 9 -8 -253 233
5474 233 -20 -118 310 311 -96 -10 252 -253 -189 235 -126 -308 302 262 -197 7 265 -151 -221 32 -64 -358 49
5497 49 407 77 -185 307 -199 -166 109 63 -269 150 189 -59 -146 -11 -140 -493 215 88 -313 -141 521 -288
5519 -288 -319 37 -163 -284 352 255 -284 227 212 -186 -33 486 -276 -223 98 225 -331 206 218 -115 -263 166
5541 166 80 -19 161 24 -114 -72 -106 -4 -376 180 141 -209 83 307 -94 62 443 -206 -173 299 190 -256
5563 -256 85 57 -442 111 185 -199 -4 -20 35 -410 383 362 -34 205 349 -432 -142 -273 -32 -339 -171 50
5585 50 -284 50 97 -324 -172 621 -96 190 -88 92 -553 286 224 -403 -98 -12 202 -122 278 405 -508
5606 -508 -51 399 -128 -138 359 -266 -151 370 225 -7 -143 363 55 104 220 -200 -405 52 118 -93 184
5627 184 389 -248 -73 191 180 -128 241 213 -304 114 277 -10 -546 74 -107 -213 49 56 -236 88 155 -194
5649 -194 -310 213 162 -356 151 552 -88 -225 21 -275 -212 270 36 -271 125 180 -181 284 250 -165 -323
5670 -323 125 -48 -235 172 152 -614 92 304 -34 -127 175 431 -274 243 271 -280 -69 137 91 -313 -124
5691 -124 376 -21 134 12 -330 -40 182 -170 -369 331 393 -704 -107 331 -134 -180 591 -60 -375 255
5711 255 286 -105 -115 417 -200 -110 419 96 -211 -39 -140 -362 -19 298 -311 -213 24 295 -88 232 164 -324
5733 -324 138 212 -594 -442 405 -6 -104 203 95 -358 293 222 -373 -205 362 -278 -107 77 165 -105 61
5754 61 249 -325 -434 211 -47 -289 311 104 -197 -13 104 -319 -464 212 -236 -527 155 123 -384 -212 389
5775 389 -251 138 258 -130 -123 151 150 -456 62 269 -320 -261 214 6 -358 46 178 -246 -32 255 55 -263
5797 -263 252 -43 -280 42 -25 -203 -36 285 -312 -740 434 20 -352 196 381 -530 -447 507 -115 -363
5817 -363 303 -161 1 68 -144 -465 -149 574 60 -663 148 77 -164 -91 176 -489 -84 184 -203 -7 353
5838 353 151 -183 -13 151 -309 -180 145 -148 10 100 139 -300 -104 262 -68 -124 466 -233 -439 303 -73
5859 -73 -513 -84 259 -76 -106 134 -210 -355 162 97 -134 9 562 -184 -38 404 -53 -183 219 398 -560
5880 -560 -169 191 12 -206 90 -142 -300 400 226 -457 55 403 -214 -79 505 -75 -553 -90 177 -205
5900 -205 168 278 -474 -179 804 10 -438 266 191 -642 62 396 -281 -153 480 -197 -353 248 184 -199 -156
5921 -156 297 3 -497 152 90 -468 370 231 -160 40 418 -198 -343 165 288 -131 127 248 -290 101
5941 101 312 15 -526 76 99 -273 344 623 -277 -399 507 -13 -351 297 24 -271 439 219 -205 -74
5961 -74 444 -207 -334 -21 14 -378 147 566 -559 123 472 -592 -369 503 211 -302 380 312 -253 91
5981 91 345 -410 -221 41 174 -508 2 468 -455 -234 278 -38 -467 36 119 -259 6 308 -286 -127 575
6002 575 9 -177 420 -131 -505 27 255 -352 182 746 100 -578 215 116 -459 252 169 -461 -366 373 -233
6023 -233 -492 145 291 -360 -15 345 -273 -393 222 -209 -184 178 245 -509 9 454 -343 -218 495 470 -386
6044 -386 64 271 -338 -79 507 -591 -139 595 -85 -326 59 246 -523 -25 328 -395 -432 475 -374 -133
6064 -133 568 540 -520 34 549 -110 -409 148 170 -680 231 417 -461 -221 412 -113 -396 474 164 -402
6084 -402 -53 650 -262 -19 542 -143 -174 102 279 -565 166 575 -121 -9 443 -60 -335 345 138 -600
6104 -600 180 434 -152 -109 316 27 -211 365 -10 -280 224 458 -305 -41 135 -105 -404 278 232 -301 206
6125 206 506 -375 -263 334 -51 -619 120 61 -569 131 551 -94 -497 369 -129 -455 435 174 -394 -174
6145 -174 391 -327 -248 -3 -60 -435 252 371 -375 235 565 -253 -255 317 -3 -399 7 -121 -505 -29 501
6166 501 -545 -405 632 -83 -311 397 396 -598 -48 490 -244 -85 376 168 -554 313 354 -750 -133 326
6186 326 -227 -440 669 -154 -461 404 389 -104 -235 569 33 -361 502 39 -636 373 675 -406 49
6205 49 476 -187 -585 272 52 -576 315 429 -434 136 542 -326 -473 295 303 -546 211 374 -361 -319 778
6226 778 -44 -249 355 560 -602 12 231 -412 -167 496 399 -446 551 -49 -652 -35 148 -284 -317 415
6246 415 -2 -307 292 90 -409 132 325 -351 -365 400 29 -554 243 133 -314 -74 410 -481 -109 524
6266 524 -204 -315 307 144 -520 125 566 -93 -105 811 -34 -807 299 239 -160 168 434 -220 -571 455
6286 455 -177 -567 60 669 -562 -165 587 -411 -191 735 -86 -479 307 184 -525 -145 596 -128 -512 569
6306 569 -7 -410 343 340 -474 64 292 -49 -377 613 207 -762 348 409 -419 -189 548 -287 -244 499 382
6327 382 -355 177 423 -434 -262 578 -264 -193 546 127 -521 114 562 -447 -442 169 -207 -196 508 399 -252
6348 -252 -41 910 -43 -270 438 159 -638 366 209 -662 -57 498 -135 -232 920 169 -514 289 23 -562
6368 -562 -105 501 -335 -407 691 108 -742 285 258 -313 -67 495 185 -339 636 60 -439 109 418 -189
6388 -189 144 189 -354 -418 302 90 -790 160 142 -526 -329 352 -2 -312 353 51 -494 196 442 -558 1
6409 1 210 -9 -675 475 111 -403 -104 483 -517 -480 461 10 -254 392 -5 -200 472 581 -473 -381
6429 -381 658 -202 -164 457 -55 -548 129 253 -495 -266 489 -213 -308 283 -46 -443 268 217 -229 -179 554
6450 554 -164 -194 325 199 -472 442 773 -290 -620 892 67 -285 128 193 -140 132 744 -338 -549 667
6470 667 207 -455 433 515 -413 116 579 -327 -135 547 -105 -494 111 177 -599 -207 520 -555 -519 468 -76
6491 -76 -515 64 607 -702 28 430 -252 -551 367 62 -591 252 405 -419 -297 672 -513 -284 393 281
6511 281 -631 -22 453 -677 -214 877 -225 -670 839 129 -559 -369 229 -428 54 399 -308 -362 292
6530 292 518 -573 331 325 -620 -213 672 -357 -237 373 -144 -538 91 789 -352 -247 383 -287 -844 66
6550 66 235 -647 -24 142 -294 -280 518 -267 -385 530 154 -700 -79 430 -461 -553 483 -28 -537 276 341
6571 341 -694 -65 393 -268 -461 1065 88 -602 331 406 -536 -56 517 -422 -301 603 -36 -656 249 539
6591 539 -507 -222 192 -286 -412 220 19 -722 82 494 -643 -330 580 -229 -708 436 298 -759 366
6610 366 272 -400 -403 614 -516 -463 465 -78 -530 301 281 -551 -245 590 -362 -576 531 303 -377 256 284
6631 284 -445 -201 236 -26 -470 408 37 -620 -10 392 -267 74 701 -147 -322 460 380 -426 420 459 -340
6652 -340 68 734 -127 -254 429 650 -401 25 354 -409 -282 688 27 -268 301 29 -606 -50 129 -510
6672 -510 -35 619 -41 -759 381 82 -593 6 270 -306 -205 623 194 -562 669 347 -497 -94 595
6691 595 -168 -656 388 -59 -528 247 330 -390 -91 691 -260 -277 653 179 -589 264 418 -299 -32 165
6711 165 -292 -137 456 243 -435 161 320 -468 110 361 -341 -750 512 133 -617 240 49 -403 -254 658
6731 658 132 -528 124 218 -175 419 579 -486 -202 520 -42 -341 653 -175 -464 155 431 -421 -317 551
6751 551 -19 -605 339 317 -678 266 283 -167 -185 475 -394 -620 460 300 -747 7 452 -309 -64 475
6771 475 121 -269 319 194 -531 -35 434 -206 -575 261 -276 -347 526 17 -692 -244 204 -494 -360 196
6791 196 11 -839 283 450 -472 -182 513 -113 -310 320 112 -462 148 633 -562 -187 710 -53 -277
6810 -277 323 18 -412 380 387 -231 -164 430 -149 -119 661 4 -344 211 424 -303 -224 409 -53 -414 475 112
6832 112 -739 340 201 -436 -385 766 56 -520 200 -75 -457 19 534 -185 -248 741 -19 -755 213 66
6852 66 -471 164 402 -184 -180 544 -37 -413 516 326 -481 45 444 -523 -521 375 -223 -601 266 773 -497
6873 -497 -14 372 9 -111 398 -157 -677 404 310 -202 -151 442 -472 -407 727 65 -813 395 331 -686
6893 -686 -147 610 -489 -333 230 4 -638 2 376 -863 94 362 135 -416 141 19 -494 97 35 -85
6913 -85 -224 313 -8 -530 206 -115 -346 259 311 -554 -291 383 -193 -471 254 167 -821 147 702 -504 -195
6934 -195 498 -39 -364 440 548 -277 268 237 -537 -27 465 -128 -258 527 399 -629 -22 666 -230 -172
6954 -172 366 285 -304 435 387 -435 -133 480 117 -466 206 29 -534 399 497 -864 179 710 -243 -209 457
6975 457 68 -332 32 387 -577 200 561 -527 -364 672 121 -493 449 158 -412 122 521 -351 -387 443
6995 443 106 -659 211 452 -320 180 471 -311 -329 223 -23 -602 -20 323 -469 -108 596 -192 -297 700
7015 700 10 -651 -49 337 -361 -172 353 -271 -509 359 115 -518 -12 425 -524 -286 515 -352 -716 144
7035 144 -44 -440 173 357 -182 -123 285 -127 -526 396 123 -734 -35 225 -371 17 581 -158 -489 484
7055 484 73 -552 -159 749 -373 -144 509 121 -160 358 343 -801 154 369 -373 -590 702 -62 -356
7074 -356 440 264 -739 7 455 -41 -260 838 -181 -401 184 279 -491 24 628 -613 -521 629 -52
7093 -52 -449 -11 635 -529 -50 498 -549 -545 64 108 -677 297 669 -393 -27 391 -24 -385 408 186
7113 186 -550 121 355 -337 -150 371 -344 -294 247 309 -481 48 541 -550 -353 906 -249 -482 306 114
7133 114 -343 388 701 -409 -302 372 210 -437 574 284 -933 -40 406 -190 -261 207 -109 -684 296
7152 296 22 -420 160 429 -366 -457 590 -171 -599 533 380 -599 48 758 -606 -379 658 -431 -579
7171 -579 153 607 -470 420 543 -366 -51 317 112 -560 479 601 -711 241 293 -143 -568 852 -84
7190 -84 -709 434 23 -430 35 455 -347 -395 463 294 -721 338 337 -788 -121 612 -383 -482 415 246
7210 246 -636 140 681 -588 -200 333 -276 -409 561 310 -637 237 265 -609 -432 215 -122 -429 506 304
7230 304 -515 257 431 -541 -320 672 -10 -656 505 242 -401 -20 617 -239 -93 521 -80 -567 702
7249 702 451 -547 82 767 -265 -364 481 -191 -620 211 290 -609 8 414 -522 -92 544 -81 -305 18
7269 18 696 -587 42 330 -95 -502 279 199 -342 262 3 -762 51 313 -517 -276 374 141 -357 537
7289 537 681 -464 159 805 -349 -399 598 -49 -225 175 218 -393 -83 595 -360 -350 397 -137 -281 473
7309 473 485 -309 -242 671 -357 -693 847 67 -755 68 246 -591 -441 554 -446 -422 527 98 -660 85
7329 85 536 -347 -387 724 -307 -599 788 257 -733 266 505 -193 -131 835 29 -374 442 369 -736 274
7349 274 298 -366 -88 732 99 -327 516 423 -178 105 732 -471 -316 962 155 -766 646 401 -585 85
7369 85 637 -301 -325 529 124 -492 445 449 -359 72 820 -425 -34 833 -1 -469 320 316 -808 -131 477
7390 477 -350 -484 672 195 -566 254 484 -854 -331 424 -361 -433 764 51 -575 301 308 -727 -45 633
7410 633 -124 -423 679 -46 -534 153 420 -405 -130 217 -116 -422 572 124 -312 230 601 -719 -230
7429 -230 472 -349 -340 170 301 -637 50 212 -524 -482 504 -223 -398 358 307 -471 315 746 -482 -116 346
7450 346 -26 -814 707 233 -1096 -7 627 -443 -280 451 -66 -739 319 46 -663 -89 551 -442
7468 -442 -273 483 197 -519 600 516 -742 316 583 -444 -84 396 74 -616 439 179 -437 89 670
7487 670 -276 -425 547 -288 -502 189 83 -657 -199 280 -85 -353 439 220 -599 143 320 -764 -26 642
7507 642 -381 -440 230 43 -881 337 580 -676 -56 681 -429 -525 523 -107 -691 161 361 -611 -128
7526 -128 684 -144 -722 536 71 -452 282 310 -654 149 773 -218 -701 539 286 -398 320 862 -106 -350
7546 -350 676 -326 -630 467 160 -686 200 456 -248 -492 651 -234 -367 133 29 -626 -90 783 -559
7565 -559 -160 461 -101 -592 539 85 -689 202 587 -529 -520 684 -125 -416 415 352 -812 163 446 -603
7585 -603 -456 542 -51 -565 496 497 -790 124 667 -432 -517 610 127 -462 421 470 -542 95 677 -525
7605 -525 -719 737 144 -692 262 616 -420 -93 847 -226 -357 497 163 -259 83 553 -574 -112 725
7624 725 82 -462 635 364 -834 -50 409 -191 -96 605 -544 -381 462 117 -966 59 665 -494
7642 -494 -263 716 125 -540 719 311 -663 -154 538 -562 -116 619 66 -603 355 184 -640 -96 650
7661 650 -362 -382 598 3 -317 232 272 -836 138 458 -540 -399 704 234 -860 444 136 -329 104
7680 104 416 -636 -180 257 -434 -789 551 346 -615 -110 637 -160 -556 661 216 -705 336 408 -415
7699 -415 -401 723 -372 -452 532 11 -671 253 329 -419 -100 612 -285 -270 226 -91 -679 22 807 -584
7719 -584 72 989 -358 -660 279 -13 -745 64 656 -639 -244 693 71 -129 391 268 -590 -115 700
7738 700 -205 -419 534 17 -625 594 -4 -796 156 477 -638 -373 567 140 -295 280 298 -604 -179 734
7758 734 -415 -250 556 -173 -651 552 387 -438 177 439 -334 -329 423 70 -592 864 446 -798 -16
7777 -16 298 -220 -332 683 24 -480 334 419 -874 342 538 -425 1 373 407 -521 653 254 -713 -256
7797 -256 726 -137 -505 376 120 -349 284 506 -680 -248 840 -449 -492 672 -70 -840 -68 342 -657
7816 -657 -87 785 -435 -505 488 -42 -541 234 472 -563 -334 535 -197 -466 351 132 -750 217 341 -460
7836 -460 -237 813 -199 -753 704 150 -539 44 639 -509 -716 635 -162 -481 685 232 -820 82
7854 82 473 -274 -360 633 -2 -699 393 316 -557 94 648 -361 -141 466 79 -513 136 403 -647 -181
7874 -181 586 -253 -749 632 -141 -533 320 145 -372 26 428 -302 -1 641 -28 -729 530 303 -539
7893 -539 110 522 -378 -604 370 285 -333 69 182 -471 292 635 -196 -400 601 88 -553 105 509 -529
7913 -529 -274 391 -248 -294 583 317 -545 236 287 -629 248 663 -369 -370 382 124 -327 281 270 -137 -91 588
7935 588 -363 -558 358 351 -670 -102 139 -650 -370 418 46 -451 261 339 -718 143 599 -492 -449 785
7955 785 163 -462 392 226 -427 260 651 -620 -488 729 48 -408 371 367 -724 46 395 -452 -413 501
7975 501 140 -322 441 432 -480 47 469 -349 -121 514 -215 -584 387 374 -628 -191 762 -203 -209 605 143
7996 143 -346 279 467 -560 79 535 -185 -252 670 511 -904 255 438 -365 -32 698 -504 -377 644
8015 644 330 -604 187 800 -746 -136 808 -193 -632 433 414 -522 89 350 -514 -13 675 -99 -629
8034 -629 352 193 -852 103 207 -666 -204 643 -45 -535 428 438 -543 230 288 -435 -175 723 262 -712
8054 -712 431 324 -524 101 650 -416 -327 733 72 -614 615 527 -500 -218 456 -408 -90 494 31
8073 31 -581 302 289 -479 87 609 -188 43 495 -144 -565 292 440 -557 -187 639 -302 -463 790 -29
8093 -29 -757 215 396 -535 -133 841 -613 -385 600 130 -367 221 574 -428 -130 761 -522 -702 553
8112 553 139 -360 191 266 -514 55 712 -199 -475 687 431 -622 366 643 -671 -306 422 10 -600
8131 -600 350 279 -210 418 500 -378 -181 290 26 -511 151 -140 -488 -123 718 -377 -271 644 153 -269
8151 -269 220 429 -49 32 387 -496 -228 408 13 -567 485 252 -344 -21 432 -482 -367 711 67 -556
8171 -556 504 -50 -730 97 426 -298 -253 594 49 -1007 604 314 -510 82 565 -557 -628 623 28
8190 28 -472
8191d72
##END NTUPLES=NMR FID
##END=
