##TITLE=1H_Pr 4769
 CDCl3, 8 sc, 
 6.5.2019
##JCAMPDX= 6.0         $$ Bruker NMR JCAMP-DX V2.0
##DATA TYPE= NMR FID
##DATA CLASS= NTUPLES
##ORIGIN= UXNMR, Bruker Analytische Messtechnik GmbH
##OWNER= root
$$ XWIN-NMR		Version 3.5
$$ Mon May  6 17:07:08 2019 Russian Standard Time (UT+4h)  she@DPX200
##.OBSERVE FREQUENCY= 200.1315
##.OBSERVE NUCLEUS= ^1H
##.DELAY= (6, 6)
##.ACQUISITION MODE= SIMULTANEOUS
##.ACQUISITION SCHEME= undefined
##.AVERAGES= 8
##.DIGITISER RES= 18
##SPECTROMETER/DATA SYSTEM= spect
##.PULSE SEQUENCE= zg30
##.SOLVENT NAME= CDCl3
##.SHIFT REFERENCE= (INTERNAL, CDCl3, 0, 15.7039)
##AUDIT TRAIL= $$ (NUMBER, WHEN, WHO, WHERE, WHAT)
$$ ##TITLE= Audit trail, XWIN-NMR		Version 3.5
$$ ##JCAMPDX= 5.01
$$ ##ORIGIN= Bruker BioSpin GmbH
$$ ##OWNER= she
$$ F:/spectra/data/she/nmr/H-F/1/audita.txt
$$ ##AUDIT TRAIL=  $$ (NUMBER, WHEN, WHO, WHERE, WHAT)
(   1,<2019-05-06 17:05:52.18 +0400>,<she>,<DPX200>,
      <created by zg, POWCHK disabled, PULCHK disabled
       configuration hash MD5:
       00 E9 B6 7A A2 85 ED C7 34 08 36 98 17 FE 4E 26
       data hash MD5: 16K
       90 63 67 F1 7A 93 96 20 70 3C 5C 98 45 53 32 CA>)
$$ ##END=
$$ 
$$ hash MD5
$$ 08 98 F4 C4 16 B6 4D C1 07 53 6F 9C A9 77 12 59
##$RELAX= 
##$RELAX= 
##$RELAX= 
##$RELAX= 
##$RELAX= 
##$RELAX= 
$$ Bruker specific parameters
$$ --------------------------
##$DU= <F:/spectra>
##$EXPNO= 1
##$NAME= <H-F>
##$PROCNO= 1
##$TYPE= <nmr>
##$USER= <she>
##$AMP= (0..31)
100 100 100 100 100 100 100 100 100 100 100 100 100 100 100 100 100 100 
100 100 100 100 100 100 100 100 100 100 100 100 100 100 
##$AQSEQ= 0
##$AQ_mod= 1
##$AUNM= <au_zg>
##$AUTOPOS= <>
##$BF1= 200.13
##$BF2= 200.13
##$BF3= 200.13
##$BF4= 200.13
##$BF5= 200.13
##$BF6= 200.13
##$BF7= 200.13
##$BF8= 200.13
##$BYTORDA= 1
##$CFDGTYP= 0
##$CFRGTYP= 5
##$CHEMSTR= <none>
##$CNST= (0..31)
1 1 145 1 1 1 1 1 1 1 1 1 1 1 1 1 1 1 1 1 1 1 1 1 1 1 1 1 1 1 1 1 
##$CPDPRG= <>
##$CPDPRG1= <>
##$CPDPRG2= <>
##$CPDPRG3= <>
##$CPDPRG4= <mlev>
##$CPDPRG5= <mlev>
##$CPDPRG6= <mlev>
##$CPDPRG7= <mlev>
##$CPDPRG8= <mlev>
##$CPDPRGB= <>
##$CPDPRGT= <>
##$D= (0..31)
0 1.2 0 0 0 0 0 0 0 0 0 0.03 0 0 0 0 0 0 0 0 0 0 0 0 0 0 0 0 0 0 0 0 
##$DATE= 1557147951
##$DBL= (0..7)
120 120 120 120 120 120 120 120 
##$DBP= (0..7)
150 150 150 150 150 150 150 150 
##$DBP07= 0
##$DBPNAM0= <>
##$DBPNAM1= <>
##$DBPNAM2= <>
##$DBPNAM3= <>
##$DBPNAM4= <>
##$DBPNAM5= <>
##$DBPNAM6= <>
##$DBPNAM7= <>
##$DBPOAL= (0..7)
0.5 0.5 0.5 0.5 0.5 0.5 0.5 0.5 
##$DBPOFFS= (0..7)
0 0 0 0 0 0 0 0 
##$DE= 6
##$DECBNUC= <off>
##$DECIM= 24
##$DECNUC= <off>
##$DECSTAT= 4
##$DIGMOD= 1
##$DIGTYP= 9
##$DL= (0..7)
0 120 120 120 120 120 120 120 
##$DP= (0..7)
150 150 150 150 150 150 150 150 
##$DP07= 0
##$DPNAME0= <>
##$DPNAME1= <>
##$DPNAME2= <>
##$DPNAME3= <>
##$DPNAME4= <>
##$DPNAME5= <>
##$DPNAME6= <>
##$DPNAME7= <>
##$DPOAL= (0..7)
0.5 0.5 0.5 0.5 0.5 0.5 0.5 0.5 
##$DPOFFS= (0..7)
0 0 0 0 0 0 0 0 
##$DQDMODE= 0
##$DR= 18
##$DS= 0
##$DSLIST= <SSSSSSSSSSSSSSS>
##$DSPFIRM= 0
$$ [...]
##$SUBNAM2= <"">
##$SUBNAM3= <"">
##$SUBNAM4= <"">
##$SUBNAM5= <"">
##$SUBNAM6= <"">
##$SUBNAM7= <"">
##$SUBNAM8= <"">
##$SUBNAM9= <"">
##$SW= 24.9337058887773
##$SWIBOX= (0..15)
0 0 2 0 0 0 0 0 0 0 0 0 0 0 0 0 
##$SW_h= 4990.01996007984
##$TD= 16384
##$TD0= 1
##$TE= 0
##$TE2= 300
##$TE3= 300
##$TEG= 300
##$TL= (0..7)
0 120 120 120 120 120 120 120 
##$TP= (0..7)
150 150 150 150 150 150 150 150 
##$TP07= 0
##$TPNAME0= <>
##$TPNAME1= <>
##$TPNAME2= <>
##$TPNAME3= <>
##$TPNAME4= <>
##$TPNAME5= <>
##$TPNAME6= <>
##$TPNAME7= <>
##$TPOAL= (0..7)
0.5 0.5 0.5 0.5 0.5 0.5 0.5 0.5 
##$TPOFFS= (0..7)
0 0 0 0 0 0 0 0 
##$TUNHIN= 0
##$TUNHOUT= 0
##$TUNXOUT= 0
##$USERA1= <user>
##$USERA2= <user>
##$USERA3= <user>
##$USERA4= <user>
##$USERA5= <user>
##$V9= 5
##$VALIST= <valist>
##$VCLIST= <CCCCCCCCCCCCCCC>
##$VD= 0
##$VDLIST= <DDDDDDDDDDDDDDD>
##$VPLIST= <PPPPPPPPPPPPPPP>
##$VTLIST= <TTTTTTTTTTTTTTT>
##$WBST= 1024
##$WBSW= 4
##$XGAIN= (0..3)
0 0 0 0 
##$XL= 0
##$YL= 0
##$YMAX_a= 152918
##$YMIN_a= -273080
##$ZGOPTNS= <>
##$ZL1= 120
##$ZL2= 120
##$ZL3= 120
##$ZL4= 120
##$ABSF1= 10
##$ABSF2= 0
##$ABSG= 5
##$ABSL= 3
##$ALPHA= 0
##$AQORDER= 0
##$ASSFAC= 0
##$ASSFACI= 0
##$ASSFACX= 0
##$ASSWID= 0
##$AUNMP= <proc_1d>
##$AZFE= 0.1
##$AZFW= 0.1
##$BCFW= 1
##$BC_mod= 2
##$BYTORDP= 1
##$COROFFS= 0
##$CY= 11.3945322036743
##$DATMOD= 1
##$DC= 2
##$DFILT= <>
##$DTYPP= 0
##$F1P= 18.9103706918063
##$F2P= -1.10871071338519
##$FCOR= 0.5
##$FTSIZE= 0
##$FT_mod= 4
##$GAMMA= 1
##$GB= 0.15
##$INTBC= 1
##$INTSCL= 1
##$ISEN= 128
##$LB= 0.24
##$LEV0= 0
##$LPBIN= 0
##$MAXI= 10000
##$MC2= 0
##$MEAN= 0
##$ME_mod= 0
##$MI= 1.114404
##$NCOEF= 0
##$NC_proc= 0
##$NLEV= 6
##$NOISF1= 3.799351
##$NOISF2= 2.8
##$NSP= 1
##$NTH_PI= 0
##$NZP= 0
##$OFFSET= 15.70392
##$PC= 1
##$PHC0= -8858.33
##$PHC1= 19.40026
##$PH_mod= 1
##$PKNL= yes
##$PPARMOD= 0
##$PSCAL= 0
##$PSIGN= 0
##$REVERSE= no
##$SF= 200.130013532006
##$SI= 16384
##$SIGF1= 3
##$SIGF2= 2
##$SINO= 400
##$SIOLD= 16384
##$SREGLST= <1H.CDCl3>
##$SSB= 0
##$STSI= 0
##$STSR= 0
##$SW_p= 3612.71676300578
##$SYMM= 0
##$S_DEV= 0
##$TDeff= 0
##$TDoff= 0
##$TI= <>
##$TILT= no
##$TM1= 0
##$TM2= 0
##$TOPLEV= 0
##$USERP1= <user>
##$USERP2= <user>
##$USERP3= <user>
##$USERP4= <user>
##$USERP5= <user>
##$WDW= 1
##$XDIM= 8192
##$YMAX_p= 0
##$YMIN_p= 0
$$ End of Bruker specific parameters
$$ ---------------------------------
##NTUPLES= NMR FID
##VAR_NAME=  TIME,          FID/REAL,        FID/IMAG
##SYMBOL=    X,             R,               I
##VAR_TYPE=  INDEPENDENT,   DEPENDENT,       DEPENDENT
##VAR_FORM=  AFFN,          ASDF,            ASDF
##VAR_DIM=   8192,          8192,            8192
##UNITS=     SECONDS,       ARBITRARY UNITS, ARBITRARY UNITS
##FACTOR=    0.0002004,     1,               1
##FIRST=     0,             0,               0
##LAST=      1.6414764,     0,               0
##MIN=       0,             -273080,         0
##MAX=       1.6414764,     152918,          0
$$ Real data points
##PAGE= N=1
##DATA TABLE= (X++(R..R)), XYDATA
0@%%%%JrJ6j6J6k4L2l7M5n6P2q8J04j21J45j72K00k35K73l15L64m18M77n42O15
$$ 0 0 0 0 0 1 -8 8 -8 8 -16 16 -21 24 -32 40 -48 56 -65 80 -92 108 -127 146 -169 195 -223 254 -288 327
29C27o98P88q86R96j115J247j393J550j723J913k121K352k604K880l189L532l917
$$ 327 -371 417 -469 527 -588 659 -734 816 -907 1006 -1115 1237 -1367 1513 -1676 1856 -2061
46b061M349m835N391o033O785p675Q748j0083J1793j4062J7240k2061L0325m8287
$$ -2061 2288 -2547 2844 -3189 3596 -4079 4669 -5414 6379 -7683 9557 -12504 17821 -30466
60c0466J54573j19037j88853L05054k097j38432O2706L7244j31113Q5252N8026
$$ -30466 124107 5070 -183783 121271 119174 -19258 43448 80692 -50421 34831 92857
71I2857j40143L4088J63189j68022j19788K22714L4627k31395P3511J51325j51975
$$ 92857 -47286 -13198 149991 -18031 -137819 84895 119522 -111873 -38362 112963 -39012
82c9012m4983J76889q7436j40606J65243N5247j90028M6377J41424j16430m2102
$$ -39012 -83995 92894 5458 -135148 30095 85342 -104686 -58309 83115 -33315 -75417
93g5417J34734q0066r4435J69417Q493k02070R2859J65228j70396p3383K00391
$$ -75417 59317 -20749 -115184 54233 62726 -139344 -46485 118743 -51653 -125036 75355
104G5355l2544j61269J17894O9059j55513M3285J38994j19690n5140J52431n1259
$$ 75355 42811 -118458 -564 68495 -87018 -43733 95261 -24429 -79569 72862 21603
115B1603j23488J42142N1322j72678N0681J36139j44764m4123K09367n3305k08217
$$ 21603 -101885 40257 91579 -81099 -30418 105721 -39043 -83166 126201 72896 -135321
126a35321J24372J35208j52171k8146J23831p2112m7355J25435n4542j17769J45580
$$ -135321 -10949 124259 -27912 -56058 67773 -4339 -51694 73741 19199 -98570 47010
137D7010M9598j97688M0523J83865j26335j10262J77710J0757j68192Q1154R9305
$$ 47010 96608 -101080 -60557 123308 -3027 -113289 64421 75178 -93014 -11860 87445
148H7445j35982L215J36355r9930q5509J55748N807j40844Q2315O6571j47737
$$ 87445 -48537 -45322 91033 -8897 -94406 61342 67149 -73695 8620 75191 -72546
159g2546L1260J58413j22812j09368J77709K1167j78681P2016J28635j30774m5022
$$ -72546 -41286 117127 -5685 -115053 62656 83823 -94858 -22842 105793 -24981 -70003
170g0003J27646n1622p2037J24736r139j41714R3138R5473j51056q655J63009
$$ -70003 57643 6021 -66016 58720 49581 -92133 1005 96478 -54578 -63233 99776
181I9776q6667j28066J46176N1828j49350M4577J01899j24420k7926J50139n3713
$$ 99776 13109 -114957 31219 83047 -66303 -21726 80173 -44247 -72173 77966 24253
192B4253j18145J08727L7239j21119O0692Q8766j36315j9012J60308o5215j28698
$$ 24253 -93892 14835 52074 -69045 -8353 80413 -55902 -74914 85394 20179 -108519
203a08519J31980N3834j55828M1684J35284j10014o9706J30802j7774r7299R6677
$$ -108519 23461 77295 -78533 -36849 98435 -11579 -81285 49517 31743 -65556 31121
214C1121K5055j34436O0692J20773j24064n3716J47706m0197j27650J17758O6157
$$ 31121 56176 -78260 -17568 103205 -20859 -74575 73131 32934 -94716 23042 89199
225H9199j52733J6229J33833q9469o7450J26847j9269j15795Q9809N4026j26117
$$ 89199 -63534 -47305 86528 -2941 -70391 56456 37187 -78608 11201 65227 -60890
236f0890L3707J16590j09885o2160J46951j7801j33201R2407P1978j39376Q027
$$ -60890 -27183 89407 -20478 -82638 64313 46512 -86689 5718 77696 -61680 -53653
247e3653J36137p8127q2004J17488j086j15161P7221O4720j22090J0368J18462
$$ -53653 82484 4357 -77647 39841 38755 -76406 815 65535 -56555 -46187 72275
258G2275q4282o6695J32246r295j34153Q3157Q8681j30224j6301J31307n5297
$$ 72275 -12007 -78702 53544 44249 -89904 -6747 81934 -48290 -64591 66716 11419
269A1419q1810J07131O636j15816O8160P8049j15577q608J18305o6898p5425J22909
$$ 11419 -70391 36740 43376 -72440 -4280 73769 -41808 -50416 67889 991 -74434 48475
281D8475P484j33435O4710R4966j16512k6561J28243m9271r3972J05166L0860
$$ 48475 55959 -77476 -12766 82200 -34312 -60873 67370 18099 -75873 29293 60153
292F0153j16380M3376Q0826j00941j3994J19008o1085r0497J19232L0558j35372
$$ 60153 -56227 -12851 67975 -32966 -46960 72048 10963 -79534 39698 70256 -65116
303f5116M3366J07122j01523m5310J19365l1973r2701R5046L3784j18885L9165
$$ -65116 -21750 85372 -16151 -61461 57904 25931 -66770 28276 62060 -56825 -17660
314a7660R7430r8796m1377J19488l2346r7629R4903M0009j21854L4104J05158
$$ -17660 79770 -19026 -60403 59085 26739 -70890 24013 64022 -57832 -23728 81430
325H1430r6061n2252J22778k0342j09538Q1036N8859j05586J3976Q9556q1624
$$ 81430 -14631 -66883 55895 35553 -73985 7051 65910 -39676 -25700 63856 -17768
336a7768l9176J16805k9518j10769Q7438O3535j16181P427J05557p2219n9756
$$ -17768 -56944 59861 30343 -80426 7012 70547 -45634 -38207 67350 -4869 -64625
347f4625J07258r512j03813P3214O0473j09229N013J07860o6544o5545J00253
$$ -64625 42633 33121 -70692 2522 62995 -46234 -41221 66639 95 -65450 34803
358C4803j540r8894O8276N7938j10120N734J15008o6874p7610J05454J4297j08491
$$ 34803 33263 -65631 2645 60583 -49537 -43803 71205 4331 -73279 32175 46472 -62019
370f2019M8676P0108r1587m999R9898o0197o8015J05915Q638j14498N2688Q2060
$$ -62019 -13343 56765 -34822 -39821 60077 -120 -68135 37780 46418 -68080 -15392 66668
382F6668r6722k0509J06250m4996p4525R4659J6640j09178M6968Q1766r5725k5468
$$ 66668 -30054 -50563 55687 10691 -63834 30825 47465 -61713 -14745 67021 -28704 -54172
394e4172J10285l6061q2814Q4866K4861j00942M1838P8675r5810k7863J15007
$$ -54172 56113 20052 -62762 22104 46965 -53977 -12139 66536 -29274 -57137 57870
405E7870l2911r1731Q2256L9504j00865K5661P9001q0965l0015J06313l1955q9522
$$ 57870 24959 -66772 15484 54988 -45877 -20216 58785 -22180 -52195 54118 22163 -67359
417f7359Q4788M3225j06586J6713Q9808o9997m1558R4699k1751q3016P9600M1746
$$ -67359 17429 60654 -45932 -29219 60589 -9408 -50966 43733 21982 -61034 18566 60312
429F0312j06391J5973R5462o9148n3154R5263p594q5003O5489M4921r6865J3038
$$ 60312 -46079 -30106 65356 -3792 -56946 38317 30723 -54280 11209 56130 -40735 -27697
441b7697R2864o7814n6717R6950m14r1385N5992N3747q8221N083Q8294o4181n5991
$$ -27697 65167 -2647 -59364 37586 37172 -54213 1779 55526 -32695 -27612 60682 -3499 -59490
454e9490R7373J272r8081N4581O5390q9028j0251R0985m7583n9371Q4961L424
$$ -59490 37883 39155 -58926 -4345 61045 -27983 -38234 52751 5168 -54203 30758 34182
466C4182r1738N3395O4396r0609j1289R6992m4670o8971Q3168J3793r2564M5397
$$ 34182 -57556 -4161 60235 -30374 -41663 55329 10659 -58312 24856 38649 -53915 -8518
478h518O8686q6194j8213R7969l7200p4336P7289K3429q8927L4110O4656p7302
$$ -8518 60168 -26026 -44239 53730 16530 -57806 19483 42912 -46015 -11905 52751 -24551
490b4551j4292R4549m1935p6513Q4203K9725r9198K4011P8801o7842l0887Q5601
$$ -24551 -38843 55706 13771 -62742 21461 51186 -48012 -24001 54800 -13042 -43929 41672
502D1672k6361p0429P1739K7680r2775K4066P6940o8687l4225Q8509k0768p4029
$$ 41672 15311 -55118 16621 44301 -48474 -24408 52532 -16155 -50380 38129 17361 -56668
514e6668O8414L2165r3907J9386Q4572o5406m5640Q7522n688p6697N4039L7858
$$ -56668 11746 43911 -49996 -30610 53962 -11444 -57084 30438 24750 -51947 2092 39950
526C9950p9142J5135P2310o3692l7558R1934j1048q4613N9553N0211q6658J111
$$ 39950 -39192 -24057 48253 -15439 -52997 38937 27889 -56724 2829 53040 -33618 -32507
538c2507Q2029n0509m8578Q2151k76q0812M9482N1534p8853k072P6861m8744m7093
$$ -32507 49522 -987 -49565 32586 32310 -48502 980 52514 -26339 -28411 48450 -294 -47387
551d7387Q1148k001q2928N3776N6110q7885j0016R1014m1182o5313P3321J7703
$$ -47387 33761 31760 -51168 2608 58718 -29167 -39183 51831 10649 -54664 18657 36360
563C6360p7486L3945N2615p1622o967P9747m4725n8311Q0122J3430q7540L6818
$$ 36360 -41126 -7181 45434 -26188 -33155 46592 1867 -56444 23678 37108 -50432 -13614
575a3614O6820p3344k1167Q3822l1618o6169P0874K5284q2289K4026O5607o1367
$$ -13614 53206 -20138 -41305 42517 10899 -55270 15604 40888 -41401 -17375 48232 -13135
587a3135k2320P4566k7762n8549O8533J7925q5319L2272P4433p0542l5863Q6562
$$ -13135 -35455 39111 11349 -47200 21333 39258 -46061 -13789 60644 -9898 -45761 40801
599D0801j2985p3275N3519L4490p2734J4826O4076n7206k9060P8135j7612o9372
$$ 40801 27816 -45459 8060 42550 -30184 -15358 48718 -8488 -37548 40587 22975 -46397
611d6397N7448L2081p9491J5944P2394n9436l9566Q3979p631q0050M8284M8035
$$ -46397 11051 43132 -36359 -20415 51979 -7457 -47023 36956 29325 -50725 -2441 45594
623D5594p3170k367O8063m1721l5855O9117j1287o8103N5265L9539q3000L922
$$ 45594 -27576 -29943 38120 -3601 -39456 29661 18374 -49729 5536 45075 -37925 -34003
635c4003Q2310m8214n2897P7142Q621p7398L7598M9678o9334n772P3131l8582
$$ -34003 48307 93 -52804 24338 32959 -44439 -6841 42837 -26497 -32269 40862 2280
647B280m8158O8659N639p1840M0937M7088p3302m162P8141m3164n6463P8044J7202
$$ 2280 -45878 22781 28420 -43420 -2483 44605 -28697 -32859 45282 2118 -54345 23699 40901
660D0901q3994K7000O1568o0165k0589O8289k6309m8578O0579R315p0813L7566
$$ 40901 -43093 -16093 45475 -14690 -35279 33010 6701 -41877 18702 28017 -42796 -5230
672e230N5381p2503j9603Q1580k5404o3403O2304K4733p5318K2131O3726n8124
$$ -5230 50151 -22352 -41955 39625 14221 -49182 13122 37855 -37463 -15332 48394 -9730
684i730k9202P1397j4587n7225N1529K2858o6001K3580N5851o1066k1794P9100
$$ -9730 -38932 32465 17878 -39347 12182 35040 -30961 -7381 48470 -12596 -34390 44710
696D4710k2186p0569O0211L9704p6283M891O7433m3096l4975O3072j0897n8899
$$ 44710 22524 -48045 12166 51870 -24413 -19522 47911 4815 -30160 32912 22015 -36884
708c6884N0242K9890p0403J2841O4108n2206l4270P4018j0270p2027M9730M2389
$$ -36884 13358 43248 -27155 -14314 49794 -2412 -36682 37336 27066 -44961 4769 47158
720D7158p3863oP3011m0155m6488O1912L049o1874L8335L5195o4999N406O5236
$$ 47158 -26705 -26711 46300 6145 -40343 21569 24618 -37256 1079 36274 -28725 -23319 41917
733D1917m7205m0911P5825j54p9597L8313N4495o4935j2114O8392l1212m7501
$$ 41917 -5288 -46199 29626 29472 -50125 -11812 42683 -22252 -34366 34026 2814 -44687
745d4687O1462R550o6718L1498M5465o1523p126O8391l3435m7172O4406Q474p2442
$$ -44687 16775 26325 -40393 -8895 36570 -24953 -32079 36312 2877 -44295 20111 28585 -43857
758d3857L4577N6200o7535k1534P5882j7124n7590M9106K1212n9415K0856M4214
$$ -43857 -9280 46920 -20615 -42149 33733 16609 -40981 8125 29337 -30078 -9222 34992
770C4992n4715j0445O8556l0818n5375O3769K3269p4542J7382O1304n2488k8176
$$ 34992 -19723 -30168 38388 7570 -47805 15964 39233 -35309 -17927 43377 -9111 -37287
782c7287O7021j3173n6480M9843K7580o5451J1880N4585m6030k3142O3278j8927
$$ -37287 29734 16561 -39919 9924 37504 -27947 -16067 38518 -7512 -30654 32624 13697
794A3697n5602N5518K7488p3523J3085O7221m9997m0044O7492o10o1405L8750
$$ 13697 -41905 13613 41101 -32422 -19337 47884 -2113 -42157 25335 24725 -36680 2070
806B070L4260n9413O102N5873m4252l0104O5783q881o4327M5598L8907o6579K758
$$ 2070 36330 -23083 -16981 38892 -5360 -35464 30319 21438 -42889 2709 41616 -24963 -22205
819b2205O5918m3288m3479O6885N877o7214L1581M3327n6196l716N8728l4812
$$ -22205 43713 425 -43054 23831 29708 -37506 -5925 37402 -18794 -22510 36218 1406
831A406l7477N7710p74o0747M1608M1404o9219p108P4509k9156n3374N5163J5559
$$ 1406 -36071 21639 20865 -39882 1726 43130 -26089 -33197 41312 12156 -41218 13945 29504
844B9504o1744K4557M5148n2337j0115O0439k8452m4375N6464J1257o3868K6402
$$ 29504 -32240 -7683 37465 -14872 -24987 35452 7000 -37375 19089 30346 -33522 -7120
856g120M7155n6445j2981O7728k4937n5094N5136K3376o7082J3608N4446m4079
$$ -7120 40035 -16410 -29391 38337 13400 -41694 13442 36818 -30264 -16656 37790 -6289
868f289k1839N5897j7338m3562M9732J3658o4802K2667N6035n4535k6646O8043
$$ -6289 -28128 27769 10431 -33131 16601 30259 -34543 -11876 44159 -10376 -37022 31021
880C1021j1468n7482M5515K7797o3073R147N5378m2256k7967N8686j0073n1940
$$ 31021 19553 -37929 7586 35383 -27690 -18543 36835 -5421 -33388 25298 15225 -36715
892c6715M3921K4905o1782J2096N5200m8054k9364O7655p171o3915M1837L8960
$$ -36715 7206 32111 -29671 -17575 37625 -10429 -39793 27862 20691 -43224 -1387 37573
904C7573o0617j896N6718l4626l3081N5845l678n3157L9864L0346o1951M501O1696
$$ 37573 -23044 -24940 31778 -2848 -35929 19916 16238 -36919 2945 33291 -28660 -24159 37537
917C7537l9593l9342O0743K075o1091L5990M1035n8689o409N9656k9608m0425
$$ 37537 -2056 -41398 19345 21420 -39671 -3681 37354 -21335 -27744 31912 2304 -38121
929c8121N3608P029n5196K9173L6187n3106r09N8561l6008m1913O0843J0024o5452
$$ -38121 15487 22516 -32680 -3507 32680 -20426 -21335 37226 1218 -40695 20148 30172 -35280
942c5280K6689M8651n0697j5445N6762k1584m1490M9067R722n7285K6018M4354
$$ -35280 -8591 40060 -10637 -26082 30680 9096 -32394 16673 26395 -30890 -4872 39482
954C9482n1886j2161N8781k4639m4680N3416J3290o3427K1910N2209m9834k1354
$$ 39482 -12404 -24565 34216 9577 -35103 18313 31603 -31824 -9914 42295 -7539 -28893
966b8893O0628j4777m9133M2838J9073n4615J8179M4216m9077j5374O2609k0319
$$ -28893 31735 16958 -32175 10663 29736 -24879 -6700 37516 -11561 -26935 35674 15355
978A5355n3592M8587K4655o2182J1981N2589m3451k5204N8519j0360n1900M0864
$$ 15355 -38237 10350 35005 -27177 -15196 37393 -6058 -31262 27257 16897 -35003 5861
990E861K5029n7352R935N1400m1915k4829N7607j1220n2456M3951K8139o2300
$$ 5861 30890 -26462 -16527 34873 -7042 -31871 25736 14516 -37940 6011 34150 -28150
1002b8150N710N7507l8052l3602N6976o27n3493L2899K9600n2286M233N1285l7975
$$ -28150 -22440 35067 -2985 -36587 20389 19762 -33731 -832 28768 -23518 -19285 32000 -5975
1015e975l0679N8465j546n6954L4252L5470n5012j517N5581l2355l6516N4607
$$ -5975 -36654 21811 20265 -36689 -2437 33033 -21979 -23496 32085 -270 -36786 17821
1027A7821N341n6356K9071L8534n1482p127N3405k7032l4810N0666L065n5487
$$ 17821 23162 -33194 -4123 34411 -17071 -24198 29207 2175 -32635 18031 21096 -34391
1039c4391L1509M0618n5220j1194O0083k3311m3925M7218J3284n3272K2734L9545
$$ -34391 -2882 37736 -17484 -28678 31405 8094 -35831 11387 24671 -28601 -5867 33678
1051C3678m9407j0098N6425k3255m3774M8945J4230n6194K1296M3897m9022j4123
$$ 33678 -15729 -25827 30598 7343 -36431 12514 26744 -29450 -8154 35743 -13279 -27402
1063b7402N8574k0577m7902M7503J9801n6944J4967M6746m2892j8210N3609j7387
$$ -27402 31172 10595 -37307 10196 29997 -26947 -11980 34766 -8126 -26336 27273 9886
1075I886m4279M5722J8038n8065J5950N0009m3815k3717N6911j0762m9287L9858
$$ 9886 -34393 11329 29367 -28698 -12748 37261 -6554 -30271 26640 15878 -33409 6449
1087F449K2839n4176J1178M9216m0936k4929N5413q154n0086L7293K5914n2912
$$ 6449 29288 -24888 -13710 35506 -5430 -30359 25054 16900 -33186 4107 30021 -22891
1099b2891P292M9191l8060k6564N5355n898n2859L5803L0876n3293J060N0618
$$ -22891 -15599 33592 -4468 -31032 24323 18425 -34434 1369 32245 -21048 -19988 30630
1111C0630l1456k8456N0749l970n0427L4892L1242n3850o84N3793k9942l3681
$$ 30630 -826 -29282 21467 17497 -32930 1962 33204 -20646 -21330 32463 2521 -31160
1123c1160N0126K150n0734L0266L2182n1883k591N4455k8138l7273M9597P072
$$ -31160 18966 21116 -29618 648 32830 -19053 -21644 32811 4673 -32600 16997 24069
1135B4069n2304K5380L4876m8702n156N2995k6923l8690N0111J0045n4966K2155
$$ 24069 -28235 -2855 32021 -16681 -21837 31158 4235 -34455 15656 25701 -29265 -7110
1147g110L9589m6370j0912N1807k2592l8462M8133J0940n6190K0732M3153m5639
$$ -7110 32479 -13891 -24803 27004 4412 -34050 14083 25023 -31167 -10435 32718 -12921
1159a2921j6028N3378j7591m1594M3533J4626n2973J8706M2896m5000j7190N4719
$$ -12921 -28949 24429 6838 -34756 8777 23403 -29570 -10864 32032 -12968 -30158 24561
1171B4561j5030m5198M2021J9738n2177J3336M4153m0739j9726N3233j1800m6295
$$ 24561 9531 -35667 6354 26092 -26085 -12749 31404 -9335 -29061 24172 12372 -33923
1183c3923L9149K3036n0979R090M5343l7144k1934N1485j0808m6395L8871K5370
$$ -33923 5226 28262 -22717 -13627 31716 -5428 -27362 24123 13315 -33080 5791 31161
1195C1161n2998N295M9545l3252k8144M8691l300m6225L3478K4829n0217N337
$$ 31161 -21837 -16542 33003 -249 -28393 20298 16998 -29227 4251 29080 -21137 -15800
1207a5800M9422l3726k9669N0357j143m9031K9766L0011m8856J122N0053l1225
$$ -15800 33622 -104 -29773 20584 19441 -29590 176 30187 -18669 -17547 32506 1281
1219A281l2452M9401M073n0907K6072L2492m5316k471M7605k8452l1023M9862
$$ 1281 -31171 18230 22303 -28604 -2532 29960 -15356 -17827 29778 1326 -29697 20165
1231B0165K701n3480K7110L7627m8471q246N1920k2312l6540M5032P656n0130
$$ 20165 22866 -30614 -3504 34123 -14348 -22594 29326 7014 -29526 15506 23162 -26968
1243b6968K2325L7178m5949r367N0930k1326l6777M4697R773n2048K1108L9466
$$ -26968 -4643 32535 -13414 -22781 28149 6823 -29954 14743 24516 -27532 -6424 33042
1255C3042m5663j3805N3864j6999m2655M0906J6645m9177J3897L8943l9055j4646
$$ 33042 -12621 -26426 27438 10439 -32216 8690 25335 -23842 -9945 28998 -10057 -24703
1267b4703M8899j6352m0003M2061J6716n2305J2756M4491l9320k1481N0806q638
$$ -24703 24196 7844 -32159 9902 26618 -25687 -12931 31560 -7760 -29241 21565 12927
1279A2927m4160L5514K2251m8968P933M3406l4263k2602M7428p574m2533L5018
$$ 12927 -31233 4281 26532 -22436 -14503 28903 -5360 -27962 19466 11892 -30641 4377
1291D377K1959m9468Q176M6950l6082k8332N1064o82m8555K9090K9223m5228j8
$$ 4377 26336 -23132 -14956 31994 -4088 -32420 18644 17962 -30593 -1503 27720 -17508 -17526
1304a7526M4248k8963k6503M7242k735m7243L0369L0063m7738o69M9110k9049
$$ -17526 26722 -2241 -28744 18498 15763 -31480 -1111 28952 -18786 -19455 29655 606
1316F06l2433M7601L973m9896K5126L5462m4155p708M6585k1379l1277M1720M177
$$ 606 -31827 15774 19747 -30149 -5023 30439 -13716 -21424 25161 3782 -27495 14225 18402
1329A8402m7024K6378L3324m7023o530N2428k2231l9493M3522J3152m9839J7090
$$ 18402 -28622 -2244 31080 -15943 -22473 29955 7724 -31769 11753 24905 -24934 -7844
1341g844L7926l9583j1849M6749j7194l5637L9516J1307m7424J7591L7542m1445
$$ -7844 30082 -9501 -21350 25399 8205 -27432 12084 23391 -24033 -6442 31100 -10345
1353a0345j2372N0114j6306m1400M0250J8601n1040J0214M2756l3837j9769M4382
$$ -10345 -22717 27397 11091 -30309 9941 28542 -22498 -12284 30472 -3365 -23134 21248
1365B1248r766l7238L4349J5524m6195J3044L9986l8069j9824N0261p681m5382
$$ 21248 11482 -25756 8593 24117 -22078 -9034 30952 -7117 -26941 23320 15639 -29743
1377b9743L3766K4478m7383M034M3040l0621k3867M5654m526m2280K9693K2896
$$ -29743 4023 28501 -18882 -14848 28192 -2429 -26296 19358 14832 -27448 2245 25141
1389B5141m3993N488M1216l3136k3209M8812l924m8096L1484L1045m8048m377
$$ 25141 -18852 -13364 27852 -5284 -28493 20319 16395 -31701 -217 30828 -17220 -21597
1401b1597M6691k2562k9419L9708J915m1084K6763K6063m5296R5M6285k6931l1407
$$ -21597 25094 2532 -26887 12821 14736 -26348 415 26478 -18818 -18723 27562 631 -30776
1414c0776M5387M370m7736K4696L3633m3508q525M7605j9522l4925L9300R372
$$ -30776 14611 18981 -28755 -4059 29574 -13934 -22459 25146 5624 -29301 9999 19371
1426A9371m2704J8022L0494l8230n307M4353k3587l2920M4051R748n0400J7141
$$ 19371 -23333 -5311 25183 -13047 -18354 25999 2412 -30508 13543 23291 -27109 -9968
1438i968M0704l8125j6538M5255j2012l5783L3808J3505m2309J4189L4240l6464
$$ -9968 30736 -7389 -23927 21328 9316 -26467 7341 20846 -21463 -7274 26966 -9498
1450i498j2358M5667j4195l8803L7107J5933m6905J2047M0764l5412k0844M7349
$$ -9498 -21856 23811 9616 -29187 7920 23853 -23052 -11005 29759 -5653 -26497 20852
1462B0852o374m1138K8481K1270m0071O098L5766l0967j5565M4015j1645m0370
$$ 20852 14478 -26660 1821 23091 -16980 -10882 24884 -6083 -21648 22367 10722 -29648
1474b9648L6343K1709m9529M595M5785k8929k6419M2733o90m0545K6681K2593
$$ -29648 6695 28404 -21125 -16530 29255 326 -26093 16640 15950 -24595 2086 24679
1486B4679m1176K740M0329k7868k2436M1911l425m0927K9660K4813m6430P73M6807
$$ 24679 -16497 -13757 26572 -1296 -23732 18179 14754 -26173 3487 28300 -18130 -17357 29450
1499B9450k6149l2115M2816P350m3498J8868K8079l6498l429L9063k3044k5209
$$ 29450 3301 -28814 14002 21352 -22146 -3278 24801 -11697 -15126 23937 893 -24316
1511b4316M1231J025m4509K4672L2176m2167q953M5567j8184l4081L8389J1106
$$ -24316 16915 17940 -26569 -1897 30279 -11888 -20841 24726 6542 -27539 10850 21956
1523B1956m3376J4678L2849l4413j0322M0010j6442l0008L5618Q357m2417J8227
$$ 21956 -21420 -6742 26107 -8306 -18628 21382 4940 -25068 10550 18907 -23510 -5283
1535e283L3317l9437j2185M7169j3338m0064L3930J9001m1543P326L4039k8886
$$ -5283 28034 -11403 -23588 23581 10243 -29821 4109 23110 -18433 -11107 22932 -5954
1547e954j4437L8513j1984l2977L3828J3661m3720J1426L8880l3821j9435M4358
$$ -5954 -20391 18122 6138 -26839 6989 20650 -23070 -11644 27236 -6585 -26020 18338
1559A8338o819m0221L0110K2115m2404L182L9406k5780k1457L7334m071l4618
$$ 18338 11519 -28702 1408 23523 -18881 -15699 23707 -2073 -23530 13804 9733 -24885
1571b4885K8233J7776m2125P644M0993l1064k4482M5133m89m3936K4619K7440
$$ -24885 3348 21124 -21001 -13357 27636 -3428 -27910 17223 16734 -27202 -2583 24857
1583B4857l8951k507L9259k1668k3630L7269o65l7691K4653K3512l9826P00M0791
$$ 24857 -14094 -16601 22658 990 -22640 14629 13964 -23727 926 24438 -15388 -14688 26103
1596B6103k5313k6688M2504L602m4321K0213L1529l6769p911L9306j6653k6718
$$ 26103 790 -25898 16606 20208 -24113 -3900 27629 -9140 -17051 22255 5602 -21116
1608b1116L3843N169l7514J9493K5882l7697l990M1943k0118l1327L8096J0062
$$ -21116 12727 17896 -19618 -125 25757 -11940 -15930 26013 5895 -25432 12664 22726
1620B2726m3225J4849L2922l3946j2206L9382j2010l0495L1382J0135l8273J3830
$$ 22726 -20499 -5650 27272 -6674 -18880 20502 8492 -22003 9379 19514 -18759 -4929
1632d929K9674l3633r758M0733j4580l4351L4807J5220m3400R407L6462l0067
$$ -4929 24745 -8888 -18646 22087 7507 -26844 7963 23183 -20217 -10810 25652 -4415
1644d415j8367L9055o441l3156K7564J4332l7259R680L2987l1636j5505M1457
$$ -4415 -22782 16273 9832 -23324 4240 18572 -18687 -9007 23980 -7656 -23161 18296
1656A8296q055l7496L0121J9431m1412N372L8232k7143k2511L8550p88l6023K3205
$$ 18296 10241 -27255 2866 22297 -19115 -13743 24489 -2654 -25165 13385 12597 -23426 -221
1669b21K0305l5968L994L4212k6321j9609M0353l818l9894K5959K5758l9295k672
$$ -221 20084 -15884 -11890 22322 -3999 -23608 16745 12927 -26967 -1008 24750 -14545 -17217
1682a7217L9752k0768k5036L4946K508l6282J9849K4518l5059k181L6854k0754
$$ -17217 22535 1767 -23269 11677 14185 -22097 -2248 22270 -12789 -14970 21884 1130
1694A130k4218L6270K453l8521K0329K7462l6624o742M0411j5869k9417L1893
$$ 1130 -23088 13182 15635 -22886 -2557 24905 -11719 -18461 21950 6081 -23336 8557
1706H557Q949l6433J3921K6831l1297o060L6279j6687k7726L4596Q057m0215J4511
$$ 8557 17506 -18927 -5006 21825 -9472 -15532 20747 4060 -23666 10930 18987 -21228 -6717
1719f717L1439l2819j1898L9366j0950l1415K9803J2330l7326J0882L0293k9769
$$ -6717 24722 -8097 -19995 19371 8421 -22994 6809 19139 -18187 -7305 22988 -6781
1731f781j2109L7478j1265k9885K9816J2364l9000J1007L3593l0836j6496L9755
$$ -6781 -18890 18588 7323 -22562 7254 19618 -19382 -8375 25218 -5618 -22114 17641
1743A7641o222l4422K6339J7417l5575N058L1327k6079j4872L7271p491l3830
$$ 17641 11419 -23003 3336 20753 -14822 -9764 21563 -4516 -19388 17883 10392 -23438
1755b3438K7538J8305l7799M123L4959k5571j9164L6862k876l4927K4015K0936
$$ -23438 4100 22405 -15394 -11271 23688 -1883 -21047 15815 12939 -21988 2027 22963
1767B2963l5803M92L4231k1435k0379L3930j471l3615K3442K0462l6878O17L7043
$$ 22963 -12840 -12348 21883 448 -19931 13999 12528 -21087 2355 22817 -14061 -13444 23599
1780B3599k1541k4401L4732L082l5295J8023K3765l2285l400L4243j8587k3239
$$ 23599 2058 -22343 12389 15471 -19824 -1801 21964 -10321 -13721 20522 1935 -21304
1792b1304L3005L462l5848J7757K4796l2503m683L5506j6899k6308L2241O603
$$ -21304 11701 15163 -20685 -2928 21868 -10635 -15318 20188 3289 -23019 9222 15825
1804A5825l6840J5498K7015l0745q042L4827j3269k6558K9465P753l5378J4648
$$ 15825 -21015 -5517 21498 -9247 -17289 17538 4269 -22289 7176 14929 -20449 -5801
1816e801K7172l1504r088L7152j2174k9475K9056J1416l5471J0482K8678k8194
$$ -5801 21371 -10133 -19221 17931 5757 -23718 5338 16754 -18717 -8235 20443 -7751
1828g751j0958L5918j0795k9688K7935J3432l5617Q435K9757k6651j2829L5351
$$ -7751 -18709 17209 6414 -23274 4661 18093 -17524 -9089 20668 -5983 -18812 16539
1840A6539q857l0245K7410J4673l5729O070L1737k4751j5726L3981n191l0248
$$ 16539 7682 -22563 4847 19520 -16209 -10139 21598 -3153 -18879 15102 9911 -20337
1852b0337K4694J5115l4732N211L2482k4262j7855L4323k516l1503K1690J7688
$$ -20337 4357 19472 -15260 -10049 22433 -1829 -19684 14639 12123 -19380 2310 19998
1864A9998l2653K179L1985k2273j8621L3513l86l2877J9830K0188l2336o1L1997
$$ 19998 -12655 -10476 21509 -764 -19385 14128 13742 -19135 695 20883 -11453 -11514 20483
1877B0483j9609j9974L2217N74l2765J8940K1469l1893k224L2666j7371k1912
$$ 20483 874 -19100 13117 13691 -19074 -134 21335 -10558 -12782 19884 2513 -19399
1889a9399L0407L226l2592J7032K3046l1602m748L4062j5428k4529K9625N637
$$ -19399 11008 14234 -18358 -1326 21720 -9882 -14630 19432 4004 -20525 9100 14737
1901A4737l2505J4846K3199k9075n754L3404j5236k5029L0011P842l3966J2182
$$ 14737 -17768 -2922 20277 -8798 -14552 18852 3616 -21413 8598 16440 -17526 -5344
1913e344K6032k7743q729L2961j2215k5883K7686R183l2968J0227K6738k6196
$$ -5344 20688 -7055 -15784 17177 4962 -20921 6765 15948 -17020 -6793 19945 -6251
1925f251j0426L2761j0514k6394K6749J0804l4510R370K9308k5560j4205L3197
$$ -6251 -16677 16084 5570 -20824 5925 16729 -17781 -8411 20897 -4663 -18868 14329
1937A4329o193k8123K2890J3279l1041O130K7685k3664j3577L2544n807k9170
$$ 14329 8136 -19987 2903 16182 -14859 -8729 18956 -4708 -18285 14259 8452 -20718
1949b0718K2858J5089l2073M261K9580k1540j6952L1708j813k9960J9644J7353
$$ -20718 2140 17229 -14844 -10583 18997 -2543 -19495 12213 10400 -19560 84 17437
1961A7437k9640J208K8779j9764j6385L0596k043k9895K0342J8462l2019l29L2397
$$ 17437 -12203 -10995 17784 -1980 -18365 12231 10188 -19707 635 19097 -12922 -13251 19146
1974A9146j8093k0859K9637K738l0149J6065J9607k8117j927K9781j6644j9521
$$ 19146 1053 -19806 9831 12569 -17580 -1515 18092 -10025 -11952 17829 1185 -18336
1986a8336K9279K110l1087J7068K1244k9936l927L2246j4902k3417K8956N935
$$ -18336 10943 13053 -18034 -966 20278 -9658 -13585 18661 3759 -19658 9298 15233
1998A5233l1006J1964K3009k5246o467K9360j3435k0838K7194M855l1594J3962
$$ 15233 -15773 -3809 19200 -6046 -12513 16847 3412 -17426 9768 14623 -16971 -3009
2010c009K4580k8122q640L2368j0196k5605K4875J0212l0660R008K4369k3779
$$ -3009 21571 -6551 -15191 17177 6981 -18624 6251 16463 -14197 -5189 19180 -4599
2022d599r789K9637r313k3549K3481R284l0129R775K5575k5680j1565L2653p216
$$ -4599 -14388 15249 5936 -17613 5868 15152 -14977 -5202 20373 -5307 -16872 15781 8565
2035H565k8214K2046J4839k9650L700K6088j9893j2720K7821n687k4974K1515
$$ 8565 -19649 2397 17236 -12414 -8714 17374 -2519 -15239 12582 6895 -18079 3436
2047C436J2695l0087M538K8667k1771j5690L0723k679k9351J9095J7778k8809
$$ 3436 16131 -13956 -9418 19249 -2522 -18212 12511 9832 -19519 -424 17354 -11455
2059a1455K8K7701j6658j6549K6514q76k6226J8541J5115k9071J768K9513j8986
$$ -11455 -11427 16274 -384 -16933 9581 8705 -17521 1020 16135 -12936 -11168 18345 -641
2072f41j9542L0701J956l0885J4874K1500k6698m354K7905j3377j8533K5201K334
$$ -641 -20183 10518 12474 -18411 -3537 17963 -8735 -13089 14816 1439 -17094 8107 10441
2085A0441k7411J5405J8640k7441k570K9854j4896k1419K7656O159l1476J1956
$$ 10441 -16970 -1565 17075 -10366 -12936 16918 2022 -19397 8259 14418 -17058 -5102
2097e102K3539k4929q241K8539q933k1611K2533O207k6265J1412K0099k5693n567
$$ -5102 18437 -6492 -14733 13806 4873 -16738 5795 12002 -14263 -2851 17248 -8445 -14012
2110a4012L0932j1828k4540K5257J0717l0357O806K5028k1688j1091K7622n893
$$ -14012 16920 5092 -19448 5809 16526 -13831 -7025 18003 -3685 -14776 12846 6953
2122F953k3098K0373J0324k6858P201K2534k2123r697K9027p923k5173K2699J3675
$$ 6953 -16145 4228 14552 -12306 -5105 17429 -4694 -14391 14636 6713 -18460 4239 17914
2135A7914l0581L469K7496j8528j5298K6201j720k3829J7863J1779k6101N299
$$ 17914 -12667 -9198 18298 -230 -15528 10673 8953 -14876 2987 14766 -11335 -6036
2147f036K3476k0050j2624K8854l769k8106K0057J6779k8631k54K7661j6115j7221
$$ -6036 17440 -2610 -15234 13620 9851 -18255 1802 18581 -10050 -10304 17357 1242 -15979
2160a5979K5710R11k5613J5177J5510k4714O59K4462j7057j4678K7328j323k8130
$$ -15979 9731 10642 -14971 206 15716 -8998 -8339 16123 -934 -15612 11716 10393 -17737
2173a7737J7203J9129k7950l306K8704j2379k0247K3029N141k5164J1487J6614
$$ -17737 -534 18595 -9355 -12661 16043 3664 -16583 6446 11587 -13577 -2090 14524
2185A4524k3542j266K5711j4375j8318K5989L216k8274J2678K0906k5168o456
$$ 14524 -9018 -10284 15427 1052 -17266 8723 11939 -16335 -3657 17249 -7919 -14375
2197a4375K8792r717k2421K1922Q259k5982P865J9733k0424n716K4543j0792j8824
$$ -14375 14417 4700 -17721 4201 12460 -13522 -5657 14076 -6348 -12064 12479 1687 -17137
2210a7137K3646N948k9182J0355K3871k2826j1065K8167n450k3164J9241J0537
$$ -17137 6509 12457 -16725 -6370 17501 -5325 -16390 11777 6327 -16837 2404 12941
2222A2941k5063N498K0840j8739r013K5363o932k1720K1225R360k7403O470K4882
$$ 12941 -12122 -6624 14216 -4523 -13536 11827 4895 -16825 4400 13760 -13643 -7173 17709
2235A7709k1100j2604K7739k842k4932J6733J4301k4202J571K2448j6302j1292
$$ 17709 -3391 -15995 11744 8902 -16030 703 15004 -9198 -7627 14821 -1481 -12773
2247a2773K4457n122k2495J9573J2593k7563K843K6506j7908j6544K6954P25k5363
$$ -12773 11684 6562 -15933 3640 16233 -11330 -8487 18019 111 -16433 10521 11246 -14117
2260a4117J3906J5838k2942j140K3436j4376j4210K3687m92k3624J5455J4512
$$ -14117 -211 15627 -7315 -8455 14981 605 -13605 10082 9590 -14034 1421 15933
2272A5933k5228J51K6295j4939j8954K5347M267k6458J0620J8539k0927m437K3001
$$ 15933 -9295 -9144 17151 2212 -16742 8605 12872 -13586 -2966 15573 -5354 -9791 13210
2285A3210j1052j6053K1747K221k4599J3327J7727k4216m294K6680j0876k0433
$$ 13210 2158 -13895 7852 10073 -14526 -1199 16528 -7688 -11982 14698 3822 -16611
2297a6611K2532O646k6268Q358K0466k0158p302K3542p777j8107J9958N182k4031
$$ -16611 5921 12567 -13701 -5343 15123 -5035 -12337 11205 3428 -14679 5279 10461 -13570
2310a3570R592J9602k2271p147K7203q614k2306K0936J0012k5634M781K1512j7432
$$ -13570 -3978 15624 -6647 -13794 13409 4795 -17511 3425 13437 -12197 -7416 14096 -3336
2323c336r601K3222n333j9647J8261Q168k4138O632K1497k0526r453K6254m877
$$ -3336 -12937 10285 4952 -14695 3566 11734 -12404 -5772 15725 -4801 -14254 12000 7123
2336G123k3694J8408J2925k5301K232K2794j5651j2354K2813j743k1314J5543
$$ 7123 -16571 1837 14762 -10539 -8307 14487 -1164 -13518 9295 7552 -13762 1781
2348A781J1297k3833M111K2221j7805j2954K5798j855k4487J5217J5991k3953
$$ 1781 13078 -10755 -6644 15577 -2228 -15182 10616 8761 -15726 -509 15482 -8471
2360h471j162K3178j2948j4758K1698Q70k2044J3121J4018k1957o67K3222j4179
$$ -8471 -9633 13545 597 -14161 7537 8407 -13637 -516 13502 -8455 -9122 14100 -79
2373g9j5201K3755J766k5282J2275J8398k2465m956K4538r814j6996J9554M390
$$ -79 -15280 8475 10241 -15041 -2766 15632 -6833 -11789 12749 2935 -14061 5493 9883
2386I883k2315J0778J5641k1483k884K4293j1225j7942K2138M997k4854R397J9621
$$ 9883 -12432 -1654 13987 -7496 -10380 13913 2688 -15254 6884 11881 -12973 -3576 16045
2399A6045k0753p058K4511p636j9484J9050P507k2881P677J7708j9305n645K3700
$$ 16045 -4708 -11766 12745 5109 -14375 4675 12182 -10699 -3022 14686 -4619 -10264 13436
2412A3436q794j9458K0428Q133k5291O406K1233j8324j0055K4039m750k0670J7065
$$ 13436 4642 -14816 5612 13745 -11546 -5140 16093 -2231 -12286 11753 7003 -13667 3398
2425C398R683k2690M673J9825j7331r757K4417n683k1000J7754J0852k4442L582
$$ 3398 13081 -9609 -4936 14889 -2442 -12199 12218 6535 -14465 3289 14141 -10301 -6719
2438f719K2265j6723j2285K3369j672k2120J4523J2558k2174J277K0902j4650
$$ -6719 15546 -1177 -13462 9907 8235 -13885 638 13196 -8978 -7701 13201 -1449
2450a449j1820K2531j994k2376J5692J3440k3919k94K3266j3043j4856K1722J539
$$ -1449 -13269 9262 7268 -15108 584 14024 -9895 -10189 13077 34 -14822 6900 8439
2463H439k2217J1979J4956k1483j647K2382j2337j4671K1444J453k2649J2403
$$ 8439 -13778 -1799 13157 -8326 -9973 12409 72 -14599 6845 8298 -14351 -1948
2475a948J5483k1759k756K3910j1069j7273K0739N072k3061R448J6307j9440l787
$$ -1948 13535 -8224 -10980 12930 1861 -15412 5327 10399 -12662 -3214 13093 -6347 -10134
2488a0134K1838r620j6421K0456M318k3334R451J7810j9787n979K3818q480j8495
$$ -10134 11704 2084 -14337 6119 10437 -12897 -3446 14364 -5423 -11402 12416 3936 -14559
2501a4559J9676O727k3042P181J8819j8615p088K2704p238j7930J8242O879k2787
$$ -14559 5117 11844 -11198 -4017 14802 -3813 -10901 11803 4565 -13365 4877 11756 -11031
2514a1031O645J9608j8320q454K3603n730j9861J7176R639k2766M001K0085j6172
$$ -11031 -4386 15222 -3098 -11552 12051 6321 -13540 3636 13275 -9491 -5490 14595 -1577
2527a577r988K2392m003j9977J5941J0611k2769L339K0803j5758j1371K2300k283
$$ -1577 -11565 10827 6824 -13153 2788 13399 -9370 -6031 14772 -986 -12357 9943 7660
2540G660k0897J4730J1871k1904J364K1201j4099j2801K1576o66k1118J3759J2396
$$ 7660 -13237 1493 13364 -8540 -7176 14025 -74 -12875 8701 8035 -13083 676 13072
2553A3072k1455M43K1362j3296j4034K1798P74k1804J2230J4111k0681j505K1569
$$ 13072 -8383 -7940 13422 126 -13908 7890 8664 -13140 -910 13201 -7480 -8985 12584
2566A2584j2226j3979K0764J918k2375J1414J5331k0346l163K2515j0945j5640
$$ 12584 358 -13621 7143 9061 -13314 -1900 13431 -6915 -10078 12437 1492 -14148
2578a4148K0314L640k2921J0119J6763k0006m200K1792q821j6365J9204M493k2056
$$ -14148 6166 9806 -13115 -2996 13767 -6239 -10439 11353 2532 -13833 5371 9864 -12192
2591a2192Q588J6761j9106n420K2580p881j7832J8466O546k2444P508J7775j8048
$$ -12192 -3604 13157 -5949 -11369 11211 3330 -14502 3964 10510 -11934 -4426 13349 -4699
2604d699o914K2284o467j8454J7821P979k2714N635J9078j7029q913K2516n036
$$ -4699 -11613 10671 4204 -14250 3571 11550 -11164 -5529 13549 -3480 -12393 10123 5087
2617E087j8929J6441Q667k1327L818J9754j6082r912K2161l565j9969J5923J0224
$$ 5087 -13842 2599 11266 -10061 -6243 13511 -2571 -12483 9678 6113 -13856 2067 12291
2630A2291k1790K883K0212j4893j1429K1680j279k0339J3248J1999k0537J149
$$ 12291 -9499 -6616 13596 -1297 -12726 8954 7675 -12664 584 12583 -7954 -6805
2642f805K0439j4274j1978K1524q20k1133J3050J3804k1165o32K1434j2723j3365
$$ -6805 13634 -640 -12618 8906 8086 -13047 3 13807 -7358 -7990 13444 721 -12644
2655a2644K0208J412k1213J1747J4052k0160j474K0906j1275j3981K0022K139
$$ -12644 7564 8976 -12237 -490 13562 -6598 -8072 12834 1559 -12422 7600 9739
2667I739k1989J1172J5319k0361l261K1920r436j6401J9410M034k1011Q668J5559
$$ 9739 -12250 -1078 14241 -6120 -9381 12539 3103 -13298 6112 10146 -10865 -2197 13362
2680A3362j8277m269K1460r334j6181J9237M761k2139Q105J7400j9094n971K2292
$$ 13362 -4915 -9184 12276 2942 -13239 5998 10759 -11380 -3275 14125 -4969 -10940 11352
2693A1352o814j8207J7274P261k1229N978J7538j6720p283K1153o062j7648J6972
$$ 11352 4538 -13669 3605 10866 -10363 -4385 13153 -3567 -10850 10303 4241 -13407 3565
2706C565P330k1638N332J8908j6714r473K2053l272j9651J4955R979k0870L329
$$ 3565 10895 -10743 -5411 13497 -3217 -12690 9363 6091 -13560 1395 11374 -9496 -6167
2719f167J8683j5271r426K0618l125j9103J5311J0049k1335K500K0178j4677j1596
$$ -6167 12516 -2755 -12181 8437 5312 -13791 1520 11569 -9766 -7266 12912 -1765 -13361
2732a3361K1640j254k0609J3403J2117j9981J34J9541j2406j1388J9942r22k0035
$$ -13361 8279 7025 -13584 -181 11936 -8045 -7911 11630 -776 -12164 7778 6856 -13179
2745a3179J3505J2087k0901k2K1173j2589j3560K0330J864k1398J1275J4357j9541
$$ -13179 326 12413 -8488 -8510 12663 74 -13486 6844 8708 -12690 -1415 12942 -6599
2758f599k173K0546j0350j3603J8680J843k0322J1390J3758k0148k025K2024j0717
$$ -6599 -8772 11774 1424 -12179 6501 8344 -11978 -588 13170 -6978 -9003 13021 2304
2771B304j5645J9853L949k1939Q691J5993j7792m614K0396p888j5254J7385M414
$$ 2304 -13341 6512 10461 -11478 -2787 13206 -4586 -9200 11196 3308 -11946 5439 9853
2784I853k0605Q511J5911j8510n005K1694p859j7011J7381O839k1264O023J7414
$$ 9853 -10752 -2241 13670 -4840 -9845 11849 3990 -13021 4360 11199 -10065 -4042 13372
2797A3372j6522o989K0391n623j6880J6057P048k0407N751J7159j6682p406K1586
$$ 13372 -3150 -10139 10252 4629 -12251 3806 10854 -9553 -3802 13357 -3325 -10731 10855
2810A0855n330j9064J6375R275k1503L375J8976j4194r923K0099l221j8002J4498
$$ 10855 5525 -13539 2836 12111 -9392 -6017 12959 -1235 -11158 8941 5720 -12282 2216
2823B216Q865j9961L162J8658j5323r426K1058k865j9457J4463J1021k1066R38
$$ 2216 11081 -8880 -5718 12940 -2383 -11809 9249 6384 -13073 1390 12411 -8655 -7717
2836g717K0345j2956j1922J9395j73j9123J2485J0857j9473J367J9153j3192j1724
$$ -7717 12628 -328 -12250 7145 6972 -12151 334 11191 -8282 -6915 12238 -954 -12678
2849a2678K0516k04k0737J1777J3722j9752j794K0794j0815j3882J8867J975j9569
$$ -12678 7838 7634 -13103 -1326 12396 -7356 -9150 11644 829 -13053 5814 7789 -11780
2862a1780J0547J2818j8690j438J9698j0441j3969J9415K419k1027R716J5821
$$ -11780 -1233 11585 -7105 -8543 11155 714 -13255 6160 8579 -12448 -2732 13089
2874A3089j9102m184K1127q063j5577J7072M913j9762P632J4230j6571l962J9692
$$ 13089 -6013 -10197 10930 2867 -12710 4362 9275 -10487 -2855 11375 -5196 -9158 10534
2887A0534q306j5232J7886N420k1384P194J7187j7310o785K0782n580j6580J5501
$$ 10534 2228 -13004 4882 10302 -11082 -3888 13299 -4011 -10796 9986 4406 -12174 3327
2900C327P050j9668N010J6616j5386o703J9514n474j6532J6213P105k0849M825
$$ 3327 10377 -9291 -4281 12335 -3051 -9754 9760 4286 -12246 3967 11072 -9777 -4952
2913d952J8711j5898r172K0767l046j7903J3520Q802j8635K798J7181j3750q532
$$ -4952 13759 -2139 -11311 9456 6410 -11493 2027 10829 -7806 -5008 12173 -1577 -10109
2926a0109J9586l325j8225J4451R420k0501K216J9338j3458j1371J9793k56j9275
$$ -10109 9477 6152 -12073 2378 11798 -8703 -6487 12851 -607 -11978 7815 7559 -11716
2939a1716J1926J1333j8214k57J8421j1996j0710J8821r89j8812J2262J1857j9642
$$ -11716 210 11543 -6671 -6928 11493 -503 -11213 7608 6619 -12193 69 11926 -7716
2952g716n34K0357j1216j3590J8266K891j9706R100J3373j7209k319J8449r018
$$ -7716 -8250 12107 891 -12699 5567 8458 -11248 -2148 11225 -5984 -8303 10146 1128
2965A128j2961J7436K140j9480R929J3652j8345k836K0192q783j5136J7222N370
$$ 1128 -11833 5603 7743 -11737 -1808 11844 -6501 -9337 10855 2072 -13064 4158 9528
2978I528k0254P016J5040j5730n262J8975p034j4329J6060M655j9428P526J5748
$$ 9528 -10726 -3710 11330 -4400 -9662 9313 2279 -12050 4010 8665 -10763 -3237 12511
2991A2511j7558n734K0693n809j6991J5667P684j9992M342J6596j4421p400J8883
$$ 12511 -5047 -10781 9912 4103 -12888 2779 10463 -9529 -5187 11409 -3012 -10412 8471
3004H471m343j5978J4592O822j9055M974J6721j5174q227K0346l702j8214J4164
$$ 8471 4128 -11850 2742 9564 -9491 -4517 12204 -2970 -11197 9149 5447 -12767 1397
3017A397J0102j9645J901J7525j2274r330J7818k177j6268J2859Q761j8527J978
$$ 1397 11499 -8146 -6245 11280 -994 -10324 7494 5317 -10951 1908 10669 -7858 -5880
3030e880J8059j3108j0157J9324q82j9233J1736J2361j8476r17J8281r944j1738
$$ -5880 12179 -929 -11086 8238 7356 -11877 -141 12220 -6256 -7173 11108 1164 -10574
3043a0574J7344L83j7232J0602J1042j7612o23J8597j0980j2152J8329J683j9696
$$ -10574 6770 7153 -10079 523 11565 -6047 -6670 11927 947 -11205 7124 8807 -10889
3056a0889R813J3759j7352l276J8958q152j3432J6199K983j7968Q551J2624j6432
$$ -10889 -1076 12683 -4669 -7945 11013 2861 -10571 5628 8611 -9357 -806 11818 -4614
3069d614l084J8717q363j4329J7169M329j9612P241J5286j6098n734J8900n589
$$ -4614 -7698 11019 2656 -11673 5496 9825 -9787 -2546 12740 -3358 -9092 9808 4219
3082D219j5234J5039M831j7781O294J4327j5669m855J8863o538j5593J5539O643
$$ 4219 -11015 4024 8855 -8926 -2632 11695 -3974 -8829 10034 3496 -12097 3442 10085
3095A0085j9537M545J6749j4719p477J8846m155j6143J4244P323j8418L741J6076
$$ 10085 -9452 -4907 11842 -2877 -10354 8492 4337 -11806 2438 9761 -8657 -4916 11160
3108A1160j3853p389J8617m314j6703J4252Q813j9060J843J7580j2379r644J7971
$$ 11160 -2693 -10082 8535 4221 -12482 1770 10583 -8477 -6634 10946 -1433 -11077 6894
3121F894j204j7222J1679R561j7425J346J6980j1821r721J7826q01j7931J1738
$$ 6894 5690 -11532 147 9708 -7717 -6371 10609 -1212 -10933 6893 6092 -11839 -101
3134a01J1026j8491M15J8016j0873j1687J7516J640j7804R182J1535j6408j121
$$ -101 10925 -7566 -7151 10865 -8 -11695 5821 7461 -10343 -1161 10374 -6034 -7155
3147g155J7454r369j1629J6640J723j8420R600J2977j7223k763J8969q295j3518
$$ -7155 10299 930 -10699 5941 7664 -10756 -1156 11821 -5402 -8165 10804 2509 -11009
3160a1009J5719L936j7746P126J3238j5682l025J7725p493j3487J5633M173j8561
$$ -11009 4710 8646 -9100 -1974 11264 -4418 -7443 10282 2789 -10698 4935 9108 -9453
3173i453P405J3867j5498m767J8571o229j4926J4866O278j8542N069J4400j3911
$$ -9453 -2048 11819 -3679 -8446 10125 3896 -11030 3836 10114 -8428 -3359 11041 -2870
3186b870n428J7453n203j4616J4245O262j8362M716J5121j3712p033J7889l200
$$ -2870 -8298 9155 3952 -10664 3581 9843 -8519 -3803 11318 -2394 -9427 8462 5262
3199E262j6264J3185P921j7662K648J5607j2160q442J7516k304j5920J2202Q261
$$ 5262 -11002 2183 10104 -7558 -4910 10697 -1463 -9905 7611 5307 -10613 1589 9850
3212I850j7538K115J6626j2126r512J7903j233j7054J0923J0053j6696L92J6437
$$ 9850 -7688 -5573 11053 -1073 -10585 7318 6085 -10969 -46 10007 -6689 -6297 10140
3225A0140j0497j0092J6810n72j6607J0486J0518j6909j62J6859r785j1163J6485
$$ 10140 -357 -10449 6361 5789 -10818 -332 10186 -6723 -6885 9974 189 -10974 5511
3238E511J185j6906Q683J1890j6093j789J7521r300j1336J5566K243j7410Q591
$$ 5511 6696 -10210 -1527 10363 -5730 -7519 10002 702 -10634 4932 7175 -10235 -1644
3251a644J1778j5402k347J6823p576j2901J5363L669j7532P047J3183j4796l936
$$ -1644 10134 -5268 -7615 9208 1632 -11269 4094 7763 -9769 -2722 10461 -4335 -8271
3264h271J6900o308j3189J4736L939j7240O757J3383j4652m500J7013n567j3967
$$ -8271 8629 2321 -10868 3868 7807 -9433 -2676 10707 -3945 -8445 8568 3001 -10966
3277a0966J4072N455j7477N325J4257j3453o259J7377m527j4095J2869O300j7121
$$ -10966 3106 8561 -8916 -3591 10666 -2787 -9046 8331 3804 -10291 2578 8878 -8243
3290h243M255J4587j2909o667J7064l717j4618J2288P509j6824K889J5092j2092
$$ -8243 -3988 10599 -2310 -8977 8087 4370 -10248 2040 9549 -7275 -4386 10706 -1386
3303a386q000J6939k505j4889J1165Q548j6422J598J5512j1191q630J6227r28
$$ -1386 -9386 7553 5048 -9841 1324 9872 -6550 -4952 10560 -631 -9261 6966 6038
3316F038j5579J0465R112j5713L27J5736j0084r668J5791mj5986R669J0159j5704
$$ 6038 -9541 924 10036 -5677 -5350 10386 302 -9366 6425 6421 -9565 104 10263 -5441
3330e441p85J6368r245j0637J5670Q47j5799Q545J0616j4970j912J6335q525j0471
$$ -5441 -6226 10142 897 -9740 5930 6777 -9022 -477 10139 -4831 -6743 9592 1067 -9404
3344i404J4625J440j5751P542J1991j5224k426J6160p164j1743J4128L132j6511
$$ -9404 5221 6661 -9090 -1548 10443 -4781 -7207 8953 1789 -9954 4174 7306 -9205
3357i205P110J1938j4209l445J5951o111j2489J4079L738j6035N678J2741j3541
$$ -9205 -2095 9843 -4366 -7811 8140 2029 -10460 3619 7357 -8678 -3000 9741 -3800
3370c800n137J6627m835j3280J2795N287j5841M574J3057j2937n174J5812m023
$$ -3800 -8937 7690 2855 -10425 2370 7657 -8184 -3610 9447 -3490 -8664 7148 3125
3383C125j3437J2344O076j6255L696J3995j1706p242J6362k695j4641J1522O891
$$ 3125 -10312 2032 8108 -8147 -4451 9544 -2162 -9404 6958 4263 -10378 1144 8035
3396H035j5060K285J4098j1067p197J5932k646j4149J1038P742j5758J729J4643
$$ 8035 -7025 -4740 9358 -1709 -8906 7026 4380 -9769 1269 9011 -6747 -5018 9625
3409I625j0087q745J5655p34j4918R625Q913j4945M17J4503r403q492J4426j0
$$ 9625 -462 -9207 6448 5714 -9204 421 9334 -5611 -5194 9309 -94 -8586 5840 5830
3423E830j4716R304R453j5436j41J5841r296j0099J4721J054j4943P798J0397
$$ 5830 -8886 418 9871 -5565 -5706 10135 839 -9260 5461 6515 -8428 -630 9767
3436I767j3979j855J4977p663j0170J3909J666j5081P754J0561j4390j888J5411
$$ 9767 -4212 -6067 8910 1247 -8923 4986 6652 -8429 -675 9886 -4504 -6392 9019
3449I019o815j1887J3777L633j5848N673J2315j2846l790J4815n568j1298J2180
$$ 9019 2204 -9683 4094 7727 -8121 -2448 9867 -2979 -6769 8046 2478 -8820 3360
3462C360M026j5007N325J2323j3408m328J5873m856j3265J2633N940j5749L425
$$ 3360 7386 -7621 -2296 10027 -3381 -7709 8164 3308 -9957 2676 8616 -7133 -3708
3475c708J2933j1109o014J4660l576j1902J0922N694j4949L080J3410j1417o591
$$ -3708 9225 -1884 -7898 6762 3186 -8716 2206 7900 -7049 -3969 9441 -1976 -8567
3488h567J5572k612j4193J0579P841j5058J186J4433j0342p169J3865j331j3104
$$ -8567 7005 4393 -9800 779 8620 -6438 -5252 9181 -1161 -8330 5535 4204 -8900
3501h900R670P112j4414J630J3421r566q026J4848q09j4481Q936R656j4736o59
$$ -8900 770 7882 -6532 -4902 8519 -1047 -9073 5775 4966 -9515 -579 9077 -5659 -6318
3515f318J4516p967r225J3355Q47j3458P632Q819j4093k1J4360q807r335J4239
$$ -6318 8198 231 -8994 4361 5208 -8250 -618 8201 -5892 -5913 8447 -360 -9695 4544
3529D544J760j4965P060J0533j3175k749J4548n893j0815J2552K740j3614O145
$$ 4544 6304 -8661 -1601 8932 -4243 -6992 7556 1663 -9152 3400 6140 -7474 -1329
3542a329R941j2705k188J4380o735j0874J3308L277j5028N645J1420j1778n003
$$ -1329 8612 -4093 -6281 8099 1364 -9510 3798 7075 -7953 -2308 9112 -2666 -7669
3555g669J4896m306j1714J0932M852j4117M647J1155j1345m147J4051m400j1671
$$ -7669 7227 2921 -8793 2139 6991 -7126 -2479 8676 -2669 -6816 7235 2835 -8836
3568h836J1517N357j4579L048J2952j0629o796J4297k050j2198R463N933j3159
$$ -8836 2681 8038 -6541 -3493 9459 -1170 -7966 6331 4281 -7917 1546 7479 -5680
3581e680K597J1706j0239n568J3784k695j2694J0258P046j4545J510J3759r199
$$ -5680 -3083 8623 -1616 -7184 6600 3905 -8789 1469 8515 -6030 -4520 9239 40
3594D0q383J3750k66j3014Q426P274j2765Q92J2084q883o730J3347j109j3357
$$ 40 -8343 5407 5141 -7873 553 7827 -4938 -4046 8038 -845 -7575 5772 4663 -8694
3608h694Q821Q388j3825n20J3977p740r014J2615J698j3518O785Q559j1744j024
$$ -8694 127 8515 -5310 -5830 8147 407 -8607 4008 5706 -7812 -1027 7532 -4212 -5236
3622e236J2467p224q128J2716R77j4169P575R476j2891k269J4105n712j0847J2148
$$ -5236 7231 7 -8121 4595 5572 -8597 -1022 8454 -4437 -6706 7399 1687 -9160 2988
3636B988L108j3517N404R723j0899k918J2602n359r464J1895K452j3863N554J1181
$$ 2988 6096 -7421 -2017 7706 -3193 -6111 6491 1132 -8332 3563 6015 -7848 -2294 8887
3650H887j2452l819J4335m307j1429J0943M770j3678L406J1072j0204m098J2591
$$ 8887 -3565 -7384 6951 2644 -8785 2158 6928 -6750 -3344 7728 -2476 -6574 6017
3663F017l805j0256J0530M465j3997M381J1499j0966n114J3868k854j2341J0007
$$ 6017 2212 -8044 2486 6951 -7046 -2665 8834 -2132 -7246 6622 3768 -8573 1434
3676A434O009j2834J677J1701r020n448J2245k199j1285R608N473j3304J942J2732
$$ 1434 7443 -5391 -3714 7987 -1033 -6481 5764 3565 -7720 1888 7361 -5943 -4001 8731
3690H731r686o445J3541r12j3141Q498P671j2779N40J1422p099p046J1872o34
$$ 8731 -955 -7400 6141 5229 -7912 586 8257 -4522 -3982 7440 341 -6705 5167 4533
3704D533j1384P750P011j3033J149J2716q391q204J3229L80j3337P247Q783j2081
$$ 4533 -6851 899 7910 -5123 -3974 8742 351 -7853 5376 5756 -7581 -334 8449 -3632
3718c632j344J2159n986q400J1295J326j2522O909Q230j2104j115J2892o692r296
$$ -3632 -4976 7183 1197 -7203 4092 5418 -7104 -195 8035 -4069 -5184 7708 1016 -8280
3732h280J2129K512j3582N318J0039j1096l032J2451m669r349J0277K822j2414
$$ -8280 3849 6361 -7221 -1903 8136 -2960 -5992 6459 1790 -7559 2718 5540 -6874
3745f874N474R193j1310k611J3158n044j0469J1182L677j2928L492J0814r627
$$ -6874 -1400 7793 -3517 -6128 7030 1986 -8483 2699 6376 -6552 -3060 7754 -1873
3758a873m989J2611l359r675R151M136j1983L443R958j0164m075J2899l274j1541
$$ -1873 -6862 5749 2390 -7285 1866 6002 -5981 -2538 7420 -2744 -6819 6080 2806 -8735
3772h735J0160N382j2885K114J1431q889n848J2021j536j0848Q409N773j1937
$$ -8735 1425 6807 -6078 -3964 7467 -1422 -7270 4751 3215 -7633 776 6549 -5388
3785e388J785J0776q743n725J2571j761j1887Q778P071j2492K99J2353p575p527
$$ -5388 -3603 7173 -1570 -7295 5276 3515 -8372 406 7477 -5015 -4716 7637 62 -7465
3799g465J1730L03j1629P186O817j1248K76J1344p521p055J2227kj2453P301Q007
$$ -7465 4265 4568 -7061 125 6942 -4306 -4030 7314 -207 -7262 4965 4963 -7490 -189 7818
3814G818j1686j136J1964n663q204J0445J871j1524N411Q145j1069q52J1452n765
$$ 7818 -3868 -5004 6960 1297 -6907 3538 5409 -6115 -704 7441 -3628 -4480 6972 1207
3828A207q361J1212J720j2072N086R346j1051l020J2838m636r407R649L368j1563
$$ 1207 -7154 4058 5778 -6294 -1208 8138 -2913 -5933 6905 2269 -7138 2511 5879 -5684
3842e684M190Q804r438k861J1480m483r489J0473L387j2646L975J0317j0137m026
$$ -5684 -1494 7310 -2128 -4989 6491 2008 -7481 2992 6379 -6267 -2292 8025 -2112 -6138
3856f138J1952k658j0284Q724M725j1664K691R502q368m298J1610l173j0115R354
$$ -6138 5814 3156 -7128 1596 6321 -5343 -2652 6850 -1518 -5816 5794 2621 -7494 1860
3870A860M519j1877K160J0602q650n524J2272j810j0834Q040N639j1098J062J0406
$$ 1860 6379 -5498 -3338 7264 -1386 -6910 5362 3552 -7282 758 6397 -4701 -3639 6767
3884F767p325o171J1517j110j1147P749O493j1665Q51J1112p414p216J1558K02
$$ 6767 -558 -6729 4788 3678 -7469 280 6773 -4892 -4041 7071 -343 -7559 3999 4201
3898D201j1398O805P007j0977j35J0789o156p296J0992J74j0902O464P248j0935
$$ 4201 -7197 -392 6615 -4362 -4497 6292 136 -7160 3832 4006 -6896 -432 6816 -4119
3912d119j122J2075o526p816J0774J969j1969N453P975r982j675J1174n123q017
$$ -4119 -5241 6834 308 -7508 3266 5235 -6734 -1281 6694 -3288 -4963 6211 1088 -6929
3926f929R802K005j1559N467Q622j0689k336J1814m201r475J0072L032j1552M054
$$ -6929 2873 4878 -6681 -1214 7408 -3281 -5617 6197 1996 -7479 2593 5625 -5927 -1873
3940a873Q877r085l764J1542l307r285R059L803j1653L285J0122r771l891J1808
$$ -1873 7004 -2081 -5845 5697 2390 -6895 2164 5967 -5686 -2401 7721 -2050 -5941 5867
3954E867k977r558Q400M590j1698K705J0002q406m764J1305k297r787Q269M731
$$ 5867 2890 -6668 1732 6322 -5376 -2671 7331 -1075 -5839 5466 3169 -6618 1651 6382
3968F382j1116J985J0091q111n486J1213q26j0759P760N729j1025J176R939p325
$$ 6382 -4734 -2749 7342 -769 -6255 4958 4132 -6627 1133 6862 -4163 -2987 6952 -373
3982c73n811J1011p50j0504P150N977j0828M40J0559o533o773J0678K90j0863
$$ -373 -6184 4827 4077 -6427 723 6700 -4128 -3688 6871 338 -6435 4243 4533 -6330
3996f330O025P486j0972n80J0878o073p048J0297P20j0962O279O842j0080j301
$$ -6330 -305 7181 -3791 -4371 6507 434 -6614 3683 4403 -6559 -280 6562 -3518 -4819
4010d819J1281n755p835J0251J533j1094N093P874r947k179J1127m452q019R359
$$ -4819 6462 707 -7128 3123 4656 -6438 -1345 6529 -3418 -5597 5530 1078 -6941 2418
4024B418K535j1313M610Q622r902k626J1235m059q980R321L108j1011M066Q704
$$ 2418 4953 -6360 -1750 6872 -3030 -5656 5579 1520 -7460 1861 4969 -6042 -1976 6728
4038F728r383l044J0891l445r087R052L746j1408L368R265q878l880J1355k598
$$ 6728 -2655 -5699 5192 1747 -7340 1712 5458 -5950 -2582 6683 -2195 -6075 5280 2682
4052B682r587P877N095j1507K532R526q280m474J1007j752j0118Q166N128j1139
$$ 2682 -6905 972 6067 -5440 -2908 6618 -1662 -6136 4871 3119 -6999 1167 6295 -4844
4066d844J692J0115p740n227J0807j167j0400P230O251j0775M78J0585p223n901
$$ -4844 -3152 6963 -777 -6004 4803 3636 -6764 466 6717 -4058 -3580 7005 -218 -6119
4080f119J0600n76j0489O912O605j1028J70J0422o115o774J0477K91j0479N677
$$ -6119 4481 3905 -6584 328 6933 -4095 -3925 6497 382 -6392 4085 4376 -6103 -426
4094d26P164j0051p28J0476n581p103J0095M29j0438N755P662j0659j163J1071
$$ -426 6738 -3313 -4041 6435 854 -6249 3846 4275 -6163 -408 7254 -3405 -4568 6503
4108F503n227p992R835J810j0777M822P795r574j919J0848m846p958R723K021
$$ 6503 1276 -6716 3119 4929 -5848 -1026 6769 -2805 -4724 6124 1278 -6680 3043 5064
4122E064j0848M092Q351r222k755J1221l905q743Q825L805j1167L131Q402q054
$$ 5064 -5784 -1692 6659 -2563 -5318 5903 1998 -6745 2080 5885 -5282 -2151 6251 -1803
4136a803l561J0732l328q937Q939L485j1341L001R658q401m349J0867k356r429
$$ -1803 -5364 5368 2040 -6897 2042 5527 -5814 -2813 6845 -1556 -5905 4962 2606 -6823
4150f823P570N034j0874J752R427p321m936J0431j620r444P811M743j0557J507
$$ -6823 747 5781 -5093 -3341 6086 -1235 -6171 4260 2640 -6804 1007 5750 -4807 -3300
4164c300R593p198n488J0642p12j0442O771N874r935K49J0056o520n942J0142
$$ -3300 6293 -905 -6393 4249 3537 -6905 -134 5740 -4195 -3946 6110 -410 -6352 3790
4178C790j77r935O476N868j0420P2J0716o224o954J0623L03j0725N943O745r549
$$ 3790 3613 -6322 154 6022 -4398 -4326 6390 166 -6788 3835 4138 -6587 -644 6101 -3448
4193c448j036J0126n040o818R483R54j0226N423P216j0110j093J0869n209p710
$$ -3448 -4484 5642 602 -6216 3267 4221 -6005 -582 6634 -3476 -4569 6300 1091 -6619
4207f619R889K131j1312M610Q281r438k481J0622m122p609R131J523r651M043
$$ -6619 3270 5401 -5911 -1301 6980 -2458 -4939 5683 1561 -6048 3083 4606 -5045 -1002
4221a002P600q869k755J0975l755q652Q914L241j0654K801R024q310l821J0231
$$ -1002 6598 -2271 -5026 5949 2194 -6458 2456 5697 -4957 -2156 6868 -1442 -5263 4968
4235D968k550q264P723L757j0385K654Q822q358l807J1039k726r599Q287M385
$$ 4968 2418 -5846 1877 5634 -4751 -2097 6725 -1633 -5440 5599 2873 -6726 1561 5946
4249E946j1003K221R602p276m930R650j271q762P082M461j0417J598R334p155
$$ 5946 -5057 -2836 6766 -510 -5440 4210 2939 -5823 1259 5720 -4697 -3099 6235 -920
4263i20m801J0337j165j0335P514N742j1144J127R885o459o246R947M9r494N673
$$ -920 -5721 4616 3451 -6884 630 6372 -4772 -3645 6240 -219 -6465 3482 3531 -5963 -290
4278b90O176j0016L30R949o406o159J0540j94j0653O427O620j0218n10J0259n334
$$ -290 5886 -4130 -3800 6149 -257 -6416 4124 3930 -6723 -296 6324 -3894 -4404 5855 521
4293E21p004R303J151j0012N317O685r264j078J0075m932p444R664J282j0359
$$ 521 -6483 2820 3971 -6041 -724 5961 -3303 -4381 5694 762 -6682 2982 4264 -6095
4307f095M615P980r481k015J0642m370p791Q502K762j0069L714P759q597k255
$$ -6095 -1480 6500 -2981 -4996 5646 1276 -6515 1987 4749 -5320 -1606 6153 -2444 -4699
4321d699J0254m151p772Q798K920j0969L815Q635q609l669J0596k676q772Q268
$$ -4699 5555 1404 -6368 2430 5350 -5619 -1804 6831 -1778 -5447 5149 2473 -6299 1969
4335A969L417r875K364Q350p904l128R959k634q771Q117M187j0702K123R312p752
$$ 1969 5386 -4489 -2125 6225 -1679 -4807 5152 2518 -6253 1864 6051 -4651 -2528 6784 -968
4350i68n033J0673j460r156O773M931r884J405Q867o966m583J0014j359r031O906
$$ -968 -6001 4672 3212 -5944 829 5760 -4124 -2719 6148 -818 -5401 4613 3254 -5777 1129
4365A129M899j0150R85R760o709n811J0065Q8j0184O110N974r315n31R536n924
$$ 1129 6028 -4122 -3137 6623 -86 -5897 4168 4256 -5928 182 6156 -3159 -3690 5846 -78
4380g8n575R346j58r478N974O432j0178n29J0471n596o953R229J259r922M946
$$ -78 -5653 3693 3535 -5943 31 6463 -3715 -4244 6227 631 -6322 2907 4166 -5756 -810
4395h10O793q589j930R823m586o665Q631J388r589M545P250r241j708J0212m221
$$ -810 5983 -2606 -4536 5287 701 -5964 2667 4055 -5534 -989 6261 -2980 -4688 5524 1303
4410A303p987Q513L061j0304L100P929p908k834R852l229p652Q131K865r934L170
$$ 1303 -6684 1829 4890 -5414 -2314 5615 -2293 -5127 4725 1496 -6156 1975 4840 -5094 -1924
4425a924Q054q113l567J0585l146q593Q153L914r794J984Q514p687l577R437k060
$$ -1924 6130 -1983 -5550 5035 1889 -6704 1449 5363 -4431 -2447 6067 -1620 -5197 4240 2180
4440B180q459P340M213r925J987Q799p482m544J0561j673r232O965N278j0164
$$ 2180 -6279 1061 5274 -4651 -2664 6135 -1347 -5891 4670 2997 -6235 730 6008 -4156
4454d156Q65Q946o006n328R831j007r121O408N204r416P02R338o649n605R958
$$ -4156 -3291 5655 -351 -5679 4152 3145 -5976 432 5636 -3780 -3078 6260 -389 -5994 3964
4469C964j02r564O070N950r814J05R086m957o344Q888L88q891N198O388r546m49
$$ 3964 3862 -5702 368 6318 -3496 -3391 5695 738 -5606 3282 3670 -5221 -23 6365 -3181 -3630
4485c630R454n375o248Q956J106r789M932P174q882j737R239l802p232Q480J934
$$ -3630 5824 449 -5799 3157 4263 -5526 -594 6580 -2302 -4039 5200 1398 -5834 2646 4580
4500D580r425M165O973q562j828R410m099p399Q694K295j0079L637Q048q368k906
$$ 4580 -4845 -680 6293 -2269 -4097 5313 1214 -6185 2509 4804 -5275 -1638 6410 -1958 -4864
4515d864R854l056p973P630L174r483K742P674p571l028R811k856q291P954L049
$$ -4864 4990 1934 -6039 1591 4765 -4718 -1976 5698 -1873 -4901 4910 2054 -6237 1717 4766
4530D766r690K433Q372o973m219R472j818q086O688L871r139J711Q150o820m301
$$ 4766 -4924 -2491 5881 -1092 -5311 4161 2343 -5743 945 4816 -4323 -2612 5538 -1282 -5583
4545e583R699j504q586O485M671r293Q67Q473n924m983R023n94q470N451N521
$$ -5583 4116 2612 -5974 511 5182 -4111 -3244 5229 -695 -5678 3345 2751 -5719 -268 5253
4560E253q946K16Q755n678n076Q704n1q922N491N829r050l86R475n352o113Q586
$$ 5253 -3693 -3477 5278 -400 -5476 3228 3177 -5745 -254 5575 -3475 -3861 5614 262 -5851 2735
4576B735R52q877M455O159q279j134R388m735o562Q763J055r069M449O919q872
$$ 2735 3687 -5190 -735 5424 -2855 -3989 5399 664 -5898 2865 3920 -5149 -700 6219 -2653
4591b653j572R452m107o412P556K278r646L930O939p953j833Q899l462p182Q178
$$ -2653 -4225 5227 1120 -5292 2264 4542 -5104 -1174 5765 -2188 -4021 4878 1416 -5766 2412
4606B412K162r072L054P514p733k959R766l137p315O937L437r469K670P412p006
$$ 2412 4574 -4498 -1444 6070 -1663 -4622 5144 2007 -5308 1629 5066 -4403 -1733 5679 -1327
4621a327l122Q885k303p780P516L096r154K248P685o576l909Q905j681p707O230
$$ -1327 -4449 4436 2133 -5647 1869 4965 -4189 -1941 5744 -832 -4741 4164 2483 -5224 1006
4636A006M281r164J336Q480o645m095Q702j091q198N956M786q972Q11Q416n813
$$ 1006 5287 -3877 -2541 5939 -706 -4801 3901 2810 -5388 568 5354 -3618 -2807 5609 -204
4651b04m968Q716l48q449N283N208q422j50Q501n384n101Q507j75q289N256N303
$$ -204 -5172 3544 3196 -5253 30 5238 -3184 -3334 5167 -217 -5318 3189 3014 -5275 -19 5284
4667E284q270m07Q603n125n598Q637M82q810M610N769q273o74Q528m372n708P841
$$ 5284 -2986 -3393 5210 85 -5513 3124 3606 -5204 -594 5175 -3098 -3772 4756 384 -5324 2517
4683B517J116q605M010O157q053j194Q962m091o350P822J793q850L415O646p450
$$ 2517 3633 -4972 -962 5195 -2858 -4052 4910 819 -5531 2291 4084 -4766 -1351 5295 -2155
4698b155k028Q992l666o662P097K120q241K900O775o965k512Q930l204o770P001
$$ -2155 -4183 4809 1143 -5519 1578 3698 -4543 -1643 5132 -1833 -4345 4585 1381 -5389 1612
4713A612K629q459K461O849o347l218Q412j892o975O009L363q330J901P195o200
$$ 1612 4241 -4218 -1757 5092 -1255 -4473 3939 2047 -4928 1081 4444 -3886 -1985 5210 -990
4728i90l746Q744j844p280O235L942q948J599P579n813m025Q355j116p631N770
$$ -990 -4736 4008 2164 -5116 1119 5061 -3887 -2288 5291 -522 -4547 3808 2692 -4939 831
4743H31M314q547O80P924n844l935Q081o22q268O063M301q165L16P950m918m921
$$ 831 5145 -3402 -2722 5202 -642 -4577 3504 2882 -5386 677 4978 -3187 -2871 5079 161 -4760
4759d760Q083m4p990M751N195q060q3Q134m891n294P862L56q049M737N248p757
$$ -4760 3323 3279 -4711 40 5235 -2825 -2908 5226 335 -4959 2903 3259 -4790 -53 5195 -2562
4775b562p21Q263m332n544P347J218q479M434N399p350j334Q254l769n943P290
$$ -2562 -3283 4980 648 -4896 2451 3669 -4810 -376 5023 -2327 -3661 4593 824 -5119 2171
4790B171J525q243L299O161o990j535P731k856o558P047J876q127L135O275o744
$$ 2171 3696 -4547 -1248 4913 -2077 -3612 4119 1263 -5295 1752 3628 -4499 -1364 4911 -1833
4805a833k555Q334k512o770O553K859p867J994O414o208k837Q191k096o694O207
$$ -1833 -4388 3946 1434 -5336 1217 4076 -3791 -1797 4617 -1591 -4428 3763 1667 -5027 1180
4820A180K696p861J895O910n987k998P928j837p248N954L871q130J261P010n405
$$ 1180 3876 -3985 -2090 4820 -1167 -4165 3763 1926 -5322 632 4503 -3627 -2366 4644 -761
4835g61l421P483j275p133N724L718p688Q81P212n200m305Q024o18p413N049M443
$$ -761 -4182 3301 2026 -5107 617 4335 -3353 -2472 4740 -460 -4765 3259 2641 -4772 277 4720
4851D720p738O08O962m640m244P076k2p160M681M657p736K52P443m648m838P492
$$ 4720 -3018 -2410 4552 -88 -4332 2744 2722 -4438 243 4900 -2836 -2584 4859 211 -4627 2865
4867B865L34p792M098N175p207p58P527l599n372P248J087p952M254M907o715
$$ 2865 3199 -4593 -495 4680 -2527 -3285 4242 643 -4729 2519 3606 -4346 -92 4815 -1900
4882a900j242P589l351n704O717J630p499L063N923o798j821P188k585n409N911
$$ -1900 -3142 4447 1096 -4608 2109 3739 -3760 -697 5226 -1572 -3393 3795 1210 -4199 1712
4897A712K151p727K796N872o235k332P887k647o176O368K194p543J981O330n552
$$ 1712 3863 -3864 -1068 4804 -1431 -3763 4124 1477 -4699 1669 3863 -3680 -1699 4631 -921
4912i21k861P062j288o522N479L055p573J927N998n143l327P355j446o764N658
$$ -921 -3782 3280 1992 -4530 949 4004 -3569 -1642 4356 -787 -4114 3241 1795 -4969 689
4927F89L126p215J002O789n049l336O954q62o778M902L418o659N59P013n249l733
$$ 689 3815 -3400 -2398 4391 -658 -3994 2960 2098 -4680 222 3640 -3019 -2460 4553 -696 -4429
4943d429P431r10o836M697L944o789K64O683m026m357O804N1p088M566M039o906
$$ -4429 3002 2092 -4744 -47 3897 -2892 -2628 4055 29 -4328 2476 2527 -4561 5 4044 -2862
4959b862qP050m035m598O829M27p016L694N123p043q36P148l598m755O322J176
$$ -2862 -2870 4180 145 -4453 2376 2803 -4213 -519 4604 -2439 -3275 3873 275 -4480 1842 3018
4975C018o945L163M723o062o96O604l224m874O176J642p554L077N217n766k033
$$ 3018 -3927 -764 3959 -2103 -2799 3805 581 -4293 1883 3525 -4029 -952 4265 -1501 -3534
4990c534O886k234n527N845J950p055K505N475n550k329O907j947n688N820K505
$$ -3534 3352 1118 -4409 1436 3386 -3669 -1164 4311 -1239 -3568 3339 1392 -4296 1524 4029
5005D029p411J967N934n525k487P228j646o300M992K938o596J413N813m799l259
$$ 4029 -3382 -1415 4519 -1006 -3493 3735 2089 -4211 781 3719 -2877 -1464 4349 -450 -3709
5020c709O692j020o215N029L265o978J121O391m769l743O937r70o034M381L730
$$ -3709 2983 1963 -4252 777 4042 -2936 -1815 4576 -193 -3936 3001 2031 -4003 378 4108
5035D108o331K26O272m611l690O579n03o223M247L714o328q6O491l705m236O311
$$ 4108 -2223 -1997 4275 -336 -4026 2553 2050 -4173 74 3788 -2540 -2626 3865 160 -4076 2235
5051B235N01o570L635M074o136l23O020l251m336O055N78o955M002M216n788j045
$$ 2235 2736 -3834 -199 3875 -2261 -2584 3436 185 -4151 1904 2482 -4473 -471 3745 -2043 -3088
5067c088O774l019n291O175J501o985K787M939n464j331O451l025m406N422J246
$$ -3088 3686 667 -4624 1551 3052 -3933 -1146 3793 -1671 -3002 3449 424 -3982 1440 2686
5082B686o369K687M956n880j391O708k127n493N013K495o441J645N751n700j912
$$ 2686 -3683 -996 3960 -1920 -3311 3397 1270 -4223 790 3285 -3156 -1511 4240 -1460 -3372
5097c372O211j892n002N255K078o618J875N322n075k203O255j369n804N056L129
$$ -3372 2839 947 -4055 1200 3278 -3340 -1465 3857 -1218 -3421 2834 1465 -4339 717 3846
5112C846o805J150N476m336k656N996p61n784M516K813o119J025N688m539l121
$$ 3846 -2959 -1809 3667 -669 -3325 2671 1910 -3874 642 3455 -2664 -1639 4049 -490 -3611
5127c611O842q09o240M195L494o250M49O023m270l233N735m4n859M065L315n985
$$ -3611 3231 2422 -3818 377 3871 -2379 -1930 4093 -177 -3410 2325 2281 -3578 487 3802 -2183
5143b183K77O022l980l964O376M6o499L600M297n842j100O560k967m145N565M93
$$ -2183 -1906 4116 136 -3828 2548 2594 -3905 -305 3992 -1850 -2950 3610 643 -3502 2063 2556
5159B556n887L045M112n887n59O336l036m516N720J202o681L023M618n717j179
$$ 2556 -3331 -286 3826 -2061 -2620 3716 680 -3836 1884 3086 -3595 -572 4046 -1671 -2850
5174b850O314k633m517N225J414o186K201M687n130j685O379k361m809N103K204
$$ -2850 3464 831 -3686 1539 2953 -3233 -1032 3655 -1475 -3160 3219 858 -3951 1152 3356
5189C356o783K064N569n204k387O229j653m794M586K034n851J132N176m454k436
$$ 3356 -3427 -1363 4206 -998 -3385 2844 1191 -3603 983 3017 -2834 -1702 3474 -980 -3416
5204c416O275j525n457N350J854o172J535N301m722k843O358p90n516M359K732
$$ -3416 2859 1334 -4123 1227 3081 -3091 -1556 3745 -977 -3820 2538 1748 -3768 591 3323
5219C323n865Q89N014l834l091O185r89n551M329K869n951L18O079l974l212N705
$$ 3323 -2542 -1653 3361 -473 -3564 2621 1632 -3919 410 3279 -2672 -2354 3725 -249 -3461 2244
5235B244m79n518L749L593n947J67N637l719l265N583j09n699L847L405n434n12
$$ 2244 1765 -3753 -4 3589 -2358 -2191 3446 -273 -3538 2045 1936 -3763 84 3489 -1945 -2457
5251b457N828l143l840N593N84o134L304L707n126n96N729l072m002N412P49n773
$$ -2457 3371 228 -3612 1981 2565 -3569 -265 3442 -1684 -2280 3449 377 -3625 1787 2536 -3237
5267c237L138L967n476j324O431k586m136M845J373o090K312M271m752j392N591
$$ -3237 -99 3868 -1608 -2932 3499 913 -3223 1622 2995 -3095 -783 3488 -1264 -2656 2935
5282B935j908m533N165J285o088K484M463n004k028O242j499m965M511J815n454
$$ 2935 1027 -3506 1659 2944 -3144 -660 3803 -1201 -3229 3013 1514 -3451 1060 2875 -2579
5297b579J547M453m280j884N645j480n113M504K410n875Q05N265m188k471N809
$$ -2579 -1032 3421 -859 -2743 2902 1422 -3691 813 3223 -2652 -1847 3418 -770 -3241 2568
5312B568j003m998L738L031n673N32N127m157k345N439p37n369L960L030n597
$$ 2568 1565 -3433 305 3336 -2337 -1805 3322 -835 -3180 2259 1522 -3847 113 3143 -2454
5327b454K17N331l681k922N685j00n550L348L449n566M25M993l309l392N433m3
$$ -2454 -2237 3094 -587 -3509 2176 2076 -3474 -126 3323 -2243 -1818 3175 -134 -3526 1907 1864
5343A864n146L196L152n007k48N647l431l584N283L55n216K653L927n015j010
$$ 1864 -3282 -86 3066 -1941 -2189 3458 27 -3557 1726 2081 -3135 -482 3445 -1570 -2580
5358b580N634k694l647M788P57n454K737M111n257q50N710k685m216M993J189
$$ -2580 3054 360 -3287 1501 2258 -3196 -459 3652 -1605 -2455 3255 570 -3646 1347 2536
5373B536n628J943M630m690j188N372k038m312M577J536n590K227M199m526j615
$$ 2536 -3092 -1149 3481 -1209 -2397 2975 937 -3375 1202 2738 -2852 -625 3574 -952 -2567
5388b567N584j906m426M381J840n155J239M340m092j892N579j311m980M214K060
$$ -2567 3017 1111 -3315 1066 2906 -2249 -1010 3330 -762 -2654 2925 1614 -3366 848 2908
5403B908n547J373M974m523j971N545j486m597L822K747n668P79N027l833k421
$$ 2908 -2639 -1266 3708 -815 -2786 2759 1273 -3324 498 3245 -2423 -1644 3383 -450 -2871
5418b871N582j090n110L768L023n477P43M780l377k727N128m57n322L807K570
$$ -2871 2711 1621 -3489 279 3302 -2175 -1432 3348 -29 -2756 2372 1915 -3407 400 2970
5433B970m893k13N297l297k997N101P7n193L117L439n627J91N085k949l100M570
$$ 2970 -1923 -2136 3161 -136 -3133 1968 2045 -3148 -31 3408 -2219 -2028 3057 108 -2992 1578
5449A578O60n061K377L598m781r88N270k522l773N170Q20n596K759L752m706j198
$$ 1578 2238 -2823 -446 3152 -1629 -2617 2653 131 -3642 1528 2348 -3248 -489 3263 -1443 -2641
5465b641N663k422m238M669J304n489K326L937m521j327N397k051m348M504J855
$$ -2641 3022 600 -3638 1031 2335 -3154 -828 3109 -1412 -2739 2658 607 -3741 763 2618
5480B618n294J490M855n015j346M954j131m806M608J755n325J443M618m232j987
$$ 2618 -2676 -1186 3669 -1346 -2692 2262 1131 -3675 933 2688 -2637 -1194 3424 -808 -2795
5495b795N051r89m744M219K223n589J394M309m034j999N195r62m412L332K716
$$ -2795 2256 1267 -3477 742 2965 -2624 -1230 3079 -955 -2954 2241 1279 -3133 199 2915
5510B915m959M40N110l774k520N095p66m980L817K831n087L79M696l164l033N258
$$ 2915 -2044 -1604 3506 -268 -2788 2307 1541 -3439 378 3209 -1878 -1499 3197 33 -3000 2258
5526B258l93n130L612K747m808J60N027l511k920M961K20m975K820K948m595n11
$$ 2258 1865 -3265 347 3094 -1714 -1554 3473 -38 -2958 2003 2223 -2752 68 3016 -1579 -2090
5542b090N473l268l092M996L30n181K646L280m490q23N133k466l510M677L84m967
$$ -2090 3383 115 -2977 2019 2349 -2832 -186 3094 -1396 -2219 2914 448 -3062 1615 1999 -2968
5558b968K494L826m655j101N253j903m088M586R21m948J711M208m612j386N106
$$ -2968 -474 3352 -1303 -2404 2849 946 -3142 1444 2365 -2583 -872 3336 -1276 -2662 2444
5573B444j666l609L916R62m793J800M007l940j755N060j801l697L903K026n511
$$ 2444 778 -2831 1085 2047 -2746 -946 3061 -879 -2634 2426 625 -3072 831 2857 -2654
5588b654J466M441m157j846M961j125m421M102J976n258J263M340l764k337N183
$$ -2654 -1188 3253 -904 -2750 2211 1086 -3335 767 2743 -2515 -1252 3088 -676 -3013 2170
5603B170o34m772L599K108n177J055M667l456k560M986o33m270L096K731n346
$$ 2170 1536 -3236 363 2471 -2706 -1651 3016 -440 -3000 1986 1353 -2917 179 2910 -2436
5618b436O34M965l395k765N027o49m533L100K930m859K53M801l442k578M740l
$$ -2436 -1802 3163 -232 -2997 2030 1381 -3152 -52 2878 -1981 -1728 3073 -369 -2947 1793 1790
5634A790m907L056K990n096K91M996l101k789M523J78m804K854L076m292j062
$$ 1790 -3117 -61 2929 -2167 -1876 3120 19 -2770 1753 1931 -2873 -19 3057 -1235 -2297
5649b297M871k098l568M619O34m971K586L149m214q49M949k588l468N088N68n022
$$ -2297 2574 476 -3092 1527 2161 -2810 -224 2925 -1289 -2138 2811 223 -3245 1843 2411 -2611
5665b611K124L674m578p74M928j969l618L846J681n243J954L345l950j216N050
$$ -2611 -487 3187 -1391 -2165 2763 794 -2824 1022 2703 -2540 -586 2759 -1191 -2407 2643
5680B643j791m010M257J238m931J626M186m126j618M996j273m118L834J829m946
$$ 2643 852 -3158 1099 2337 -2594 -968 3218 -908 -2526 2470 1197 -2921 913 2742 -2204
5695b204J298L883l723j964N086j444m174M029K100n054R55M289l408k724N157
$$ -2204 -906 2977 -746 -2710 2376 932 -3242 787 2887 -2167 -1212 3077 -331 -3055 2102
5710B102o25m396L347K156m329L29M295l404k362M521k69m515L340K798n143L64
$$ 2102 1477 -2919 428 2584 -1745 -1416 2879 -525 -2887 1634 1365 -3150 190 2988 -2155 -1791
5726a791M718l292k425M556k94l982K437L253n073J84M770l213l047N048k49m521
$$ -1791 2927 -365 -2790 1766 1472 -2510 -73 3180 -1893 -1709 3061 -152 -3199 1849 1600 -2921
5742b921K680L374m922j33M840k710l148M277O50m626K360K995m334l39M884k654
$$ -2921 -241 3133 -1789 -1922 2918 208 -2940 1337 1987 -2639 -279 2716 -1618 -1957 2927 273
5758B73l173M148O24m855K652L248l938j283M876k045l616M145J282n087K531
$$ 273 -2900 1248 1872 -2983 -331 2917 -1021 -2304 2572 527 -3089 1056 2338 -2749 -218
5773b18L389m228j235M934j679l889M143Q22m494J791L741l918j488N121j493
$$ -218 3171 -1057 -2292 2642 963 -2926 1217 2039 -2455 -664 3077 -841 -2329 2792 1299
5788A299m157L846J500m408J174L748l642j840M792j150m201M194J620n138J225
$$ 1299 -2858 988 2488 -1920 -746 3002 -640 -2480 2312 1162 -3039 1155 2775 -2363 -1138
5803a138M378l746k231N323j253l930L009K312m625O21M157l328k077M936j295
$$ -1138 3240 -506 -2737 2586 1333 -2597 412 2724 -1901 -1280 2877 -451 -2528 2408 1113
5818A113m296L686K051m563M17M751l395k865N069L10n148K825K780m458o3M537
$$ 1113 -3183 503 2554 -2009 -1592 3159 -236 -3101 1968 2278 -2870 -45 2735 -1723 -1786 2751
5834B751k716k703L974O28m752K695K693m323o7M361k388l388M808M54m651K397
$$ 2751 35 -2668 1306 1934 -2818 -123 2570 -1753 -1820 2541 153 -3235 1573 2027 -2624 -227
5850b27L049m256r40M749j847l494M061P61m422J937L334m085r93N016k039m044
$$ -227 2822 -1434 -2374 2375 528 -2966 1095 1856 -2566 -629 2705 -1380 -2373 2643 604 -3440
5866c440M359J136m480J299L908l826j046M415j562l548L745P67m331J891L535
$$ -3440 919 2055 -2425 -1126 2782 -1044 -2090 2325 763 -2785 960 1727 -2604 -713 2822
5881B822m042j001M298j603l700M068J525m825R33M253l161j881M461j334l389
$$ 2822 -1220 -2221 2077 474 -3226 842 2367 -2458 -1525 2728 -433 -2314 2147 813 -2576
5896b576L173J897m463Q78L936l457j732M497p24m572L488K449m412L7M741l431
$$ -2576 597 2494 -1969 -1091 2845 -612 -2344 2153 1429 -3143 345 2794 -1618 -1581 3160 -271
5912b71k462M772p4m800L097K485m334L32M089k709k636M518k6m838K519L422
$$ -271 -2733 2039 1965 -2835 262 2747 -1587 -1255 2834 125 -2511 2007 1981 -2857 -338 3084
5928C084m980J85M357k226k982M094N30m571K288K969m331k52M514k385l272M573
$$ 3084 -1896 -1711 2646 420 -2562 1532 2062 -2509 -221 2748 -1583 -1835 2679 294 -2978 1595
5944A595N51m626K255K946l970p90M703j960l373L351J747m973J960L817m348
$$ 1595 2146 -2480 -225 2721 -1249 -2039 2664 704 -2669 682 2429 -2544 -584 3233 -1115
5959a115j062M607j989l382M030J308m772J414L845l731j467M523j254l805L534
$$ -1115 -2177 2430 441 -2941 1089 2397 -2375 -961 2884 -847 -2314 2209 955 -2850 684
5974F84J513m435J286L448l471j366M719j605l689L505J736m719J134M262l683
$$ 684 2197 -2238 -952 2496 -975 -2341 2378 773 -2916 589 2325 -2394 -1260 3002 -681
5989f81j885M232o78l907L012K345m239J92M161l103k180M790p51l952L014K286
$$ -681 -2566 1666 988 -2919 93 2438 -1801 -1609 2552 -551 -2731 2059 1308 -2644 370 2656
6005B656m447M23M264l083k666M521j75m473L006K498m105J58M079k789k249L775
$$ 2656 -1791 -1368 2896 -187 -2853 1668 1493 -2980 26 2524 -1581 -1423 2656 -133 -2382 1393
6021A393M6m021K540K932m398m33M405k333l079M516M42m469K294K998m039n60
$$ 1393 1439 -2582 -42 2890 -1508 -1941 2464 131 -2948 1568 2010 -2459 -165 2833 -1206 -1766
6037a766M378k108l117L818M52m098K161L027m091p01M339j709k988L387J338
$$ -1766 2612 504 -2613 1205 1657 -2441 -280 2747 -1344 -2045 2294 585 -2403 984 2322
6052B322m704J872K984l537r71M703j894l447L666J311m452J727L191l819r24
$$ 2322 -2382 -510 2474 -1063 -2034 2669 775 -2672 994 2305 -2147 -420 2771 -1048 -1972
6067a972M162j380l539L562J713m657J382L344l366j408M483r53l976L526J475
$$ -1972 2190 810 -2729 833 2546 -2111 -729 2615 -751 -2159 2324 1371 -2605 921 2396
6082B396m454R49L655l506j225L970p83l906L324K210m463L40M004l132j551L936
$$ 2396 -2058 -1109 2546 -960 -2185 1785 1002 -2904 420 2630 -1833 -1493 2511 -621 -2172 1764
6098A764p60l603L024K358m755M00L985k929k055M331l00m129L098J921m000J36
$$ 1764 1004 -2599 425 2783 -1972 -1572 2413 -516 -2571 1760 1460 -2669 429 2350 -1650 -1514
6114a514L986k541k646M486l20m041K541K443m332N16L858k466k727M184K34m343
$$ -1514 2472 -69 -2715 1771 1451 -2590 -49 2394 -1938 -1422 2436 -30 -2757 1427 1661 -2682
6130b682K441K629l924j71L998j952k991L924M93m660K400L144m106p01M396j937
$$ -2682 -241 2388 -1536 -1707 2291 339 -2652 1272 1765 -2895 -495 2649 -1457 -2158 2238 301
6146C01k772L593R75m395J780K907l584q41M106j402l376L669J031m556K019L346
$$ 301 -2471 1122 2097 -2298 -518 2389 -1195 -2036 2070 668 -2708 961 1992 -2564 -545 2801
6162B801l470j482M284j524k999L468P54l676Q39L672l244j098L970r17l582K986
$$ 2801 -669 -2151 2133 609 -2390 1078 1832 -1844 -1005 2667 -577 -1675 2295 1378 -2204 782
6178G82J585m238J063L529l301j612M143p05l807L152J395l562N87L715k793k261
$$ 782 2367 -1871 -808 2721 -580 -2192 1951 1246 -2561 591 1986 -1576 -989 2726 -67 -2328
6194b328M429r11l818L194J647l828O75L303k575k161M175M8m322K873K138m182
$$ -2328 2101 1190 -2628 566 2213 -1615 -940 2363 -212 -2373 1802 1850 -2472 401 2539 -1643
6210a643P7M103k607k252L755Q1l988K493K406l845j61M172k573k469L868L32
$$ -1643 -1566 2537 -70 -2322 1433 1514 -2474 19 2425 -1420 -1581 2591 18 -2451 1417 1749
6226A749m190J952L156l894l76L880k142k593L750M30l899K201K675m238l63M187
$$ 1749 -2441 -489 2667 -1227 -1603 2277 135 -2458 1292 1722 -2177 24 2699 -1539 -1902 2285
6242B285j794l316L778O71l737J377L077l670n57M061j799k871L676O84m082J716
$$ 2285 491 -2825 953 1624 -2113 -736 2341 -1329 -1886 2175 376 -2495 1181 1865 -2217 -501
6258e01K947l611r51M226j493l311L094J755m094J140L085k946j712M439j136
$$ -501 2446 -1165 -2116 2110 617 -2694 400 2155 -1939 -799 2286 -660 -2372 2067 931
6273I31l264K995J477l820R34L427l231j575M001q06l398K804J520l586N13L623
$$ 931 -2333 662 2139 -1681 -747 2680 -551 -2126 1875 1069 -2329 475 1995 -1591 -1078 2545
6289B545k993j420L829q86l544L059J501l816M75L608k464j961L939o06l633K413
$$ 2545 -448 -1868 1961 1075 -2469 590 2091 -1725 -1250 2358 -106 -2067 1872 1266 -2367 46
6305D6K301l644j6L563k272k179L933J8l774K158J864l403K4L848k436k290L942
$$ 46 2347 -1297 -1313 2250 -22 -2201 1732 1750 -2024 134 1998 -1405 -1381 2467 31 -2259 1683
6322A683J74l982K228K208l437l51L810k436k356L901K03l733J956K623l581p40
$$ 1683 1857 -2125 103 2311 -1126 -1477 2333 -103 -2459 1442 1645 -2088 -132 2491 -1090 -1830
6338a830M242k003l026L691N44l688J752K780l311q84L700j625k681L301P14l582
$$ -1830 2412 409 -2617 1074 1618 -2070 -318 2462 -849 -1733 1967 342 -2339 962 1676 -1906
6354a906J567K533k884q30L543j444k807L132J067m001J171K989k405j412L197
$$ -1906 -339 2194 -690 -1520 2023 579 -2228 904 1971 -2030 -859 2130 -275 -1687 1510
6369A510p75l245L160J285l956R47L288k877j628M031j025l047K735J783m108
$$ 1510 735 -2510 650 1935 -2021 -1074 2214 -663 -2291 1740 715 -2332 403 2186 -1922
6384a922N11L887k959j456L369n53l252K839J370l606Q43K978k335j893L487k75
$$ -1922 -1411 2476 -483 -1939 1430 877 -2375 464 1834 -1772 -929 2049 -286 -2179 1308 1033
6400A033l623K717K163l583J24L270j972k327L904k98l725K628J700l118j59L603
$$ 1033 -2590 127 2290 -1293 -1169 2101 129 -2198 1706 1408 -2317 311 2011 -1107 -1266 2337
6416B337k260k498L750R9l898K469K244l551N1L702k356k677L730L27l477J969
$$ 2337 77 -2421 1329 1428 -2470 -1 2243 -1308 -1257 2445 89 -2588 1142 1469 -2008 -39
6432c9K203l148m18L729j930k666L451M69l666J611K677l388o32L841j496k760
$$ -39 2164 -984 -1402 2327 397 -2269 1182 1651 -2015 -404 2273 -1115 -1747 2094 598 -2162
6448b162L220O02l455J314K779l152j019L974j389l019L222P66l666J717K694
$$ -2162 1058 1660 -1795 -481 2298 -854 -1873 2101 712 -2307 915 1681 -1985 -268 2426
6463B426l242j006L752p69l216K389J456l507O93L339l000p61L149p92k941K392
$$ 2426 -816 -1822 1930 1161 -2055 334 1790 -1717 -1024 2315 -685 -1446 1703 911 -2030 362
6479C62J758l758R45K896k990j281L427l76l274K767J234l409M17L121k146j863
$$ 362 2120 -1638 -693 2203 -787 -2068 1359 983 -2291 476 1710 -1699 -1282 1839 -307 -2170
6495b170L779m94l315K346J905l628M64L325k664j654L499k42l103J551K524l436
$$ -2170 1609 1115 -2200 146 2051 -1577 -1113 2212 -452 -2106 1393 1151 -1952 -401 2123 -1313
6511a313j70L474j962k079L328l13l198K131J852l179k3L434j889k300L383J98
$$ -1313 -1483 1991 29 -2050 1278 965 -2233 -102 1750 -1429 -1452 1982 93 -2207 1176 1374
6527A374l797J904K521k789n73L341j458k444K753N80l313J487K454l318l30L258
$$ 1374 -2423 -519 2002 -787 -1360 1981 523 -1921 832 1412 -1901 -414 2040 -1278 -1608 1650
6543A650j201k628L081Q97l952J758K438k841p67L406j247k297K596O43l225J112
$$ 1650 449 -2179 902 1799 -2153 -395 2043 -798 -1565 1841 594 -1703 893 1536 -1689 -577
6559e77K791k759j041L422j004l221K807J721l624Q08K793k670j238L392q17k790
$$ -577 2214 -545 -1586 1836 832 -2389 418 2139 -1485 -677 2116 -554 -1792 1600 783 -2007
6575b007K550J266l174N84K872k418j490L455n64l055K469J600l624O92L026k461
$$ -2007 543 1809 -1365 -781 2091 -327 -1817 1638 1074 -1981 488 2088 -1536 -844 2182 -279
6591b79j246K811l18l081K503J335l180N23K873j893j949K926O3l137K190J997
$$ -279 -1525 1286 968 -2113 390 1725 -1455 -932 1941 48 -1901 1025 1088 -2049 141 2138
6607B138l563L08K955j784j972L130j46k846J898J950l313O4K914j923j845L317
$$ 2138 -1425 -1117 1838 54 -1918 1212 1066 -1780 118 2068 -1245 -1181 1733 -190 -2035 1282
6623A282J46l494J832K031k677n93L172j241k141K784K8k893J381K208k685m52
$$ 1282 1428 -2066 -234 1797 -880 -1473 1699 458 -1683 1101 1129 -1764 -383 1825 -860 -1312
6639a312K688j025k676K976R01l323J327K562k955q94L230j200k063K262J063
$$ -1312 1376 351 -2325 651 1552 -1771 -444 2118 -837 -1731 1499 299 -1764 498 1561
6654A561l359J049K757k679q11K968j160k558K675J227l440J085K748k897r49
$$ 1561 -1798 -749 2008 -671 -1482 1486 326 -2232 443 1670 -1770 -685 2063 -834 -1783
6669a783L476j022k591K266J157l351Q66K930k372j337L107o78k748K556J195
$$ -1783 1693 671 -1920 346 1503 -1848 -982 1948 -424 -1761 1346 668 -2080 476 1671
6684A671l158O46K941k568j119L258p04k789K221J348l160M38K888k064j428K839
$$ 1671 -1487 -841 2100 -468 -1587 1671 967 -1822 399 1747 -1413 -975 1913 -151 -1579 1260
6700A260m05k454J694J515k838K74K706j686j985L395j44l175J859J740k843k90
$$ 1260 855 -1599 95 1610 -1228 -954 1752 66 -1919 1476 1332 -1843 16 1756 -1087 -1377
6716a377L092j912j389K690j27k888J879J926k937m63L390j773j930K782N60l253
$$ -1377 1715 -197 -1586 1104 977 -1911 -32 1894 -1043 -1506 1884 111 -1819 963 1523 -1730
6732a730J356K490l153o44L348j183k564K901L21k804J446K126k761l88K723q33
$$ -1730 -374 2116 -1037 -1681 1667 484 -2080 821 1142 -1662 -216 1910 -851 -1239 1484 651
6748F51k421K288Q32l011J182K580k879o61K854q47k508K287J076k857P53K590
$$ 651 -1770 518 1350 -1661 -479 2101 -778 -1439 1415 568 -1940 347 1423 -1434 -681 1909
6764A909k631q51K977n16k901K624R32l061Q39K415k249j165L070p11k736K195
$$ 1909 -722 -1573 1404 888 -2013 611 1543 -1518 -679 1736 -513 -1678 1392 681 -2055 140
6780A40J229k908P68K419j979j426K824n44k450K156J367k738K29K821k232j476
$$ 140 1369 -1539 -771 1648 -331 -1757 1067 523 -1927 229 1596 -1142 -913 1908 -324 -1800
6796a800L075p20k428J932J485k846M89K609j959j444K811k04k628J671J474k551
$$ -1800 1275 555 -1873 59 1544 -1302 -813 1796 -163 -1607 1204 1000 -1628 43 1517 -1034
6812a034j3K823j744j520K630L7k971J950J710k915l30L147j423j906K545N62
$$ -1034 -1047 1776 32 -1488 1142 1179 -1792 158 1868 -1047 -1377 1770 347 -1559 986 1548
6828A548k955J070K116k557k55K871j596k135K592O40k690J210K320l031k36K941
$$ 1548 -1407 -337 1779 -778 -1033 1838 242 -1893 699 1339 -1351 -141 2179 -852 -1088 1853
6844A853j445k284K414R21k994J355K087k610p55K885r36k357K369P49k677P97
$$ 1853 408 -1876 538 1459 -1535 -180 1907 -703 -1458 1427 491 -1866 503 1252 -1425 -628
6860f28K097k161r65L371j268k241K448P08k740O68K331j930r85K571r05k113
$$ -628 1469 -692 -1657 1714 446 -1795 653 1361 -1379 -711 1620 -310 -1295 1276 371 -1742
6876a742J995J265k804N77K148j703j146K712o22k718K385J262k888M22K342j760
$$ -1742 253 1518 -1286 -709 1439 -264 -1410 1302 680 -2038 347 1609 -1279 -857 1485 -275
6892b75j449K949m52k524J782J586k424l91K653j751j398K887k94k551J632J855
$$ -275 -1724 1225 773 -1751 31 1617 -807 -1198 1455 -296 -1694 1193 899 -1652 -20 1835
6908A835l028J93K731j824j549K701j76k733J659J865k777Q1K451j490j948K969
$$ 1835 -1193 -1000 1731 -93 -1642 1059 883 -1850 -191 1674 -1103 -1022 1429 -61 -2009 960
6924I60K65k700J359J993k905J5K615j477j948K622L41k518J386J557k291m65
$$ 960 1225 -1475 -116 1877 -1028 -1013 1602 125 -1823 799 1140 -1378 8 1565 -726 -1191
6940a191K801j394k080K791P29l135Q43K525k458q62L082r21k498K527L43k430
$$ -1191 1610 216 -1864 927 1656 -1479 -636 1889 -569 -1431 1651 730 -1768 759 1102 -1328
6956a328Q66K023k136p49K734n84k292K043P38k385O07K530k432j068K833r07
$$ -1328 -462 1561 -575 -1324 1410 826 -1466 577 1315 -1070 -463 2067 -365 -1433 1400 493
6972D93j917J805J199k918R52J926j826j208K967n83k805K153J369k862M91K254
$$ 493 -1424 381 1580 -1338 -386 1540 -286 -1494 1473 890 -1915 238 1607 -1255 -764 1490
6988A490j831j136K925n43k436J518K128l071J70K664k073j626K587J11k602J328
$$ 1490 -341 -1477 1448 905 -1531 -13 2115 -956 -786 1878 -195 -1821 766 877 -1725 -397
7004c97J937k559j78L081k109j520K895j25k806J629J842k590k62K347j302j646
$$ -397 1540 -1019 -1197 1884 -225 -1745 1150 1025 -1781 -152 1690 -900 -1162 1185 -117 -1763
7020a763K732K16k694J444J598k592j20K598j364j537K054P64l106J504J977k775
$$ -1763 969 1185 -1509 -65 1533 -1059 -1179 1419 55 -1482 572 1336 -1770 -266 1711 -1064
7036a064k27K666j486j776K478O53k508P93J987k035p09K568q97k329K420P98
$$ -1064 -1291 1375 -111 -1887 591 1244 -1264 -471 1516 -519 -1228 1340 443 -1886 534 1332
7052A332k708Q29K451k523q11K966j068k541K800N83k825J149K259k309j128K754
$$ 1332 -1376 -547 1904 -619 -1430 1536 468 -2073 727 1310 -1515 -366 1893 -416 -1544 1210
7068A210p63k193K210R15k688P13K089j737j239K676k86k664J984J491k835L59
$$ 1210 447 -1746 464 1379 -1309 -596 1493 -244 -1483 1193 907 -1757 227 1718 -1117 -758
7084g58K376j866j289K472k88j989J387J310k405L60K517j668j532K325J11k796
$$ -758 1618 -248 -1537 935 647 -1342 45 1355 -1050 -690 1827 159 -1373 952 1063 -1733
7100a733J846J538k555j5K711j590j633K386j89k487K169R57k410J62K594j807
$$ -1733 113 1651 -904 -919 1792 202 -1431 955 766 -1721 448 1405 -1005 -843 1751 -56
7116e6j661K834K01k746J611J319k437p0K466j081j957K252M24k594J280K104
$$ -56 -1717 1117 1318 -1428 183 1502 -935 -1005 1461 380 -1577 675 1099 -1495 -215 1889
7132A889k701l25K475j004k112K426N82k787J189K132k749m99K811j071k093K298
$$ 1889 -812 -1137 1338 334 -1778 648 1230 -1557 -368 1764 -985 -1484 1327 256 -1837 461
7148D61Q85k768R57K007k224m06K041q98j382J914M87k345O51K492k308j084K614
$$ 461 1346 -1422 -465 1542 -682 -1088 953 55 -1327 587 1074 -1271 -620 1872 -436 -1520 1094
7165A094n46k605K501J098k945O79K247k116o23K295n52j884J599J276k743K20
$$ 1094 548 -2057 444 1542 -1403 -724 1523 -593 -1216 1079 527 -1357 242 1518 -1225 -1005
7181a005K679j538j611K421k11k364J743J426k429J02J948j532j032K646j69k856
$$ -1005 1674 136 -1475 946 735 -1629 114 1540 -889 -787 1161 -371 -1403 1243 1074 -1782
7197a782J936J240k772N02K542j685j407K414J02k498J386J425k157P6K167j439
$$ -1782 154 1394 -1378 -876 1666 -19 -1426 988 1090 -1408 -22 1403 -754 -678 1489 50
7213E0j661K465J23k450J626J491k574J18K696j734j567K215N84k741J236J572
$$ 50 -1611 854 977 -1473 153 1644 -930 -812 1884 150 -1417 798 1382 -1359 -123 1449
7229A449j946p23K749r74j932K459O3k713J469J379j671p68K802j066k504K647
$$ 1449 -497 -1220 1529 555 -1377 1082 1145 -1568 -99 1280 -391 -1159 1643 577 -1927 720
7245G20P48k552O94J843k316l69K660j001k102K340O38k969J195K365k578p84
$$ 720 1468 -1084 -390 1453 -863 -1232 1428 427 -1675 665 1303 -1666 -471 1894 -684 -1468
7261a468K836r62k010K122Q71k808N37K428k067q81K642q93j818J711J269l063
$$ -1468 1368 406 -1604 518 1389 -1419 -882 1546 -521 -1402 1240 347 -1471 240 1509 -1554
7277a554Q46K146j868j050K445k7k734K239J286k916M45K336j839j173K254q2
$$ -1554 -708 1438 -430 -1480 965 938 -1796 443 1729 -1187 -742 1594 -245 -1418 836 754
7293G54k218J447J313k353p6K501j584j478K761j32k307J130J523k058M7J821
$$ 754 -1464 -17 1296 -1057 -1133 1368 -216 -1694 1067 935 -1372 -242 1281 -777 -730 1091
7309A091j041j842K575L27k250J151J626k587K0K442j151j967K579j52k356J251
$$ 1091 50 -1792 783 1110 -1140 11 1637 -950 -930 1512 361 -1606 973 821 -1535 -284
7325b84J857k280n89K813j260j843K199O58k852J333J867k352j14K406j160k195
$$ -284 1573 -707 -1296 1517 257 -1586 613 1271 -1581 -248 1619 -733 -847 1559 399 -1796
7341a796K262N76k214P69K200k521m41K363p41j989K004R04k540N20K256k148
$$ -1796 466 1042 -1172 -403 1797 -724 -1165 1198 457 -1532 472 1376 -1164 -644 1612 -536
7357e36o25K517q24k199K260P10k610N63K316j621j494K739n40k373K097R43k448
$$ -536 -1161 1356 532 -1667 593 1303 -1307 -744 1572 -49 -1543 1196 656 -1717 380 1323 -1125
7374a125L8K256j360j011K248k45k463J840J170k359J70K397j294j988K790j53
$$ -1125 -1087 1169 -191 -1202 1046 801 -1662 178 1348 -1011 -841 1556 262 -1726 1064 911
7390I11k332J785J257k802N39K304j714j665K779J45k620J222J733k281k18K563
$$ 911 -1421 364 1621 -1181 -642 1662 -52 -1717 1062 1207 -1413 -191 1542 -739 -957 1606
7406A606j754j562K478M74k459J092J377k054K7K132q35k110K204L76k445J249
$$ 1606 -148 -1710 768 1242 -1217 -125 1252 -802 -775 1357 522 -1588 616 992 -1453 -204
7422b04J601k155o25K629r49j934K197M29k361Q38J913k293k14K370r19j785J648
$$ -204 1397 -758 -1383 1246 297 -1637 560 989 -1372 -534 1379 -914 -1128 1242 323 -1462 186
7439A86R72k474Q89J802j882q53K676j010j646J503J156k422O29K074j923j047
$$ 186 1158 -1316 -427 1375 -507 -1360 1316 306 -1340 163 1319 -1103 -474 1600 -323 -1370
7455a370K451l84k076J841P83k310L24K009j348j480K709l16k392J634J629k618
$$ -1370 1081 697 -1379 462 1245 -1065 -741 1268 -80 -1560 1149 833 -1559 75 1704 -914
7471i14K43K073j818o23K296o78k017J463J486k476L40K471j916j389K645n12
$$ -914 -671 1402 -416 -1039 1257 579 -1438 25 1511 -965 -625 1846 -70 -1459 1186 674
7487F74k054J476J338k509K75K137j163j522K270k01k144J358J728k516j20K332
$$ 674 -1380 96 1434 -1075 -800 1337 174 -1348 922 721 -1423 -65 1663 -853 -973 1359
7503A359j397j264K038L82k708J291K115k473K2K093j525j578K484R3k307J039
$$ 1359 -38 -1302 736 1118 -1590 -299 1816 -657 -635 1458 -67 -1645 839 932 -1375 -336
7519c36J858k205p44K767j154j540J951O63k924J461J717k115o44K581r32j813
$$ -336 1522 -683 -1427 1340 186 -1354 597 1260 -1664 -203 1514 -601 -1245 1336 404 -1409
7535a409J819O73k596J252K025k208p11K443r32j990J864Q84k497O74K310j942
$$ -1409 410 1083 -1513 -261 1764 -444 -1155 1288 356 -1634 230 1114 -1383 -709 1601 -341
7551c41r08K360m64k239J961J193k970O18K291j704j487K597l05k310J795J137
$$ -341 -1249 1111 647 -1592 369 1562 -1408 -790 1501 -203 -1690 907 602 -1708 87 1224
7567A224k124J1K147j647r30K633n01k266J759R72k208M1J988j076j514K441m32
$$ 1224 -900 -889 1258 -389 -1319 1314 813 -1453 306 1278 -930 -889 1099 23 -1491 950 518
7584E18k121J457J512k259j85K373j497j285K327J43k440J401J545k069l24K353
$$ 518 -1603 -146 1366 -893 -1078 1295 -202 -1487 840 983 -1457 -56 1489 -580 -904 1449
7600A449j313j297K211J02k275R22K052k542r5K574j455j740J911O24k479J413
$$ 1449 136 -1161 1050 1152 -1123 -201 1851 -691 -786 1788 333 -1407 504 1128 -1351 62
7616F2J486j786p64K614j203k146K169Q10k564Q56K085j989m47K508j382j581
$$ 62 1548 -238 -1002 1612 409 -1737 432 1242 -1322 -466 1619 -370 -817 1691 309 -1272
7632a272J659P87k121N83J744k000m69K154o88j984K309O69k629Q78J581j877
$$ -1272 387 1174 -947 -364 1380 -620 -1089 1065 377 -1607 702 1371 -1258 -380 1201 -676
7648f76l98K234m51k153J777R15k309O21J847j633j044K173k97k132J625R88k058
$$ -676 -1074 1160 709 -1444 333 1248 -1061 -440 1407 -226 -1270 903 606 -1526 99 1087 -971
7665i71L98K002j956j024K310l46j817J487J141k249L46J989j710j040K347k12
$$ -971 -573 1429 -527 -1551 759 413 -1404 83 1224 -1025 -679 1310 -400 -1440 907 695
7681F95k206J406J473k363j27K589j412j588K457K18k437J327J507k113n03K452
$$ 695 -1511 -105 1368 -995 -1122 1467 55 -1533 924 1142 -1295 32 1539 -574 -1077 1375
7697A375j479j614K238L75k341J294J500k230k19K442j220j607K251K30k307Q19
$$ 1375 -104 -1718 520 895 -1446 -152 1348 -882 -1101 1341 121 -1486 765 995 -1312 -493
7713d93K186k290n39K368p13k086J904R11k432Q44J955k074q00K453j077j627
$$ -493 1693 -597 -1136 1232 519 -1567 337 1248 -1184 -340 1615 -459 -1259 1194 117 -1510
7729a510K408M50k290N75K176k176r27K506p69j727J429Q22k022Q68J466j639
$$ -1510 898 1348 -942 -367 1809 -367 -1294 1212 443 -1284 145 967 -1055 -187 1279 -360
7745c60p57K293o86j762J711J110k578M88J997j709q88J974j82k242J866R15j960
$$ -360 -1117 1176 490 -1272 439 1549 -1029 -541 1456 -253 -1141 833 651 -1591 275 1190 -770
7762g70M3K334j759r68K063j30k126J607Q94k067J8K510j545j269K209k31k081
$$ -770 -727 1607 -152 -1120 943 813 -1313 294 1188 -879 -861 1649 104 -1165 1044 813 -1268
7779a268J236J409k352jK267j034j739K441k17k160J484J268k042j84K014j155
$$ -1268 -32 1377 -975 -976 1291 257 -1482 959 742 -1418 66 1334 -708 -892 1122 -33
7795c3j552K337q2j883R68J671k329K2K352j297j665K164J46j934O85J847j820
$$ -33 -1585 752 670 -1213 -245 1426 -903 -881 1471 174 -1491 673 819 -1115 -430 1417 -403
7812d03r48K528r80j644J798N74k195Q69J712j972m52K497r81j908J720Q87k384
$$ -403 -1351 1177 197 -1447 351 925 -1270 -401 1311 -661 -1113 1384 403 -1505 215 1102 -1282
7829a282R67J649j874o37K401p53k083J933R87k595Q43J676j505j124K532p71
$$ -1282 -315 1334 -540 -1177 1224 471 -1612 321 1308 -1287 -444 1232 -273 -1397 1135 364
7845C64j614J270J307k380L31K354j838j080K291m29j607J189J077k083q6K371
$$ 364 -1250 20 1327 -1053 -722 1632 -206 -1286 1005 576 -1031 158 1235 -848 -934 1437
7861A437j700r43K119o8k022J365J145k099rK145j387j097J811R3j632J217J237
$$ 1437 -263 -1206 913 845 -1177 188 1333 -766 -775 1370 -17 -1114 697 790 -842 375 1612
7878A612k412J77J887j123j421J964K95k276J304J412k154r4K066j187j151J741
$$ 1612 -800 -623 1264 141 -1280 684 979 -1297 7 1419 -735 -829 1237 50 -1101 640
7894F40M61k320Q97J835k228l00K470j301j422K193J53k527J597J155j928k22
$$ 640 1101 -1219 -322 1513 -715 -1015 1455 154 -1268 925 1078 -1449 148 1303 -625 -847
7910h47J679p74j200J956K30k615J125J994k385O1J831r23j655K206O3j953J064
$$ -847 832 58 -1142 814 1044 -1571 -446 1548 -837 -776 1055 132 -1523 683 746 -1207 -143
7927a43J363j752l79J920q51j519J851Q50k641R37J542j675o59K212m19k248K042
$$ -143 1220 -532 -911 1009 158 -1361 490 1340 -1301 -364 1178 -497 -1156 1056 637 -1611 431
7944D31N05j852O68J423j438q81K076p81j469J783L79j959L44K044j735o97K136
$$ 431 936 -916 -248 1175 -263 -1144 932 151 -1318 465 844 -1115 -771 1273 -462 -1159 977
7961I77n32j744J150J009j762K59J830j123j262K261l52k053J342J265k256L01
$$ 977 445 -1299 -149 860 -902 -643 1187 64 -1198 1063 711 -1342 0 1265 -991 -690
7977f90J838j093j098J919j16j891J278J353k344k26K262j218j267J888L78k403
$$ -690 1148 55 -1043 876 760 -1131 147 1500 -844 -1070 1192 -26 -1293 595 973 -1430
7993a430J648J185j875k87K142j379j042J927k05j623P61J510j927l14K238j145
$$ -1430 218 1403 -472 -759 1383 4 -1038 889 684 -939 -178 1332 -595 -909 1329 184
8009A84j374J903J25k135J108J382j535l08J736j058j061J434L81j715O14J555
$$ 184 -1190 713 838 -1297 -189 1193 -342 -650 1086 28 -1033 401 782 -933 -319 1236
8025A236j727l16J538o03j256J726N97k364M98J864j551m50K055q87j489J946
$$ 1236 -491 -807 731 128 -1128 598 1195 -1169 -671 1193 -358 -808 1247 360 -1129 817
8041H17L61k621J038J512j668n29K156o16j717J458P20j805N72J588j628o76K073
$$ 817 1178 -1443 -405 1107 -561 -1090 1066 450 -1267 191 911 -894 -322 1266 -362 -1038 1035
8058A035q35j780J662R00j757L51J598j114q92J619k46j647J231P76j726J23J721
$$ 1035 200 -1580 82 982 -775 -424 1174 60 -832 787 541 -1106 125 901 -825 -702 1019
8075A019j472o37K024l31k000J173J318j828K23J766j630j047K137j71j564Q36
$$ 1019 -453 -1090 934 603 -1397 -224 1094 -734 -511 1255 -375 -1422 715 544 -1020 -184
8091a84J251j740QK105j379j282K025p2j898R43J464j819j88K157j229j478K165
$$ -184 1067 -673 -665 1440 61 -1221 804 732 -1166 -223 1241 -578 -766 1391 162 -1316 849
8108H49j76j816J072J151j900K19J884q93j495J684O92k183R51J260j519k26J613
$$ 849 673 -1143 -71 1080 -820 -601 1283 390 -1105 579 1271 -912 39 1299 -220 -446 1167
8125A167r29j280J759K23k099R38J231j441n27J991n66j695J712O95k247L90J829
$$ 1167 238 -1042 717 940 -1159 -221 1010 -431 -958 1033 467 -1228 484 1179 -1068 -678 1151
8142A151j530m54J749q4k018J731O76k118N36J588j511q16J961m12j807J556R27
$$ 1151 -379 -833 916 832 -1186 545 1221 -897 -361 1227 -284 -1100 861 449 -1358 198 1125
8159A125k277P38J604j334q43J705k32j533J017J252k071p1K250j454j119J916
$$ 1125 -1152 -414 1190 -144 -987 718 486 -1047 -30 1222 -849 -920 1330 -124 -1243 673
8175F73k23j585J326J048k051NJ877j085j081J799j0j908J204J194k019J52
$$ 673 450 -1135 191 1239 -812 -807 1070 -15 -1096 703 693 -1215 -11 1183 -836 -684
8191f84
$$ Imaginary data points
##PAGE= N=2
##DATA TABLE= (X++(I..I)), XYDATA
0@%%%%%%%%qJ6j6J6j6K4l2L6m4N1n9P2q7R9j14J33j53J73j95K22k53K87l21L59
$$ 0 0 0 0 0 0 0 0 0 -8 8 -8 8 -8 16 -16 20 -24 27 -32 40 -47 52 -62 71 -82 91 -104 118 -135 152 -169 190
32A90m03M50n03N59o19O88p64Q48r38J036j148J273j412J566j741J943k175K444
$$ 190 -213 237 -266 293 -326 362 -402 446 -492 544 -604 669 -743 823 -918 1025 -1150 1294
50A294k762L146l622M231n031O138p774J0428j5432K7908j09476j82128L30270
$$ 1294 -1468 1678 -1944 2287 -2744 3394 -4380 6048 -9384 18524 -90952 -273080 57190
63E7190P6632k10911K9716R3801j13472L1949R9786j15874k0623J60270j06919
$$ 57190 133822 -77089 -47373 46428 -67044 -35095 64691 -51183 -71806 88464 -18455
74a8455j45859K02191Q4204k37427K1652J97483j17332j03501J72368k5134j65413
$$ -18455 -164314 37877 122081 -115346 -93694 103789 -13543 -117044 55324 30190 -135223
85a35223J31488J03205j86661l019J73729q6391r6795J34252j9099j20096J31315
$$ -135223 -3735 99470 -87191 -90210 83519 -2872 -99667 34585 15486 -104610 26705
96B6705N6934j93571M3906J92589j35942j23747J93249J9813j89054Q0104J20789
$$ 26705 83639 -109932 -66026 126563 -9379 -133126 60123 79936 -109118 -29014 91775
107I1775j41789j0713J56430q6242j02407J43578L407j43085J02976R3944j64828
$$ 91775 -50014 -60727 95703 9461 -92946 50632 54039 -89046 13930 107874 -56954
118e6954j57J64382r8616r2242J84660n789k16709R4709J79634j43694q2580J45004
$$ -56954 -57111 107271 8655 -83587 101073 95284 -121425 -26716 152918 9224 -73356 71648
130G1648k5429r1208J06050l708j31096J01722Q8006j80238p316J98617q7830
$$ 71648 46219 -44989 61061 57353 -73743 27979 115985 -64253 -71569 127048 39218
141C9218j54151J56963N9754j82320L6999J38526j15843n0644J42939n5014j17011
$$ 39218 -114933 42030 101784 -80536 -43537 94989 -20854 -71498 71441 16427 -100584
$$ [...]
##END NTUPLES=NMR FID
##END=
