##TITLE=1H_Pr 4768
 CDCl3, 8 sc, 
 6.5.2019
##JCAMPDX= 6.0         $$ Bruker NMR JCAMP-DX V2.0
##DATA TYPE= NMR FID
##DATA CLASS= NTUPLES
##ORIGIN= UXNMR, Bruker Analytische Messtechnik GmbH
##OWNER= root
$$ XWIN-NMR		Version 3.5
$$ Mon May  6 17:32:10 2019 Russian Standard Time (UT+4h)  she@DPX200
##.OBSERVE FREQUENCY= 200.1315
##.OBSERVE NUCLEUS= ^1H
##.DELAY= (6, 6)
##.ACQUISITION MODE= SIMULTANEOUS
##.ACQUISITION SCHEME= undefined
##.AVERAGES= 8
##.DIGITISER RES= 18
##SPECTROMETER/DATA SYSTEM= spect
##.PULSE SEQUENCE= zg30
##.SOLVENT NAME= CDCl3
##.SHIFT REFERENCE= (INTERNAL, CDCl3, 0, 15.7039)
##AUDIT TRAIL= $$ (NUMBER, WHEN, WHO, WHERE, WHAT)
$$ ##TITLE= Audit trail, XWIN-NMR		Version 3.5
$$ ##JCAMPDX= 5.01
$$ ##ORIGIN= Bruker BioSpin GmbH
$$ ##OWNER= she
$$ F:/spectra/data/she/nmr/H-F/1/audita.txt
$$ ##AUDIT TRAIL=  $$ (NUMBER, WHEN, WHO, WHERE, WHAT)
(   1,<2019-05-06 17:30:59.45 +0400>,<she>,<DPX200>,
      <created by zg, POWCHK disabled, PULCHK disabled
       configuration hash MD5:
       00 E9 B6 7A A2 85 ED C7 34 08 36 98 17 FE 4E 26
       data hash MD5: 16K
       6C 84 F0 86 34 33 9C B4 79 01 1C 8D 2E C1 36 85>)
$$ ##END=
$$ 
$$ hash MD5
$$ 51 DD 76 C1 4A F4 E2 50 61 21 C0 7F 42 70 4C 82
##$RELAX= 
##$RELAX= 
##$RELAX= 
##$RELAX= 
##$RELAX= 
##$RELAX= 
$$ Bruker specific parameters
$$ --------------------------
##$DU= <F:/spectra>
##$EXPNO= 1
##$NAME= <H-F>
##$PROCNO= 1
##$TYPE= <nmr>
##$USER= <she>
##$AMP= (0..31)
100 100 100 100 100 100 100 100 100 100 100 100 100 100 100 100 100 100 
100 100 100 100 100 100 100 100 100 100 100 100 100 100 
##$AQSEQ= 0
##$AQ_mod= 1
##$AUNM= <au_zg>
##$AUTOPOS= <>
##$BF1= 200.13
##$BF2= 200.13
##$BF3= 200.13
##$BF4= 200.13
##$BF5= 200.13
##$BF6= 200.13
##$BF7= 200.13
##$BF8= 200.13
##$BYTORDA= 1
##$CFDGTYP= 0
##$CFRGTYP= 5
##$CHEMSTR= <none>
##$CNST= (0..31)
1 1 145 1 1 1 1 1 1 1 1 1 1 1 1 1 1 1 1 1 1 1 1 1 1 1 1 1 1 1 1 1 
##$CPDPRG= <>
##$CPDPRG1= <>
##$CPDPRG2= <>
##$CPDPRG3= <>
##$CPDPRG4= <mlev>
##$CPDPRG5= <mlev>
##$CPDPRG6= <mlev>
##$CPDPRG7= <mlev>
##$CPDPRG8= <mlev>
##$CPDPRGB= <>
##$CPDPRGT= <>
##$D= (0..31)
0 1.2 0 0 0 0 0 0 0 0 0 0.03 0 0 0 0 0 0 0 0 0 0 0 0 0 0 0 0 0 0 0 0 
##$DATE= 1557149458
##$DBL= (0..7)
120 120 120 120 120 120 120 120 
##$DBP= (0..7)
150 150 150 150 150 150 150 150 
##$DBP07= 0
##$DBPNAM0= <>
##$DBPNAM1= <>
##$DBPNAM2= <>
##$DBPNAM3= <>
##$DBPNAM4= <>
##$DBPNAM5= <>
##$DBPNAM6= <>
##$DBPNAM7= <>
##$DBPOAL= (0..7)
0.5 0.5 0.5 0.5 0.5 0.5 0.5 0.5 
##$DBPOFFS= (0..7)
0 0 0 0 0 0 0 0 
##$DE= 6
##$DECBNUC= <off>
##$DECIM= 24
##$DECNUC= <off>
##$DECSTAT= 4
##$DIGMOD= 1
##$DIGTYP= 9
##$DL= (0..7)
0 120 120 120 120 120 120 120 
##$DP= (0..7)
150 150 150 150 150 150 150 150 
##$DP07= 0
##$DPNAME0= <>
##$DPNAME1= <>
##$DPNAME2= <>
##$DPNAME3= <>
##$DPNAME4= <>
##$DPNAME5= <>
##$DPNAME6= <>
##$DPNAME7= <>
##$DPOAL= (0..7)
0.5 0.5 0.5 0.5 0.5 0.5 0.5 0.5 
##$DPOFFS= (0..7)
0 0 0 0 0 0 0 0 
##$DQDMODE= 0
##$DR= 18
##$DS= 0
##$DSLIST= <SSSSSSSSSSSSSSS>
##$DSPFIRM= 0
$$ [...]
##$SUBNAM2= <"">
##$SUBNAM3= <"">
##$SUBNAM4= <"">
##$SUBNAM5= <"">
##$SUBNAM6= <"">
##$SUBNAM7= <"">
##$SUBNAM8= <"">
##$SUBNAM9= <"">
##$SW= 24.9337058887773
##$SWIBOX= (0..15)
0 0 2 0 0 0 0 0 0 0 0 0 0 0 0 0 
##$SW_h= 4990.01996007984
##$TD= 16384
##$TD0= 1
##$TE= 0
##$TE2= 300
##$TE3= 300
##$TEG= 300
##$TL= (0..7)
0 120 120 120 120 120 120 120 
##$TP= (0..7)
150 150 150 150 150 150 150 150 
##$TP07= 0
##$TPNAME0= <>
##$TPNAME1= <>
##$TPNAME2= <>
##$TPNAME3= <>
##$TPNAME4= <>
##$TPNAME5= <>
##$TPNAME6= <>
##$TPNAME7= <>
##$TPOAL= (0..7)
0.5 0.5 0.5 0.5 0.5 0.5 0.5 0.5 
##$TPOFFS= (0..7)
0 0 0 0 0 0 0 0 
##$TUNHIN= 0
##$TUNHOUT= 0
##$TUNXOUT= 0
##$USERA1= <user>
##$USERA2= <user>
##$USERA3= <user>
##$USERA4= <user>
##$USERA5= <user>
##$V9= 5
##$VALIST= <valist>
##$VCLIST= <CCCCCCCCCCCCCCC>
##$VD= 0
##$VDLIST= <DDDDDDDDDDDDDDD>
##$VPLIST= <PPPPPPPPPPPPPPP>
##$VTLIST= <TTTTTTTTTTTTTTT>
##$WBST= 1024
##$WBSW= 4
##$XGAIN= (0..3)
0 0 0 0 
##$XL= 0
##$YL= 0
##$YMAX_a= 126931
##$YMIN_a= -152778
##$ZGOPTNS= <>
##$ZL1= 120
##$ZL2= 120
##$ZL3= 120
##$ZL4= 120
##$ABSF1= 10
##$ABSF2= 0
##$ABSG= 5
##$ABSL= 3
##$ALPHA= 0
##$AQORDER= 0
##$ASSFAC= 0
##$ASSFACI= 0
##$ASSFACX= 0
##$ASSWID= 0
##$AUNMP= <proc_1d>
##$AZFE= 0.1
##$AZFW= 0.1
##$BCFW= 1
##$BC_mod= 2
##$BYTORDP= 1
##$COROFFS= 0
##$CY= 11.3945322036743
##$DATMOD= 1
##$DC= 2
##$DFILT= <>
##$DTYPP= 0
##$F1P= 18.9103706918063
##$F2P= -1.10871071338519
##$FCOR= 0.5
##$FTSIZE= 0
##$FT_mod= 4
##$GAMMA= 1
##$GB= 0.15
##$INTBC= 1
##$INTSCL= 1
##$ISEN= 128
##$LB= 0.24
##$LEV0= 0
##$LPBIN= 0
##$MAXI= 10000
##$MC2= 0
##$MEAN= 0
##$ME_mod= 0
##$MI= 1.114404
##$NCOEF= 0
##$NC_proc= 0
##$NLEV= 6
##$NOISF1= 3.799351
##$NOISF2= 2.8
##$NSP= 1
##$NTH_PI= 0
##$NZP= 0
##$OFFSET= 15.70392
##$PC= 1
##$PHC0= -8866.142
##$PHC1= 27.40026
##$PH_mod= 1
##$PKNL= yes
##$PPARMOD= 0
##$PSCAL= 0
##$PSIGN= 0
##$REVERSE= no
##$SF= 200.130013532006
##$SI= 16384
##$SIGF1= 3
##$SIGF2= 2
##$SINO= 400
##$SIOLD= 16384
##$SREGLST= <1H.CDCl3>
##$SSB= 0
##$STSI= 0
##$STSR= 0
##$SW_p= 3612.71676300578
##$SYMM= 0
##$S_DEV= 0
##$TDeff= 0
##$TDoff= 0
##$TI= <>
##$TILT= no
##$TM1= 0
##$TM2= 0
##$TOPLEV= 0
##$USERP1= <user>
##$USERP2= <user>
##$USERP3= <user>
##$USERP4= <user>
##$USERP5= <user>
##$WDW= 1
##$XDIM= 8192
##$YMAX_p= 0
##$YMIN_p= 0
$$ End of Bruker specific parameters
$$ ---------------------------------
##NTUPLES= NMR FID
##VAR_NAME=  TIME,          FID/REAL,        FID/IMAG
##SYMBOL=    X,             R,               I
##VAR_TYPE=  INDEPENDENT,   DEPENDENT,       DEPENDENT
##VAR_FORM=  AFFN,          ASDF,            ASDF
##VAR_DIM=   8192,          8192,            8192
##UNITS=     SECONDS,       ARBITRARY UNITS, ARBITRARY UNITS
##FACTOR=    0.0002004,     1,               1
##FIRST=     0,             0,               0
##LAST=      1.6414764,     0,               0
##MIN=       0,             -152778,         0
##MAX=       1.6414764,     126931,          0
$$ Real data points
##PAGE= N=1
##DATA TABLE= (X++(R..R)), XYDATA
0@%%%%%%%lJ1j6J6k4L2l3M1n6O5p4R0j07J28j51J73j99K31k66L04l45L92m45N03
31B67n66O35p13P98q90R88j096J219j355J502j661J837k035K255k500K774l082
48a623L436l845M322m885N566o411P488q914J0901j3892J8968k9816R4967j06903
62c0641p9639K25442q0081j06433J34089Q985j67832J14903J00306j77295q836
73f7032J93963j09072j35226J72655L7721j88937P4778J28246j49816l0975J69662
84I5967q5293j20948J63348K8405j89245P6595J44839j49561n1061J69472o1374
95B1144j27101J48418L9280j80643O3455J45991j41369n9163J68634m5992j31825
106i9171J35075M5650j75110N5387J50368j33808o7526J67136l9681j42969J29258
$$ plain form
0 0 0 0 0 0 0 0 0 -3 8 -8 8 -16 16 -17 24 -32 33 -41 49 -58 70 -81 92 -107 124 -142 162 -183 209 -236 267
31 267 -299 336 -377 421 -469 519 -577 642 -713 789 -872 965 -1070 1185 -1315 1459 -1623
48 -1623 1813 -2032 2290 -2595 2971 -3440 4048 -4866 6035 -7857 11111 -18705 76262 -30641
62 -30641 -110280 115162 35081 -71352 62737 71722 -96110 18793 119099 -58196 -67032
73 -67032 126931 17859 -117367 55288 93009 -95928 -21150 107096 -42720 -73695 95967
84 95967 10674 -110274 53074 81479 -107766 -31171 113668 -35893 -86954 82518 21144
95 21144 -105957 42461 81741 -98902 -35447 110544 -30825 -89988 78646 32654 -99171
106 -99171 35904 81554 -93556 -38169 112199 -21609 -89135 78001 38320 -104649 24609
117B4609O9061j67613K9318J40493j20242o1590J67951l9013j54172J25048Q2218
128I6068j67950J5530J48921j07331p7141J55902k3930j46703J16326Q2482j66527
139g4353J1232J54858j02610q7993J56803p798j50914R9530R1113j53271M752
150e8651J52561r6853r5895J52649O059j49167Q9348R4373j50211n697J55256
161I3772q3184j01356J42360J0717j50434Q2189J04931j41041k0794J46866p2232
172A1794j00057J36972J7169j51203P0937J09083j33420k7175J47934o3121j09340
183i0427J27701K9531j44668N9341J09144j26084l2505J47005n5740j13453J21963
194C1808L8098j44408N0220J14069j19574m2147J44264m3382j13969J13296M0144
$$ plain form
117 24609 93670 -73943 -44625 95868 -24374 -85964 81987 42974 -111198 13850 96068
128 96068 -71882 -56352 92569 -14762 -91903 63999 40069 -106634 9692 92174 -74353
139 -74353 -63121 91737 -10873 -98866 57937 50139 -100775 -1245 89868 -63403 -58651
150 -58651 93910 -2943 -98838 53811 59870 -89297 51 94424 -55787 -61484 93772
161 93772 10588 -90768 51592 62309 -88125 -5936 98995 -42046 -62840 84026 11794
172 11794 -88263 48709 65878 -85325 -14388 94695 -38725 -65900 82034 18913 -90427
183 -90427 37274 66805 -77863 -18522 90622 -35462 -67967 79038 23298 -90155 31808
194 31808 69906 -74502 -24282 89787 -29787 -71934 72330 28948 -85021 28275 68419
205F8419j43759M7650J21452j16070n4667J42208l2110j15481J07225M7734j42487
216f9886L5200J23033j06211n7070J39223k9811j22982J04749O2797j40933J9131
227d2760J22561r4597o1167J33929k3024j22589R9061O6093j40360J3235J29422
238G9804q7188p2535J27367r926j20032Q8897O9254j33716P842J28860q1989p7914
250h1276J26114m70j22996P7862P6489j24752j716J25355p3856p9027J21544M078
262D7349j25670P1783Q4826j18834j3211J22519o3227q0521J15832Q853j26295
273g6596O5632R1498j15053k1806J22164n3855q5031J09712J6181j24467N8487
284a3134R3091j11205k6700J25195m8477r2961J05437K7544j23076M7166R4286
$$ plain form
205 68419 -75340 -27690 93762 -22308 -76975 65233 33123 -82358 24867 72601 -69886
216 -69886 -34686 88347 -17864 -74934 64289 34478 -88504 16245 79042 -61891 -42760
227 -42760 79801 -14796 -75963 57966 34942 -87647 11414 77507 -62853 -49618 79804
238 79804 -7384 -79919 47448 37522 -82510 6387 75641 -58075 -50233 78627 -3362 -81276
250 -81276 44838 44368 -78628 -766 75723 -49029 -50745 74610 754 -78273 43271 47349
262 47349 -78321 -6538 78288 -40546 -53757 68762 5535 -74986 40846 49699 -76596
273 -76596 -10964 80534 -34519 -56325 65839 11984 -73047 36665 52846 -71621 -13134
284 -13134 79957 -31248 -57948 67247 18770 -74191 31246 58790 -64286 -17120 77166
295G7166j03989k9226J24083m6385r7646J04632L6772j25261L6853J00106r6663
306a9558l7890J19880l7207r7386R9773L9731j26548L2145J06421r2320m7213
317f0172J17158k7683r9832R3141M5346j22917K4298J06847q5802n2802J15421
328E3003k0611j02575Q5240N1916j17114J7069J05175q0932n6184J15057j3583
339C6461j06613P7110N9452j11378Q600J04111p3658n8928J10181q385j07017
350g0064P2554O4992j09728P84J05849o5305o4482J04599j653j05904O7039O8126
362F6807j07749n300J08632n9244o9833J01303N708j07088N9770P2953j02398
373c6439j1574J08413n4490p4313R9908J2991j09003N2474P7594r8186j7367J08462
$$ plain form
295 77166 -26823 -56049 68034 21649 -75997 28635 65407 -59854 -23001 77105 -19558
306 -19558 -57448 62432 25225 -72161 27612 67343 -59205 -27060 79361 -12959 -60172
317 -60172 56986 29303 -70529 22612 67958 -54959 -30661 76186 -9616 -62418 53003
328 53003 32392 -70183 15057 66973 -50141 -33072 72103 -8829 -65013 50044 36461
339 36461 -70152 6958 66410 -44968 -36368 67743 -5915 -64843 45338 36953 -70064
350 -70064 2490 67482 -42246 -41462 64387 -918 -65400 39199 37546 -68358 -1319 66807
362 66807 -40942 -46242 62390 3146 -66687 34616 40324 -66764 -6994 65959 -36439
373 -36439 -48013 60400 5910 -68403 31505 44496 -64507 -12033 65561 -32625 -49992 58470
385E8470m9006p8079R7644J9373j09853M4263Q2194r2580k3275J06795m3095q0743
397f7892R4248K5248j11054L8769Q7002q8242l1194J05280l5073q2141Q8051K9501
409E2503j08262L3705Q9034q4850l6994J04829k7373q5660Q2246L6001j04843
420d9664K6071Q9425p9139m0205J02437k1785q8368P6467M3016j01840J8646Q9207
432F4268p2358m4213R9603j6964r0450P2328M8888r9945J0077R1409o5656m8955
444e1968R5737j1662r1125O7392N2632r8693N137R3696o0780n5526R3064m361
456C3543r1194O1476N5665r6337J139R4971n7316o0021R2730K317r3822N4062
468b787O0952r1310m556R4322n2609o2355R0810P704r7011M9367O6691q7438j2314
$$ plain form
385 58470 9464 -68615 29029 48402 -61451 -17188 65006 -27574 -50849 55946 12851 -67892
397 -67892 26356 51604 -59450 -20681 66321 -21921 -53115 52165 17092 -65049 23002 52503
409 52503 -55759 -22054 66980 -17870 -54864 49965 22592 -63068 19178 55179 -49664
420 -49664 -23593 65832 -13307 -53512 48925 27140 -61228 15239 58255 -43585 -24939 64268
432 64268 -8090 -52303 47300 30336 -60114 12214 61102 -38843 -28766 62643 -3013 -51968
444 -51968 43769 32107 -59018 8374 61006 -37687 -32550 61146 366 -55160 37904 33543
456 33543 -57651 3825 59490 -36847 -35708 59263 1947 -58074 34656 36973 -56849 -2787
468 -2787 58165 -33145 -37701 56621 4012 -58343 32467 40171 -56840 -7473 59218 -28220 -40534
481d0534R3595m5758o5001Q7499J1716r6808M4890P0417q5341j8747R3431l9060
493A0299o7670Q2509J6713r5905L9906P2079q2110k3143R3198l3067p1383P7449
505A8875K2758r2537L2885P2266p6820k6415R1938k9225p3648P4557K8963r1325
517d7728K5528P4981p0768l0566Q9344k4908p4145P1467L3290r0794K0390P7591
529E3682o5818l5189Q6709j9091p5628O7604L6994r0133J6040Q0654o2951m1115
541d8242Q6287j3262p7825O2205M0981q7231J0957Q0901n9671m4662Q6129q130
553B8437q1588N6991M6567q4669N947Q0826n5306m7563Q4939m163q3361N3438
565D95N1761q3355l30Q1350m9299m9836Q1749j94q4033M9932N5219q1103o178
$$ plain form
481 -40534 53061 7303 -57698 29801 41517 -55291 -10401 60016 -25325 -44072 49359 10299
493 10299 -57371 25138 41851 -54054 -14148 57931 -24179 -47322 45876 12809 -58574 18875
505 18875 41633 -50904 -18019 54247 -22573 -48988 42950 13725 -59923 14634 43597 -47728
517 -47728 -22200 52781 -17987 -48553 40791 15883 -58262 13205 46495 -44299 -23909 53682
529 53682 -12136 -47325 39384 20293 -55335 12269 49263 -40870 -24830 55824 -7127 -48242
541 -48242 38045 24783 -53042 9163 50144 -37087 -26130 54771 -4900 -49562 36567 28437
553 28437 -53151 3840 50407 -34262 -28315 52511 -2795 -50358 34581 30418 -52943 495
565 495 52256 -31099 -31429 49921 622 -49214 32535 32341 -51692 -1760 53459 -27644 -33822
578c3822Q3053m3815n3672P7853N417q2625M4307N6652p7989j0276Q3227l9530
590H780n7306P4360J1334q2283L8209N8483p3711j4341Q1951l5911n9567P2166
602B2164J6280q2427L1864O1488o9403j8559Q0199l1410o1938O9843K0303q2045
614d3641K7734O4621o6000k4150P9064k5748o3330O6684K4242q2092K3958O7543
626D8885o3394k8457P9374k1099o5893O2559K8687q0449K0125O9048o1219l2572
638d4405Q0032j6104o9816N8778L4135p8686J3755O9921n6408l5049P8454j3134
650B1473p2208N5795L9543p7704P802P1413n1533l8782P6307q058p2879N1706
662B875M2549p6389L619P3668m7055m3563P3468k659p1823M7410M4945p4439j510
$$ plain form
578 -33822 49231 5416 -48256 29597 35014 -47611 -3304 53348 -24641 -34917 48310 8780
590 8780 -48526 25834 37168 -45115 -6906 51577 -22134 -36475 45476 9565 -50002 22164
602 22164 38444 -43983 -12119 49369 -20034 -38593 41606 10196 -51742 18101 38404 -43641
614 -43641 -15907 48714 -17286 -41436 37628 11880 -51450 15234 39476 -42616 -18658 48885
626 48885 -14509 -42966 36408 15309 -50584 11975 40662 -39787 -19662 49386 -11833 -44405
638 -44405 35627 19523 -50293 8485 42620 -36066 -22311 47610 -8798 -43847 34607 21473
650 21473 -50735 5060 44603 -33101 -25299 46114 -5419 -44201 32106 24048 -48831 2875
662 2875 45424 -30965 -27346 46322 -733 -44296 29172 26513 -45310 2100 47045 -27394 -28904
675b8904P3899m2012m5946P1214K527p3160M1487M8104p0440n263P3472l8475
687F503m9703O8899P426p3275L6682N1335o7327j0287P2575l4311n1376O6820
699B3961J1450p4846L2675N4668o4509j6032P2710k9790n3456O4399J4452p4281
711c8599K9355N7471o3224k0122P3749k5305n6687O0627J9046p3368K5380N9390
723D7713o1122k2883P3504k2047o0196N8798K4583p2867J9608O0216n6651k5606
735c6950P2895j9573o2714N6956K8492p3209J5023O2862n2116l0083O9625j4197
747A7011o2767N3693L1126p2792J0129O5431m8164l3738O7961r894o3137M8902
759C761L4425o9598O458O5264m5069l6802O7683m884o4762M3418L8583o6860K283
$$ plain form
675 -28904 44995 2983 -42963 28251 30778 -42382 -895 47209 -23231 -28494 44978 6503
687 6503 -43200 25699 33125 -40150 -3468 47867 -19460 -29747 42828 8517 -42859 23961
699 23961 35411 -39435 -6760 47908 -16601 -32633 40077 10287 -43169 21230 35682 -38599
711 -38599 -9244 48227 -14997 -35119 38630 13325 -43362 17265 36311 -37057 -11677 47713
723 47713 -13409 -36292 37212 15165 -45031 13767 38350 -34517 -14909 45307 -11344 -36950
735 -36950 35945 16372 -46342 10614 39106 -34103 -19080 43782 -8334 -38417 31208 17011
747 17011 -45756 7937 39063 -33729 -23600 41831 -6333 -40071 27890 17996 -45141 3761
759 3761 38186 -31412 -24954 40310 -4759 -41561 26122 21238 -43524 -106 38477 -28383 -26100
772b6100O5137m0736l9421O5407o09o5698M0428M2120o5293k794O5424l7046m1636
785d0817O4041K880o6946L7097M4885o2705p160O5608l3242m4073O1647O395o7037
798c9427L3708M8317o1345j1394O6122k9351m7871O0141J1323o6845K9412M9178
810D1968n9421j3498O7728k7372n0938N8008J6068o6642K4450N2075n5892j7107
822c0573O5989k3747n2151N5880J9922o7605K0264N4958n2268k1608O4794j9787
834A4068n3346N2887K2779o6759J6205N6286m9215k5265O3788j4678n5372M8152
846I530K6106o4872J3148N6554m6084k8565O2458j0324n6566M5171K9233o3046
858b7257Q092N7703m3096l0918O1791o697n8522M1788L3089o1597L890N8598l9683
$$ plain form
772 -26100 39037 -1699 -41120 24287 23678 -42020 -1592 40528 -24765 -27559 37865 819 -40817
785 -40817 23224 26104 -40842 -3745 41140 -21565 -28725 36883 3641 -40432 21215 27610 -39427
798 -39427 -5719 42598 -18747 -30141 35981 6630 -41241 18900 30223 -36622 -7210 41968
810 41968 -17453 -30951 36777 9405 -41533 16475 32543 -34099 -9649 42426 -13466 -30573
822 -30573 35416 11669 -40482 15398 35320 -32285 -12021 42937 -9331 -30939 33855 14068
834 14068 -39278 13609 36388 -30371 -14166 42120 -7095 -32360 31428 16750 -38622 9530
846 9530 35636 -29236 -16088 40466 -5618 -34183 28275 17951 -38615 6556 35789 -27257
858 -27257 -19165 38538 -4558 -35476 26315 19618 -38904 2884 35973 -25624 -21734 36864 -2819
871b819l3182O0648m455n9285L9646L6647o1108j52N9230l6268l5944N8870m38
884B1390n9492L7051L8195o0231l267O0863l2966l9701N7156M131n9929L3450
896c350M0345n8206o164O1455l0999m2408N6769P502o0982K9278M3691n5033r474
909b7576O0071k8056m3742N5602J0856o2031K5767M6534n2382j3500N9493k3852
921G184m4887N2471J3929o1704K2551M8479m9708j7521N8917j8799m7018M8908
933A2802J7502o0460J8993M9258m7219k0763N9457j6124m8812M5750K1413n9029
945b7232J3572N1088m4015k2890N8180j3160n1261M4253K5055n8408R523N1821
957C6526m0704k5652N7148j0114n2172M2068K7898n8601O513N3193l8398k8791
$$ plain form
871 -2819 -36001 24647 20192 -39093 553 37200 -23908 -24060 35170 -1098 -37042 21828 21390
884 21390 -38102 -1051 37144 -23087 -26354 34509 1543 -38158 18998 23129 -36800 -3350
896 -3350 36995 -21211 -27375 34080 3081 -39327 17442 24944 -36038 -6760 36931 -18102 -27576
909 -27576 32495 4439 -39303 16299 27155 -34876 -9109 37425 -14957 -28457 31036 7184
921 7184 -37703 14768 28697 -33007 -10456 38023 -11685 -29206 29711 10912 -36106 12802
933 12802 30304 -30156 -11163 38095 -9124 -29887 29570 13446 -35366 10384 31797 -27232
945 -27232 -13660 37428 -6587 -29477 28703 15543 -35718 8535 33590 -24818 -15295 36526
957 36526 -4178 -29830 27318 17204 -34968 7100 34998 -23603 -17090 36103 -2295 -31086
969c1086N6338o263n3172L9088L0332n8135L325N5232l5839l2410N5746k913n4420
982c4177L5800L3656n6709N22N5111l4130l4232N5316J141n6533L2640L6315n3740
995a9020l668N4947l0931l6011N3866L993n7314K9796L8854n1521p659N5079k7286
1008C125l8037N1208O955n6109K6008M1556n0362j0449N5013k3659m0239M8537
1020A3547J0844n5909K2932M2219m7670j3299N5214k0667m2582M6437J4543n5309
1032b9700J8895M3855m5029j5769N4616j7949m4486M5240J7876n5817J5505M5622
1044C2859m2400j9033N4451j5135m5650M3994K0257n5872J2291M7997m0400k2073
1056b8714N3713j1390m7082M0972K3456n5667R453M9616l8793k4860N3712p870
$$ plain form
969 -31086 25252 18989 -34183 4905 35237 -22898 -19573 35659 -180 -32590 23156 20243 -34177
982 -34177 1623 35279 -21430 -20908 34203 73 -34159 21157 22298 -34235 -1595 34720 -19020
995 -19020 -22688 32259 1328 -34683 19183 23176 -34138 -4342 34512 -17009 -24668 30411 3125
1008 3125 -34912 16296 23251 -32858 -6850 34706 -15656 -26105 28908 5249 -34990 13547
1020 13547 24391 -31518 -8586 33633 -14037 -27336 27878 7211 -35371 11066 25609 -29700
1032 -29700 -10805 33050 -11979 -27748 26868 8919 -35567 9673 27549 -28268 -12763 32859
1044 32859 -9541 -28574 25877 10742 -34908 9086 29343 -26529 -14238 33759 -6641 -28714
1056 -28714 24999 13609 -33473 7499 30955 -24712 -15259 34357 -4436 -29296 24416 16546
1068A6546m9263L8405K6112n4015O520M9571l6528k7517N3638m817n0494L5104
1080C262K9559n2401K634M9836l3608k9568N2670j976n1863L2454L2757n1167
1092a7411j652N0306k9882l1168N0035J073n1870K9890L4212m9799m522N1230
1104C0442k7154l3900M8147M636n1545K6551L5972m7570p329N1259k4439l6647
1116c1577M6958P952n2008K2957L7562m5126r991N1716k2974l8197M5742J1361
1128B4375n2723J9510M0339m3124j3197N1244j9897l9521M4559J3414n3686J7242
1140a1465M3095m1883j6284N1220j6389m1214M2041J6274n2773J5063M3528m0866
1152i653j8477N2137j3210m3966M0293J9613n2169J1918M3939l8678k0471N2062
$$ plain form
1068 16546 -32717 5688 31800 -22215 -15695 33876 -2652 -30169 23469 18652 -31842 3262
1080 3262 32821 -19580 -16946 32890 -718 -30286 22384 20408 -31455 999 33756 -17411
1092 -17411 -19063 31243 1361 -29807 20228 21301 -30569 -679 33533 -16266 -20788 30442
1104 30442 3288 -30612 17535 22171 -29374 -2823 33149 -14421 -21750 29509 5070 -31577
1116 -31577 15381 23333 -28675 -5718 31844 -13282 -23273 28443 5469 -32728 13014 24375
1128 24375 -28348 -8838 31501 -11623 -24820 26424 6527 -32994 11565 24979 -28707 -11465
1140 -11465 31630 -10253 -26537 24683 8294 -32920 9121 25395 -27378 -12315 31213 -9653
1152 -9653 -28130 24007 10797 -33169 7124 26737 -25432 -13514 30425 -8253 -28724 23338
1164B3338j1053m5360L7934K3055n1247P938M4939l5804k2430N0702q475m6234
1176c2697L6074K5538n0136M392M6202l3052k4848M8935n352m6431L3462K7230
1188B9317m9119K239M7124l0288k8271M7840j259m7293L0338K9552m6878j029
1200a7727M7022k8175k9959M7010K054m8508K7176L1995m5466l927M7479k6235
1212B739l1450M6181M324m9652K4856L4284m4235o736M7790k3738l3357M4917
1224A5923O455m9854K2864L6002m3675r282M8767k0947l5901M3293R302m9602
1236b6655K0107L7391m2420j1288M9273j8754l7918M1910J2270m9307J7312L8439
1248C0360m0353j3998M9179j6049l9701L9807J5897m9148J3447M0296l8271j6199
$$ plain form
1164 23338 12285 -33075 4859 27914 -23333 -15395 29544 -6260 -28690 22012 13537 -32697
1176 -32697 3377 28915 -21221 -16829 29373 -3679 -28527 20408 15056 -31375 2087 29317
1188 29317 -19802 -17563 29561 -727 -28998 18842 17583 -29710 628 30180 -16698 -17727
1200 -17727 29295 1120 -28839 18171 20225 -28283 -1107 30888 -14578 -18505 28974 2739
1212 2739 -28711 17470 21794 -27858 -3002 31282 -12953 -19689 28101 4363 -28994 15923
1224 15923 22378 -27476 -4612 31390 -12285 -21567 27200 6253 -29648 13645 22947 -26655
1236 -26655 -6548 30843 -11577 -22865 26408 7654 -30264 11646 23916 -25391 -8079 30360
1248 30360 -9993 -23991 25188 9139 -30562 9245 25142 -24006 -10559 29737 -8534 -24733
1260b4733M8254j3541m0561L7865J8648m9112J0410M1416l5661j9059M7728j0896
1272A0758m1467L5739K0911m8057P709M2671l4060k1429M6779p006m2849L3242
1284B941K3315m7301N316M3253l1779k3584M6477m663m3897L1036K5412m5120
1296a8594K415M3679l0045k5230M5887k135m5480K9339K8247m4926j08M3969k7101
1309h3k7532M5265J86m5980K6891L0373m4327l029M5406k5181k9322M3300L288
1322A9255m6339K4662L1653m3350n081M6408k3011l2112M2666N863m6127K1791
1334c722L2995m1879p126M6239k1144l3532M1504R193m6938J8721L4812l9623
1346a0500r864M5668j8392l5176M0393J1661m6632J5470L6931l8006j2376M4433
$$ plain form
1260 -24733 23521 9980 -30581 7284 25932 -23180 -12770 28646 -7015 -26074 21654 10758
1272 10758 -30709 5030 25941 -22116 -14407 28264 -5796 -27225 19554 12548 -30301 2941
1284 2941 26256 -21045 -15729 27524 -4255 -27839 18638 13975 -29922 1114 26526 -18594
1296 -18594 -16179 27500 -2545 -27775 18112 15977 -29503 -164 28083 -16843 -16951 27018 -83
1309 -83 -27615 17650 17836 -28144 -1253 29120 -15207 -18236 27170 1989 -27333 15967 19255
1322 19255 -27084 -2422 29231 -14119 -19200 27208 4197 -27915 14751 20614 -25513 -3722
1334 -3722 29273 -12606 -19732 26507 5363 -28169 13335 22528 -24410 -5689 29123 -10500
1346 -10500 -20364 25304 6912 -28264 12129 23790 -22842 -7372 29559 -8447 -20823 23610
1358B3610j5106l5806L7523J4204m6206J3214L7203l5833j5517M5419j2484l8035
1370b7814L5666J6570m5225J0658L8048l4314j7731M5589j0077l9999L4063J9239
1382B4673m4625P890L8778l2373j8933M4721q480m0838L2727K1563m4681N140
1394a4438M0548l0294k1539M4186n646m1771L0886K3491m4770L605M1581k8473
1406b634k3914M3883l389m2252K8604K5297m3624J338M2615k7126k6257M3358
1418A5899j04m3025K5482K7392m2044q88M2584k5611k7219M2339K669m3879K3311
1431c094K9025l9993m413M3045k2483k9140M0543N346m3896K0712L1000l8780
1443a2128p145M3098j9600l0729L8575P823m3449J8154L2490l7538r187M3106
$$ plain form
1358 23610 8504 -27302 10221 24425 -21781 -8567 28636 -7197 -22714 22705 10221 -27814
1370 -27814 7852 24422 -20803 -10145 27903 -6411 -24142 21447 11370 -28629 5434 24673
1382 24673 -19952 -12062 26716 -5657 -24590 20131 11651 -29187 3540 25103 -19578 -14438
1394 -14438 26110 -4184 -25723 18463 12817 -28954 1932 25423 -19347 -15742 25839 -2634
1406 -2634 -26548 17335 13946 -28306 298 25595 -18029 -16691 25924 -1202 -27459 15899
1418 15899 15795 -27230 -1748 25644 -16400 -17288 25296 -315 -27534 14805 17474 -26405 -3094
1431 -3094 25931 -14062 -18475 24570 2087 -27053 13490 18836 -25060 -4348 26652 -12128
1443 -12128 -19273 23825 4225 -26504 12071 19894 -23555 -5401 27089 -10449 -19636 23470
1455B3470j7091l2883L7461J0415m3194J5385L3413l5465j1379M2910j4994l4270
1467b6222L5545J3460m3309J3178L4873l4700j3429M3195j2925l6122L4708J5627
1479B3879m3526J0683L6210l2736j5721M2573j0824l6840L3155J7409m3220Q351
1491a0607L7451l1279j8046M2168p851l7968L0633J9502m2480O159L8720k9820
1503c418k0486M2542n545l9064K8451K1581m1205L682L8641k7293k2530M1204
1515A6560k539m0032K6510K3451l9803O65L9124k5451k3403M0395m11m0835K3955
1528a814K5546l8274k172L9430k2402k5803L8737K457m0237K1392K7281l7906
1540a3765l742L9770k0504k7423L7374N250m0509J9056K8263l6464n608M0328
$$ plain form
1455 23470 6379 -26504 10957 21372 -21822 -6437 26976 -8489 -19868 23042 8048 -26222
1467 -26222 9323 22783 -20526 -7348 27525 -7175 -20604 22591 9666 -26456 8252 23879
1479 23879 -19647 -8964 27246 -5490 -21211 21362 10538 -26302 6853 24262 -18958 -10607
1491 -10607 26844 -4435 -22481 19687 11836 -26132 4501 24003 -18477 -12318 26402 -3418
1503 -3418 -23904 18638 13093 -25971 2480 24061 -17144 -13462 25179 -2114 -24644 16560
1515 16560 14021 -26011 499 23950 -15853 -15188 23936 -1515 -24918 15477 15066 -25769 -1814
1528 -1814 23732 -14542 -16714 22716 314 -25489 13248 15705 -24532 -3140 24141 -13765
1540 -13765 -17507 22263 1759 -25664 11710 16960 -23549 -4493 23770 -12694 -18302 22026
1552B2026j8871k9390L6697P720m0984J6817L0131l4944q300M0375j6725l0650
1564b6098L5757R711m1030J4375L2195l3716j0730M0514j4634l1862L4169J1961
1576B0612m1093J2930L3056l2698j2896M0315j1507l3693L2165J3955m0308J0560
1588h602L4300l0854j5366M0227r315l4722K9957J6685l9633P576L4720k9040
1600d067j6635L9396o902l5721K7839J8688l8511N033L5093k6395j9047L8696
1612A7467m753l6046K5879K0680l8308K637L6195k4385k1330L7814j860l6973
1624b2983K4013K1908l6840K37L6872k3053k2735L6979Q18l7707K1826K3425l5796
1637a3036j604L6897k1227k4432L6549K980l8463J9722K5495l4970m074L7619
$$ plain form
1552 22026 3155 -26235 10462 18182 -22802 -5985 24146 -10798 -19098 21277 4552 -26098
1564 -26098 9659 19370 -21660 -7285 24910 -8806 -19536 20978 6344 -25518 8651 20612
1576 20612 -20481 -7551 25505 -7193 -20089 20226 8719 -24974 7191 21146 -19162 -8602
1588 -8602 25698 -5156 -20522 19705 10390 -24332 5625 22310 -17323 -9747 24973 -4067
1600 -4067 -20702 18694 11792 -23929 3910 22598 -15913 -10880 24213 -2182 -21229 17467
1612 17467 12714 -23332 2547 23227 -15081 -12444 23751 -634 -21964 15850 13990 -22983
1624 -22983 1030 22938 -13902 -13665 23207 154 -22581 14398 15216 -22491 -665 22760 -13036
1637 -13036 -14640 22257 1030 -23402 13147 16127 -22336 -2614 22881 -12089 -16163 21456
1649B1456j9850k6059L5960M674l8445J7973K7013l3942o090L7863j7668k6875
1661b3990L3998O612l8432J5956K8711l3304p893L7685j5061k8784L3025Q793
1673A7316l7660J3640K9453l1293j0196L7852j3254l0154L1320J1612l7631J1036
1685g959L0654k9995j2183L8118j0934l1369K9184J3784l6966Q910L0978k7819
1697e597j3921L6718p753l2586K7664J5765l6712O534L2355k6429j5972L6401
1709A6467n863l3140K5884J7470l5910M510L3071k4672j7635L5925l663l3770
1721b1326K3747J9153l4945K237L3535k3500j9194L5292j109l4609K2088K0580
1733B1949l4472O11L3802k0981k1606L4839O43l5206K0075K2771l3807j593L4477
$$ plain form
1649 21456 1606 -24453 11507 16181 -22264 -4291 22722 -11220 -17310 20553 2885 -23990
1661 -23990 10008 16620 -21812 -5856 22855 -10449 -18342 19343 4282 -24502 8523 17316
1673 17316 -20344 -6704 22749 -8544 -18740 19112 5858 -24296 7024 18636 -18995 -7959
1685 -7959 22695 -7300 -19483 18635 7701 -23668 5516 19300 -17666 -8756 22222 -5597
1697 -5597 -19518 17200 9447 -23139 4525 20290 -16422 -9888 22467 -3962 -19934 16467
1709 16467 10604 -22536 3348 20818 -15092 -10582 22489 -2183 -19818 16107 12444 -21326
1721 -21326 2421 21574 -13371 -11134 22401 -1099 -20293 14999 13890 -20719 1369 21949
1733 21949 -12523 -11912 21890 909 -20697 14142 14785 -20421 -346 22425 -11382 -12975 21502
1746B1502j9767k2976L4009K569l5685J8610K3984l2647m228L4618j7208k4824
1758b2043L2888M924l5445J6533K5046l1724n891L5262j6061k5604L0934P121
1770A5940l4779J3929K6502l0550p512L4834j3599k7028K9782R100l4963J1822
1782f522K7139k8087r790L4314j1592k7994K8844J0638l4623R427K8741k6984
1794f489j1497L3917r392k8859K6815J2731l3970P670K9388k6056j3488L4364
1806A5134p408k9443K4684J4857l3955O399L0142k5034j4950L4393n625l0645
1818b1451K3574J6334l3418M085L0884k2997j6648L3883l480l1335K1956J8226
1830A9613l2570J706L1224k1367j8154L2827j549l1728K0174J9961l2011j89L2169
$$ plain form
1746 21502 1735 -21241 12768 15337 -20348 -1738 22246 -10401 -14629 19989 2781 -22043
1758 -22043 10845 15769 -19676 -3143 21903 -9821 -15712 19550 3489 -22115 8819 15940
1770 15940 -18839 -4910 21592 -8958 -16470 18364 4765 -22263 7519 16619 -18344 -6522
1782 -6522 20617 -7470 -17260 17054 5462 -22532 6312 16950 -17673 -8246 20495 -6489
1794 -6489 -17986 15931 6539 -22320 4495 17226 -16744 -9074 20314 -5742 -19230 15134
1806 15134 7726 -21717 2967 17824 -16131 -9732 20410 -4624 -19574 14819 9194 -21451
1818 -21451 2123 18457 -14961 -10876 20008 -2989 -19637 14246 10766 -20569 1387 19613
1830 19613 -12957 -11251 19973 -1394 -19548 13279 11730 -19998 176 20137 -11874 -12063 20106
1843B0106j9610j9712L1466Q55l1896J8280K0639l0737j939L1994j7825k1084
1855a9463L0543L221l2461J6466K1939k9327l956L2008j5917k2849K9816N025
1867A5045l2226J4208K3315k8251o017L1788j3398k3834K8097O990l2343J2391
1879d235K4595k7250p458L1699j1887k5036K6841Q925l2310J0815K5207k6061
1891f155r385L1594r813k6333K5709J0776l1685Q652K5958k5258j0600L2138q627
1904F971k6992K4286J2437l2091P199K6517k3434j2520L1855o566k8204K3341
1916B799J3994l1267N175K7691k2047j4183L0908m566k8690K1986J5228l0838
1928a3810L463K8482k0540j5740L0388k433k8884J9543J6443k8991J282K8593
$$ plain form
1843 20106 496 -19216 12250 13105 -18791 -511 20128 -10609 -12548 19446 1621 -19463
1855 -19463 11080 14301 -18160 -1694 20245 -9082 -13038 18970 3053 -19796 10020 15045
1867 15045 -17181 -2973 20342 -7909 -13926 17862 4464 -19370 8727 15717 -16626 -4235
1879 -4235 20360 -6890 -14348 17351 5464 -19572 7269 16194 -16116 -5301 19906 -6155
1891 -6155 -15540 16054 6241 -20092 5617 16393 -15292 -6640 19318 -5940 -16540 15598 6971
1904 6971 -20021 4265 16702 -15389 -8190 18327 -5107 -17627 14228 7662 -20542 2799
1916 2799 16793 -14474 -9299 18392 -3655 -17838 13070 8504 -20186 1800 17028 -13810
1928 -13810 -10347 18135 -2405 -18145 12243 9810 -19074 469 16912 -12079 -10797 17796
1940A7796j9458j7008K9906k13k9662J7940J8314k8508m66K8621j7027j9034K9258
1953A0459J215k9336J6344J9238k7535k306K9195j5525j9776K7672L033k9545
1965a6867J4802K0679k6812m137K9196j4061k0480K6376N266k9816J2979K1518
1977A8643k5854n673K9615j2314k2095K5419O832k9435J1305K2513k5263o723
1989a3030K9382j0761k3465K4835Q436k9423R345K3219k3833q951K9857r433k4218
2002a8040K4041R874k9354P381K4492k2740j0345K9524p663k5051K2609J0999
2014A5727k8928O177K4999k1489j1781K8570n562k5376K0928J2619k8320M506
2026g930K5181k0063j3394K8355l678k6361J9387J4563k7613K588K5284j8290
$$ plain form
1940 17796 -1662 -18670 11236 11023 -18639 -699 17615 -10893 -11359 17262 235 -18799 10459
1953 10459 11674 -17662 -1318 17920 -9615 -11921 17274 1749 -18027 9645 12678 -16867
1965 -16867 -2065 18614 -8198 -12335 16861 2800 -17680 8696 13962 -15854 -2875 18643
1977 18643 -7211 -12884 16731 4417 -17678 7741 14573 -14862 -3557 18956 -6307 -13030
1989 -13030 16352 5591 -17874 6961 15397 -14026 -4681 18538 -5295 -14246 15611 6178 -18040
2002 -18040 6001 15875 -13479 -6098 18394 -4346 -14691 14833 7170 -17881 4728 15727
2014 15727 -13201 -7024 17975 -3514 -15295 13275 7713 -17663 3265 15884 -12436 -7930
2026 -7930 17251 -2812 -16206 12149 8471 -17890 1497 16060 -11553 -8965 16319 -1971
2038a971j4460K7696k221k6668J7946J5617k7126J303K5809j7161j5549K6984
2050A0199l97k7142J6453J7087k6642j42K6162j5813j7024K6265J505k7544J5564
2063a469J7627k5970j762K7197j4922j8378K5627K859k6509J2970J9060k4832
2075h502l426K7321j3480j9363K5234M429k7439J1548K0276k4017m960K7567j2009
2088C179k0217K3927O290k7834J0799K0920k3027o633K6988r613k1638K2973P877
2101A3991k7569Q905K1951k2209p606K6601q253k2210K1583R201k7103P496K2461
2114A7239k1200r592K7108o350k3084J9858J0807k6366N602K2735j9561j0747
2126a3551K6397n199k3620J8978J2232k5900L716K3429j8511j2005K5810l698
$$ plain form
2038 -1971 -16431 11265 9044 -17624 322 15939 -11187 -9884 15925 -1236 -16785 10199
2050 10199 9802 -17340 -887 16200 -10442 -10584 15578 -235 -17259 9006 10511 -17033 -1469
2063 -1469 16158 -9812 -11574 15623 701 -17677 7950 10809 -15700 -2730 16330 -8502
2075 -8502 -11928 15393 1913 -17450 7784 12213 -15226 -3678 16598 -7419 -12379 15188 3179
2088 3179 -17038 6889 13179 -14655 -3856 17064 -5963 -12596 14392 4779 -16859 6114 13991
2101 13991 -13578 -4673 17278 -4931 -12537 14064 5811 -16399 5184 14385 -12718 -5222 17239
2114 17239 -3961 -13553 13555 7205 -15879 3979 14786 -11580 -5978 16757 -2804 -13551
2126 -13551 12846 7647 -15973 3005 15237 -10663 -6947 16482 -2029 -14034 11776 8078
2138H078k3969J7851J3331k5426K354K3741j6904j3803K5534j540k4928J6539
2150H58J4425k5207J057K4534j6198j4888K5127n4k4856J5034J5178k4232o48
2163i870K5061j5193j5855K4784J070k5601J3929J6631k3700j898K4526j3156
2175G28j6920K3590K986k5488J2329J7560k2906l598K5088j1724j7923K2597M600
2188A0919k5541J1018J8252k1871n051K5323j0353j8878K1512N916k4598Q790
2200d562J9383k0925o552K5446q654k0198K0223Q299k5001P189K0381k0169p870
2213a3010K5011p103k0840K0019Q922k4907O067K0807j8564r199K4625o049k1257
2226a5478J8635J0388k4815M696K1868j7825j0767K4838m268k1999J7218J1518
$$ plain form
2138 8078 -15891 1960 15291 -10135 -7781 15960 -944 -14747 10787 9247 -15681 858
2150 858 15283 -9924 -8867 15667 -531 -15419 9708 9654 -15202 -168 15010 -9222 -9870
2163 -9870 15191 -2 -15857 8927 9997 -15604 -1675 14956 -8744 -10642 13884 728
2175 728 -16192 7398 10384 -15104 -2775 14785 -8121 -11719 13369 1645 -16278 6319 10919
2188 10919 -14622 -3604 14648 -7223 -12274 13049 2696 -16182 5330 11246 -13352 -4562
2200 -4562 14821 -6104 -12656 12790 4136 -16062 4161 12460 -12541 -5352 15029 -5140 -13010
2213 -13010 12001 4898 -15942 4077 12999 -11908 -5841 14966 -3598 -12797 11828 5779 -15478
2226 -15478 3157 13545 -11270 -6574 15294 -2531 -13298 11540 7272 -14727 2491 14009
2238A4009k4030L358K1814j7075j1380K4504k613k2870J6084J2855k3889K329
2250f904K2168j5839j3131K4074j373k3422J5487J3733k3008J75K3031j4970j3639
2263a3618K3085J45k3368J3705J4966k2514j091K3303j3536j5035K1956J681k3121
2276a3442J2423J5258k1496k245K3332j2215j6386K2197K675k3032J0737J6528
2288A4334k0891l994K3318j0397j7171K1018M897k3844R154J7863k0095n246K3278
2301A2224r237j8269K0321O212k3536Q002J8576j9654o195K3150p573j8846J9282
2314D457O868k3149O779J9119j8865p983K3632o260j9734J8227Q657k3500N817
2327e935J9566j7607q758K3546n182k0466J7280J0166k3326M600K0209j7194r940
$$ plain form
2238 14009 -10021 -6663 15151 -1924 -13304 11200 8587 -14283 1801 14656 -9233 -6904
2250 -6904 15264 -575 -13706 10368 8995 -14427 1060 14793 -8215 -8040 14991 21 -13618
2263 -13618 9467 9612 -13756 -51 14915 -7599 -8690 14613 1077 -13958 7998 9679 -13442
2276 -13442 -1019 14239 -7257 -9502 13830 1615 -14771 7426 10101 -12931 -2194 14334
2288 14334 -6557 -10551 12767 2370 -14801 6217 11114 -12730 -3576 14287 -5808 -11054 12224
2301 12224 2987 -15282 5039 11251 -12285 -4283 14293 -5361 -11556 11594 4021 -14825 4457
2314 4457 11325 -11824 -5045 14074 -4791 -12774 10858 4598 -15136 3091 11748 -11752 -5935
2327 -5935 13631 -3976 -12734 10812 5630 -14836 2444 12610 -10716 -6116 14093 -3101 -13041
2340a3041K3383l699k1365J6333J0931k1988K537K0974j5826j0994K2716k006
2352G955k1855J5004J2139k1819J449K0815j4169j2373K1976n58k1465J3118J3688
2365A3905k1815L17K1596j3201j3913K1663P90k1854J2227J3918k0915r99K1710
2378A3429j2119j4828K1227K100k1913J0523J5221k0059k459K1857j0740j5631
2390a3392J9936M027k2609J0005J5932j9311m248K2049r632j6588J9973M704k2678
2403a1832Q961J7002j9620n162K2780q427j7631J9123N715k2360P741J7389j8459
2416d780o442K2645p573j8169J8042P406k1837N907J8100j7825p460K2892o529
2429D377j8901J7379Q369k2235N318J8471j6534q351K2008m858j9181J6100R349
$$ plain form
2340 -13041 10342 6643 -14722 1611 12542 -9446 -6909 14065 -1761 -12755 9961 7955
2352 7955 -13900 1104 13243 -8576 -7127 13688 -481 -12854 9122 8564 -12901 217 13905
2365 13905 -7910 -7593 14003 802 -13111 8552 9342 -12512 -285 13633 -7282 -8281 13429
2378 13429 1310 -13518 7709 9809 -12104 -1581 13640 -6419 -8878 12979 2239 -13392
2390 -13392 6544 10571 -12038 -2033 13899 -5412 -9660 12389 2757 -13831 6142 10846 -11832
2403 -11832 -2871 14131 -5489 -10651 12129 3702 -13929 5194 10909 -11451 -3710 13679 -4780
2416 -4780 -11222 11423 3850 -14319 3723 11129 -10708 -4801 13299 -4526 -11986 10906 4377
2429 4377 -14524 2855 11224 -11011 -5693 12778 -3756 -12107 9901 5043 -14138 1962 11311
2442A1311k1573M018J9106j5760r546K1683l134k0158J5568J0035k1399K948J9908
2455A3007j4992j1069K1756j985k0409J4020J1656k0954J502K0157j3626j2189
2467a3126K1375r67k0434J2970J2805k0557L1K0516j2659j2945K0454P68k0959
2480a2728J1909J3427j9666j425K0980j1459j3872J9954J718k1419J1498J4428
2492A3345j9971j917K1334j0529j4939J9248L162k1447J0031J5147j9261l086
2504h883K1738j0032j5766J9017M497k1625R069J5457j8456m648K1909q564j6716
2517a3003J8288N551k1492P518J6578j7793n557K1335p183j7091J7408O764k1552
2530a0229O426J7047j6986o927K1299n687j7934J6339P913k1070M787J8329j6463
$$ plain form
2442 11311 -10262 -6244 12862 -2898 -12444 9239 6105 -14053 1515 11550 -9849 -6901 13007
2455 13007 -1985 -13054 8702 6717 -13692 328 11984 -8970 -7468 12689 -937 -13126
2467 -13126 8249 7282 -13152 -182 12623 -7934 -7903 12613 -46 -12991 7463 8231 -12728
2480 -12728 -819 12608 -7058 -8483 12497 1038 -12834 7120 8838 -12581 -1083 13345
2492 13345 -6626 -8543 12791 2262 -12677 6571 9733 -11714 -1683 13464 -5797 -8883
2504 -8883 12855 2823 -12943 6074 10571 -11054 -1985 13472 -4984 -9632 12277 3713 -13003
2517 -13003 5285 10836 -10656 -3138 13440 -4353 -9910 11425 4242 -12849 4559 11323 -10229
2530 -10229 -3803 13244 -3742 -10669 10630 4943 -12991 3348 11261 -9809 -5022 13307 -3156
2543c156q203K1420m613j8485J5301R105k1003L794J8576j5150r487K1159l021
2556F237j9222J4442R891k0500K572J8848j4191j0468K0409j578j9196J3238J1072
2569A1554k0453J426J9222j3201j1311J9866P3k0187J2780J2146k0219L64K0211
2582A2271j2540j2619J9888Q01k0244J1657J2687j9360j350K0558j1221j3431
2594a2903J9179K140k0384J0317J3841j9076j925K0758j0196j4789J9196L113
2606I271k0783R493J4701j8244l333K0541q879j5530J8238M217k0397Q152J5507
2619A2954j7951m518K0993q032j5978J7272N550k0496P073J6383j7233n759K0385
2632A0643o173j6957J6569O769k0364N874J6886j6406o600K0308n373j7735J6033
$$ plain form
2543 -3156 -11359 10061 5448 -13037 2264 11369 -9634 -5840 12736 -2414 -11901 9258 6237
2556 6237 -12985 1457 11348 -9152 -6580 12268 -1923 -12391 8018 6440 -12756 482 11554
2569 11554 -8899 -7473 11749 -1452 -12763 7103 7176 -13011 -231 11915 -8304 -7940 12271
2582 12271 -269 -12888 7000 7801 -12443 -786 11901 -7459 -8809 11749 528 -12903
2594 -12903 6276 8416 -11968 -1651 12190 -6886 -8811 11947 1751 -13038 6158 9271
2606 9271 -11512 -2019 12682 -5562 -8895 11646 2767 -12763 5475 9692 -10705 -2553 12954
2619 12954 -4997 -9515 11478 3446 -12532 4740 10290 -10206 -3133 13250 -3983 -9742 10643
2632 10643 4470 -12487 4082 10851 -9513 -3639 13247 -3159 -9759 10549 5176 -12559 3474
2645C474Q003k0454M358J7763j5433q307K0389l984j7938J5037Q861k0426L548
2658e109J7930j4768r078K0226k886j8636J4155R525j9797K410J8719j3627j0492
2671a1428J9699j775j8705J2836J0742j9430J458J8761j2846j1602J9862o73j9246
2684a2347J2259J1518j9158N85J9007j1955j2815J9878L63j9818J1455J2651j8836
2697g213j160J9542j0844j2691J8456J814j9724J0160J3449j8256k657K0113r664
2710A325j4143J8086L072j9443Q619J4323j7572l515J9736q128j5094J7453M384
2723I103j9989Q041J4901j7156m445J9999p556j5391J6701N530j9947O958J5606
2736A2355j6803n529K0408o610j6516J6563O365j9932O054J6255j6152o689K0400
$$ plain form
2645 3474 11477 -8977 -4619 13144 -2289 -10596 9793 5809 -12129 2908 11769 -8657 -5109
2658 -5109 12821 -1947 -11025 9201 6315 -12321 1834 11359 -8438 -6028 12691 -936 -11428
2671 -11428 8271 6496 -12209 627 11369 -8061 -6603 12158 -688 -12290 7572 6899 -12347
2684 -12347 -88 11430 -7728 -7143 11864 -91 -12906 6972 7335 -12483 -1028 11623 -7213
2697 -7213 -8373 11169 325 -12366 6090 7904 -11820 -1660 11789 -6467 -9124 10989 1325
2710 1325 -12818 5268 8340 -11103 -2484 11839 -5733 -9248 10488 2360 -12734 4719 9103
2723 9103 -10886 -2845 12056 -5100 -9545 10454 2898 -12493 4208 9738 -10209 -3251 12355
2736 12355 -4448 -9977 10431 3821 -12695 3868 10233 -9699 -3645 12610 -3542 -10231 10169
2749A0169n321j6827J5274P483j9839M665J7296j5486p944K0211m413j6948J4286
2762B606Q311j9311L376J7776j4281r070J9887k986j8070J3778R265j9009K108
2775e620J8136j3581r647J9187j291j8555J2682J0243j8864R30J8779j2759j1176
2788a1536J9368q30j8692J1649J1623j8813L65J8649j1493j1894J8322Q74j8908
2801a1316J0462J2411j8292r85J9036j0592j3075J8080K089j8943R650J3133j8198
2814f540k072J9228r319j3702J7496L004j9123Q691J3805j7139l565J9513q208
2827B069j4571J7026M016j9342P582J4595j6233m838J9318p018j5010J6198N109
2840H901j9486P055J5091j5871n788J9732o308j5596J5727N465j8726N537J5940
$$ plain form
2749 10169 4848 -11979 3295 10778 -9061 -4396 12900 -2586 -10530 9681 5268 -11680 2606
2762 2606 10917 -8394 -5018 12758 -1523 -10593 9294 6308 -11762 2016 11281 -7728 -5620
2775 -5620 12516 -1065 -10712 8475 7184 -11371 1311 11554 -7310 -6380 12399 -360 -11536
2788 -11536 7832 7002 -11690 -41 11582 -7231 -6866 11783 290 -11604 6718 7592 -11316
2801 -11316 -854 11557 -6735 -7720 11316 724 -12351 5729 7818 -11125 -1475 11658 -6540
2814 -6540 -8612 10616 1297 -12405 5091 8095 -11028 -2337 11468 -5671 -9236 10277 2069
2827 2069 -12502 4524 8540 -10802 -3220 11375 -4858 -9696 9622 2604 -12406 3792 8901
2840 8901 -10585 -3530 11561 -4310 -10098 9634 3326 -12270 3457 8922 -9804 -4267 11673
2853A1673j5347o753J9830n601j6209J5119P277j9358M597J6563j4356p856J9169
2866H748l749j6844J4213P931j8787L326J7144j3789q668J8974k524j7194J2701
2879A482R515j8750K231J7355j2640j0041J8886j421j7579J1912J0246j8451J493
2892e762J7779j1939j1319J8876k76j8357J1268J1089j7949j94J8496j0949j1991
2905a1228J8354P62j8688J0639J1865j7608j670J8857j0106j2588J7612J735j8271
2918a0335R091J2899j7173k446J8772r309j3147J7181L127j8914Q305J3762j6959
2931e146l360J9055p886j4449J6434L984j8555P137J4483j6144m668J9115p098
2944B902j4805J5490N247j8743O229J5064j5366n718J9072n858j5648J4912O434
$$ plain form
2853 11673 -3674 -10427 9403 3802 -12407 2712 9989 -9369 -4772 11791 -2565 -10421 8748
2866 8748 4999 -11845 2368 10299 -8488 -5162 11982 -1807 -10475 8499 5975 -11219 1482
2879 1482 10997 -7753 -5522 11833 -807 -10848 8038 6617 -10962 950 11196 -7255 -5762
2892 -5762 12017 78 -11241 7635 7359 -10998 270 11359 -6590 -6784 11712 763 -11228
2905 -11228 7126 7888 -10800 -161 11704 -5904 -7574 11283 1177 -11411 6201 7936 -10335
2918 -10335 -1244 11655 -5518 -7964 10808 1499 -11648 5533 8660 -10254 -1949 11813 -5146
2931 -5146 -8506 10549 2663 -11786 4648 8632 -9923 -2786 11697 -4447 -9115 10000 2902
2944 2902 -11903 3587 8834 -9909 -3680 11384 -3982 -9700 9372 3514 -12134 2778 9212
2957I212j8601M735J6101j4815o830J8724m662j5717J4003O887j7981M253J5800
2970A1109j3791p686J8323l128j6529J3299Q116j8011K829J6390j2771q606J8252
2983G796k398j6553J2522Q960j8069K132J7044j2633r206J7934j562j7136J1808
2996F39J0225j7871R30J7146j1381j0283J7684k15j7604J1084J0919j7375n38
3009f640J7514j0372j1302J7304R19j7654J0012J1430j6779j882J8171r237j2349
3022a0865J6889J649j7516R166J1722j5918k624J8272q636j3124J6412L466j8346
3035i453P735J3366j6036l553J8028o976j4087J5517M242j8227P064J3862j5292
3048c810m678J8088o061j4748J5080N503j7952N401J4087j4340n967J8473n519
$$ plain form
2957 9212 -9389 -4654 11447 -3368 -10198 8526 3864 -11853 2150 9037 -8944 -4691 11109
2970 11109 -2682 -10368 7955 4827 -11702 1597 9713 -8298 -5469 10921 -1850 -10456 7796
2983 7796 5398 -11155 1367 10327 -7742 -5610 11434 -1199 -10405 7529 5967 -11169 639
2996 639 10864 -7007 -6077 11069 -312 -10595 7089 6874 -10730 354 11273 -6102 -6640
3009 -6640 10874 502 -10800 6504 7423 -10231 -219 11211 -5568 -7450 10721 1484 -10865
3022 -10865 6024 7673 -9843 -677 11045 -4873 -7497 10775 2139 -10985 5427 8893 -9453
3035 -9453 -1718 11648 -4388 -7941 10087 3111 -10976 4541 8783 -9444 -2380 11482 -3810
3048 -3810 -8488 9600 3539 -11209 3871 9374 -8578 -3177 10910 -3430 -9397 9076 3557
3061C557j4681J4088O002j7436M223J5080j3860o480J7814m266j5276J3191P212
3074I168j7595L729J5344j2965p589J7471k764j5849J2699P901j7644K958J5561
3087A0425j2345q692J7526j618j6502J1899Q782j7172J803J6408j1494r640J7184
3100F564q98j6426J0631J0045j6977O63J6380j0312j0429J6696O41j7158J0265
3113c15J0580j6636m12J6917r699j1191J6303J286j6810R253J0993j5769j541
3126g041J7078q881j1812J5848K251j6811P970J2240j5790k658J7430p647j2709
3139a0532J5275L376j7140P065J2488j4536l692J7084o560j3262J4773L927j6974
3152h708O324J3363j4223n040J7217n652j3345J3775M913j6847N239J3956j4003
$$ plain form
3061 3557 -11124 2964 8966 -8470 -4247 10833 -3027 -9507 8307 4041 -11235 1956 9168
3074 9168 -8427 -4698 10646 -2319 -9908 7563 4799 -11050 1649 9550 -8094 -5136 10425
3087 10425 -1920 -10612 6914 5296 -11206 693 9475 -7697 -5894 10514 -980 -10620 6564
3100 6564 5666 -10760 -129 9916 -7061 -6398 9982 -330 -10759 5937 6578 -10580 -315
3113 -315 10265 -6371 -6783 10134 435 -10756 5547 6833 -9977 -724 10269 -5500 -7041
3126 -7041 10037 1156 -10656 5192 7443 -9368 -1398 10842 -4948 -7606 9824 2177 -10532
3139 -10532 4743 8119 -9021 -1956 10532 -4004 -7696 9388 2828 -10434 4339 8266 -8708
3152 -8708 -2384 10979 -3244 -8284 8933 3281 -10064 3711 8624 -8223 -2984 10972 -3031
3165c031n423J7154m703j4177J2970O427j7047M257J4239j2779o535J6915l897
3178D370j4494J2440O862j6834L596J4708j2631p363J7121k886j5037J1703P590
3191I145j6590K298J5283j1438q520J6571j447j5468J0854Q663j5813P03J5638
3204I879j0734r001J5883p95j5256J0201R233j5990L78J5645r897r750J5765J78
3218E739j5736R326R990j5374m69J5826r029j0508J5143J257j5777Q460J0820
3231I668j5188j526J6038p883j1465J4637K727j5825O979J1542j4348k504J5641
3244H493o689j1765J4092L245j6290P122J1554j3965l419J6019o172j2404J3637
3257C458M572j6069N461J2489j3372m705J6567n171j2721J2364N225j5992M982
$$ plain form
3165 -3031 -8454 8700 3997 -10180 2790 9217 -7830 -3573 10666 -2113 -8648 8267 4370
3178 4370 -10124 2316 9178 -7656 -4060 10648 -1983 -9346 7775 4889 -10148 1555 9145
3191 9145 -7445 -5147 10136 -1302 -9822 6749 5302 -10166 688 9351 -6462 -5759 9879
3204 9879 -855 -9856 6027 5232 -10024 177 9410 -6580 -6202 9443 -454 -10204 5561 5739
3218 5739 -9997 -671 9319 -6055 -6524 9302 273 -10235 4908 6165 -9612 -1152 9668
3231 9668 -5520 -7046 8992 1109 -10356 4281 7008 -8817 -1838 9704 -4644 -7148 8493
3244 8493 1804 -9961 4131 7376 -8914 -1792 9762 -4203 -7622 8397 2225 -10179 3458
3257 3458 8030 -8039 -2578 9911 -3461 -8166 8401 3230 -9491 2873 8098 -7894 -2912
3270b912J3167j2591n614J6144m584j3325J2711N457j5656L885J3707j2194o367
3283h172J5896l253j3803J1822O290j5663L023J4334j1930p068J5963k736j3910
3296i207J1088P386j5838J850J4769j1036p755J5156j154j4538J0214Q208j5427
3309f284J407J4569r896q814J5167m68j4826R287Q898j4698m8J4827r122r443
3323i444J4982M77j5055Q304R895j4552p09J4812q311r960J4046J586j4677P401
3337a205J0221j4124j514J5292p726j0585J3826K094j4984O981J0654j3479k644
3350g193J5437o623j1346J3040L449j4898O152J1039j3028l621J5306n221j2211
3363i718J2904L923j5077N468J1624j2145m450J4688m431j2290J1834N137j4872
$$ plain form
3270 -2912 10255 -2336 -7950 8194 3610 -9715 2996 8453 -7203 -3318 10389 -1805 -8172
3283 -8172 7724 4471 -9332 2490 8780 -6883 -3860 10474 -1456 -8524 7439 4703 -9207
3296 -9207 1881 9267 -6571 -4721 10048 -988 -8743 6413 5259 -9279 935 9143 -6284
3309 -6284 -4877 9692 -204 -9018 6149 5681 -9145 142 9040 -5658 -5706 9121 -1 -9444
3323 -9444 5538 6015 -9040 -736 9159 -5393 -6102 8710 399 -9561 4485 6071 -8606 -1205
3337 -1205 9016 -5108 -6622 8670 944 -9641 4185 6279 -8705 -1724 8930 -4549 -7193
3350 -7193 8244 1621 -9725 3315 6764 -8134 -1982 9057 -3971 -7592 7714 2493 -9718
3363 -9718 3186 7109 -7968 -2500 9124 -3021 -7471 7217 2786 -9504 2330 7467 -7405
3376g405M301J2118j1585n441J5073l436j2809J1204O075j4736L149J2995j1251
3389a748o385J4976k592j3234J0417O830j4582K515J3059j0263p169J4979k187
3402D616j3402R937P533j4329J069J3705r445p904J4505j080j3555Q851Q275j4188
3416e412M96J4003q867q368J3871l80j3653Q396Q970j4064J11J3559p808r230
3430h376J3629O20j3938P572R208j3465r63J3959p411r489J3172J550j3889O943
3444h78R514j2773j878J4076o562j0421J2717K354j3849O168J0128j2314k913
3457f631J4198n822j0665J2151K961j3675N263J0738j1991l520J4226n151j0915
3470h833J1202M069j3960M937J0922j1125m683J4085l933j1537J0907M918j3754
$$ plain form
3376 -7405 -3104 9014 -2571 -8012 7061 3625 -9184 2020 8095 -6641 -3492 9503 -1748
3389 -1748 -8133 6843 4251 -8983 1434 8264 -6318 -3803 9256 -1007 -8176 6803 4616
3402 4616 -8786 1151 8684 -5645 -4576 9129 -316 -8220 6285 5205 -8350 501 8776 -5412
3416 -5412 -4916 9087 220 -8148 5723 5343 -8310 86 9056 -5008 -4897 8662 854 -8376
3430 -8376 5253 5873 -8065 -493 8715 -4750 -5713 8246 835 -8654 4518 6068 -7821 -878
3444 -878 8636 -4137 -6015 8061 1499 -8922 3795 6149 -7700 -1532 8596 -3718 -6631
3457 -6631 7567 1745 -8920 3231 6192 -7483 -2220 8518 -3473 -6993 7233 2082 -8833
3470 -8833 2369 6438 -7522 -2585 8337 -2788 -7471 6614 2681 -8856 2051 6969 -6785
3483f785L186J2105j1014n298J4200l093j2101J0097N544j3603L109J1854j0107
3496a906o029J3741k385j1748R298O398j3503K328J2238r783o885J3849j429j2340
3510h156Q950O996j3460J532J2607r301p328J3520m31j2828Q426P417j3107N96
3524d567J2910q383p966J3219l3j3005Q065P955j2918j99J2978p342q631J2366
3538D449J085j2883P071Q802j2863p86J3073o387r543J1824J840j2567O171R480
3552H766j2522j970J3367n776r653J1669K314j3014N580R835j1975k652J3433
3565G402n518j0291J1437L489j3200M553R984j0861l613J3417m309j0647J0613
3578B456L722j2815M215J0242j0194m766J3515l453j1014J0021M716j3093L464
$$ plain form
3483 -6785 -3599 8506 -2508 -7806 6394 3301 -8800 1297 6841 -6762 -3653 8201 -1906
3496 -1906 -7935 5806 3421 -8327 971 7369 -6134 -3806 8432 -1351 -8236 5613 4184 -8156
3510 -8156 794 7790 -5670 -4138 8469 -832 -8160 5360 4929 -7899 527 7944 -5163 -4567
3524 -4567 8343 -40 -8006 5213 5180 -7825 240 8195 -4723 -4922 8056 714 -7917 4449
3538 4449 5534 -7349 -278 8524 -4339 -5125 7948 1561 -7982 3842 5682 -6885 -714 8766
3552 8766 -3756 -5726 7641 1865 -7788 3881 6195 -6819 -1239 8596 -3379 -6031 7402
3565 7402 1884 -8407 3030 6519 -6681 -2128 7856 -3005 -6618 6799 2490 -8157 2456
3578 2456 6178 -6637 -2422 7820 -2374 -7140 6375 2922 -8092 1929 6645 -6448 -2984
3591b984J0736r973m944J3114k793j1517R808M910j2558K439J1489r368n686J2655
3605E328j827j1432Q984N725j2602J725J1777r165o058J2709j482j1666Q406O641
3619G063j2429R38J1955q279p107J2701o50j1941P882O925j1840O8J2205q052
3633e61p057J1907Q2j1997P438Q026j2220n52J2275o775q377J1844R75j2157O393
3648g56Q536j1842q67J2266o397p985J0662J887j2300N813R133j1340k129J2315
3662F996n141r174J0849K602j2807N476R394j0850k779J2204m745r437J0510K864
3676E962j2044M802R305j0521l345J2217l847j0182J0189L722j2286M051R773
3689G796r770m519J2889l273j0536R443M366j2144L038J0623r605m547J2035k599
$$ plain form
3591 -2984 7752 -2221 -7165 5949 3156 -8361 1447 6357 -6201 -3762 7727 -1641 -7327 5328
3605 5328 3501 -7931 1053 6778 -5824 -4099 7678 -1487 -7545 5164 3682 -7984 422 7063
3619 7063 -5366 -4428 7527 -752 -7859 4842 4192 -7749 133 7058 -4782 -4714 7491 -561
3633 -561 -7618 4289 4371 -7626 -188 7838 -4382 -4934 7341 566 -7811 4033 5008 -7149 -756
3648 -756 7780 -4062 -4929 7337 940 -7045 3617 5504 -6796 -983 8150 -3190 -5319 6996
3662 6996 1855 -7319 3530 6132 -6675 -1199 8195 -2655 -5434 6770 2025 -7412 3098 5962
3676 5962 -6082 -1280 8025 -2496 -5841 6376 2529 -7653 2536 6258 -6028 -1977 7796
3689 7796 -1974 -6493 6396 3123 -7413 2030 6396 -5748 -2710 7913 -1692 -6239 5796 3197
3703C197j0785R148N204j2209K228J0862r075n401J2201j837j1163Q564O071j2410
3717e405J606J0983q075o403J1990r72j1190P996O421j2060R71J1293p755o735
3731g335J1443J72j1475P315O800j1371n68J2058p259p190J1177K10j0979O158
3745h44P702j1452l92J1306n798p993J0785J354j1662O074Q243j1336j347J1956
3759F596n758q432J0661K162j2040N433Q556j0304k366J1865m794q749J0446K097
3773E373j1774M748Q944r874l093J2243m564r308R703L278j1480M046R191r294
3787a861m035J2272l733r468R211L678j1655L389R980r591l950J1388k750r819
3801f944R117M085j1616K893J0040q525n207J1620k216j0040P999N381j1461J947
$$ plain form
3703 3197 -7588 1560 6764 -5445 -3217 7645 -1430 -6831 5370 3533 -7630 934 7005 -5405
3717 -5405 -3799 7184 -891 -7294 4696 3724 -7466 530 6951 -5109 -4138 7155 -600 -7335
3731 -7335 4108 4280 -7195 120 6920 -4451 -5019 7039 -220 -7410 3767 3977 -7002 -844
3745 -844 6858 -4594 -4986 6320 522 -7471 3314 4668 -6994 -920 7323 -4013 -5360 6596
3759 6596 838 -7594 3067 5229 -6811 -1378 7178 -3126 -5492 6373 1579 -7170 3276 5373
3773 5373 -6401 -1653 7291 -2583 -5676 6567 2003 -7305 2398 5676 -5804 -1758 7433 -1861
3787 -1861 -5896 6376 2643 -6825 2386 6064 -5591 -2202 7778 -1813 -5763 5625 2875 -6944
3801 -6944 2173 6258 -5358 -2465 7575 -950 -6157 5463 3247 -6793 1206 6587 -4874 -2927
3815b927J0454q158n460J1297j684j0300P684N941j1604J151J0992p746o162J1116
3829D594n69j0954P185O504j1307N75J0641o773o808J1120k54j0559O741O459
3843F595j1079Q6J1297o774p279J0771N99j1116O298P127j0697n55J1097o069
3857C01p234J0277R81j0980N654P702j0452j574J1378m899q075R827J974j1535
3871f655N187Q405j0336j863J1155m735q240R534K889j1764M479Q776r429k847
3885e444J1317l868q895R042L180j1276L639R064q992l414J0961k982r392Q818
3899A758M020j1290K909R590q722m462J1639k363r561Q194M129j1118K483R923
3913G129q338m782J1250j850j0299Q139M879j0612J386R966p434n419J0765j299
$$ plain form
3815 -2927 7527 -631 -6091 5206 3522 -6778 906 6847 -4757 -3606 7386 -360 -6522 4594
3829 4594 4025 -6929 256 6760 -4547 -3972 6669 -104 -6912 4208 3954 -6605 136 6595
3843 6595 -4484 -4398 6899 125 -7154 3617 4216 -6900 -602 6525 -4172 -4727 6370 301
3857 301 -6933 3344 4325 -6655 -1001 6701 -3751 -5325 6053 1154 -6921 2906 4880 -6655
3871 -6655 -1468 6937 -3399 -5262 5893 1158 -7082 2452 5341 -6423 -1944 6832 -2597 -5444
3885 -5444 5873 2005 -6890 2152 5332 -5944 -2305 6759 -2233 -5647 5314 2332 -7060 1758
3899 1758 5778 -5512 -2603 6987 -1735 -6197 5442 3079 -6482 1712 5841 -5277 -2794 7129
3913 7129 -1209 -5991 5259 3409 -6890 1249 6128 -4484 -3098 6868 -566 -5985 4780 3481
3927C481j0167P388N867j1019J033J0077o756o079J0653o18j0216O757O310j0710
3941c999L50J0159o550o001J0488l54j0183O435O485j0643m1J0643o320p137J0400
3956C732P29j0887N762P346r889j318J0771n434p540J0014J341j0563M798P811
3970F673r803k054J0950m629p489R021K282j0811M520P901r263k609J1064m341
3984A412q172R114K605j0635L796Q271r146k658J1090m135q482Q718L376j0874
3998e720L495Q536q761l314J0737l014q766Q341M088j0956K711Q797q044l876
4012e746J0493k509q943P998M327j0716K224R695q090m882J0948j974r440P690
4026A075M890j0465J327R978p315n185J0284j164r844P065N675j0408N92J0027
$$ plain form
3927 3481 -6686 702 6569 -4450 -3417 6660 -96 -6175 4478 3860 -6356 401 6711 -3999
3941 -3999 -3649 6510 -40 -6041 4447 4093 -6090 345 6830 -3813 -3854 6789 469 -6668 3732
3956 3732 4461 -6426 -664 6682 -3207 -4525 6246 812 -6728 3286 4627 -5936 -1138 6673
3970 6673 -3130 -5184 5766 1137 -6352 2669 4951 -5860 -1340 6561 -2702 -5311 5753 1412
3984 1412 -6760 2354 4959 -5676 -1880 6391 -2755 -5413 5677 1542 -6940 1778 5154 -5720
3998 -5720 -2225 6311 -2450 -5764 4973 1959 -6807 1534 5622 -5334 -2623 6174 -1870 -5746
4012 -5746 4747 2238 -6705 1293 5620 -5096 -2872 6823 -1267 -6149 4799 2825 -6615 1075
4026 1075 5965 -4500 -3173 6805 -510 -5695 4589 3425 -6419 646 6321 -4087 -3495 6532
4040F532p000n694J0595o03j0241O587O129j0429M93J0265o439o380J0163N39
4054D517j0167N304O963j0120k57J0162n643o758R619Q14j0268N462P351j0122
4068c143j368J0687n172p231R502J329j0081M769P544r440j973J0486m523p769
4082f383R108K301j0765M659P508r029k236J0506m010q171Q750K707j0620L821
4096a854Q125q554l009J0802l696q329Q487K914j0274L041Q697q689l287J0673
4110E047k958q717Q206L512j0072K514Q859q062m250J0578k280r081P765M530
4124E591j0574J755R661p697m653J0198j729r008P241M748j0206J166R860o962
4138f09n528J0273r47r684O851N746j0052K48R742o062o505J0508k33j0026O237
$$ plain form
4040 6532 -468 -6162 4433 3830 -6411 176 6305 -4124 -3631 6634 195 -6185 3978 4517
4054 4517 -5650 -346 6617 -3503 -3760 6402 759 -5999 3620 4434 -5834 -372 6979 -3143
4068 -3143 -4511 6176 1004 -6227 3275 4604 -5477 -708 6836 -2604 -4577 5909 1386 -6383
4082 -6383 2725 5026 -5739 -1080 6428 -2601 -4837 5669 1659 -6512 2238 4945 -5675 -1854
4096 -1854 6271 -2283 -5292 5510 1814 -6515 1972 4886 -5388 -2347 6350 -2339 -5626 5047
4110 5047 2089 -6628 1578 5090 -4982 -2468 6391 -1671 -5921 4657 2377 -6704 1061 5591
4124 5591 -4983 -3228 6433 -1264 -5917 4281 2552 -6456 785 5533 -4673 -3507 6353 -609
4138 -609 -6137 4136 3189 -6495 356 6102 -3950 -3702 6040 -22 -6527 3981 3748 -6278 -41
4153d1O184j0003PJ0284o397o160R730M66r919N374O695r721p14J0315n367o744
4169f011R276R44r792M793P374r298j558J0426m957p368R251J601j0020M707P305
4184F673r188j927J0338m294p655R098K126j0594M274P679q677k578J0715m213
4198A777p962Q610K673j0118L363Q030q257l100J0446l110q545Q101L264j0264
4212e092K948Q518q277l175J0013k399q868Q034L811j0029K079Q595p434m296
4226e572J0194j930q877P393M122r915J425R401p741m327J0196j567r066O765
4240E01M950r823J071R201o794n067R992p07r413O522N356j0093O70R355o132
4255d11n651R664j89r570N885O124r788J02R584n591o699R851M59r872N629O694
$$ plain form
4153 -41 6143 -3860 -3853 6431 34 -6126 3604 4070 -5849 -475 6220 -3501 -4215 6100 733 -6011
4169 -6011 3265 4209 -5583 -790 6584 -2714 -4272 6154 1197 -6171 3080 4681 -5339 -632 6673
4184 6673 -2515 -4442 5896 1602 -6053 3045 5171 -5423 -1149 6530 -2147 -4725 5990 1777
4198 1777 -6185 2425 5098 -5020 -1657 6373 -1884 -4984 5462 2352 -6193 1908 5172 -5092
4212 -5092 -2144 6374 -1903 -5078 4935 2536 -6332 1702 5513 -4516 -2437 6158 -1276 -5572
4226 -5572 4622 2692 -6185 1208 5330 -4585 -3160 6241 -1500 -5827 4369 2802 -6264 501
4240 501 5451 -4372 -3301 5900 -894 -5961 4031 3324 -6089 433 5789 -4304 -3634 5721 -411
4255 -411 -6062 3602 3413 -6157 -272 5852 -3936 -3834 5750 159 -6540 3311 3770 -6102 -473 6221
4271F221r748p73J0005n584o435R398J108j0084N089O828r323j096R901m287p296
4286f076R013J400r740M380P291r157j793J0076l967p202Q496K221j0298M251
4300a105P390q466k444R945l637p793Q229K962r906L211Q149q241l232J0256l116
4315B202q533Q313L330j0067K621Q533q023l448R894k585q158P550L959j0180
4329d592K527Q454p704m025R821j466r290P373M507r869J516R098p269m453R520
4344D148q81r317O980M630r936J102R228o475n236R710n27r278O403N033r752
4359d168Q15R310o175n741R747l59r284N853N739r572K4R171n165o784R848K41
4375C500r385N258O070q864r25R812n109o566Q992J215r859N098O571q957j309
$$ plain form
4271 6221 -3527 -4300 5705 121 -6314 3084 4192 -5892 -803 6025 -3298 -4394 5507 1220 -6076
4286 -6076 2937 4337 -5403 -1023 6268 -2889 -4682 5394 1427 -5775 2721 4942 -5356 -1105
4300 -1105 6285 -2181 -4625 5320 1683 -6110 2119 5081 -4825 -1614 6535 -1706 -4938 5318 2202
4315 2202 -6331 1982 5312 -4755 -2134 6399 -1624 -5072 4822 2237 -5921 1629 5588 -4592
4329 -4592 -2065 6389 -1315 -5340 4481 3015 -6275 1098 5605 -4264 -2748 6350 -919 -5372 4148
4344 4148 3267 -6050 930 5560 -4376 -3274 5954 -521 -5757 3953 3426 -5852 551 5584 -4168
4359 -4168 -3353 5957 -218 -5959 3788 3429 -5855 -2 5737 -3835 -3811 5360 195 -6589 3259 3500
4375 3500 -5885 -627 5443 -3421 -4346 5466 357 -6209 2783 3998 -5861 -763 5808 -3149 -4458
4390d458R725m690o694Q593J556r711M510P220q879j844R672l876p116Q252K273
4405D533r959M125P653q682k526R673l170p667Q051K770r667L063P780p818l015
4420d856R680k946p590P326L531r743K320Q396p532l480R397k018q487P503L564
4435E065r688K316Q548p357l987R632k039q345P296M196r722J783Q547o898n032
4450e685R869q79q949O780M481r396R23Q998o558m653R038n32r091O104N214r055
4466c391j00R680o206n714R517l59r050N491O098r033o94R244n317n947Q880N52
4482C651r285N139O135q858m41Q934m996o084Q672R72r369M447O783q608j424
4497d332R411m200o756Q259J567r369L979O960q105j940R333l724o806P647K376
$$ plain form
4390 -4458 5267 577 -6117 2476 4032 -5679 -1169 6051 -2828 -4672 5000 1124 -5992 2260 4533
4405 4533 -5426 -1301 6352 -2330 -4856 4817 1647 -6020 2031 4801 -4866 -1803 5977 -1841 -4856
4420 -4856 4824 1878 -5712 1614 5145 -4598 -2278 6118 -1414 -4894 4503 2485 -6002 1501 5065
4435 5065 -4623 -2307 6241 -1116 -5103 4529 2490 -5855 1441 5637 -4085 -2302 6245 -653 -5685
4450 -5685 4184 3305 -5644 1136 5617 -3779 -2856 6142 -416 -5069 3969 3437 -5654 450 5664 -3391
4466 -3391 -3491 6189 -17 -5731 3786 3427 -5623 -132 5966 -3067 -3761 5483 166 -5781 3099 3651
4482 3651 -5634 -495 5640 -3218 -3659 5275 279 -5805 2867 3839 -5530 -1083 5700 -2908 -4332
4497 -4332 5079 879 -5877 2382 3949 -5420 -1441 5519 -2586 -4526 4807 1083 -5723 1924 4300
4512D300r505L420P291p913k443J0041l908p345P989K424r612L131Q178q023l430
4527e405J0031k942p887P929K853r392K686P965p347l638R685k565p726P078L559
4542D884r224J907Q376o830m108R161j481q337O784L933r026J567Q294o684l934
4557d718Q551j105q280O367M720r210P20Q616o010n032R448o67q805O005M660
4572E260q725K81R023n522n552Q856r5q895N710N294r077j29R331n241n781Q525
4588C263L17q530M794N946q598m39Q381m399o045Q368Q62q866M666O054q223j401
4604c850Q832l981o337P727J746r299M467O436q080j732Q868l808o507P661K103
4619D246r495M112O812p571k493Q981l224o763P009K749r216L306O830p404k512
$$ plain form
4512 4300 -5205 -1785 5506 -2407 -4850 5191 1283 -6062 1927 4351 -5261 -2130 6048 -1975 -5405
4527 -5405 4626 1684 -6203 1726 4579 -4813 -2127 5838 -1509 -5147 4538 1973 -5753 1325 4884
4542 4884 -4340 -2433 5943 -887 -4995 4166 2685 -5652 1132 5065 -3961 -2394 5900 -784 -4718
4557 -4718 3833 2728 -5552 815 5535 -3675 -2955 5661 -349 -5381 4067 3400 -5405 600 5260
4572 5260 -3465 -3184 5839 317 -5235 3621 3526 -5369 341 5635 -3442 -3571 5760 519 -5262 3263
4588 3263 3580 -4950 -156 5790 -2808 -3247 5134 735 -5310 3058 3920 -4946 -280 5774 -2449 -3850
4604 -3850 4982 1001 -5336 2391 4137 -5162 -695 5741 -2339 -4071 4797 989 -5518 2143 4246
4619 4246 -5249 -1137 5675 -1896 -4389 4592 1368 -5395 1614 4363 -4853 -1547 5283 -2121 -4633
4634d633R049k566p404P062L106r342K376P815o940l585R014k118p271O607L527
4649D697r245J903P561n879l896Q919j912p787O541L815r003J439Q087o093m477
4664e330Q874j060p832N785M406q412N20Q103n399m972Q749m79q088N496M735
4679E096q209PQ166n220m805Q375j78q474N159N577q535j82Q455m842n270P864
4695B984R47q634M381N881q016j155Q673m418n989Q246Q19q528M290N976p726
4710b269j131Q159l275o859P841J640q794L854O661q042j719Q750l396o727P606
4725B299J811q728L339O699p304k101Q448k975o631O893K682q894K808O739o656
4740a571k904Q657k471o972O497K924q429K163P017n881l522Q364j903p272O125
$$ plain form
4634 -4633 4416 1850 -5554 1508 4614 -4728 -2352 5463 -1477 -5062 3952 1834 -5437 1170 4697
4649 4697 -4548 -2645 4916 -963 -4859 4060 2148 -5639 902 4717 -4286 -2847 5240 -853 -5330
4664 -5330 3544 2484 -5348 437 4843 -3569 -3049 5054 -345 -5317 3432 2953 -5135 361 5096
4679 5096 -3113 -3106 5060 -160 -4965 3410 3232 -5242 -83 5494 -3041 -3223 5232 390 -4880 2984
4695 2984 3931 -4703 -322 5559 -2457 -3612 5061 643 -5346 2900 3719 -4809 -519 5457 -2269
4710 -2269 -3400 4759 1484 -5375 2466 4106 -4688 -834 5827 -2215 -3934 4816 1420 -5307 2299
4725 2299 4110 -4618 -1279 5420 -1884 -3985 4463 1488 -5143 1750 4432 -4462 -1654 5085 -1571
4740 -1571 -4475 4182 1711 -5261 1236 4160 -4269 -2106 4911 -970 -4492 3872 1969 -5303 822
4755H22L607q727J921P251n714l623Q300j705p382N917L812q256J353P771o212
4770h65m025Q054q38p578N777M062q280R33P543n197m413P825m86p480N110M641
4786D783q075K31P731m825m699P610L24q108M724N031p543p23Q489m618n241P955
4802C046n7p879M472N412p425q89Q324m075o036P826P20p761L941N609o931j732
4818c435P756l014o301P301J386q080L196O256o991j520Q229l506n821O735J990
4833D181q234L021O092o725j721P676k560o517O429K477q036K217O512o264k188
4848c640P816k264o825O204L110q046K068O513n762l357P712j572o956N996L420
4863D417p936J135P266n900l126P829j414o917N093L909p796P69P297n332l668
$$ plain form
4755 822 4429 -4298 -2377 4874 -840 -4463 3837 2132 -5250 667 4479 -3777 -2424 5347 -865
4770 -865 -4890 3164 2326 -5252 525 4587 -3693 -2760 4783 -414 -4827 2998 2512 -4968 142 4783
4786 4783 -3292 -3061 4670 -155 -4854 2756 3080 -5028 -304 4727 -2816 -3539 4950 332 -4909 3046
4802 3046 2989 -4890 -418 4994 -2431 -3320 5004 929 -5107 2719 3439 -4322 -381 5228 -1703 -3435
4818 -3435 4321 1307 -4994 2307 3693 -4387 -1191 5065 -1926 -3446 4783 1277 -4544 2191 4181
4833 4181 -4053 -1032 5060 -1665 -3386 4290 1730 -4787 1642 4119 -3917 -1700 4812 -1452 -3640
4848 -3640 4176 1912 -4913 1291 4401 -3645 -1577 4936 -826 -4183 3529 1957 -4999 997 4417
4863 4417 -3519 -2384 4882 -1018 -4144 3685 2271 -4646 447 4356 -3440 -2671 4626 -706 -4374
4878d374P360o60p107N051M330p807M57P229m844m382P748m83p307M969M354p470
4894b936j12P608m847m670P529r6p237L996N194p256l48P732m312n096P126P66
4910C041p430L612N316o889j030P631l331n809O629J698p955L667N331o502j624
4925c645P574k972n667O845R36o999K695O019o510k091P830k863n876O547J738
4940C561p494K698O158o587j952P328k258o180O060K513p301J779O437n679k741
4955c658P069j833n949N485K780p677J905O744n327l572P295j098o810N477L372
4970D203p080P25O677m977l315O993p88o939N385L300p143Q93O482m624l848P119
4986C063n10p142M866M025o781M7O808m289m285O842J82p168M331M498p133k73
$$ plain form
4878 -4374 2986 2326 -4781 270 4600 -3207 -2750 4479 -365 -4747 3001 2518 -4789 180 4534 -2936
4894 -2936 -3048 4560 -287 -4957 2572 2476 -4761 -765 4429 -2827 -3175 4557 245 -4851 2275 3041
4910 3041 -4389 -777 4539 -2350 -3380 4251 920 -4889 1740 3438 -4517 -850 4481 -2021 -3645
4925 -3645 3929 957 -4710 2135 3071 -3928 -1233 4786 -1724 -3815 4015 1152 -4724 1823 3561
4940 3561 -3933 -1235 4923 -1664 -3616 3712 1454 -4726 1334 3847 -3454 -1675 4762 -917 -3658
4955 -3658 3411 1578 -4371 1114 3894 -3783 -1878 4866 -461 -4033 3262 2164 -4646 831 4203
4970 4203 -2877 -2152 4525 -452 -3767 3226 2438 -4501 884 4184 -2959 -2066 4416 -208 -4056 3063
4986 3063 2553 -4589 277 4302 -2479 -2432 4376 87 -4198 2644 2826 -4342 -11 4487 -2646 -2919
5002b919P351m261m658O623N58o750L670M196o266p71P245l482n217O766N36o892
5018d271L630M992o657q64P006l166n162O708R70o975K665N017n889j483P058
5033C579k631n338N970J631p143K620N447n795j943O950k270n739N955K025p012
5048c694K436N465n678k126O725j621o100N921K305o927J620N937n019l104O997
5063C137j341n966N174K645o732J240O272n011l234O771r58o222M866L298o664
5078b725Q16O077m434l400O798q75o440M445L955o891P45O160m271l730O581j86
5094B625o864M646L913o701o7O463l856l915O350J99o526L722L951n917l93O384
5110D014l450m538O476L08o417L298M240n928p72O513l111m634N960J053o613
$$ plain form
5002 -2919 4432 171 -4487 2136 2694 -4056 -386 3810 -2456 -3227 4018 536 -4681 2085 2621 -4271
5018 -4271 -641 4351 -2306 -3170 3836 670 -4492 2216 3186 -3789 -1124 3893 -1996 -3479 3579
5033 3579 948 -4390 1580 3211 -3932 -1312 4135 -1660 -3603 3347 1077 -4662 1293 3318 -3694
5048 -3694 -1258 4207 -1471 -3597 3128 1507 -4593 1328 3633 -3294 -1674 4263 -756 -3860 3137
5063 3137 1796 -4170 1004 3649 -3083 -1843 4429 -582 -3816 2955 1997 -4225 641 3939 -2725
5078 -2725 -1909 4168 -266 -3666 3132 2257 -4183 262 4217 -2674 -1929 4231 -40 -3770 2811 2625
5094 2625 -4239 407 4320 -2381 -2448 4015 159 -3756 2594 2793 -3733 -11 3940 -1977 -2370 4014
5110 4014 564 -3974 2502 2810 -3607 -309 3931 -1997 -2769 3744 633 -4001 1959 3012 -3601
5125c601K963M914o127j109O366k443n003N618J494o700K781N264n839j847O772
5140C503k506n120N571J824o683K245N128n437j840O526k168n102N239J954o320
5155c186J896N083n271k013O555j756n589N206K455o665J582N735m950k913P027
5170C196j372o103N108K353n980P47N966m715l055O580q92n713M520K972o438
5185b826R74N488m036l421O436q30n760M138L512o060L70O052m021l644O156k79
5201B249o005L961L480o140J40O529m052l786N876N5o098L881L581n779l65O406
5217C933l796l746N672L81o055L153M848o263o96O278k941m712N734R44o233K988
5233e11M483n722j115O429k712m635N413J342o311K500M736n355j460O315k458
$$ plain form
5125 -3601 -638 4276 -1851 -2960 3406 963 -4040 1578 3072 -3628 -847 4417 -1422 -3269 3503
5140 3503 997 -4123 1448 3272 -3411 -1166 3962 -1475 -3315 3211 1043 -4059 1180 3134 -3186
5155 -3186 -1290 3793 -1478 -3491 3064 1308 -4281 925 3380 -3285 -1703 4032 -918 -3831 3196
5170 3196 1824 -4279 829 3182 -2798 -2051 3915 -800 -3855 2725 1833 -3880 640 3612 -2826
5185 -2826 -1852 3636 -400 -3821 2615 1785 -3975 163 3675 -2385 -2015 4037 16 -3628 2528 2249
5201 2249 -3756 205 3685 -2455 -2315 4214 162 -3624 2252 2307 -3791 90 3671 -2108 -2473 3933
5217 3933 137 -3609 2063 2444 -3611 -458 4390 -1873 -2569 3709 768 -3944 1790 2734 -3499 -511
5233 -511 3972 -1750 -2865 3564 852 -3783 1630 2972 -3339 -839 3897 -1458 -2918 3397 939
5248I39m628N021J766o154K013N046n432j503O087j861n045N048J875o404J820
5263a412N368m953k120N847j324n361M691K535o297J514N285m449k644N979r52
5278A707n549M345K634n927Q95N371m208k552N716r65n062L952L115o056K44N706
5294C366l647l350N993n41n596L963L091n648K73N561l850l228N697J71n769L678
5310A64L209n795K80N583l333l746N892J27n882L280L679n456n30N875k805l887
5326c345N160J114o164K745L929n211q92O154l132l822M995J045n757K878M102
5341C799n406q43N486k196m242N127J355o294K402M683n122j582N923j934m802
5356c646M888J869n888J763M866n028j489N500j633m544M582J764n813J647N076
$$ plain form
5248 939 -3689 1332 3098 -3056 -1043 4003 -1429 -2932 3155 1294 -3751 1297 3172 -3232 -1412
5263 -1412 3956 -997 -3117 2730 1406 -3955 736 3271 -3026 -1512 3773 -676 -3320 2659 1707
5278 1707 -3842 503 3137 -2790 -1895 3476 -732 -3284 2432 1467 -3595 357 3472 -2584 -2340 3366
5294 3366 -281 -3631 2362 1821 -3775 188 3279 -2369 -2096 3465 -385 -3613 2084 2255 -3514 164
5310 164 3373 -2422 -2142 3441 108 -3638 2254 2381 -3501 -221 3458 -1998 -2528 3347 542 -3345
5326 -3345 1815 2929 -3235 -490 3439 -1772 -2664 3490 358 -3464 1531 2576 -3181 -303 3799
5341 3799 -1607 -2450 3036 840 -3402 1725 3080 -3214 -812 3871 -1251 -2833 3090 1156 -3646
5356 -3646 1242 3111 -2777 -1014 3852 -1176 -2665 2835 1202 -3342 1240 3004 -2809 -1162 3914
5371C914m509k322N719j049n076M257K330n980J411M861m278k580N897j084m943
5386c432L830L109o085Q84N068m118k327N593j061m909L973K484n540K91N566
5401C326l415k948N432q26n135L746K984n555K40N449l514l198N288P7n420L266
5417b03L506n455j79N683l081l891N416M26n521K956L674n259l75N391k729l704
5433c345M895O63n204K485L736m998p62N482k421l833M640J098n596K691L774
5448C305n004j103N643k390l721M965R02n724K468M005m436j603N557k083m274
5463c493M686J841n771J805M277m095k170N603j457m616M480K061n827J371M853
5478C548m317j989N339j212m521M071K145n439J226M718m069k402N441r67m571
$$ plain form
5371 3914 -595 -2917 2802 1753 -3323 934 3264 -2716 -1305 3556 -722 -3302 2595 1511 -3432
5386 -3432 398 3507 -2578 -1694 3374 -744 -3071 2522 1461 -3448 525 3009 -2531 -2240 3326
5401 3326 -89 -3037 2395 1569 -3566 180 3164 -2391 -2151 3298 -216 -3414 1874 1951 -3469 -203
5417 -203 3303 -2152 -2331 3352 271 -3620 1796 2222 -3299 -343 3331 -1928 -2303 3088 359 -3345
5433 -3345 1550 2213 -2991 -506 3230 -1768 -2530 2952 531 -3302 1338 2436 -3160 -469 3305
5448 3305 -1699 -2802 2841 451 -3270 1695 2597 -3127 -659 3346 -1090 -2693 2864 781 -3493
5463 -3493 1193 3034 -2737 -932 3345 -750 -2920 2683 1226 -3390 1090 3151 -2676 -1305 3548
5478 3548 -769 -2758 2581 1369 -3152 919 3064 -2375 -1149 3569 -500 -2902 2539 1572 -2999
5493b999L530K675n378P21M998l660k928N414p19m969L540K847n235L16N231l331
5509E3k864M775m5n118L245L215n349K11N419l331l685N509k6n292L269L017n004
5526b001m80N602k833l663M930N91n097K565L427m884n20M990k057l610M515P32
5542B207n143K511L638m558j371N557k549l774M959P66n256K093M050m758j205
5557b833N329j981l824L933J747n318J744M418m377j533N164j574m427M293J624
5572B385n116J392M638m084j898N124j116m502L991K127n227J083M862m658j634
5587b633N161r38m569L425K391n214J024M860l832k258N040r03m851L837K399
5602B939n146P41M826l378k681M776l45m861L348K958n277M86M898l438k806N047
$$ plain form
5493 -2999 531 3206 -2172 -1451 3547 -113 -3041 2373 1654 -3315 225 3072 -2163 -1847 3384 53
5509 53 -2811 1964 1919 -3199 46 3261 -2088 -1877 3542 211 -3474 2035 2009 -3283 -14 3003 -2001
5526 -2001 -2481 3121 288 -3375 1555 2146 -2951 -386 3041 -1843 -2363 2627 570 -3040 1475 2207
5542 2207 -2936 -425 3213 -1345 -2716 2841 292 -3482 1477 2243 -3013 -920 3130 -1628 -2833
5557 -2833 2496 515 -3309 624 2371 -2947 -1203 3215 -1162 -2695 2469 895 -3532 761 2385
5572 2385 -2731 -1339 3299 -785 -2683 2441 1325 -3177 814 2941 -2286 -1203 3659 -999 -2633
5587 -2633 2528 1590 -2979 446 2837 -2377 -1353 3507 -325 -2583 2457 1554 -3297 540 2939
5602 2939 -2207 -1466 3360 -18 -2699 2077 1732 -3129 219 3177 -2100 -1614 3284 -154 -2960 2087
5618B087j31n139L231L442n474J79M966k846l086M844J52m941K731L319m876n32
5634b074N137k803l325M571N67n097K604L671m808o26N346k568l743M645R46n558
5650c115K210M123m524j036N125k281l772M458J227n365K380L664m306j476N461
5665B773k059m091M270J686n501J687M473m211j726N231j358m798M800J413n363
5680b774J396M396l722k270N198j106m428M302J623n396J434M682l895k186M675
5695A929n73m429L618K351n116O32M977l737k349M694n99m468L683K654n408O49
5711a492M552l077k942N014j01m931L360K436m769L95M608l176k770M702K92n066
5727b965L012K778m476k10N156l244k988M709K36m827K599L361m555r04N143k355
$$ plain form
5618 2087 1956 -3183 48 3490 -1984 -1805 3161 315 -2771 2073 2225 -2716 15 3334 -1542 -2074
5634 -2074 3063 260 -3065 1506 2073 -3024 -420 3251 -1557 -2183 3163 595 -3148 1497 2443 -3115
5650 -3115 -905 3218 -1306 -2342 2783 502 -3270 1188 2415 -2950 -570 3094 -1212 -2688 2773
5665 2773 714 -3377 893 2579 -2922 -1235 3238 -973 -2699 2532 1174 -3624 1176 2589 -2774
5680 -2774 -1378 3018 -704 -2974 2224 1118 -3310 992 2615 -2781 -1347 3335 -560 -2746 1929
5695 1929 1356 -3073 545 2896 -2220 -1588 3389 -348 -2697 1997 1398 -3070 613 3267 -2141 -1492
5711 -1492 3060 -17 -2959 2055 1954 -2977 383 2819 -1950 -1555 3053 -123 -2893 1809 2101 -2965
5727 -2965 47 2825 -1651 -1861 3295 51 -2937 1772 2008 -2819 -220 3141 -1414 -2318 2825 470
5743D70l474M660N68m953J973L893m316j175N313k406l568M639P25n119K204L649
5759C083m167j274N183k140l550M185J222n310K366L421m195j254M832j506m082
5774c186M100J569m975J419L901l656j652M841j206m218M085J819n316J505M004
5789C034l987j921N098j083m308L829K166n053Q84M136l459k202N271j122m520
5804c237L421K552m837O14M578l512k395M829p46m583L254K673m734J57M868l464
5820e62k601N048m41m454K885K831m662J40M326k714k935M940j09m867L347K335
5836B507l966o38N052k932k775M643J11m679K659K944m403o41N015k207l579M429
5852A540M20m401K379L197m327p06M386j839l440M539L54m728K275L241l968j170
$$ plain form
5743 470 -3004 1656 2224 -2729 -756 3137 -1179 -2354 2959 553 -3015 1624 2349 -2770 -566 3083
5759 3083 -1084 -2358 2825 685 -2865 1320 2542 -2768 -402 3019 -1176 -2430 2402 896 -3186
5774 -3186 914 2483 -2492 -1073 2828 -828 -2480 2361 1155 -3063 1022 2841 -2475 -970 3034
5789 3034 -953 -2874 2224 1141 -3167 662 2828 -2225 -1341 2795 -664 -2866 2405 1283 -3237
5804 -3237 184 2736 -2101 -1487 3091 -421 -2816 2013 1267 -3316 -62 2611 -2123 -1966 2902 -562
5820 -562 -3163 1885 1444 -3010 -125 2706 -1956 -1816 2510 -204 -3139 1801 1692 -3175 172 2507
5836 2507 -1459 -2097 2955 23 -2752 1891 2002 -2677 -18 2926 -1477 -2118 2897 690 -2889 1540
5852 1540 1960 -2441 -62 3135 -1192 -1898 2488 649 -2791 1748 2102 -2626 -351 2890 -1078 -2248
5868b248M885j944l699M081J272m972J956L801m168j241M721j839l565L932J549
5883B521m726J314M159m120j407M844j489m135L889J838n142R61M566l557k018
5898b502M512j029m054L692J959m715R47M057l435j770M314n85m558L407K658
5913B898n090P74M292l164k659M788m66m598L555K323m787O70M534l627k250M448
5929A641L6m432L081K590n014L36M559k943k863M854m9m578K656K706m406l27
5945b153M750k407l346M769J09m686K609K959m056k03M270k379l355M329M07m139
5961b522K203L454m336j011M701k091l313M210R06m688K030L358l972j202M971
5976B698k050l690M386J073m822J758L813m304j138M935j769l754M059J512m859
$$ plain form
5868 -2248 2637 693 -3006 1075 2347 -2625 -669 3132 -1036 -2277 2444 605 -2960 972 2521
5883 2521 -2205 -891 3268 -852 -2259 2585 1096 -3039 850 2688 -2454 -1493 3073 -484 -2502
5898 -2502 2010 981 -3073 619 2578 -2137 -1190 2867 -568 -2338 1976 1391 -3167 240 2898
5913 2898 -2192 -1418 2874 -290 -2949 1839 1373 -3225 330 2653 -2134 -1464 3070 -557 -2807 1641
5929 1641 1677 -2755 326 2916 -2098 -1762 2797 -146 -3009 1845 1796 -2782 -126 2580 -1826 -2153
5945 -2153 2597 190 -3156 1613 1722 -2964 -355 2604 -1452 -1655 2615 236 -3119 1210 1617 -2522
5961 -2522 -319 3135 -1201 -2212 2489 398 -2915 1295 2201 -2487 -457 2901 -1071 -2273 2698
5976 2698 648 -3042 1344 2417 -2405 -647 3166 -1138 -2276 2659 890 -2864 1195 2707 -2152
5991b152J203L831l604j804M756j278l740L649J801m972J206M055l526j822M813
6006B416j068l903L247J901m488Q89M260m050j738M793p89m395L412K066m532
6021a979N45M687l459k361M307j69m417L486J982m295K31M085k727k539M437j86
6037A628m256K683K781m470j68M249k743k653M829j23m615K724K827m315k72M444
6053B550k181l168M021K33m483K858K862m379l14M373k068l246M321O41m697J857
6069h20L614m236j026M936k380k981L945R76m674J856L428l729r57M234j458m041
6085c313M216J319m570J681L553l848j190M580j654l469L683J162m269J001L738
6100B620l092j911M684j547l479L615J664m608Q49L920l082j978M383r38l772
$$ plain form
5991 -2152 -949 2882 -722 -2526 2230 952 -2788 861 2662 -2310 -1104 2951 -575 -2397 2416
6006 2416 1348 -2555 692 2593 -1895 -1006 3254 -796 -2534 2259 1470 -2925 487 2553 -1979
6021 -1979 -1434 3253 -206 -2567 1740 1571 -2846 640 2622 -1673 -1442 2643 -84 -2623 1814 1628
6037 1628 -2628 55 2836 -1634 -1802 2447 -296 -2949 1880 1757 -2858 -134 2693 -1622 -1894 2550
6053 2550 369 -2799 1222 1455 -3028 -170 2692 -1687 -2001 2372 304 -2942 1379 2020 -2677 -820
6069 -820 2794 -1442 -2468 2468 88 -2893 1052 2028 -2646 -790 2638 -1091 -2048 2186 728 -3313
6085 -3313 903 2222 -2348 -667 2886 -962 -2152 2428 774 -2695 988 2150 -2119 -1118 2620
6100 2620 -472 -2383 2301 754 -2725 890 2554 -2054 -1205 2715 -367 -2345 2038 1100 -2672
6115b672L347J737m135K86M260k929k039M205q35l957L101K093m173M88L836k563
6131E0k548M572n19m279K879K733m360K4M243k620k713M385k59m101K479K807
6147B773m275j32L957k308k546L673N85m351K395K619l982k65M487k287k948M011
6163A406M25m423K374K744l666m51L689j827k979L812N55m073J888K992l285j318
6179b137M730j989l463M084P28m037J194L717l899j078M176j533l185L408R74
6194A690l899J392L379l186j742M286j410l359L523J597m443J336L477l436j503
6209b298L873o06l733L299J720m368J005L802l503j354L927p05l776L345J794
6224B422m358Q66L601k723k023M004n91l629K461K577m457M92L584k193k320M305
$$ plain form
6115 -2672 675 2412 -1723 -1437 2823 -106 -2145 2060 1225 -2732 369 2462 -1711 -1223 2613 50
6131 50 -2498 2074 1555 -2724 155 2888 -1472 -1448 2795 175 -2538 1847 1588 -2513 -34 2773
6147 2773 -1502 -1634 2323 15 -2531 1142 1727 -2624 -229 2390 -1592 -1857 2630 343 -2605 1406
6163 1406 1831 -2592 -218 2526 -1140 -1591 2098 271 -2708 1104 1659 -2414 -526 2466 -819 -2137
6179 -2137 2593 604 -2859 1225 1953 -2084 -890 2827 -1072 -2150 2026 493 -2692 716 1690
6194 1690 -2209 -817 2562 -624 -2366 1920 510 -2849 674 2271 -2172 -836 2641 -795 -2298
6209 -2298 1575 969 -2764 535 2255 -2113 -1108 2694 -809 -2163 1764 1059 -2717 628 2422
6224 2422 -1936 -1070 2531 -192 -2215 1789 1198 -2431 30 2607 -1850 -1358 2226 33 -2287 2018
6240B018j064l563K908K087l943J43M065k613k410L938m5l979K551K441l951o
6256a423L924k304k549M370j19m289K343K578l766j95L806j936k978L831L93m257
6272b571K009L070l855m00M171j844k930L598O00m187J624L385l382j207L834
6287A915j292l007L279Q53l974J630L102l687o89L715r99l190L447J020m114J126
6303h65L387l112j398L984j328l314L203J577m323J227L312l189j397L987q86
6318H65l369K873K018m032O62L649l085j760L670o40l327L019J603l986P59L327
6334B246k536k027L921l42l854L009J841l767J97L420k329k178M086m94l738K648
6350A03K143l812J50L599k240k055L356K75m055K470K447l791k66L570k043k142
$$ plain form
6240 2018 954 -2609 299 2386 -1557 -1414 2651 38 -2372 1566 1521 -2458 93 2534 -1417 -1423
6256 -1423 2501 197 -2352 2018 1899 -2390 -47 2531 -1235 -1430 2376 440 -2538 1293 1686 -2571
6272 -2571 -562 2508 -1347 -1747 2424 580 -2350 1248 1848 -2339 -715 2670 -712 -1919 1915
6287 1915 623 -2384 895 1748 -2226 -596 2506 -1181 -1870 1845 846 -2344 1103 2123 -1991 -865
6303 -865 2522 -590 -1988 1996 668 -2646 557 2134 -2189 -962 2350 -839 -2236 1751 865
6318 865 -2504 369 2387 -1645 -983 2666 -419 -2179 1491 851 -2476 543 2146 -1840 -1081 2246
6334 2246 -290 -2317 1604 1262 -2592 417 2258 -1509 -1312 2108 -221 -2399 1687 1193 -2545 103
6350 103 2246 -1566 -1416 2183 -57 -2112 1244 1519 -2536 -66 2381 -1410 -1676 1894 -149 -2291
6366b291L956l46l189J756K356l496m03L653j946k393L573M82l960J967K580l265
6382i66o38L471j412k874L386P88l563J271K607k847p42L530j460k490K878R37
6398A876l824J392L013k968j247L912j399l081K984J442l963J118K807k544j271
6413a753L493q97k960K872J025l614J044K982k707j898L955n01l221K621J763
6428B204l814O23L152k554j704L781n44l630K882J710l522j0L593k388k102L741
6444A418l17l316K075K159l484L95K959k206j629L351j83l570K290K128l509l5
6460a474L224j605k484L327L22l608K139K347l242m70L370j817k282L373J17k976
6476a739J462K407l536l95L872j755k389K842O67l476J860K298k759r12L512j449
$$ plain form
6366 -2291 1665 1319 -1870 -114 2242 -1254 -1657 1996 50 -2343 1230 1712 -2248 -281 2299 -966
6382 -966 -1604 1867 455 -2419 967 1755 -1808 -537 2070 -777 -1519 2011 551 -1939 939 1876
6398 1876 -1948 -556 2457 -511 -1758 2154 755 -2326 658 2100 -1863 -745 2062 -482 -1753
6413 -1753 1740 843 -2117 755 1780 -1834 -790 2192 -515 -2413 1542 1041 -2180 441 2204
6428 2204 -1610 -987 2165 -389 -2093 1688 1144 -2486 396 2106 -1416 -1426 2167 -221 -2323 1418
6444 1418 1101 -2215 -140 2019 -1465 -1070 1889 -317 -1946 1405 1222 -2348 -58 2070 -1439 -1474
6460 -1474 1750 145 -2339 988 1310 -2298 -159 2188 -1054 -1524 1846 29 -2253 1120 1237 -1739
6476 -1739 -277 2130 -1406 -1801 2071 316 -2073 769 1436 -2040 -180 2118 -641 -1553 1959 510
6492E10k654L141N97l205J352K508l069p61L364j139k982L248R02l599J569K437
6508B219k894j034L558j102k946K719J191l647J333K804k955r56L368q83k819
6523b044K788J241l738J140K500k415j351L655r57k738K611J330l406M32L241
6538B289k533j665L431m52l126K453J560l116j31L273j955j870L194m66k576J806
6554A16J910l276l2L412k273j782L505l64l016J796K337l502j54L644k456j732
6570a867K861J26k987J699K037k980j40K920j726k086L244M38l459J780J633k539
6586a046j85L113j992j656K536O62l268J323K565k914p96L420j095k760K708P37
6602A352l348J647K633l124q59L245j057k472K711Q46l382J272K381k190j330
$$ plain form
6492 510 -2144 997 1594 -1611 -259 2249 -820 -1581 1783 644 -2338 910 1812 -1787 -218 2219
6508 2219 -675 -1709 1849 747 -2199 520 1711 -1936 -603 2201 -754 -1710 1658 775 -2044
6523 -2044 744 1985 -1753 -613 1887 -528 -1879 1776 819 -1919 692 2022 -1384 -952 2289
6538 2289 -244 -1909 1522 1070 -2056 397 1957 -1159 -1290 1983 28 -1842 1352 886 -1690 116
6554 116 2026 -1250 -1282 2130 -143 -1925 1580 1216 -1800 -4 2333 -1169 -1323 2321 -135 -1867
6570 -1867 994 1120 -1867 -168 1869 -1111 -1251 1669 -57 -2143 1101 1539 -1920 -140 1493 -1046
6586 -1046 -1231 1882 -110 -1766 770 1432 -1836 -513 2052 -862 -1658 1762 667 -2093 615 1352
6602 1352 -1996 -349 2284 -840 -1699 1546 489 -1983 728 1574 -1808 -536 1845 -345 -1675
6617a675L398j022k786K515J304l215P28K488k221j009K927o29l086K792J447
6632A956l222P88K744k522j281K984p56k621K364J314l047M37K861k049j638L037
6648A349k95l015K129K144l455L32K563k119j200K855l6l005J780J749k811j3
6664a048K941j886j997L277n3l576K549J727k890l15K985j866j921L081K28k932
6680a696J521K115l015k24K937j267k307L183R4l024J211K165k812l09L219j541
6696B50k047K645O13l224J203K455k842l78K800j183k334K709O12l051J228K410
6712A866k818m45K963j170k460K798Q54l092R33K340k374q79K919r93k453K869
6728H58Q30k995M00K490k196j353L372o73k749K485J032k856O43K425k224r46
$$ plain form
6617 -1675 1723 701 -2085 430 1734 -1481 -753 1735 -486 -1495 1432 803 -2283 509 1956
6632 1956 -1266 -478 2266 -256 -1537 1447 691 -1930 434 1748 -1299 -862 1999 -50 -1688 1349
6648 1349 1054 -1961 168 2312 -1143 -811 1752 -367 -1567 1288 1252 -1753 27 1776 -1035 -1048
6664 -1048 1893 7 -1990 1287 1234 -2342 207 1934 -956 -1271 1714 -152 -2073 1008 1236 -1696
6680 -1696 -175 1940 -1075 -1299 1638 371 -1936 1247 1341 -1683 -472 1693 -1119 -1428 1791 250
6696 250 -1797 848 1461 -1763 -560 1895 -947 -1325 1475 292 -2042 667 1279 -1772 -544 1866
6712 1866 -952 -1397 1566 396 -2064 734 1588 -1504 -571 1769 -605 -1484 1435 442 -2011 858
6728 858 1688 -1307 -907 1583 -613 -1966 1406 733 -2016 469 1501 -1355 -712 1713 -511 -1457
6744a457K919o61k616K350Q69k770O85K461j994j604L122o1l029K146J472l013
6760a181P6K918j839j513K775q2k718J662J783l053L39K629j795j888L046j3k844
6777a698J760J652k628k99K916j438j687K485j17k676J572J906k477m65K841j365
6793B82k094L090R6l016J266J869k279m79K921j327k177K528P17k683Q16K112
6809A642k248p62K929j460j752K057J127l175J152K098k146q98K974j171k295
6824a928K611O87k611M31K754k567j073K947p06k578K622N37k483K61K679k154
6840e71j023K796o46k109J723J348k814L32K658j899j404K595l67k334K116J233
6856A634k705J18K467k030j157K820m30k460K069J198k758M19K149j442j734K944
$$ plain form
6744 -1457 1462 801 -1815 535 1404 -1366 -681 1780 -214 -1818 1304 1243 -1786 360 1832 -1181
6760 -1181 -1105 1813 -26 -1539 1236 1154 -1564 98 1881 -1172 -833 1796 1 -1887 1159 1146 -1698
6777 -1698 62 1714 -914 -1213 1703 265 -1422 1063 946 -1730 -158 1748 -729 -1194 1647 282
6793 282 -1812 1278 1374 -1642 -376 1493 -786 -1265 1656 329 -1848 680 1397 -1286 -470 1642
6809 1642 -606 -1368 1561 101 -1651 406 1533 -1642 -490 1608 -538 -1436 1538 367 -1928
6824 -1928 683 1370 -1241 -810 1944 -623 -1696 1251 545 -2033 589 1126 -1357 -1096 1583 -571
6840 -571 -1594 1202 556 -1553 170 1518 -1296 -964 1694 -205 -1609 986 619 -1715 401 1634
6856 1634 -1071 -953 1514 -516 -1673 1147 717 -1743 326 1524 -1234 -815 1334 -108 -1842 1102
6872A102k67k513K022J418k966M8K861j804j626K549L1k492J523J873k760l9K478
6889A438j231k124K599P97l004J552J392k267k87K571j051k186K583M76k427P84
6905c85K259k723k82K484r90k047K206R52l018J163J958k102q22K796q85k321
6921a757K348J158k927P91J825j799r93K909q78k302K187R34k922R49K251k228
6937d54r42K714n36k491J964J009k452M29K539j933j476K503m22k202J682J529
6953A461k488N11K079j723j519K720j43k447J384J547k571L68K537j961j625K748
6969H78K59k761J897J188k460j86K850j782j516K561K7k609J287J579k141L25
6985f04K061j403j881K673J54k395J277J793k542l07K509j346j376K069L16k568
$$ plain form
6872 1102 835 -1678 344 1762 -1204 -1156 1705 -99 -1725 824 855 -1637 -114 1759 -1001 -1040 1438
6889 1438 207 -1917 682 1479 -1525 27 1419 -848 -1135 1436 385 -1801 782 1258 -1169 -385
6905 -385 1874 -849 -1131 1353 363 -1684 522 1474 -1544 -381 1577 -525 -1347 1449 564 -1757
6921 -1757 591 1749 -1178 -387 1438 -361 -1354 1555 677 -1625 562 1496 -1426 -477 1774 -454
6937 -454 -1396 1318 782 -1709 255 1264 -1188 -759 1780 -153 -1629 874 452 -1750 -68 1461
6953 1461 -1027 -516 1563 -160 -1679 1041 898 -1549 -165 1382 -1189 -821 1716 -245 -1870 878
6969 878 1137 -1624 273 1461 -999 -1185 1665 -117 -1633 928 955 -1654 -367 1212 -929 -604
6985 -604 1457 54 -1827 846 1000 -1395 -118 1675 -867 -1174 1335 -11 -1387 682 998 -1570
7001a570J431J832k362n91K900j551j695K579L20k592R61J774k125o23K620j147
7017A61j807K466L24k339R44J838k152o52K446p68k257K200Q50k553P12K526k323
7034c84r27K860q35k063J926J025k673N11K349k273j125K863n35k332K057R32
7050A376k402K08K396j999q13K893q64k484J980R12k620Q01K003j817q36K350
7066A084k68k426J714J112k358L68K338j990j011K424j65k306J607J154k194J74
7082g43K352j537j990L051r0k321J169J524j914l60K414j499j734K616j69k434
7098a665J791J241k291k00K724j422j653K412Qk256R55J847k343l79K410r90j953
7115a764K313P89k808J262J819j831q79K450j039k046K134Q25k762J100K024k220
$$ plain form
7001 -1570 -139 1693 -669 -1260 1640 89 -1606 973 1293 -1299 -338 1436 -689 -1312 1308 161
7017 161 -1646 820 1144 -1195 -251 1587 -565 -1217 1229 461 -1796 404 1254 -1299 -587 1939 -384
7034 -384 -1311 1549 714 -1349 577 1602 -1071 -560 1789 -484 -1609 1254 719 -1613 444 1376
7050 1376 -1026 -818 1578 -421 -1234 1659 795 -1689 291 1203 -1417 -616 1387 -430 -1266 1084
7066 1084 816 -1610 104 1216 -1142 -774 1564 -426 -1437 987 822 -1484 123 1277 -917 -743
7082 -743 1609 72 -1918 1133 1043 -1278 -109 1415 -499 -859 1555 56 -1678 938 769 -1665
7098 -1665 126 1367 -924 -1124 1600 178 -1475 937 945 -1311 -356 1491 -852 -1231 1179 189 -1764
7115 -1764 549 1338 -1470 -208 1611 -220 -1099 1351 312 -1734 400 1225 -1537 -437 1587 -633
7131f33m50K394q09j890K093M21j896N37J733j888q04K493q01j927J664P83k132
7148a112M18K186j429j152K026l17k036J777R82k378M26K198j877r21K298n10
7164E79j817J392J295k167O9K168j817j076K306m36k033J793J305k740K08K813
7180A842j579j566K314j60k303J586J220k113L9K242j653j330K434k5k308J096
7196b64J604k266q8K534j567j584K259K64k293J406J521k302l63K436j234j756
7212a693K337O88k619Q06J920j983o70K514r79j794K176N41k289O53J832j978
7228e38q18K555j019j897K294P57k638O19K323j986j016K327l68k357J960P36
7244I34k221J041J527j871r37K588m79k319K045Q80k417L61K107j576q34K373
$$ plain form
7131 -633 -1083 1311 502 -1388 705 1126 -770 -233 1500 -388 -1192 1301 500 -1427 237 1020 -1112
7148 -1112 -694 1492 63 -1089 937 620 -1416 361 1343 -1035 -609 1589 -288 -1209 1089 579
7164 579 -1238 154 1449 -718 -649 1519 -298 -1374 932 496 -1537 256 1561 -1179 -971 1842
7180 1842 263 -1303 1011 851 -1452 134 1354 -759 -720 1522 -131 -1461 973 948 -1360 -264
7196 -264 1340 -926 -1014 1520 -47 -1631 628 892 -1401 5 1526 -776 -1139 1297 63 -1693
7212 -1693 644 1332 -1287 -481 1439 -544 -1214 1300 321 -1473 703 1244 -1045 -392 1440 -538
7228 -538 -1356 1199 180 -1717 577 1334 -1304 -685 1638 -348 -1364 963 595 -1762 198 934
7244 934 -1287 -246 1281 -590 -1527 1061 582 -1737 308 1188 -1229 -868 1239 -337 -1171 1202
7260A202q61j677J598R73k251L48K110j723r23J928M1k449J938J172k512L55K354
7277A623j451j578K236J42k509J733J362k447K64K186j825j234K311K3j941J216
7293A11J544k541J6K444j276j741K419j67k376J436J709k465Q8K160j036j777
7309a452K082N32k778J489J453k097r6K052o61j811J985L62k567J334J640k084
7325f17m26K712j339j564J846L39k392J182J967k212p84K559q28k212K326M56
7341A013k419N26K620k025j021K317o67j677J684J161k892R58J727j739q87K475
7357A154n76k338K166P98k557Q24K089j750j282K769n08k617K251R01k413M61
7373f28J850j341j259J905J09k302J463J491j975j11K342j498j391K457k83k282
$$ plain form
7260 1202 341 -1336 262 1235 -1016 -668 1442 -281 -1204 724 765 -1684 254 1426 -1086 -731 1623
7277 1623 172 -1406 830 972 -1537 196 1558 -889 -625 1561 -264 -1498 813 836 -1105 111
7293 111 1655 -886 -870 1574 298 -1443 976 809 -1567 -131 1578 -887 -799 1361 325 -1452
7309 -1452 630 1162 -1616 -127 1326 -771 -867 1185 524 -1287 698 1060 -1507 -173 1467 -617
7325 -617 -1043 1669 330 -1234 612 951 -1441 -259 1708 -504 -1288 1271 443 -1769 557 1013
7341 1013 -1406 -880 1740 -285 -1306 1011 344 -1333 351 1512 -1380 -422 1305 -434 -1321 1154
7357 1154 578 -1760 406 1204 -1353 -529 1560 -190 -1472 1297 789 -1828 423 1324 -1089 -628
7373 -628 1222 -119 -1378 527 636 -1666 -203 1288 -687 -798 1544 46 -1345 1112 829 -1453
7389a453J620J242k229L7K130j296j439K241l3k405J566J624k372L18J857j165
7405B43j914K213M53k211J258J295k022n6K172j340j671K356J39k178J034J491
7421A262j476m00K055j382j304K129K65k334R51J782k351m17K385r41j771K206
7437F59J88j835P56J576j730p66K496r69j580J862N93k239Q34J553j928m23J995
7454A042q99j536J635J105k542M28K097j661q87K144k23k225J860Q93k305N46
7470e28J828j516r41K029m97k010J802J077k427M41J971j267j346K429o08j710
7486a273J109J416k326M44J932j297j288K196r5k179J453J279k376oK602j481
7502A10j147J833j69j723R02J571k264M6J859j100j230K203j43k254J361J455
$$ plain form
7389 -1453 167 1409 -820 -783 1347 51 -1388 853 820 -1585 -19 1605 -767 -449 1408 243
7405 243 -1671 542 995 -1216 42 1337 -685 -741 1431 91 -1580 776 915 -1263 -229 1262
7421 1262 -214 -614 1441 59 -1245 884 1149 -1185 -234 1548 -803 -1220 1165 224 -1547 659
7437 659 847 -988 -232 1344 -386 -1152 1344 375 -1205 657 1250 -989 -155 1398 -530 -953 1042
7454 1042 143 -1393 242 1347 -1195 -767 1330 -331 -1218 926 703 -1522 338 1231 -1074 -528
7470 -528 1300 -216 -1157 872 375 -1635 167 1244 -1183 -742 1229 -38 -1384 1045 437 -1273
7486 -1273 -164 1252 -1074 -630 1302 5 -1283 913 818 -1361 92 1371 -1005 -1011 1591 110
7502 110 -1037 796 627 -1096 -194 1377 -887 -841 1018 -82 -1312 891 748 -1506 -145 1310
7518A310j894l50K481j291j723K128K58k201J008J557j676q00K436q45j613J819
7534F04J54j937Q01J691j534q44K268p79j791K043M89j996N76J489j542p30K095
7551A057p35j659J598M40k086J225J648j809o37K177q06j388J322R30k300N47
7567d76J530j286j039K075j44k001J766P04k138J73K166j727p04K040k03k208
7583a472J668Q39j894k21K533j362j176K184l67k137J571Q65j837J37J812j267
7599a24j356K405k04j872J353R22k208O67J561j204j099J713K73k244J266J311
7615A160j741m47J963n39j854K163k63j644J380J237k456m4K348j070j254J424
7631C63M88j954P69J572j763o62K251j024j371J818M39j832O92J582j749m17J961
$$ plain form
7518 1310 -584 -934 1547 256 -1467 661 919 -1282 -274 1283 -393 -1193 1243 398 -1215 604
7534 604 758 -1179 -378 1313 -221 -1065 1203 424 -1367 676 1165 -831 -255 1234 -308 -1038 1057
7551 1057 322 -1337 261 701 -1385 -160 1488 -321 -958 1219 413 -975 347 1277 -1023 -476
7567 -476 1054 -232 -1271 804 660 -1341 425 1129 -1009 -836 1330 -397 -1101 939 736 -1472
7583 -1472 196 1035 -859 -1080 1453 91 -1085 1099 732 -1405 166 1031 -806 -669 1143 -124
7599 -124 -1480 925 721 -1151 202 1124 -1084 -417 1144 -60 -1159 554 827 -1417 -151 1160
7615 1160 -581 -1028 935 396 -1458 705 442 -1202 178 1415 -1041 -1085 1263 193 -1061 363
7631 363 851 -1103 -334 1238 -525 -1187 1064 40 -1331 487 926 -906 -214 1368 -381 -798 1163
7648A163r91j243J474L56j889N13J824j785j70J902p52j562J583N91k111O91J710
7665A304j393p87J685j09j995J618O36j765J73J642j368m75J717j51k185J637
7681A84J198k320L13K002j659p75K094n33j723J406J194j915j38J960j392j010
7697a114J989j92j810J383P17j587J00J549q71j013J635k21j968J453J225k248
7713i73K73J846j217j398K459k55j611Q08J250j487l69K281j161j658J706L50
7729H44k132J120J213j819q0J601m59j549J531L02j655P35J587j564n40J967o41
7746D61j707J532P67k084P08J535j503l53J513r01j167J571P06k216P03J392j404
7763d47n68K120p32j750J707O50k170Q23J267q86p88J778n32j877J695N52j628
$$ plain form
7648 1163 172 -1071 403 759 -1130 -617 1207 -578 -748 1154 402 -1160 423 1014 -1097 -406 1304
7665 1304 -89 -876 809 700 -1295 323 959 -806 -633 1009 -359 -834 883 732 -1453 184
7681 184 1382 -938 -625 1377 -282 -1057 1037 504 -1219 187 1381 -534 -672 1288 -104 -1114
7697 -1114 875 683 -1127 256 973 -614 -514 1035 164 -849 786 565 -1403 50 1275 -973
7713 -973 -700 1146 -71 -1469 990 735 -876 -68 1182 -305 -674 1607 446 -1212 494 844
7729 844 -1288 -168 1045 -774 -854 747 288 -1261 270 572 -1083 -348 1239 -325 -865 1102 461
7746 461 -1246 286 1053 -1031 -323 1212 -291 -644 869 -32 -1199 372 1078 -1138 -435 957 -447
7763 -447 -1015 1105 373 -1377 330 980 -1190 -367 900 14 -774 1004 472 -1405 290 842 -786
7780g86M11J402j503l59J453o3j868J249J292k454P84J505j178q73J748k79j854
7797a373J517P22j505K3J679j126j120K118j82j828Q76J060j567J62J805j318
7813e7r76J488J65j610J042R23j686p4K218j175j306J758K43j982Q72J381k145
7830i21L87J487m24j523J555K05j727O79J492j542m52J318j02j653J659K29j618
7847i51O86J516j951k88J772q30j329J979J52j611M09J434j574n54K019n31j309
7864i61J227O21j685K00J769j416n47J649k11j768J454P33j840N20J457j446q29
7881a073J982j69j778J410M55j671L72J392j096r44J755R0j635J085Q31j580j99
7898g73J674j110m96J382J89j991R35J199j682R7J501p88j119J668J1j749J030
$$ plain form
7780 -786 -375 1027 -476 -835 618 555 -1313 -64 1228 -1226 -442 1063 -115 -988 760 481 -1373
7797 -1373 144 866 -639 -616 1063 -63 -1183 935 753 -1075 -199 861 -706 -544 1261 -57
7813 -57 -1033 455 620 -990 52 975 -711 -785 1433 258 -1048 710 953 -1029 -157 1224 -921
7830 -921 -534 953 529 -994 561 766 -961 -282 1210 -332 -784 534 432 -1221 438 667 -951
7847 -951 -265 1251 -700 -988 784 -46 -1375 604 756 -855 -446 988 -586 -1140 879 348 -961
7864 -961 266 887 -798 -598 1171 -245 -792 857 646 -1122 332 1065 -775 -255 1202 -244 -1073
7881 -1073 909 740 -1038 372 827 -844 -472 920 -176 -1120 635 725 -910 175 1006 -574 -773
7898 -773 901 -209 -705 677 866 -1125 -190 1009 -673 -576 925 137 -982 686 697 -1052 -22
7915b2R94j354R6J504j082j098J511J43j751J058J194j663L6J271o19j012J553
7932G59Jj557N45J199j436o0J760r77j142J086M70j356O79P93j298r9J459n41
7950B85j595J944L25j809N91J424j462k94J735o81j546J531O06j653K92J096j265
7967d76l56J668n32j405J361N87j679L87J263j246n99K055o27j433J147Q04j722
7984h03L48J570j505o42J986m08j482J275N54j538M6J628q16j308K025o23j177
8001h70P47J135j599J33J272p82r03J781n54j508R81J139j747k2J595r30p62J294
8019D00K85j608J073P43j383m11J609q00r79J611Q8j454P15R38j452j01J875p70
8037C79j513J445L75j416Q02O66j173l12J717m88j592J365O35j677N01J308j248
$$ plain form
7915 -22 972 -382 -286 1218 136 -962 549 692 -1059 -1 1193 -470 -434 837 218 -794 759
7932 759 760 -797 -252 947 -489 -549 1211 234 -908 178 648 -708 -29 764 -534 -633 826 285
7950 285 -1310 634 959 -850 -259 1165 -297 -591 1144 463 -1083 448 1054 -599 -307 789 -476
7967 -476 -832 836 304 -1101 260 847 -832 -445 818 -428 -1027 1028 401 -1032 115 919 -803
7984 -803 -455 1115 -390 -1032 954 546 -936 339 893 -645 -599 1029 213 -1095 930 307 -870
8001 -870 -123 1012 -587 -454 818 36 -867 914 360 -1148 -167 972 -775 -797 798 -132 -894 400
8019 400 685 -923 150 893 -490 -901 708 -92 -1071 540 628 -826 -111 827 -625 -726 1149 379
8037 379 -1134 311 686 -730 72 738 -435 -747 970 482 -1110 255 890 -787 -286 1022 -226
8054b26m93J375l46j089P88Q10j559N40J330j396k21J421m40j340J056R42j989
8071h37K08J610j294m40J536k68j509J103M13r53O0J604j518o46J747o96r62J046
8089B04O93j391K15J393j380m56J363J1j361R68O31j754K93J627j126q66J418
8106D82j92j157N96J222j600J69J427r50j238J725L7j713J170P06j141K20J112
8123H75j249l11R06K65j220N79J224j682J56J146p78n39J085K62j449L26J292
8140H88j135m54J515r09q81J292L59j485M01J479j325m37J530m72j503J573L51
8157G87j432L45R50j191k6J225m17j114J094P83j763M05J454j387j17J170p29
8174C7q06R36R21j898N45J447j385q52J703l56q77N74R36j875N09J330j068
$$ plain form
8054 -226 -719 656 310 -779 9 819 -740 -200 1130 -266 -487 934 494 -846 210 1152 -837
8071 -837 -629 981 -313 -753 783 515 -994 109 522 -431 -371 1233 -285 -931 816 120 -842 204
8089 204 897 -494 -279 1114 -266 -722 641 652 -709 259 890 -864 -571 1056 -70 -936 482
8106 482 290 -867 -271 951 -649 -480 947 -3 -1241 484 521 -1192 -22 684 -457 -237 875
8123 875 -374 -685 221 486 -734 -155 1069 -613 -457 689 -89 -628 457 719 -730 -404 888
8140 888 -247 -701 814 -95 -976 316 675 -810 -409 1070 -255 -692 838 366 -1137 436 787
8157 787 -645 -300 650 -541 -567 658 241 -873 221 1004 -759 -354 1100 -287 -404 766 37
8174 37 -769 167 1088 -810 -265 1182 -203 -1055 648 292 -585 -11 925 -950 -441 889 -179
8191a79
$$ Imaginary data points
##PAGE= N=2
##DATA TABLE= (X++(I..I)), XYDATA
0@%%%%%%%%%Pj5J6j6J6j8K5l1L2m0M9n6O4p2Q6j00J11j24J42j63J84k06K31k59
33a37K89l20L58l99M41m88N43o03O65p36Q16r05J003j114J244j394J567j772K019
52A077k327K723l241L958n021O746r993J8027o8830r5897K32860j4085j62981
65i6984J08040O4201j63036N9070J40270j50609n9344J95918n3580j70666J46030
76A9310R1190j90269K1017J64370j18446q4407J68431k9989j52704J28884P8847
87I6234j85518K5254J74086j18891j03287J67205o441j55877J10259Q7205j72760
98h2531J2486J71438j07366j07293J63053O368j57787R5095R3463j62187N749
109f9512J71900r8924j14144J58207J4916j61915Q9413J12005j55966k0150J62199
$$ plain form
0 0 0 0 0 0 0 0 0 0 0 7 -8 8 -8 8 -10 15 -16 16 -24 25 -31 33 -39 47 -53 58 -66 76 -87 97 -109 122 -137
33 -137 152 -168 190 -209 232 -256 287 -316 349 -387 429 -476 527 -587 657 -737 830 -942 1077
52 1077 -1250 1473 -1768 2190 -2831 3915 -6078 11949 -56881 -152778 80082 65997 -96984
65 -96984 11056 75257 -87779 -28709 111561 -39048 -98392 97526 43946 -126720 19310
76 19310 110500 -79769 -58752 105618 -12828 -97235 71196 41207 -111497 17387 96234
87 96234 -89284 -64030 110056 -8835 -112122 55083 48642 -107235 3024 90229 -82531
98 -82531 -70045 101393 -5973 -113266 49787 56155 -101632 -6537 86926 -75261 -69512
109 -69512 102388 3464 -110680 47527 62443 -99472 -10059 101946 -54020 -74170 88029
120H8029p6993j05125J51414J2573j68760Q6038J24201j52636l4639J66211o4373
131B5940j18171J38499K7668j59044P3105J20225j49176l7543J68082n9884j27552
142i7851J36026M1703j62185N6189J26683j32856m5723J60375n3837j30170J31462
153B9816N3866j58585M4210J27541j25418n2390J60818m0560j34461J18469N8953
164H2259j52478L8323J34001j17765o5559J50778k7251j29241J09970O1517j51150
175f6596K8313J36583j07378p1713J47001j9666j34664R9782P3011j43257J5460
186d3124J33335r7905p4401J42846j2400j37301R2942P9837j39899O440J35153
$$ plain form
120 88029 11036 -94089 57325 69898 -98862 -12824 111377 -41259 -75898 90313 25940
131 25940 -92231 46268 73936 -85108 -12003 108222 -40954 -78497 89585 29701 -97851
142 -97851 38175 79878 -82307 -26118 100565 -32291 -78014 82361 28524 -101646 29816
153 29816 83682 -74903 -30693 96848 -28570 -80960 79858 39298 -95163 23306 82259
164 82259 -70219 -31896 102105 -15660 -81219 69559 42308 -86933 23037 84554 -66596
175 -66596 -38283 98300 -9078 -80791 66210 46544 -88120 11662 84673 -58584 -43124
186 -43124 90211 -7694 -82095 60751 48351 -88950 3992 83829 -56070 -49630 85523
$$ [...]
8191h85
##END NTUPLES=NMR FID
##END=
