##TITLE=1H_Pr 4762
 CDCl3, 8 sc, 
 6.5.2019
##JCAMPDX= 6.0         $$ Bruker NMR JCAMP-DX V2.0
##DATA TYPE= NMR FID
##DATA CLASS= NTUPLES
##ORIGIN= UXNMR, Bruker Analytische Messtechnik GmbH
##OWNER= root
$$ XWIN-NMR		Version 3.5
$$ Mon May  6 17:17:26 2019 Russian Standard Time (UT+4h)  she@DPX200
##.OBSERVE FREQUENCY= 200.1315
##.OBSERVE NUCLEUS= ^1H
##.DELAY= (6, 6)
##.ACQUISITION MODE= SIMULTANEOUS
##.ACQUISITION SCHEME= undefined
##.AVERAGES= 8
##.DIGITISER RES= 18
##SPECTROMETER/DATA SYSTEM= spect
##.PULSE SEQUENCE= zg30
##.SOLVENT NAME= CDCl3
##.SHIFT REFERENCE= (INTERNAL, CDCl3, 0, 15.7039)
##AUDIT TRAIL= $$ (NUMBER, WHEN, WHO, WHERE, WHAT)
$$ ##TITLE= Audit trail, XWIN-NMR		Version 3.5
$$ ##JCAMPDX= 5.01
$$ ##ORIGIN= Bruker BioSpin GmbH
$$ ##OWNER= she
$$ F:/spectra/data/she/nmr/H-F/1/audita.txt
$$ ##AUDIT TRAIL=  $$ (NUMBER, WHEN, WHO, WHERE, WHAT)
(   1,<2019-05-06 17:16:25.26 +0400>,<she>,<DPX200>,
      <created by zg, POWCHK disabled, PULCHK disabled
       configuration hash MD5:
       00 E9 B6 7A A2 85 ED C7 34 08 36 98 17 FE 4E 26
       data hash MD5: 16K
       B5 0A 62 58 A5 7E D4 D1 DD EA B1 59 A9 3B 16 73>)
$$ ##END=
$$ 
$$ hash MD5
$$ 07 AD 26 71 47 90 73 91 CF 7D 9E 9D 0E 2D 90 96
##$RELAX= 
##$RELAX= 
##$RELAX= 
##$RELAX= 
##$RELAX= 
##$RELAX= 
$$ Bruker specific parameters
$$ --------------------------
##$DU= <F:/spectra>
##$EXPNO= 1
##$NAME= <H-F>
##$PROCNO= 1
##$TYPE= <nmr>
##$USER= <she>
##$AMP= (0..31)
100 100 100 100 100 100 100 100 100 100 100 100 100 100 100 100 100 100 
100 100 100 100 100 100 100 100 100 100 100 100 100 100 
##$AQSEQ= 0
##$AQ_mod= 1
##$AUNM= <au_zg>
##$AUTOPOS= <>
##$BF1= 200.13
##$BF2= 200.13
##$BF3= 200.13
##$BF4= 200.13
##$BF5= 200.13
##$BF6= 200.13
##$BF7= 200.13
##$BF8= 200.13
##$BYTORDA= 1
##$CFDGTYP= 0
##$CFRGTYP= 5
##$CHEMSTR= <none>
##$CNST= (0..31)
1 1 145 1 1 1 1 1 1 1 1 1 1 1 1 1 1 1 1 1 1 1 1 1 1 1 1 1 1 1 1 1 
##$CPDPRG= <>
##$CPDPRG1= <>
##$CPDPRG2= <>
##$CPDPRG3= <>
##$CPDPRG4= <mlev>
##$CPDPRG5= <mlev>
##$CPDPRG6= <mlev>
##$CPDPRG7= <mlev>
##$CPDPRG8= <mlev>
##$CPDPRGB= <>
##$CPDPRGT= <>
##$D= (0..31)
0 1.2 0 0 0 0 0 0 0 0 0 0.03 0 0 0 0 0 0 0 0 0 0 0 0 0 0 0 0 0 0 0 0 
##$DATE= 1557148584
##$DBL= (0..7)
120 120 120 120 120 120 120 120 
##$DBP= (0..7)
150 150 150 150 150 150 150 150 
##$DBP07= 0
##$DBPNAM0= <>
##$DBPNAM1= <>
##$DBPNAM2= <>
##$DBPNAM3= <>
##$DBPNAM4= <>
##$DBPNAM5= <>
##$DBPNAM6= <>
##$DBPNAM7= <>
##$DBPOAL= (0..7)
0.5 0.5 0.5 0.5 0.5 0.5 0.5 0.5 
##$DBPOFFS= (0..7)
0 0 0 0 0 0 0 0 
##$DE= 6
##$DECBNUC= <off>
##$DECIM= 24
##$DECNUC= <off>
##$DECSTAT= 4
##$DIGMOD= 1
##$DIGTYP= 9
##$DL= (0..7)
0 120 120 120 120 120 120 120 
##$DP= (0..7)
150 150 150 150 150 150 150 150 
##$DP07= 0
##$DPNAME0= <>
##$DPNAME1= <>
##$DPNAME2= <>
##$DPNAME3= <>
##$DPNAME4= <>
##$DPNAME5= <>
##$DPNAME6= <>
##$DPNAME7= <>
##$DPOAL= (0..7)
0.5 0.5 0.5 0.5 0.5 0.5 0.5 0.5 
##$DPOFFS= (0..7)
0 0 0 0 0 0 0 0 
##$DQDMODE= 0
##$DR= 18
##$DS= 0
##$DSLIST= <SSSSSSSSSSSSSSS>
##$DSPFIRM= 0
$$ [...]
##$SUBNAM2= <"">
##$SUBNAM3= <"">
##$SUBNAM4= <"">
##$SUBNAM5= <"">
##$SUBNAM6= <"">
##$SUBNAM7= <"">
##$SUBNAM8= <"">
##$SUBNAM9= <"">
##$SW= 24.9337058887773
##$SWIBOX= (0..15)
0 0 2 0 0 0 0 0 0 0 0 0 0 0 0 0 
##$SW_h= 4990.01996007984
##$TD= 16384
##$TD0= 1
##$TE= 0
##$TE2= 300
##$TE3= 300
##$TEG= 300
##$TL= (0..7)
0 120 120 120 120 120 120 120 
##$TP= (0..7)
150 150 150 150 150 150 150 150 
##$TP07= 0
##$TPNAME0= <>
##$TPNAME1= <>
##$TPNAME2= <>
##$TPNAME3= <>
##$TPNAME4= <>
##$TPNAME5= <>
##$TPNAME6= <>
##$TPNAME7= <>
##$TPOAL= (0..7)
0.5 0.5 0.5 0.5 0.5 0.5 0.5 0.5 
##$TPOFFS= (0..7)
0 0 0 0 0 0 0 0 
##$TUNHIN= 0
##$TUNHOUT= 0
##$TUNXOUT= 0
##$USERA1= <user>
##$USERA2= <user>
##$USERA3= <user>
##$USERA4= <user>
##$USERA5= <user>
##$V9= 5
##$VALIST= <valist>
##$VCLIST= <CCCCCCCCCCCCCCC>
##$VD= 0
##$VDLIST= <DDDDDDDDDDDDDDD>
##$VPLIST= <PPPPPPPPPPPPPPP>
##$VTLIST= <TTTTTTTTTTTTTTT>
##$WBST= 1024
##$WBSW= 4
##$XGAIN= (0..3)
0 0 0 0 
##$XL= 0
##$YL= 0
##$YMAX_a= 104825
##$YMIN_a= -107033
##$ZGOPTNS= <>
##$ZL1= 120
##$ZL2= 120
##$ZL3= 120
##$ZL4= 120
##$ABSF1= 10
##$ABSF2= 0
##$ABSG= 5
##$ABSL= 3
##$ALPHA= 0
##$AQORDER= 0
##$ASSFAC= 0
##$ASSFACI= 0
##$ASSFACX= 0
##$ASSWID= 0
##$AUNMP= <proc_1d>
##$AZFE= 0.1
##$AZFW= 0.1
##$BCFW= 1
##$BC_mod= 2
##$BYTORDP= 1
##$COROFFS= 0
##$CY= 11.3945322036743
##$DATMOD= 1
##$DC= 2
##$DFILT= <>
##$DTYPP= 0
##$F1P= 18.9103706918063
##$F2P= -1.10871071338519
##$FCOR= 0.5
##$FTSIZE= 0
##$FT_mod= 4
##$GAMMA= 1
##$GB= 0.15
##$INTBC= 1
##$INTSCL= 1
##$ISEN= 128
##$LB= 0.24
##$LEV0= 0
##$LPBIN= 0
##$MAXI= 10000
##$MC2= 0
##$MEAN= 0
##$ME_mod= 0
##$MI= 1.114404
##$NCOEF= 0
##$NC_proc= 0
##$NLEV= 6
##$NOISF1= 3.799351
##$NOISF2= 2.8
##$NSP= 1
##$NTH_PI= 0
##$NZP= 0
##$OFFSET= 15.70392
##$PC= 1
##$PHC0= -8855.067
##$PHC1= 15.80026
##$PH_mod= 1
##$PKNL= yes
##$PPARMOD= 0
##$PSCAL= 0
##$PSIGN= 0
##$REVERSE= no
##$SF= 200.130013532006
##$SI= 16384
##$SIGF1= 3
##$SIGF2= 2
##$SINO= 400
##$SIOLD= 16384
##$SREGLST= <1H.CDCl3>
##$SSB= 0
##$STSI= 0
##$STSR= 0
##$SW_p= 3612.71676300578
##$SYMM= 0
##$S_DEV= 0
##$TDeff= 0
##$TDoff= 0
##$TI= <>
##$TILT= no
##$TM1= 0
##$TM2= 0
##$TOPLEV= 0
##$USERP1= <user>
##$USERP2= <user>
##$USERP3= <user>
##$USERP4= <user>
##$USERP5= <user>
##$WDW= 1
##$XDIM= 8192
##$YMAX_p= 0
##$YMIN_p= 0
$$ End of Bruker specific parameters
$$ ---------------------------------
##NTUPLES= NMR FID
##VAR_NAME=  TIME,          FID/REAL,        FID/IMAG
##SYMBOL=    X,             R,               I
##VAR_TYPE=  INDEPENDENT,   DEPENDENT,       DEPENDENT
##VAR_FORM=  AFFN,          ASDF,            ASDF
##VAR_DIM=   8192,          8192,            8192
##UNITS=     SECONDS,       ARBITRARY UNITS, ARBITRARY UNITS
##FACTOR=    0.0002004,     1,               1
##FIRST=     0,             0,               0
##LAST=      1.6414764,     0,               0
##MIN=       0,             -107033,         0
##MAX=       1.6414764,     104825,          0
$$ Real data points
##PAGE= N=1
##DATA TABLE= (X++(R..R)), XYDATA
0@%%%%%%%%Pj5J6j6J7k5L2m0M9n7P0q0R2j08J26j47J69j95K24k54K88l29L72m16
$$ 0 0 0 0 0 0 0 0 0 7 -8 8 -8 9 -16 16 -24 25 -32 38 -42 50 -58 68 -79 90 -105 119 -135 153 -176 196 -220
32b20M68n26N87o54P29q10Q99r98J106j224J354j500J663j842K042k269K532k835
$$ -220 248 -278 309 -345 384 -426 473 -525 581 -643 711 -789 874 -968 1074 -1195 1337 -1498
50a498L184l598M099m719N508o552Q006j0186J3858k1603O6502r0477m4725J87026
$$ -1498 1686 -1912 2187 -2532 2976 -3576 4430 -5756 8102 -13501 53001 -37476 -82201 104825
64A04825r0077j01140J36114J8855j56814Q8895R7057j47096j4946J63158q5408
$$ 104825 14748 -86392 49722 68577 -88237 658 97715 -49381 -64327 98831 13423
75A3423j11458J44774K7538j59661P0465J09835j36257k6493J54250p0176j12849
$$ 13423 -98035 46739 74277 -85384 -14919 94916 -41341 -67834 86416 16240 -96609
86i6609J36376L3199j55610N8380J15532j25682l6804J46927n6196j12173J24937
$$ -96609 39767 72966 -82644 -24264 91268 -34414 -71218 75709 19513 -92660 32277
97C2277L7149j49285N2130J18280j21813m5808J46157m2222j17150J12494M6203
$$ 32277 69426 -79859 -27729 90551 -31262 -77070 69087 26865 -90285 22209 68412
108F8412j40690M0421J15853j11323m8212J41011l7090j19533J09139N3954j40083
$$ 68412 -72278 -31857 83996 -27327 -75539 65472 28382 -91151 17988 71942 -68141
119f8141L0277J20551j03416n7120J37687k5824j22218R9407O1806j34985J9748
$$ -68141 -37864 82687 -20729 -77849 59838 34014 -88204 11203 73009 -61976 -42228
130d2228J21356r3191o2669J31324j7791j20664R2135O5318j31467J3704J23947
$$ -42228 79128 -14063 -76732 54592 36801 -83863 8272 73590 -57877 -44173 79774
141G9774q8048p0288J29850p724j22919Q2050P2427j25125M685J22256p8958p3290
$$ 79774 -8274 -78562 51288 43564 -79355 2695 75122 -50003 -45318 76938 -2020 -75310
153g5310J23945j205j22532P4806P7045j20162l326J20912o9918p7551J17770
$$ -75310 48635 47430 -75102 -296 76749 -43413 -46739 74173 4255 -73296 44474
164D4474O434j20775O5806Q0457j13370j0364J18822o2339q0452J11708J2408
$$ 44474 50908 -69867 -4061 76396 -36974 -47338 71484 9145 -71307 40401 52809
175E2809j18551N8969Q2596j08825j6567J18530n4848q4645J04633K0918j16111
$$ 52809 -65742 -6773 75823 -33002 -49569 68961 14113 -70532 34101 55019 -61092
186f1092M9839Q5141j02197k2496J15723m7909q6296R9369K5333j14779M4340
$$ -61092 -11253 73888 -28309 -50805 64918 17009 -69287 30082 55415 -59364 -15024
197a5024Q7740r7244k9117J14268l9935q9811R3725L2489j13726L6396R0902r1173
$$ -15024 72716 -24528 -53645 60623 20688 -69123 24602 57091 -56635 -20239 70663 -20510
209b0510l6034J13050l3080r3178Q9297L8154j11869K8867R4088q6385m1963J11367
$$ -20510 -56544 56506 23426 -69752 19545 57699 -54170 -25303 68785 -17600 -59563 51804
221E1804k5413r5644Q2291M5231j09302K0911R5494p9194m6990J07676j8702r6695
$$ 51804 26391 -69253 13038 58269 -51033 -30122 65372 -13822 -60812 46864 28162 -68533
233f8533P6624N0533j06967J4024R7656p2830n3215J04258j0025r7758O8848N5215
$$ -68533 8091 58624 -48343 -34319 63337 -9493 -62708 41550 31525 -66233 2615 57830
245E7830j01610O628R7460o5866n7001J00043l622r7341O2509N9104r7453k16
$$ 57830 -43780 -37152 60308 -5558 -62559 37484 33862 -63479 -970 58134 -39319 -39535
257c9535R7564n8774o1447R5601M222r7339N4585O3567r2295p060R6376n0849
$$ -39535 58029 -745 -62192 33409 37631 -59708 -5123 58444 -33851 -40911 55465 4616
269D616o5364R0655J0489r6700M8489O7053q8536j3358R6778m4263o9865Q6498
$$ 4616 -60748 29907 40396 -56304 -7815 59238 -29298 -42656 54122 9859 -60006 26492
281B6492J7551r6087M0520P1240q3451k0015R5321l6803p3466Q1864K3401r5318
$$ 26492 44043 -52044 -11524 59716 -23735 -43750 51571 14768 -58698 23166 46567 -48751
293d8751L4966P4452p9646k6359R5448l0853p6685P7288K9697r4832K7892P7777
$$ -48751 -13785 60667 -18979 -45338 50110 19257 -57428 19860 49557 -45275 -17383 60394
305F0394p4568l2242R3720k4456p8907P2286L4904r3316K1898P9946p0033l7380
$$ 60394 -14174 -46416 47304 22848 -56059 16227 51131 -42185 -20287 59659 -10374 -47754
317d7754R2345j8650q1039O7316M0232r1257J4655Q1538o3908m2759Q9441j1635
$$ -47754 44591 25941 -55098 12218 52450 -38807 -24152 57386 -6522 -49281 40160 28525
329B8525q1911O0738M4809q8305Q718Q2471n8600m7422Q6819n080q3199N5213
$$ 28525 -53386 7352 52161 -36144 -27426 55045 -3555 -50977 35842 30762 -52437 2776
341B776M8788q4474J840Q2907n2024n1383Q2529R26q2849M9166N2342q1107l548
$$ 2776 51564 -32910 -31070 51837 -187 -51570 30959 31885 -50964 -1798 50544 -30563 -34111
354c4111Q3114m6845n4690P9438O913q3333M3127N6759p7316j0069Q3013m0278
$$ -34111 49003 2158 -52532 26906 33819 -49514 -6387 50372 -26944 -37013 46000 5722
366E722n8975P5857J2927q3390L6989O0973p4218j5858Q3450l4484o2590P2083
$$ 5722 -53253 22604 35531 -47859 -10870 50103 -24115 -39973 43477 8993 -53597 18486
378A8486J9550q4134L1141O5344p0562k2491Q3659k8035o6247O7939K5273q3528
$$ 18486 38036 -46098 -14957 50387 -20175 -42666 40993 12958 -53289 14650 39923 -43605
390d3605K5569O7933o6027k7890Q3052k2023o9195O3951L0518q2137J8630P0959
$$ -43605 -18036 49897 -16130 -44020 39032 17009 -52186 11765 42283 -39854 -21224 49735
402D9735o1132l3379Q1357j5521p1383N8582L5747p9338J2683P1696n6064l8168
$$ 49735 -11397 -44776 36581 21060 -50323 8259 44006 -35332 -22649 49047 -7017 -45185
414d5185P9820r959p2766N3599M0688p8120O728P3557n0548m2806P6384l041p3837
$$ -45185 34635 24676 -48090 5509 46197 -31923 -25195 48362 -2186 -44992 31392 28351 -45486
427d5486M7874M4518p4251N95P3717m5207m6002P3147J832p4285M3071M8417p2313
$$ -45486 2388 46906 -27345 -26750 46967 1760 -44242 28905 30737 -43548 -477 47940 -24373
440b4373m691P4808m0200m9866O9886P350p4254L7874N1924o9545r962P5108l5883
$$ -24373 -29064 45744 5544 -44322 25564 32914 -41340 -3466 48458 -21087 -31049 44059 8176
453H176n2901O7602J2234p5211L3157N4928o6537j4993P5809l1350n6744O5264
$$ 8176 -44725 22877 35111 -40100 -6943 47985 -18552 -33545 42264 10914 -45830 19434
465A9434J6647p5134K8631N7688o4097j8765P5674k7182n9812O3733K0697p6105
$$ 19434 36081 -39053 -10422 47266 -16831 -35596 40078 12896 -46916 16817 37514 -38591
477c8591K4886O0467o1669k3148P5423k2592o1910N9820K5177p5003K0005O2199
$$ -38591 -13705 46762 -14907 -38055 37368 14776 -47134 12686 37863 -37140 -17135 45064
489D5064n7854k6925P4335j8704o3081N6627K8872p4571J6454O4056n4568l0951
$$ 45064 -12790 -39715 34620 15916 -47165 9462 38334 -36237 -19783 44273 -10295 -41246
501d1246P2787j3356o4403N2450L2299p2111J1407O4789n0417l4317P1241q786
$$ -41246 31541 18185 -46218 6232 38531 -33580 -22173 42616 -7801 -42118 29123 20337
513B0337o5633M8724L5922p0032O315O6583m6792l8243O9655l874o6452M4045
$$ 20337 -45296 3428 39350 -30682 -24367 42216 -4576 -42819 26836 22962 -43490 555
525E55L9710o7961K146O6620m2723m0966O7868J94o7461M0607M3009o6414k654
$$ 555 40265 -27696 -25550 41070 -1653 -42619 25249 25443 -42018 -1411 41598 -24816 -27470
538b7470O7853l8172m4744O5472N396o8535L6614M6425o4263p273O8562l4528
$$ -27470 40383 2211 -42533 22939 28335 -40200 -3586 42839 -21424 -28697 39865 5337
550E337m7123O3542R512o9276L2501M9641o2817j1503O9932l0365n1167O1566
$$ 5337 -41786 21756 31268 -38008 -5507 44134 -18683 -30186 39746 9381 -41786 19780
562A9780J3299o9230K8465N2094n9979j5639O9394k6339n2757N8426J7289o9037
$$ 19780 33079 -36151 -7686 44408 -15571 -31210 38184 11845 -40912 17514 34803 -34234
574c4234K4531N4038n7206j9547O8976k2107n5489N5324K1695o8499J9880N5919
$$ -34234 -9703 44335 -12871 -32418 36558 14451 -41038 14286 35981 -32518 -12638 43281
586D3281n3647k3130O7276j7869n6419N1661K5064o6896J5485N7115m9986k7056
$$ 43281 -10366 -33496 33780 15911 -40508 11153 36217 -30679 -15194 41921 -8065 -35121
598c5121O6059j3228n8314M8482K8761o5416J0346N8562m6114l0234O4235r129
$$ -35121 30938 17710 -40604 7878 36639 -28777 -18431 40131 -5983 -36217 28018 18889
610A8889n9007M4726L1546o3822P044N9307m3020l3494O3278n146o0129M1160
$$ 18889 -40118 4608 36154 -27668 -20624 38683 -4337 -37831 25447 20301 -39828 1332
622A332L5198o3158L259O0909m0193l6502O1820r99o1467L8707L7922o1900o34
$$ 1332 36530 -26628 -23369 37540 -2653 -39155 22665 21666 -39801 -1094 36828 -25072 -25706
635b5706O2143l7103l9176O0372L138o2433L4986M0689n9618m353O2250l3229
$$ -25706 36437 -666 -39842 20530 23668 -38765 -3779 36910 -22708 -27061 35189 1960
647A960m2146N8975O343o2418L1548M3391n7644q572O3267k9914m4429N6371J0518
$$ 1960 -40186 18789 25132 -37286 -5738 37653 -19991 -28563 34704 4790 -39639 16732 27250
660B7250o2646K7561M5817n4759j2579O2400k5064m6994N4298J3531o1796K3964
$$ 27250 -35396 -7835 37982 -16777 -29356 33044 7980 -39014 15284 28815 -32981 -9017
672i017M7096n1852j5655O1626k1597m8252N0949J7447o1070J9872M9075m9141
$$ -9017 38079 -13773 -29428 32198 10601 -37651 13298 30745 -30325 -10453 38622 -10519
684a0519j9334O0900j7938m9497M7901K0479n9753J5658N0272m6193k2141N9920
$$ -10519 -29853 31047 13109 -36388 11513 31992 -27761 -12103 38169 -8024 -30165 29755
696B9755j4044n1252M4605K4050n9284J1948N2050m3330k5295N8309j0340n2161
$$ 29755 15711 -35541 9064 33114 -26170 -14222 37828 -5502 -30797 27512 17172 -34989
708c4989M2032K6966n8223Q188N3447m1000k8760N8191o502n3997L9293K9935
$$ -34989 7043 34009 -24214 -16026 37421 -3579 -32339 25852 19350 -34647 4646 34581
720C4581n7663N150N3826l7703l1520N6803l178n4631L6208L2703n6134J063N5037
$$ 34581 -23082 -17932 35894 -1809 -33329 23474 20296 -34335 1873 34576 -21558 -20495 34542
733C4542l4851l3975N5472J90n5575L3263L4782n4032k345N5241l1362l6146N3155
$$ 34542 -309 -34284 21188 21378 -34197 -934 33848 -20184 -22529 32712 1350 -34796 18359
746A8359L784n5461K9295L7564n2226n647N5351k8495l7563N0631P074n5072K6108
$$ 18359 22143 -33318 -4023 33541 -18685 -24332 31019 2524 -35039 15592 22666 -32406 -6298
759f298L9319m9565r527N4877k3942l9971M8181J0562n4375K2535M0858m7244
$$ -6298 33021 -16544 -26071 28806 4864 -35107 13074 23636 -30739 -8204 32654 -14590
771a4590j2141N4223k0635m1612M5784J4020n4004J9032M2602m5026j4959N3458
$$ -14590 -26731 27492 6857 -34755 11029 25049 -28955 -9923 32679 -12347 -27306 26152
783B6152j7008m2972M3170J6943n3635J5924M3986m2237j8289N3587j4494m4687
$$ 26152 9144 -33828 9342 26285 -27350 -11426 32560 -9677 -27966 25621 11127 -33560
795c3560M1489K0205n3701J2695M5895m0011k1107N2952j1175m5853L8956K2694
$$ -33560 7929 28134 -25567 -12872 33023 -6988 -28095 24857 13682 -32171 6785 29479
807B9479n2908R788M6331l7527k3649N2260p850m7417L6614K5167n1339N815M8131
$$ 29479 -23429 -13641 32690 -4837 -28486 23774 15924 -31493 5121 30288 -21051 -15236 32895
820C2895l4766k6641N0664m111m8030L3453K7927n0261K297M8843l1890k9230
$$ 32895 -1871 -28512 22152 18041 -29989 3464 31391 -18870 -16573 32270 380 -28850
832b8850M9266j107m8559L0733K9714m8461p31M8634k8116l1123M6780K751m8638
$$ -28850 20416 19309 -29250 1483 31197 -17264 -17995 30639 2523 -28600 18180 20931 -27707
845b7707K6423L2101m5837m633M8547k4828l3560M5188O172m8961K3031L4953
$$ -27707 -1284 30817 -15020 -19653 28894 4066 -29494 15694 21866 -27095 -4064 30889
857C0889m4163q093M8485k1875l4803M2510R313m8273J9505L6218m1696j0427
$$ 30889 -13274 -21367 27118 5243 -29560 12950 22263 -26010 -6505 29713 -11983 -22410
869b2410M7633j8480l7040M1079J1967m8165J6848L7745l9823j3980M8319j5708
$$ -22410 25223 6743 -30297 10782 22749 -25416 -8568 29177 -10646 -24626 23693 7985
881G985l8366L8585J4977m7742J3795L9309l7523j6556M7379j2133l9819L6134
$$ 7985 -30381 8204 23181 -24561 -10766 28543 -8980 -25536 21843 9710 -30109 6025
893F025J8220m7731J0585M1485l5551j9820M6972q675m1368L3523K1205m6369
$$ 6025 24245 -23486 -12901 28584 -6967 -26787 20185 11510 -29858 3665 24870 -21499
905b1499O891M1948l2276k2183M5860n299m2776L1561K3324m5420M382M2855l0250
$$ -21499 -14608 27340 -4936 -27119 18741 13442 -29334 2227 25551 -19869 -15487 27368 -2882
918b882k4174M4837k888m2766K8610K5622m3723J112M2939k6993k6297M2605O85
$$ -2882 -27056 17781 14893 -27873 737 26359 -17364 -16252 26687 -306 -26603 16002 16687
931A6687m3107K5951K7743m2608j867M3433k4291k8458M1474L475m3342K2734
$$ 16687 -26420 -469 27274 -15334 -17201 26232 1941 -26517 14957 18432 -24910 -2176
943b176K9617m0200n313M3639k1165l0499L9739O584m3538J9875L1345l8855p887
$$ -2176 27441 -12759 -18072 25567 4402 -26097 13642 20226 -23312 -3437 27908 -10947 -18834
956a8834M3682j8497l2308L8202R072m3795J7433L2922l7394j0004M3701j6257
$$ -18834 24848 6351 -25957 12245 21317 -22478 -5045 27877 -9517 -19521 24180 7923
968G923l3979L6701J1352m3432J4644L4793l5668j3275M3625j3460l5485L4921
$$ 7923 -26056 10645 21997 -21435 -6791 28002 -7666 -20941 22684 9224 -26261 8660
980H660J4416m3673J1699L6345l3922j5466M3077j1011l6281L2602J6901m3329
$$ 8660 23076 -20597 -8898 27447 -6475 -21941 21136 10125 -26156 6446 23347 -19982
992a9982R249L7480l2185j7802M2789q169l7798L0865J9183m2609O177L8466k9422
$$ -19982 -10733 26747 -5438 -23240 19549 11380 -26418 4447 23630 -18979 -12802 25664 -3758
1005c758k0287M1445m929l8782K8269K1589m1378L184L9333k7095k2676M0455
$$ -3758 -24045 17400 12471 -26311 1958 23547 -17831 -14647 24686 -2409 -25085 15370
1017A5370j570l9522K5389K3894l9788N73L9225k4387k4561L9029J001l9611K3096
$$ 15370 13800 -25722 -333 23561 -16227 -15654 23571 -816 -25377 13652 14653 -24958 -1862
1030a862K5510l8689j936L9611k1635k6545L7873L897m0554K0890K7625l6929
$$ -1862 23648 -15041 -16977 22634 999 -25546 12327 16224 -24330 -3440 24185 -12744
1042a2744n012L9918j9425k8796L7035O610m0514J8012K9492l6023p728M1030
$$ -12744 -17756 22162 2737 -26059 10976 17586 -22928 -4916 24576 -11447 -19175 21855
1054B1855j6900l0331L5037R300m0819J5821L1450l4789j0164M0715j4569l1648
$$ 21855 4955 -25376 9661 18961 -21858 -6037 25413 -9376 -19540 21175 6606 -25042
1066b5042L3936J1437m0615J2977L3127l2955j2643M0598j1766l3751L1890J4514
$$ -25042 8894 20331 -20284 -7307 25820 -7135 -19778 20820 9054 -24697 7193 21707
1078B1707m0335J0285L3953l0875j5342M0265q766l5101K9963J6796m0001P716
$$ 21707 -18628 -8343 25610 -5265 -20607 19658 10892 -24209 5754 22550 -17451 -9735
1090i735L5482k8952j7914L9455n998l5579K7496J8917l9286M920L6432k6786
$$ -9735 25747 -3205 -21119 18336 12338 -23241 4255 23172 -16114 -11194 25238 -1548
1102a548k0113L8741l470l6414K5098K0966l7835J999L6436k3825k2314L7697
$$ -1548 -21661 17080 13610 -22804 2294 23260 -14575 -12576 23860 35 -22279 15418
1114A5418o93l7620K3605K2500l6975o57L7386k1791k4525L7040J451l7776K1148
$$ 15418 14725 -22895 710 23210 -13765 -14422 22964 1173 -23352 13688 15139 -22637 -1489
1127a489K4892l6363k858L7888k0344k5720L5986L944l8565J9492K6267l5133
$$ -1489 23403 -12960 -15818 22070 1726 -23994 11992 15936 -22629 -3137 23130 -12003
1139a2003n067L7996j8124k7124L4763N925l8639J7266K8312l4396p611L8936
$$ -12003 -17070 20926 2802 -24322 10441 16366 -22273 -5007 23305 -11091 -18702 20234
1151B0234j6030k9130L3212R135l8826J4965K9529l2910r697L8758j3638l0209
$$ 20234 4204 -24926 8286 17421 -21405 -6440 23089 -9821 -19518 19240 5602 -24607
1163b4607L1738J1434l8611J1798L1113l0579j2467L8551j0722l2452L0515J3492
$$ -24607 7131 18565 -20046 -8248 22865 -7714 -20181 18370 7648 -24804 5711 19203
1175A9203l8424R745L2547k9042j5013L8171p991l2834K7856J6074l7495P003
$$ 19203 -19221 -9476 23071 -5971 -20984 17187 9196 -23638 4218 20292 -17203 -10200
1187a0200L3200k6771j7041L7041n346l3703K5761J8124l6394M010L4019k4398
$$ -10200 23000 -3771 -20812 16229 10883 -22820 2941 21065 -15329 -11319 22700 -1698
1199a698j9139L6124k991l4237K4102J9900l5741J587L4825k2690k0955L5302
$$ -1698 -20837 15287 12296 -21941 2161 22061 -13680 -12093 22732 42 -20913 14389
1211A4389l51l5204K1809K2279l5612o00L5674k0879k3104L5052J892l5674J9959
$$ 14389 14038 -21166 643 22922 -12690 -13290 22384 1505 -21599 13453 15345 -20329 -370
1224c70K3535l4367l002L6623j9288k4721L3859M184l6382J7422K6075l3605n487
$$ -370 23165 -11202 -14204 22419 3131 -21590 12269 16453 -19929 -2507 23568 -10037 -15524
1237a5524L6364j6505k6405L2826O239l6592J5696K7190l2316p482L6611j4884
$$ -15524 20840 4335 -22070 10756 16995 -19597 -3901 23289 -9027 -16509 20102 5218
1249E218k7570L1274Q915l6899J3227K8690l0277j0566L6785j2426k9160K9792
$$ 5218 -22352 8922 17837 -19062 -5835 22855 -7422 -17988 18797 6371 -22789 7003
1261G003J1003l6378J0959K9697k8966j2203L6255r844l0185K7698J3198l5764
$$ 7003 18006 -18372 -7413 22284 -6682 -18885 17370 7526 -22659 5039 18237 -17527
1273a7527Q311L0603k7205j3937L5499p281l1186K6185J5005l5011N837L1648
$$ -17527 -9216 21387 -5818 -19755 15744 8463 -22723 3462 18467 -16544 -10707 20941
1285B0941k5258j6164L5123n350l1800K4260J7345l4960L906L2933k3727j8431
$$ 20941 -4317 -20481 14642 9292 -22508 1752 19097 -15863 -11957 20976 -2751 -21182
1297b1182L4957k858l2990K2795J8994l3924J667L2818k1197k0358L3882l78l3719
$$ -21182 13775 10917 -22073 722 19716 -14208 -12541 20277 -920 -21278 12604 12226 -21493
1310b1493K1256K0558l3450k01L3947k0371k1578L3390J548l4043J9340K1961
$$ -21493 -237 20321 -13129 -13330 20617 246 -21332 12058 13606 -20437 -1097 20864
1322B0864l2097k738L4015j8025k3184L2543L311l4175J7456K3674l1883m323
$$ 20864 -11233 -13971 20044 2019 -21165 11378 14689 -19486 -2030 21644 -10239 -14562
1334a4562L4526j6571k4040L0840N620l4185J5088K5105l0141p090L4882j4150
$$ -14562 19964 3393 -20647 10193 15813 -18372 -3284 21821 -8320 -15410 19472 5322
1346E322k5795K9603P611l4189J2685K6818k8677r243L4315j1805k7107K7756
$$ 5322 -20473 9130 16741 -17448 -4763 22055 -6622 -15865 18450 6645 -20462 7294
1358G294J0265l3935J0349K7436k6720j1220L3685r318k8070K6367J1766l3449
$$ 7294 17559 -16376 -6027 21409 -5311 -16531 17154 7836 -20234 6133 17899 -15550
1370a5550Q611K7779k5302j2728L3387p611k8807K4716J3775l2999O072K9070
$$ -15550 -6939 20840 -4462 -17190 16197 8586 -20221 4495 18270 -14729 -8657 20413
1382B0413k3771j4961L3046n344k9931K3542J5569l3185M412L0408k2877j6443
$$ 20413 -3358 -18319 14727 9383 -20548 2994 18563 -14622 -10210 20198 -2679 -19122
1394a9122L2876l752l0426K1664J7446l2135J957L1160k1194j8638L2293j391
$$ -19122 13754 10002 -20424 1240 18686 -13449 -11492 19668 -1526 -20164 12129 10738
1406A0738l0954K0015J9190l1639j05L1693j9415j9688L1228O54l1340J8035K0648
$$ 10738 -20216 -201 18989 -12650 -12755 18938 -477 -20165 11063 11717 -19623 -1588 19060
1419A9060l0824j950L1695j6879k1709K9886L455l1562J5967K1961k9168m468
$$ 19060 -11764 -13714 17981 1102 -20607 9279 12734 -18828 -2861 19100 -10068 -14536
1431a4536L1799j4784k2539K8309N701l1487J3382K3126k7454o186L1422j2869
$$ -14536 17263 2479 -20060 8249 13950 -17537 -4155 18971 -8483 -14669 16753 3884
1443C884k3743K7192P580l1717J1743K4353k6285q550L1417j0516k4586K5354
$$ 3884 -19859 7333 14913 -16804 -5061 19292 -6993 -15543 15874 5358 -19228 6126
1455F126R316l0596R245K5460k5120j0075L1294q951k5589K4376J0986l1074P867
$$ 6126 15442 -15154 -5909 19551 -5569 -15644 15650 6699 -18890 5486 16472 -14602 -6735
1468f735K6772k3747j2230L0871o489k6902K3022J2716l0728O395K6394k2232
$$ -6735 20037 -3710 -15940 14931 8442 -18460 4562 17278 -13450 -7055 19339 -2893
1480b893j3242L0349n094k7289K1780J4328l0210L789K8038k0962j5197K9900
$$ -2893 -16135 14214 9120 -18169 3611 17939 -12271 -8482 19556 -1406 -16603 13297
1492A3297l291k8001K0049J5865k9713K356K8294j9321j6660K9368j475k8570
$$ 13297 10006 -17995 2054 17919 -11794 -9438 18856 -465 -17125 12243 10768 -17802
1504a7802J8507J7082k8542P4K8813j8048j7650K8146J039k8750J5960J9055k7546
$$ -17802 705 17787 -10755 -10681 18132 84 -17566 10580 11619 -17131 -1171 17884 -9662
1517i662k401K8864j5343j9485K7089K753k8558J4444J9603k6208l784K8450j3674
$$ -9662 -12063 16801 1458 -18027 9062 11815 -16743 -2299 17304 -8904 -12688 15762 2088
1530B088k0446K6049M383k8331J2489K0954k5257n964K8645j1441k1443K4606
$$ 2088 -18358 7691 12074 -16257 -3768 17186 -8071 -14035 14610 3169 -18274 6332
1542F332O541k8677J0760K1957k4014p240K8419r912k2385K3577Q040k8298Q850
$$ 6332 12873 -15804 -5044 16913 -7101 -14341 14078 4166 -18219 5358 13398 -14900 -6050
1555f050K3014k2466r220K8076q173k3099K2059R955k8302P295K3971k1582j0889
$$ -6050 16964 -5502 -14722 13354 5181 -17918 4141 14096 -14206 -6911 17060 -4522 -15411
1568a5411K8090n839k4543K1047J1359k8041N551K4800k0178j2405K7968m853
$$ -15411 12679 6840 -17703 3344 14703 -13338 -7787 17013 -3165 -15570 12398 7545
1580G545k4672J9617J3112k7360L580K5521j9196j3461K6906k786k5316J8400
$$ 7545 -17127 2490 15602 -11758 -8178 17343 -1853 -15314 11592 8806 -16510 1890
1592A890J4252k6746J834K5816j7376j5098K6130o82k5885J6752J5809k5830k85
$$ 1890 16142 -10604 -8770 17046 -330 -15428 10702 10020 -15865 887 16696 -9134 -9419
1605i419K5761j5640j5950K5185P97k5455J4457J6863k4923j780K5922j3579j7884
$$ -9419 16342 702 -15248 9937 10734 -14721 -264 16599 -8324 -10104 15818 2239 -15645
1618a5645K4673K790k6215J3073J7650k3430l554K5672j1798j9382K3804M435
$$ -15645 9028 11818 -14397 -1324 16326 -7104 -10658 15014 3216 -16166 7638 12073
1630A2073k6338J1560J9418k3082n403K6079j0331j9577K1738O510k6053R558
$$ 12073 -14265 -2705 16713 -6369 -11772 14307 3976 -15601 6137 12647 -13406 -3848
1642c848K0248k2095p088K6070q873k0571K1440P572k6109Q274K0955k0703q816
$$ -3848 16400 -5695 -12783 13287 4414 -16157 5283 12855 -13254 -4980 15975 -4728 -13544
1655a3544K5874o711k1732K0066R394k6053O308K1953j9666j0030K5784n836k1872
$$ -13544 12330 5619 -16113 3953 13347 -12706 -6398 15555 -4111 -14141 11643 5807 -16065
1668a6065J8946J0361k5222M447K2433j8494j0911K5069l689k3160J7825J2098
$$ -16065 2881 13242 -11980 -7533 14900 -3594 -14505 10564 6875 -16285 1540 13638
1680A3638k4829L065K2720j6636j3068K4934k444k3196J6441J3256k4024J099
$$ 13638 -11191 -8126 14594 -2042 -15110 9824 7380 -15816 625 13881 -10143 -9044
1692i044K3184j5064j3690K3775m61k3697J4851J4629k3463m29K3684j3998j4943
$$ -9044 14140 -924 -14614 9161 8700 -14997 -146 14483 -8980 -9409 14275 277 -14666
1705a4666K3078J086k3725J3316J5217k2224j821K3615j2699j5902K2458K201
$$ -14666 8412 9498 -14227 -911 14306 -7918 -9739 13876 1177 -14725 7733 9934
1717I934k3405J1914J6550k1720l499K3753j0973j6775K1267M214k3994J0412
$$ 9934 -13471 -1557 14993 -6727 -10226 13527 2554 -14221 7046 11260 -12734 -2322
1729b322J7507k0926m670K3573r588j7705K0348N564k3774Q797J8440k0045o255
$$ -2322 15185 -5741 -10411 13162 3574 -14131 6217 11781 -11993 -3196 15244 -4801 -11056
1742a1056K3943q188j9140J9793O972k3954P347J9264j8907p486K3764o988j9510
$$ -11056 12887 4699 -14441 5352 12324 -11630 -4283 14981 -3926 -11412 12352 5364 -14146
1755a4146J8048Q618k3314N893J9867j7888r369K3224m803k0078J6877J0029k3178
$$ -14146 3902 12520 -10794 -4901 14966 -2922 -12291 10933 6130 -13948 2929 12958 -10220
1768a0220M350K0210j6463j0435K2749l168k0897J5858J0703k2741L139K0747
$$ -10220 -5870 14340 -2123 -12558 10191 7023 -13874 1984 12687 -10054 -6915 13832
1780A3832j5294j1954K2529j839k1392J5057J1919k2087Q99K1595j4143j2749
$$ 13832 -1462 -13416 9113 7274 -14118 939 12858 -9229 -8330 13265 -878 -13627
1792a3627K1931q01k1092J3348J3061k1542q6K1508j2861j3711K1108O02k1238
$$ -13627 8304 7503 -13589 -241 12820 -8722 -8808 12700 -161 -13872 7236 7838 -13400
1805a3400J2151J4139k0872j487K1755j1697j4583K0493K296k1855J0959J4920
$$ -13400 -1249 12890 -7982 -9469 12286 589 -13994 6499 8795 -13060 -2101 12819
1817A2819k0012k652K1737j0526j5521K0203L436k2273J0421J5610j9230m611
$$ 12819 -7193 -9845 11892 1366 -14155 6048 9484 -12789 -2368 13242 -5988 -10599
1829a0599K2275r332j6412J9702M307k1884Q604J6992j8837n350K2115p981j7458
$$ -10599 11676 2344 -14068 5634 9941 -11943 -3339 13653 -5184 -10534 11581 3600 -13858
1842a3858J8529O155k1803P236J6807j7078o836K1847o604j7316J6971P402k1519
$$ -13858 4671 10826 -10977 -3741 13066 -4012 -10848 10999 4395 -12921 4050 11452 -10067
1855a0067N502J8096j6304q165K1465n045j8329J6113Q728k1542M567J8593j5767
$$ -10067 -4565 13531 -2773 -10938 10527 5482 -12847 3266 11994 -9548 -4981 13612 -2155
1868b155r192K1176l329j9183J4816J0254k1086K826J9258j4281j0779K0875j918
$$ -2155 -11347 9829 6500 -12683 2133 12387 -8699 -5873 13385 -896 -11675 9200 7282
1881G282j9384J3548J1207k0326J087J9372j3045j1719K0096k61k0026J2818J1887
$$ 7282 -12102 1446 12653 -7673 -6586 12786 -259 -11978 8118 7857 -12169 649 12536
1894A2536j9756m13K0268j2081j2599J9605N80j9957J1634J3038j9833j049J9969
$$ 12536 -7220 -7633 12635 554 -12045 7560 8140 -11817 -183 12855 -6978 -8027 11942
1907A1942j0847j3560J9035J692k0339J0420J3838j8479k870K0678j0032j4162
$$ 11942 1095 -12465 6570 8262 -12077 -1657 12181 -6298 -9168 11510 1478 -12684
1919a2684J8128L127k0188R474J4399j8385l482J9978q156j5188J7660M331j9990
$$ -12684 5444 8571 -11617 -2143 12256 -6129 -9611 10367 2211 -12977 4683 9014 -10976
1932a0976P731J5512j7499m856K0100p305j5441J6682N544k0009O446J5995j6296
$$ -10976 -3245 12267 -5232 -10088 10012 2707 -12734 3948 9492 -10517 -4071 11924 -4372
1945d372n834J9613n997j6114J5589O852j9753N427J6482j5383p074J9530m325
$$ -4372 -10206 9407 3410 -12704 2885 9737 -10016 -4589 11893 -3490 -10564 8966 4641
1958D641j6771J4779P478j9224L954J6926j4291q035J9292l474j7356J3859Q638
$$ 4641 -12130 2649 10127 -9097 -5143 11783 -2508 -10543 8749 5275 -12081 1778 10416
1971A0416j8689K878J7381j3348r489J9070k050j7795J2860R505j8159J353J7776
$$ 10416 -8273 -5395 11986 -1362 -10851 8219 6169 -11626 1234 10739 -7420 -6067 11709
1984A1709j2435j0074J8519p24j8067J1795J0634j8083O39J7412j1077j1173J7926
$$ 11709 -726 -10800 7719 6995 -11072 723 11357 -6726 -6087 11325 248 -10925 7001
1997G001M46j8218J0963J1592j7849p13J8255j0546j1556J7581J099j8438R986
$$ 7001 7447 -10771 192 11784 -6065 -6778 11477 931 -10625 6956 8055 -10383 -397
2010c97J2104j6827j814J7989r351j2484J6589K270j7806P929J3492j6271l361
$$ -397 11707 -5120 -6934 11055 1704 -10780 5809 8079 -9727 -1798 11694 -4577 -7938
2023g938J8054p926j3016J5761L357j7499O735J3792j5558m009J7664o731j3789
$$ -7938 10116 2190 -10826 4935 8292 -9207 -2472 11320 -4238 -8247 9417 2686 -11103
2036a1103J5168M680j7814N681J4390j4765n263J7805n400j4379J4050N855j7654
$$ -11103 4065 8745 -9069 -3388 11002 -3763 -9026 8779 3379 -11000 3050 8905 -8749
2049h749M495J4835j3700o626J7823m401j4619J2892O871j7341L705J5037j2766
$$ -8749 -4254 10581 -3119 -9745 8078 3677 -10942 1950 8821 -8520 -4815 10222 -2544
2062b544p246J7288l299j5209J2343P994j7245K543J5655j2217q152J6906j973
$$ -2544 -9790 7498 4199 -11010 1333 9327 -7918 -5375 10280 -1937 -10089 6817 4844
2075D844j5612J1362Q687j6859J805J5893j1155r236J6925j287j5811J0392R672
$$ 4844 -10768 594 9281 -7578 -5773 10120 -1035 -10271 6654 5367 -10444 -52 9620
2088I620j6416N28J6052j0260r714J6247Nj5815R359J0380j5817p51J6351r038
$$ 9620 -6796 -6268 9784 -476 -10190 6057 6062 -9753 -394 9986 -5831 -6582 9769 731
2102G31j0853J5741J113j6277Q868J0608j5070j577J6215p740j1195J4168K689
$$ 731 -10122 5619 6732 -9545 -677 9931 -5139 -6716 9499 1759 -9436 4732 7421
2115G421j6372P603J1446j4382k543J6216p205j1801J4202L330j6220O514J2123
$$ 7421 -8951 -1348 10098 -4284 -6827 9389 2184 -9617 4585 7915 -8305 -1791 10332
2128A0332j3946l276J5438n530j2692J4060L653j6050N706J2554j3124m498J5504
$$ 10332 -3614 -6890 8548 3018 -9674 4386 8039 -8011 -2305 10249 -2875 -7373 8131
2141H131m627j2749J2573M937j5756M643J3183j2553n341J5464m592j2854J2106
$$ 8131 3504 -9245 3328 8265 -7491 -2848 10335 -2218 -7559 7905 3313 -9541 2565
2154B565O037j6007M129J3256j1808o122J5237l256j3320J1144O699j5416K815
$$ 2565 8602 -7405 -3276 9980 -1828 -7950 7287 4031 -9289 1855 8554 -6862 -4047
2167d047J3367j1002o780J5081k301j3884J0595P359j5116J973J3891j0115q028
$$ -4047 9320 -1682 -8462 6619 4318 -9566 1029 8388 -6728 -4755 9136 -979 -9007
2180i007J4782q36j4603R869Q249j4639M60J4340r071q689J4483m95j4174R150
$$ -9007 5775 4939 -9664 205 8454 -6185 -5725 8615 -456 -9145 5338 4843 -9331 -181
2194a81Q684j4227J56J4066q466r091J3617J073j4287P340R585j3438j401J4762
$$ -181 8503 -5724 -5568 8498 32 -9059 4558 5631 -8656 -1316 8269 -5169 -6570 8192
2208H192p707r456J3021J593j4186O835J0331j2955k190J4233o158j0665J2634
$$ 8192 485 -8971 4050 5643 -8543 -1708 8623 -4332 -6522 7711 1553 -9112 3522
2221C522L088j4361N439J1281j2687k981J4055n163j0930J1859L831j4455N191
$$ 3522 6610 -7751 -2312 8969 -3718 -6699 7356 2193 -8737 3122 6953 -7502 -2311
2234b311J1323j1923m251J4531m291j1758J1824L853j4001M342J1771j1079n187
$$ -2311 9012 -2911 -7162 7369 3078 -8680 3144 6997 -7004 -2662 9109 -1970 -7157
2247g157J4106l468j2110J1172M986j3934L226J1950j0074n896J4105k858j2299
$$ -7157 6949 3481 -8629 2543 7529 -6405 -3179 8771 -1303 -7199 6906 4048 -8251
2260h251J0123N844j3599K208J2603r897p027J4368j776j2821R575O962j3697
$$ -8251 1872 7716 -5883 -3675 8928 -969 -7996 6372 4596 -8225 1350 8312 -5385
2273e385J339J2624r098p115J3358q37j2939Q506P661j3296J87J3199p995q363
$$ -5385 -4046 8578 -520 -7635 5723 4886 -8053 453 8114 -5182 -4995 8204 209 -8154
2287h154J3175K11j2994P864Q026j2305j110J3179p274q678J2314J266j3152O792
$$ -8154 5021 5232 -7762 102 8128 -4177 -5287 7892 618 -8060 4254 5520 -7632 -840
2301h40Q710j1931k122J3781o581r263J1880K052j3383O299R332j1463k782J3347
$$ -840 7870 -4061 -6183 7598 1017 -8246 3634 5686 -7697 -1398 7934 -3529 -6311 7036
2315G036n617j0231J1771K859j2793M714J0147j0773l852J3605n134j0290J1085
$$ 7036 1419 -8812 2959 5818 -6975 -2261 7886 -2887 -6739 6866 1732 -8558 2527
2328B527L587j3051L957J0940j0801l946J3046m164j0628J0529M475j3243L471
$$ 2527 6114 -6937 -2980 7960 -2841 -6787 6259 2095 -8533 1996 6471 -6772 -3301
2341c301J1300j0222m818J3145l234j1193R660N394j2774K502J1287q975o326
$$ -3301 7999 -2223 -7041 6104 2870 -8323 1337 6731 -6043 -3541 7746 -1229 -7555
2354g555J3092j805j1866R297O085j2572J106J2057q443o642J2611j230j1389
$$ -7555 5537 3732 -8134 1163 7248 -5324 -4218 7839 -604 -7246 5365 4135 -7254
2367g254Q073O758j2466O66J1937p820p048J1781kj1813P145P476j1555m28J1932
$$ -7254 819 7577 -4889 -4223 7714 -106 -7154 4627 4625 -7188 -43 7433 -4122 -4550 7382
2382G382p064p595J1522Q61j1918O397P925j1016r92J1755o355q008J1157J732
$$ 7382 318 -7277 4245 5106 -6812 -415 7510 -3506 -4498 7257 902 -7106 4051 5783
2396E783j2223N263R073j1481j732J2353n586q897J0966K280j2367N142R056j0524
$$ 5783 -6440 -1177 7896 -3585 -5317 7036 1450 -7447 3519 5799 -6568 -1426 7630 -2894
2410b894l042J2660m980r365J0627L001j2458M622R624j0401l436J2373m113r838
$$ -2894 -5936 6724 1744 -7621 3006 6007 -6451 -1829 7795 -2606 -6042 6331 2218 -7620
2424g620J0012L917j2662M038R816r885m068J2263l191j0462R740M042j1925K833
$$ -7620 2392 6309 -6353 -2315 7501 -2384 -6452 5811 2620 -7842 1898 5940 -5985 -3152
2438c152J0754r382n040J2268k644j0044Q449N222j2100K366J0690q897n808J2179
$$ -3152 7602 -1780 -6820 5448 2804 -7240 1209 6431 -5669 -3303 7387 -1510 -7318 4861
2452D861j628j0784Q313N704j1870J358J0943q063o024J1691n75j1311P526O449
$$ 4861 3233 -7551 762 6466 -5404 -4046 6897 -1166 -7190 4501 3926 -7385 141 6590
2466F590j1847R50J1317p237o837J1111n5j1201P251O942j1292l94J1487o619
$$ 6590 -5257 -4307 7010 -227 -7064 4047 3992 -7209 42 6984 -4308 -4702 6785 166
2480A66p640J1605N56j1435O385P479j1090j142J1957o249p973J1175J332j1914
$$ 166 -7474 4131 4687 -6748 -363 7116 -3974 -5116 6841 592 -7381 3794 5126 -6788
2494f788O060Q109j0783j695J1837n701q072J0470J930j1676N104Q667j0354k516
$$ -6788 -728 7381 -3402 -5097 6740 1039 -7033 3437 5367 -6309 -1205 7462 -2892 -5408
2508e408J1910m846q813J0355K540j1622M787Q614r999k750J1344l738r421R782
$$ -5408 6502 1656 -7157 3198 5738 -5884 -1097 7517 -2482 -5232 6112 2374 -7047 2735
2522B735L234j1599L558R387r118l989J1528k702r770Q659M606j1986K914J0010
$$ 2735 5969 -5630 -2072 7315 -1803 -5792 5736 3034 -6736 1923 6529 -5457 -2543 7467
2536G467q951m410J1460k326j0150Q303N335j1611J891J0053p986n357J1229j524
$$ 7467 -1484 -5894 5566 3240 -6910 1393 6728 -4883 -2992 7061 -925 -6282 4947 3423
2550C423j0258P742N405j0884J121J0382p658n683J0978n55j0931P253O347j1281
$$ 3423 -6835 907 6312 -4572 -3451 6931 -727 -6410 4568 4013 -6918 335 6682 -4599
2564d599R19J0388p284o227J0786j62j0751O915O675j1009K64J0339o242o971
$$ -4599 -3680 6708 -576 -6803 3983 3821 -6930 -15 6660 -4349 -4085 6254 12 -6959
2578f959J0924K05j0974O587O541j0571o45J1086o271o798J0067J213j1147N689
$$ -6959 3965 4170 -6804 -217 6324 -4247 -4892 6194 -77 -6875 3192 4405 -6742 -1053
2592a053P560j0157j172J0818n365p790J0025J639j0598M825P699r713j743J0764
$$ -1053 6507 -3650 -4822 5996 631 -7159 2866 4505 -6093 -1268 6431 -3282 -5025 5739
2606E739m674q038R676K359j0960M276Q492r384l115J1425m121q240Q859L086
$$ 5739 1065 -6973 2703 5062 -5898 -1622 6870 -2514 -5629 5796 1675 -6565 2294 5380
2620E380j0757L447Q637q984l144J0690k847r121Q902L456j1014L147Q907q299
$$ 5380 -5377 -1930 6707 -2277 -5421 5269 2422 -6699 2203 5659 -5355 -2208 6699 -1600
2634a600l582J0233k534r188Q510L962j0433K125R269p500m924J0867k147r175
$$ -1600 -5182 5051 2517 -6671 1839 5801 -4632 -2507 6762 -738 -5662 5205 3058 -6117
2648f117P560M622j0565J595R499p224n247J0658j835r304P463M858j0068R43
$$ -6117 1443 6065 -4500 -2905 6594 -630 -5877 4781 2946 -6358 1105 5963 -4105 -3162
2662c162R934p193n168J0085o83j0052O813N414j0007M84R828o478n740R972j14
$$ -3162 6772 -421 -5589 4496 3813 -6239 574 5988 -4019 -3535 6293 -185 -5925 4047 3933
2677C933j0034N960O386j0132j7J0185o134o264R899J43r887N633O473r495o75
$$ 3933 -6101 -141 6245 -3887 -3904 6281 147 -6117 3782 3925 -5962 -329 6144 -3351 -4026
2692d026R902n520o808R488J247j0414N195O868r239j209R933m444p225Q682K001
$$ -4026 5876 356 -6452 3036 4283 -6131 -936 5932 -3307 -4516 5417 973 -6252 2430 4431
2707D431r850L890P569q708k215R859l902p537Q420K848j0240L534P699p923l190
$$ 4431 -5419 -1529 6040 -2668 -4883 4976 1074 -6463 1957 4805 -5435 -1901 5798 -2125 -5315
2722e315J0402l627p595P771K867r498K985P865p825l117R793k854q072P642L465
$$ -5315 5087 1460 -6135 1636 4503 -4995 -2010 5855 -1970 -5087 4706 1852 -6220 1422 4887
2737D887r368J843Q651p601l864R969k022q681P593M016r926J895Q519o914m488
$$ 4887 -4481 -2638 6013 -1588 -5452 4517 2495 -6186 1407 5423 -4503 -2608 5911 -1003 -5491
2752e491R889j629q920P322M374r163J126Q520o428n124R603o23r445O481N275
$$ -5491 4398 2769 -6151 1171 5545 -3618 -2492 6028 -400 -5524 4079 3456 -5989 492 5767
2767E767r289L16R378o138n256Q830q9q779N543N612q857l58R196n529n850R092
$$ 5767 -3522 -3206 6172 34 -5222 3608 3519 -5260 283 5895 -2962 -3320 5876 347 -5503 3589
2783C589K48r249N388O053q937m31Q948m859o279Q645J093r452M817O243q323
$$ 3589 3837 -5412 -24 6029 -2908 -3339 5609 750 -5529 3116 4209 -5243 -426 5817 -2506
2798b506j271Q921l901o583P782J756r036L947O689q029j931Q768l355p097Q023
$$ -2506 -3777 5144 1243 -5340 2442 4198 -4838 -891 5798 -2231 -4162 4606 1251 -5846 2177
2813B177K535r466L194P081p541k567R133k926p377P328K991r274L007P323p395
$$ 2177 4712 -4754 -1560 5521 -2020 -4587 4546 1620 -5757 1571 4562 -4712 -1705 5618 -1777
2828a777l034R329k437q005P382L177r126K557P526p262l018Q482j955p289O588
$$ -1777 -4811 4518 2081 -5924 1458 4635 -4491 -1934 5592 -1670 -4688 3794 1839 -5450 1138
2843A138L430q920J452P977o144l973Q898j564p816O511M110r112J484P921o221
$$ 1138 4568 -4352 -2900 5077 -1067 -5040 3858 2294 -5522 989 5099 -4013 -2529 5392 -829
2858h29m480Q800q41p987N780M648q782N33Q665n778n208Q680j46q327N236N208
$$ -829 -5309 3491 2650 -5337 443 5091 -3691 -3158 5507 -271 -5479 3201 3055 -5272 -36 5172
2874E172q234m64Q787n091n464Q367L77q767N457M996q104n23Q370m831n705Q685
$$ 5172 -3062 -3526 5261 170 -5294 3073 3450 -5317 140 5136 -2968 -3491 4879 48 -5657 3028
2890C028P59q747M453N628p764q05Q386l958o163P499J851q578L649O501p804
$$ 3028 3787 -4960 -507 5121 -2643 -3448 4938 980 -5183 2316 4167 -4411 -762 5739 -2065
2905b065j532Q452l589o208P163J928q386L148O632p437j848Q370l083o515O987
$$ -2065 -3597 4855 1266 -4942 2221 4149 -4237 -1089 5543 -1894 -3742 4628 1545 -4970 2017
2920B017K096q365L203O287o381k551Q084k430p236O738L053q533K280P165o791
$$ 2017 4113 -4252 -1049 5238 -1143 -3694 4390 1960 -5276 1462 4515 -4018 -1738 5427 -1364
2935a364l049Q903k233p235O018L494q347J891O858n913l718Q307j336p644O048
$$ -1364 -4413 4490 2257 -4978 1040 4534 -3813 -1922 4936 -977 -4695 3612 2276 -5368 680
2950F80M018q219J018P470n658m276Q415r54p508N418M301q146Q35P024m606m508
$$ 680 4698 -3521 -2503 4967 -691 -4967 3448 2494 -5014 404 4705 -3441 -2606 4418 -188 -4696
2966d696P514p5p576M786M670p587j97P906m409n002P251J01p624M549M919p288
$$ -4696 2818 2743 -4833 -47 4623 -2964 -3161 4745 336 -4666 2585 2686 -4938 -389 4530 -2758
2982b758o60P778l839n638P585R55p862L746N557p168j573Q074l796n641P427
$$ -2758 -3418 4360 521 -5117 2468 3423 -4439 -693 4864 -2304 -3877 4197 401 -5240 2187
2997B187J452q220L287O014o923j524P759l179n777O623K259q145L126N896o701
$$ 2187 3639 -4581 -1294 4720 -2203 -3727 4032 853 -4924 1699 3958 -4187 -1061 4835 -1866
3012a866j793P719k569o161O412K119p530K366N987o010k652P920j830o770O156
$$ -1866 -3659 4060 1491 -4670 1742 3861 -3669 -1303 4684 -1326 -3978 3942 2112 -4658 1498
3027A498K702p596J996O282n731l255Q055j839o825O057L045p821J503O754n154
$$ 1498 4200 -3396 -1400 4882 -849 -4104 3951 2112 -4713 1344 4389 -3432 -1929 4825 -329
3042c29l641P240q28o730N038L753p723Q90P311n437l559P106m15o969M692M204
$$ -329 -3970 3270 2442 -4288 750 4503 -3220 -2330 4981 -456 -4015 3091 2676 -4293 399 4603
3058D603p336K16P300m664m263P065l07p288M891M369p413M6P165l939n015P281
$$ 4603 -2733 -2517 4783 119 -4144 2921 2614 -4674 217 4586 -2827 -2781 4384 445 -4570 2711
3074B711K17p358L976M979p215k65P330m152m691O616Q21o928L314N175o430j312
$$ 2711 2928 -4430 -454 4525 -2690 -2955 4375 223 -4468 2148 2969 -3959 -645 4530 -1900 -3212
3090c212P248l422n341O756J131p367L347N174o231j594P346l169n459O598J539
$$ -3212 4036 614 -4727 2029 3160 -4207 -860 4314 -1917 -3511 3835 666 -4793 1805 3344
3105C344p424K723N758o007k095P263k558n534N749K233p173K104O160o160k045
$$ 3344 -4080 -1357 4401 -1606 -3701 3562 1004 -4530 1219 3452 -3721 -1617 4543 -1617 -3662
3120c662P079k236n684N530K788p413K024N864n336k654O915j711n731N236K834
$$ -3662 3417 1181 -4503 1027 3815 -3598 -1574 4290 -1046 -3700 3215 1504 -4227 1009 3843
3135C843p201J514O124n212l026P192j186o418M937L556p159Q50O672m824l624
$$ 3843 -3358 -1844 4280 -932 -3958 3234 2048 -4370 567 4123 -3036 -2186 4486 -338 -3962
3150c962O822m99o703N118L240o720N53O564m813l443O690o16o283M388L906o527
$$ -3962 2860 2361 -4342 776 4016 -2704 -2151 4413 -400 -3843 2847 2231 -4052 336 4242 -2285
3166b285r9O447l825m286O687O8o553L728M558o864k84O700l542m597O604P19
$$ -2285 -2384 4063 238 -4048 2639 2707 -3846 -118 4440 -2424 -2708 3992 450 -4147 2457 3176
3182C176o936L662M168o067p22O587l484m482O068J114o595L124M548o049j237
$$ 3176 -3760 -98 4070 -1997 -2719 3868 384 -4098 1970 3084 -3511 -387 4161 -1888 -3125
3197c125O882k890m751N642J451o797K554M883n424j308O435k689m762N189J796
$$ -3125 3757 867 -3884 1758 3209 -3588 -1034 3849 -1575 -2883 3552 863 -3899 1290 3086
3212C086o391J981N460n533j811O300j933m849M803J765o075J426N761n129k280
$$ 3086 -3305 -1324 4136 -1397 -3208 3092 1159 -3690 1113 2878 -3197 -1771 3990 -1139 -3419
3227c419O337j613n319N098K119o258J582N316m957k427O445j617n327M878K313
$$ -3419 2918 1305 -4014 1084 3203 -3055 -1473 3843 -1114 -3541 2904 1287 -4040 838 3151
3242C151o268J412N324m292l199O721j306n431M331L062o018O18N621l944l301
$$ 3151 -3117 -1705 3619 -673 -3872 2849 1543 -3888 443 3505 -2513 -1895 3726 -218 -3519
3257c519O354r86n650L967L504o165J36O112m391k883N474J31n711L264M064n907
$$ -3519 2835 1849 -3801 166 3670 -2495 -2359 3753 -638 -3521 1953 2084 -3627 -363 3701 -2206
3273b206j64O160l652l545N546Q9n346L337L653n824m17N803k866l907N409K70
$$ -2206 -2370 3790 138 -3407 2139 2228 -3118 219 3872 -1952 -2369 3434 568 -3339 2070 2340
3289B340n543K943M037n206j055N920k990m188N555J070n904K643M226n300j127
$$ 2340 -3203 -260 3777 -1429 -2484 3436 446 -3742 1813 2883 -3021 -378 3848 -1452 -2579
3304b579N509k316m102N088J172n688K480L840m342j610N491j864m475M534J883
$$ -2579 2930 614 -3488 1600 2772 -2916 -436 3404 -938 -2548 2943 1079 -3396 1138 3021
3319C021o027J996M634m613j688N597j914m144M522J721n741J552M501m188j816
$$ 3021 -3006 -1010 3624 -989 -2677 2920 1006 -3138 1384 3105 -2636 -1084 3417 -771 -2587
3334b587N061j120m922M303K041n381J194N247m728k112N376j272m574L972K397
$$ -2587 2474 1354 -3568 735 2776 -2605 -1411 3836 -892 -3004 2372 1100 -3474 498 2895
3349B895n355Q38M865l766k597N237n42m819L364K376m588R0N400l697l040N091
$$ 2895 -2460 -1622 3243 -523 -3120 2117 1575 -3244 120 2496 -2092 -2002 3398 -299 -3339 1752
3365A752k04m903L175K987m824n4N170l223l015N127l38m897K972L157m622k49
$$ 1752 1548 -3355 -180 2807 -2017 -2071 3099 -124 -3139 1988 1650 -3247 -275 2882 -1740 -1989
3381a989M606k698l478N481L85n049K194L443m425n48M637k326l454M548O77m602
$$ -1989 2617 -81 -3559 1922 2307 -2742 -548 2895 -1530 -2078 2559 233 -3221 1327 2004 -2598
3397b598J805L901m267j099M889k178l579M285J068m890K114L653m416o41M724
$$ -2598 -793 3108 -1159 -2258 2631 453 -3126 1159 2227 -2663 -549 3104 -1312 -1953 2771
3412B771j869l760M149J145m816J878L446l769j567M682j248l985M102J339m733
$$ 2771 902 -2858 1291 2436 -2380 -502 2944 -825 -2392 2290 1042 -2943 1159 2498 -2235
3427b235J227L885l536j493M710j514l911L551J784m627R78M353l596k179M644
$$ -2235 -1008 2877 -659 -2152 2558 1044 -2867 684 2468 -2159 -1181 3172 -424 -2603 2041
3442B041p63m222L563K296m640N22M044l183k390M868n10m276L269K061m504J34
$$ 2041 1278 -2944 619 2915 -1725 -1203 2841 -342 -2732 2136 1626 -2650 619 2680 -1824 -1690
3458a690M327k700k461M307k35m234K611K390l743j93M341k785k705M429Qm048
$$ -1690 2637 -63 -2524 1783 1548 -2686 -75 2315 -1428 -1621 2720 -65 -2770 1659 1667 -2381
3474b381K192K804m080m42M161k110k991M227N12m509K329K817m195k21L744j535
$$ -2381 -189 2615 -1465 -1907 2254 144 -2847 1380 1892 -2617 -288 2529 -1666 -1887 1857 322
3490C22l053L668R33m216J593L646m058r91M565j884l022L600R58m293J466L223
$$ 322 -2731 937 1870 -2346 -753 2893 -1165 -2156 2409 525 -2497 1103 2061 -2232 -766 2457
3506B457l453r58L929j522k855K912J462m084J527K893l129j193L992q73l608
$$ 2457 -996 -1954 1975 453 -2402 510 1972 -2112 -585 2308 -821 -2014 1978 1105 -2503
3521b503L160J378l970J040L383k952j602M049j053l480L248J262l664N83L637
$$ -2503 657 2035 -1935 -895 2488 -464 -2066 1983 930 -2550 698 1960 -1704 -1121 2516
3536B516k877j449L450m09l518K716J938m371J005L396k618k246L904R6l985K694
$$ 2516 -361 -1810 1640 1231 -2287 429 2367 -2004 -999 2397 -221 -2467 1437 1533 -2452 242
3552B42J990l619K25L541k147k577L878j1l804K214K376l696q5L731j745k538
$$ 242 2232 -1387 -1162 2379 232 -2345 1533 1522 -2282 -68 2308 -1388 -1473 2258 513 -2025
3568b025L613p3l717K004K124l140l01L689j687k673L429N48l930J585L255l747
$$ -2025 1588 1515 -2202 -198 1926 -1214 -1515 2174 487 -2186 1243 1791 -2139 -554 2701 -1046
3584a046p59M096j751k867L542O00l750J292K946l288o49L684j502l006L078J242
$$ -1046 -1805 2291 540 -2327 1215 1815 -1935 -643 2303 -985 -1634 2050 548 -2458 620 1862
3600A862l663J449K895l482j123L919j181l123L380R93l736R18L053k680j303
$$ 1862 -1801 -352 2543 -939 -2062 1857 676 -2447 933 1926 -1810 -892 2161 -519 -1822
3615a822L396q19k996K924R20l394N24L497k914j236L477n63l406K489J899l913
$$ -1822 1574 755 -2241 683 1603 -1791 -1267 2230 -684 -1920 1557 994 -2412 77 1976 -1937
3631a937Q47L379k712j618L690m40l648L128J281l482N68L150k587j399L395o61
$$ -1937 -1090 2289 -423 -2041 1649 1209 -2439 689 1970 -1512 -944 2206 -381 -1780 1615 954
3647I54k884K013J946l468J55L127k106j548L231k79l175J935K210k995o83L709
$$ 954 -1930 83 2029 -1439 -1284 1843 -263 -1811 1420 1141 -2034 -99 2111 -884 -1567 2142
3663B142j922k356L379Ll437K056K293l305j97L484j967k454L420M70l676K133
$$ 2142 220 -2136 1243 1246 -2191 -135 2158 -1147 -1344 2140 173 -2281 1139 1609 -2067 66
3679F6K062l047o71L673j557k662L103M07l216J762K179k838o37L455j499k525
$$ 66 2128 -919 -1590 2083 526 -2136 967 1374 -1842 -80 2099 -739 -1376 2079 580 -1945
3695a945K859P73l223Q78L209l177j203L633j135k618K854P22l229J013K740k576
$$ -1945 914 1687 -1536 -658 2551 -626 -1829 1804 669 -1949 905 1627 -1602 -589 2151 -425
3711d25j432L472j040k568K276J452l472R75K987k561j385L456q94k676K039J485
$$ -425 -1857 1615 575 -1993 283 1735 -1737 -762 2225 -336 -1721 1735 841 -1835 204 1689
3727A689l091N52K931k253j406K676j04k721J952J497l198N70K780k311j408K943
$$ 1689 -1402 -850 2081 -172 -1578 1098 994 -1727 225 1722 -1476 -906 1874 -437 -1845 1098
3743A098p0k943K149J217k482K95K757k314j887L352k4l076J825K037l434N24
$$ 1098 1028 -1915 234 1451 -1031 -736 2021 -293 -2180 1172 1148 -1928 -103 1934 -1500 -976
3759i76K732j984j790K977P4k818J625J925k912q4L236j551k475K945J72k969
$$ -976 1756 -228 -2018 959 1033 -1785 -160 1765 -1147 -1231 2005 454 -2021 924 1096 -1873
3775a873J600K144k640k98K542j277k210K946L85k950R66K454k725n77L392j518
$$ -1873 -273 1871 -769 -1067 1475 198 -2012 934 1319 -1631 -665 1789 -936 -1513 1879 361
3791C61k086K393M76k676J211J973k176r39L129j171k470K649P16l119J378K395
$$ 361 -1725 668 1144 -1532 -321 1652 -524 -1463 1666 495 -1975 674 1390 -1729 -351 2044
3807B044k833p32L247j333k331K517J080k839P11K319k235j042L090j076k166
$$ 2044 -789 -1521 1726 393 -1938 579 1659 -1180 -469 1850 -385 -1427 1663 587 -1579
3822a579K178Q58k739O78K287k116j129K868n2k932K292J009k741K95K731k276
$$ -1579 599 1457 -1282 -604 1683 -433 -1562 1306 1254 -1678 614 1623 -1118 -823 1908 -368
3838c68j165K963n10k450J909J278k938O42K495j936j144K356k73k706K110J343
$$ -368 -1533 1430 920 -1530 379 1657 -1281 -639 1856 -80 -1224 1132 859 -1847 263 1606
3854A606k889N68K185j523j673K911j78k639J700J574k853K34K491j621j658K468
$$ 1606 -1283 -715 1470 -53 -1726 1185 1007 -1632 68 1642 -1211 -977 1514 -107 -1765 703
3870G03M00k911J542J760k319l83K756j501j791K434L36k657J396J483k360O1
$$ 703 1103 -1808 -266 1494 -825 -1208 1548 47 -1744 690 1026 -1631 -235 1248 -1112 -1051
3886a051K442j343j676K437M49l055J555J690k101n11K722j351j937K313L58k557
$$ -1051 1391 48 -1628 809 1258 -1797 -242 1448 -653 -1164 1558 207 -1730 583 941 -1616
3902a616J314J616j794q30K755r71k019K231O16k497P69K013j932j007K725p04
$$ -1616 -302 1314 -480 -1310 1445 474 -1545 686 1302 -1195 -426 1587 -345 -1352 1373 669
3918F69k217K102Q48k882J013J997j946r53K526k38k398J655J066k188L65J854
$$ 669 -1548 554 1402 -1480 -467 1530 -416 -1369 1157 919 -1479 176 1242 -946 -581 1273
3934A273j692r17K595j55k503J866J124k520M47K011j736j094K619n03k268J436
$$ 1273 -419 -1336 1259 1104 -1399 467 1591 -929 -482 1529 -207 -1301 1318 815 -1453 -17
3950a7J670k511M4K319j658j300K494j63k262J585J305k526J85K157j208j412
$$ -17 1653 -858 -814 1505 -153 -1453 1041 878 -1384 201 1506 -1020 -835 1322 114 -1298
3966a298K425l17j999J213J412k067k60K142j149j350J968K36k109J126J428k107
$$ -1298 1127 810 -1189 24 1436 -631 -891 1251 102 -1248 720 956 -1153 -27 1401 -706
3982g06k16K283j177j803K442K92k521J093J681j900m28K240j418r17J842R1k024
$$ -706 -922 1361 184 -1619 823 1115 -1406 -313 1368 -532 -960 1280 -138 -1055 787 878 -1146
3999a146R91J446j780o99K439j156j900K369K97j891R21J364j999L7J747o30j718
$$ -1146 -155 1291 -489 -1188 1251 95 -1805 564 861 -1030 -109 1255 -744 -707 1040 410 -1308
4016a308J553R70k395R52J493j977o68K408p29j551J503P75j915J65K139j875
$$ -1308 245 1215 -1180 -228 1265 -712 -1380 1028 299 -1252 251 1026 -889 -724 1415 -460
4032d60o51J882k58j790J290J178k276O67J607j745o11K084j96k125J672P82k003
$$ -460 -1111 771 513 -1277 13 1191 -1085 -418 1189 -556 -1167 917 721 -1404 268 1050 -953
4049i53L98J880j571o95K037o75j734J223J343j821k58J839q15j190J628J78j957
$$ -953 -555 1325 -246 -941 1096 421 -1313 -90 1253 -568 -826 1013 198 -992 636 814 -1143
4066a143J148J257k094J56J532l71j493J430M18j661J087Q79j808J68J606j168
$$ -1143 5 1262 -832 -676 856 485 -1008 422 840 -821 266 1145 -663 -495 1111 -57
4082e7j151J888Q2k026J301R09j376m77J753p30j398J899K58j955R94J469j570
$$ -57 -1208 680 762 -1264 37 946 -430 -907 846 116 -1282 617 875 -1080 -86 1383 -187
4099a87n70J785p73j167J267N80j936Q16J315j537k49J501l50j874J651O52j616
$$ -187 -757 1028 255 -912 355 935 -1001 -185 1130 -407 -656 845 495 -1379 272 924 -692
4116f92K01J483j251p41J902o77j583J767O12j928O03J436j454o45J668k14j576
$$ -692 -491 992 -259 -1000 902 225 -1358 409 1021 -907 -304 1132 -322 -967 701 487 -1089
4133a089J158Q09j504K70J276j329o38J397Oj498J378J116k108J34J573j273n05
$$ -1089 69 878 -626 -356 920 -409 -1047 350 356 -1142 236 1352 -756 -622 951 -322 -827
4150h27J453j32j656J157R01j231k67J597j137p18J638j50j480J027O16j547J51
$$ -827 626 494 -1162 -5 896 -335 -602 995 -142 -860 778 628 -852 175 791 -756 -605
4167f05J406p43j187J599J99j341R33O15j450l00J987j381m26R51L44j458P65
$$ -605 801 58 -1129 470 669 -672 261 876 -574 -874 1113 -268 -694 257 601 -857 -92
4184i2J067j293k26J181l83j075J312L39j575N83J016j306Q6J474n80j618J434
$$ -92 975 -318 -544 637 254 -821 491 830 -745 -162 854 -452 -366 1108 528 -1090 344
4201C44N79j677K36J486j417r6J513l64j614J573K1j505N54J392j383k13J454
$$ 344 923 -754 -518 968 -449 -545 968 604 -1010 563 584 -921 -367 1025 -358 -571 883
4218H83o11j261J114L48j149M23J505j620n35J590k75j269R67M90j017K75J234
$$ 883 272 -989 125 473 -676 -253 1252 -368 -903 687 412 -857 110 600 -417 -142 1092
4235A092j354o23J504j01j442J184M65j479N08J078o43j293J624j49j524J016
$$ 1092 -262 -885 619 518 -924 260 725 -754 -246 832 189 -1104 520 371 -1153 -137
4251a37R78j338J59J224r67p92J243p7j331R73Q06j477L22J079m94j191J704k76
$$ -137 841 -497 -338 886 -81 -873 370 293 -1038 -65 741 -736 -414 665 171 -1020 684 408
4269D08j316Q83P30j305l0J368o93q64J490k7j600Q93J012j481O6J153p08p92
$$ 408 -908 -25 705 -600 -630 738 45 -819 671 644 -956 -63 949 -532 -466 687 -21 -813
4287h13R71M89j541P45J278j702K03J410r56r79J171M87j540L22J517j381m67
$$ -813 158 647 -894 -149 1129 -573 -370 1040 84 -895 276 763 -777 -455 1062 -319 -786
4304g86J166k05r07R86K57j040J67J171j042l87J331m22j086J309M36j825K88
$$ -786 380 175 -732 254 511 -529 -362 809 -233 -620 711 289 -797 512 948 -877 -589
4321e89J465j209j66J381p53r85J341M18j703K96J535j009q56J425k17j202J097
$$ -589 876 -333 -499 882 129 -856 485 903 -800 -504 1031 22 -834 591 374 -828 269
4338B69O44j564L87J355j017q64J501m69j144J216L22j005l06J727j123q74J527
$$ 269 913 -651 -264 1091 74 -790 711 242 -902 314 636 -369 -675 1052 -71 -945 582
4355E82j37j112P65P11j372J46J143o83j069J589j76j205Q02O97r74m03J450m07
$$ 582 445 -667 98 809 -563 -417 726 43 -1026 563 387 -818 -16 681 -293 -696 754 347
4373C47j130J251j5j301Q94O17j225j36J645j003r51J579m7j369P47Q96j220k68
$$ 347 -783 468 453 -848 46 663 -562 -698 947 -56 -1007 572 525 -844 -97 799 -421 -689
4391f89J441r03o51J164K40j425M32J015j057r8J374q19q29R61M23j356O85P81
$$ -689 752 -151 -802 362 602 -823 -391 624 -433 -531 843 24 -805 156 579 -777 -92 689
4409F89j035k76J192l66j026Q98O98j486P53O72j064m35J760o15j183J114K62
$$ 689 -346 -622 570 204 -822 76 774 -712 41 713 -351 -786 974 359 -824 290 552
4426E52j219O39J096j388l60J307j12j580J514J06j248M29R59q68m00J196k37
$$ 552 -667 -28 1068 -320 -680 627 515 -1065 449 555 -693 -264 695 -173 -573 623 386
4443C86j121J071K92j155K74R85q17m07J257l32j202R80L25j082K05J208j067
$$ 386 -735 336 628 -527 -253 732 -85 -492 765 433 -769 211 536 -546 -341 867 -200
4460b00k23Q37J65j213P46P82j364O2J328o56q72J536o73q41R58J40j195O24M43
$$ -200 -423 414 579 -634 112 894 -470 -408 920 264 -608 928 255 -586 372 512 -683 -59 384
4479C84k21j136J104K44j063J012N1j048K42J053q33p54J732l44j030M48Q31j042
$$ 384 163 -973 131 375 -688 324 375 -673 -431 622 -211 -965 767 423 -607 -159 672 -370
4497c70r6J135m59p13J035j55j276J012R80j464KJ149o08j031J019K52j258Q01
$$ -370 -466 669 210 -503 532 377 -899 113 1093 -371 -369 780 172 -859 160 412 -846 -45
4515d5Q05j079L8R15q61l70J209k59j310R28N73r95q7J280r35n35P74O71j232
$$ -45 760 -319 -281 634 -227 -597 612 353 -957 -29 544 -451 -538 742 -193 -728 46 717 -515
4534e15M1J020r98j04Q89j23o41N55M24j164M30R31j292L1J051p09l92J010Q5
$$ -515 -474 546 -452 -556 333 210 -431 124 548 -616 -186 745 -547 -516 535 -174 -566 444 529
4553E29j371O66Q01r63l5J137o29r98J091K63j091M67J249j333k60J062q8j012
$$ 529 -842 -176 625 -338 -373 764 135 -863 228 491 -600 -133 1116 -217 -477 585 497 -515
4571e15P77N54j523N59Q99j176k35J453m66j114J141K83j353L39J093q14m21J123
$$ -515 262 816 -707 -148 751 -425 -660 793 327 -787 354 637 -716 -377 716 -98 -519 604
4589F04l05o67O03J86j038L01J085q19k24J000n12p62Q23K48r33L67N79n03o84
$$ 604 299 -368 235 421 -617 -316 769 -50 -274 726 214 -548 275 523 -410 -43 536 33 -651
4608f51J083k27r54O11Q63j222L26Q07p18j79Q53p3j115O33M87j005K53J148q86
$$ -651 432 205 -749 -138 725 -497 -171 636 -82 -261 592 519 -596 37 524 -481 -228 920 34
4627C4m58O98J77j168N12R17j117L96M20m69l19O77k2r34M67Q35q61m5P94m76
$$ 34 -424 274 451 -717 -205 712 -405 -9 411 -58 -377 300 278 -656 -189 646 -215 -260 534 58
4647E8p32R97J00r32L42P52q35l06J275q57k17N75L60j296N27O97j028L30O54
$$ 58 -674 323 423 -509 -167 585 -250 -556 719 -138 -355 220 580 -716 -189 508 -520 -190 464
4666D64k14q69Q66q2o81N18M34n21m98J122n99o43Q31L96j123L63O93p25LQ97
$$ 464 250 -619 247 165 -516 2 436 -85 -583 539 -60 -703 128 524 -599 -236 457 -268 -265 632
4686F32n27p14O09M35j092O10M14n95j7O70r2q35P74M45j207K31Q70q21J3P77
$$ 632 105 -609 0 435 -657 -47 367 -228 -245 425 333 -502 272 717 -490 -259 611 -210 -197 580
4706E80l79m23K06L96q33J61R85r69m78J228j14p40K61J64m63M6R55p86k33P10
$$ 580 201 -222 -16 380 -453 -292 693 -276 -754 474 360 -380 -119 45 -418 -372 583 -203 -436 274
4726B74k04m90Q61j31n58K51M59p42J2O04o9n50K20M57r87M05N78m51n69O76J14
$$ 274 70 -420 441 310 -248 3 462 -280 -268 336 267 -283 -63 394 -593 -188 390 -61 -630 46 160
4747A60n03K12N56p20k50J194n26p75Q32r5k09K59K78p43L3Q72p17p31J010ko76
$$ 160 -343 -131 425 -295 -545 649 123 -652 180 85 -124 135 413 -330 -297 575 -142 -873 137 135 -541
4768e41N87O78q92K3N10p64K8N82j16p15M84M80o05l6P28l75k51N22k55n30K98
$$ -541 46 724 -168 -145 365 -399 -371 211 95 -620 -136 344 -261 -297 431 56 -195 327 72 -458 -160
4789a60N58n40L6O48m44o86J042j82l35k08O28n61J28L92k04k98N02N2q28N51
$$ -160 398 -142 -106 542 98 -588 454 272 -63 -271 357 -204 -76 316 112 -186 316 368 -460 91
4809I1L43p50o7Q00l39j99K38K74p15J69N26n63k99P00r0m93O05M41r86N8N26
$$ 91 434 -316 -383 417 78 -121 117 391 -324 -155 371 -192 -491 209 119 -374 231 672 -314 -256 270
4830B70k05o05O71Q6n13O33J84q26j73J074n59m37P35O4q50M90K72l30j14N18
$$ 270 65 -540 131 217 -296 337 521 -305 -478 596 37 -400 335 399 -451 39 311 -19 -133 385
4850C85l70j56L30j23n78O48L31o55jO03j03p25P80m8o77P83M5m53k42N09j37
$$ 385 15 -141 189 66 -512 136 467 -188 -189 414 311 -414 366 318 -359 424 469 16 -226 283 146
4871A46l31L51j53o99Q32M9l90k55J019o07m12P00L8q65O45M56p28J25M22k93
$$ 146 -185 166 13 -686 146 195 -195 -450 569 -38 -450 250 288 -577 68 524 -204 -79 343 50
4891E0m15M84j23k47K31L18l54j75M51l28j87M00K6k23L08k4l88lM58j57p07Q34
$$ 50 -365 119 -4 -251 -20 298 -56 -231 220 -108 -295 105 131 -92 216 192 -196 -199 259 102 -605 229
4913B29K41p61J06M65l99j94O71k19m99L41L46n17J51J32J75l93M82j2q86O39
$$ 229 470 -291 -185 280 -119 -313 358 139 -360 -19 327 -190 -39 93 268 -125 357 345 -541 98
4933I8N1o29L50k0j55l07P59m2n82L00K90m27J18P24n02j8L80n76l27P13K88m67
$$ 98 149 -480 -130 -150 -305 -612 147 105 -477 -177 113 -314 -196 528 26 8 388 -188 -515 198 486 19
4955A9l9J92k63j32P08m00n50N34K20n91L23L8R1m79M30J16m70M15L49n16m87
$$ 19 -20 172 -91 -223 485 85 -465 69 289 -302 21 59 150 -329 101 217 -253 162 511 -5 -492
4976d92J187r61K66N27m58k21K06K44l02j58O28j96l97q5M57n70r2N90k74OO75
$$ -492 695 -266 0 527 69 -152 54 298 -4 -162 466 270 -127 -212 245 -325 -417 173 -101 -95 580
4997E80n77l58M26K25m24L85j60m06q4K51K38n87M68Pl80L76O11o98J60L80k38
$$ 580 3 -355 71 296 -128 257 97 -309 -393 -142 96 -491 -23 -16 -396 -20 591 -107 53 433 195
5018A95o78Q96k28m50K10K66m38Q0P48r13P6K42L55m62j51M53m03j64M01J16o97
$$ 195 -483 413 185 -265 -55 211 -227 -147 601 -312 -236 6 361 -101 -252 201 -202 -366 35 151 -546
5039e46O95o8n21O23K74m38n47O65K03o74L01N14p37J41M00m75m1L34J71n08M56
$$ -546 149 81 -440 183 457 19 -528 137 340 -334 -33 481 -256 -115 285 -190 -231 103 274 -234 222
5060B22J85r92N12K49k08k88Q01n74m16P19J1p19L90N11m14l54L72L63p83P20
$$ 222 407 -585 -73 176 -32 -320 481 -93 -509 210 221 -498 -108 403 -11 -365 7 370 -413 307
5080C07J39n88k80R29p21L8K58J45o95O51K22p39K51Lj00l51O18J81p48O20J47
$$ 307 446 -142 -422 507 -214 -176 82 227 -468 183 405 -334 -83 -80 -180 -531 87 268 -480 140 287
5101B87l14k94O16l54l99P41r3o62N32M03p89L7Q13l39l93K73J11p41N72L87o12
$$ 287 -27 -321 295 -59 -458 283 190 -472 60 463 -326 -289 524 185 -208 65 176 -565 7 394 -218
5122b18K94K94p06K71L35n6n84L54N51o77j8O49l90m22O00nn04K91K42o07N6Q06
$$ -218 76 370 -336 -65 270 214 -370 -16 535 -142 -160 489 99 -323 277 272 -232 59 301 -306 -250 556
5144E56o29k67O22o0o64L15O27m10l83R92p72n36J020l11k78J50L31n37R0M01
$$ 556 -73 -340 282 222 -442 -127 500 90 -293 699 -73 -609 411 100 -178 -28 303 -234 -144 257
5164B57n14l67O32J92o55j00P85p40K06M96J78r14N06L08m58J10O39q41l11P93
$$ 257 -257 -624 8 200 -455 -555 230 -510 -304 192 370 -544 -38 270 -188 -78 561 -280 -591 202
5184B02n4m67M95N2p27M83L69m75k2N21k53m33M99K15n26J8M19l95k47M97j57
$$ 202 148 -319 176 228 -499 -16 353 -122 -144 377 124 -309 190 405 -121 -103 316 -79 -326 171 14
5205A4j61M34K7m40o8N92p29lP56n65k36M93J56n67L56L42l32l26N80k53l59N56
$$ 14 -147 287 314 -126 -194 398 -331 -334 422 -143 -379 114 270 -297 59 401 69 -257 323 70 -289 267
5227B67J06p77M43K86m81l12R12m48j27LM13m90k41J053m62k73M39j36m60M60
$$ 267 373 -404 39 325 -156 -468 444 -4 -131 -128 285 -205 -446 607 145 -128 311 175 -285 175
5247A75Ok32k26O97o44L72K03J3p37L50K65n27R7M95k04k55L04J9m39L90J5n47
$$ 175 181 -51 -277 420 -224 148 351 364 -373 -23 242 -285 -188 307 103 -152 152 171 -268 122 137 -410
5269d10K83M10m48l95R86m71n17OO06l93K44M12l54k63N98J55r23K23O56n72k47
$$ -410 -127 283 -165 -560 426 -45 -562 -556 50 -343 -99 313 -41 -304 294 449 -474 -251 405 -167 -414
5290d14O69l90m17Q90J86j132O17L04m76M38j47o1o41N58L23o60N79N7n45k14
$$ -414 255 -135 -552 338 524 -608 9 313 -163 275 128 67 -574 -16 307 -353 226 283 -262 -476
5310d76J192m00m44M18L11q60k28O06o48L58M60j83l14L20J97o74K26L19q6l71
$$ -476 716 316 -128 290 601 -259 -487 119 -529 -171 289 106 -208 112 309 -365 -139 180 94 -277
5330b77O59P0j104J006Qk46k03M78l96l97N70m6p80Q91K9k36j47M14o96L78K66
$$ -277 382 452 -652 354 362 116 -87 391 -5 -402 168 122 -658 233 262 26 -121 293 -403 -25 241
5351B41l9o48M11pk62K52P63r67m9O48k10l07L18K36n43J23M57l54k98N45j93
$$ 241 202 -446 -35 -42 -304 -52 711 -256 -305 343 133 -174 144 380 -163 -40 417 63 -235 310 117
5372A17n96O67ml76K89J76l83k39N51j83j05L27m5l40m3Q21n04m04M55J5q56O61
$$ 117 -479 188 184 -192 97 273 -110 -349 202 19 -86 241 196 -144 -187 634 130 -274 181 196 -660 1
5394AJ61m23P5L95m40J52K02J37o83O30J53l98l86Q20k93l32M36j67m16L83K55
$$ 1 162 -261 -186 209 -231 -79 123 260 -423 207 360 -38 -424 396 103 -229 207 40 -376 7 262
5415B62j80m78L05no83J047O3l55L10K63m28k69L41l72j08N32j48n03M92R3k85
$$ 262 82 -396 -91 -96 -779 268 331 -24 286 549 121 -148 193 -179 -287 245 97 -406 86 179 -106
5436a06lL00j14n13N37P7l79K02J93k30r0M50m59n2J24M78o81J36O12q80J91O17
$$ -106 -109 191 77 -436 101 178 -201 1 194 -36 -126 324 -135 -187 -63 415 -266 -130 482 -398 -207 410
5458D10l29m01K07L82l11l1M55m97q8Q35m30k66L95l42j10QN37n56l1K85k89k8
$$ 410 81 -320 -113 269 -42 -73 382 -115 -203 632 202 -64 331 -11 -121 -113 424 -132 -163 122 -167 -195
5480a95J62L80q17K88N23n25J84K59K41o23K8M55m81j33Q48n57k04L13J72m11
$$ -195 -33 347 -470 -182 341 -184 0 259 500 -123 -95 360 -121 -254 594 37 -167 146 318 -93
5500i3L43Q7n48K33J95k42k13N28p7m15J62K52m30R5K86k55m92P25O4p31P91M55
$$ -93 250 337 -211 22 217 -25 -238 290 213 -202 -40 212 -218 -123 163 -92 -584 141 205 -526 265 720
5522G20p09j39N10k86k61K30K30n31J67L35m09q9N82o6p69P61j3m21K38K48p06
$$ 720 11 -128 382 96 -165 65 295 -236 -69 266 -143 -232 350 284 -485 276 263 -158 80 328 -378
5543c78J93O48p82J07M31n1j01l84L33k83k18R27m14l07N30l7m38J91M25o24o5
$$ -378 -185 463 -319 -212 219 168 67 -317 16 -267 -485 442 28 -279 251 214 -224 -33 392 -232 -297
5564b97P76m55k58L23k6m11M90L7k23l28O80k38m10M33O22r57R1O78n17k11N17
$$ -297 479 24 -234 89 63 -348 142 179 -44 -372 308 70 -340 93 715 -242 -151 527 10 -201 316
5585C16j76n09M88J50l41q6N47m04r4L45N0p43P92j07m76M65K79p13o4J80L22
$$ 316 140 -369 119 269 -72 -158 389 -15 -109 236 286 -457 335 228 -248 217 496 -217 -281 -101 221
5606B21m78J54N82o70j55Q58n50m43O59kp38M09N82k12l46J60j94j65N09Q6k63
$$ 221 -257 -103 479 -191 -346 512 -38 -481 178 176 -562 -153 429 217 -129 31 -163 -328 181 267 4
5627DJ09j0m94N83O8l38k60O25l5m90M42j70k14j1M57L2m15M32k36k85K71N8O3
$$ 4 113 103 -391 192 260 -78 -338 287 252 -238 204 34 -180 -191 266 298 -117 315 79 -206 65 123 186
5650A86n03J030n08m61M03Q4m31J81M86n07l81O21K2l94J00L18m50L07J23k33
$$ 186 -317 713 205 -256 147 231 -200 -19 467 -40 -421 200 222 -172 -72 246 -204 103 226 -7
5670gk59O27m6o03R4N24o57r9P65o27J69l2K37j02L61j22l00m12O37j0m51N05
$$ -7 -266 361 315 -288 -194 330 -327 -426 339 -288 -119 -151 86 -16 345 223 -77 -489 148 138 -313 192
5692A92P2o76N33M07q35K41L04l10m54R63o77M4N43N0o05K40O33q75OM46k38k40
$$ 192 264 -412 121 528 -307 -66 238 -72 -526 437 -240 -196 347 397 -208 32 665 -210 -204 242 4 -236
5714b36K51L97n92K72j2k10l60Q40j43q02Q49M7m76J09M35k66n53O84J29m14Q2
$$ -236 15 412 -180 92 80 -130 -490 350 207 -595 254 301 -175 -66 369 103 -450 234 363 -51 31
5735C1M27m43m82J063o48l90M76K25r11P50J01k09r6K54k7m34K76P0k94j68J039
$$ 31 458 15 -467 596 -52 -442 34 259 -652 98 199 -10 -106 148 121 -313 -37 33 -261 -429 610
5756F10o84o8N46n61l43N54L17o45j5N40l96K6K51j27k59N97k7p53N33J70m84
$$ 610 -74 -142 404 -157 -500 54 371 -274 -289 251 -145 -119 132 5 -254 343 316 -437 96 266 -218
5777b18K04L00k79k85M19L48m84k17N21m01l48L97M5k03O5O09n93j80P55o76k17
$$ -218 -14 286 7 -278 141 489 5 -212 309 -92 -440 -43 2 -201 -136 473 -120 -300 455 -221 -438
5798d38P64k60j97j30O73n48K4K51l68K0M11k8l91K89M91j200O97K54o96OM85
$$ -438 326 66 -131 -261 412 -136 -112 139 -229 -209 202 174 -217 72 563 -637 60 314 -382 -376 109
5819A09n5m38L44J86j63k41K35j51k53J008l73l67K22L28n56o9N78o43o1N93R1
$$ 109 54 -384 -40 146 -17 -258 -23 -174 -427 581 208 -159 63 391 -165 -234 344 -299 -360 233 324
5840C24n90N1M47m60j39Q93k25p94O37L35n88J91J0k41L95K54m37n11N87J08m67
$$ 324 -266 -215 232 -228 -367 526 301 -493 144 479 -109 82 92 -149 246 500 63 -448 139 247 -220
5861b20J53N96p47N5N05j59n65M96R9l89M94n0m45L1N13m68M0M17j72m57R7O28
$$ -220 -67 529 -218 -163 342 183 -382 114 213 -176 318 268 -177 -146 367 -101 -61 356 184 -273 -176 452
5883D52o72N0O20m42n19Q10J32p68J16L96m69K48J22j49m99M77O49j037M52M41
$$ 452 -220 -170 450 8 -511 299 431 -337 -221 175 -294 -46 76 -73 -572 -95 554 -483 -31 410
5903D10m51r6O00k15o23L57L72o59q7N84k98L8J24J0m46N32K36n97O7M39l06o82
$$ 410 -41 -137 463 248 -375 -18 354 -305 -392 192 -106 -68 56 66 -380 152 388 -209 -142 297 -9 -691
5925f91R07K70r24N73J78n87L42K60m08l97O89k34j64K36J59n88K17N51l97l08
$$ -691 216 486 -438 135 313 -274 68 328 -80 -477 212 -22 -186 50 209 -379 -162 389 -8 -316
5945c16L84k9m97M87K43o43M42J82l43O0J67j23l95j0Q06l50l33O03j96o17O49
$$ -316 68 39 -458 29 272 -371 71 253 -90 -30 137 14 -381 -391 415 65 -268 335 139 -478 171
5966A71j06n05K22P88n77l61O75k83m53L22L08n20L47M16n80m9M46l02k89K38
$$ 171 65 -440 -218 570 -7 -368 307 24 -429 -107 201 -319 28 444 -136 -185 261 -41 -330 -92
5986i2M59l14k08M09m76j39Q13k41o21P13M8l93P6L27l36k78L84K28n57M56Q1
$$ -92 367 53 -155 254 -222 -361 452 211 -410 303 351 -42 34 361 25 -253 131 359 -198 258 339
6007C39o94Q6J105q48n14Q10k41m26O55j25m60K4M50k25k08P00p3o72M17P6l44
$$ 339 -355 -269 836 -12 -526 284 43 -383 272 147 -313 -289 161 -64 -272 428 355 -317 100 176 -168
6028a68K15O17o65m75O28j6m20J19O39r01J32Q32q47J45L82l80k16K50M32m88
$$ -168 47 664 -1 -476 152 136 -284 -165 474 -427 -295 537 -310 -165 217 -163 -379 -129 303 -185
6048a85l30R29m57l72J109l30o95K08L06l56R9M86p30j70Q23n8o90N19R0k01n7
$$ -185 -515 414 -43 -415 694 364 -331 -123 183 -173 -74 412 -318 -488 335 277 -413 106 196 -5 -62
6069f2L32l11j64L27J93n11l1O19m85n6K97k80K8K29Mo66N56J04l64J49N74n15
$$ -62 270 -41 -205 122 315 -196 -227 392 -93 -149 148 -132 -104 125 129 -537 19 123 -241 -92 482 -33
6091c3m58R45jo95K00P48r25J92K24j83m93N61M43q25k0M27l70k06O99l62m23
$$ -33 -491 454 453 -242 -42 706 -219 -27 197 14 -479 82 525 -300 -320 107 -263 -469 230 -132 -555
6112e55Q53k16o39L50K92N0k70M10j72l37K59L79n60k4L81q6m53N57P8m75N25
$$ -555 298 82 -557 -207 85 135 -135 275 103 -234 25 404 -156 -180 201 115 -338 219 297 -178 347
6133C47M8o99q9N47k09k56L61K94p21N40L60n67M8K04q1k96M38k47k52N07k6j71
$$ 347 395 -304 -393 154 -55 -311 50 344 -377 163 523 -44 4 208 127 -169 269 22 -230 277 251 80
6155H0r2K45k30k68K54M1k60J35M95m55J15J28Q6m41K74J02q12N87J57m70K75
$$ 80 -12 233 3 -265 -11 30 -230 -95 400 -55 60 188 274 -167 107 209 -603 -16 141 -329 -54
6176e4K78n54J68M14j60m22N59N8m10k37P84m82p6K62l65R7K85k8m40N74l6m0
$$ -54 224 -330 -162 252 92 -330 229 287 -123 -360 424 -58 -134 128 -237 -140 145 117 -323 251 215 175
6198A75k41K08J09o55L31L40o72J90M55J56o51M1L34n03K94O85o36j78P39j74
$$ 175 -66 142 251 -404 -73 267 -405 -215 240 396 -255 -214 120 -383 -89 596 -40 -218 521 347
6218C47p58L46J61n88L66N02n61P1R2K95m43K91k0n39L22J88j93Q2M26k38p7P6
$$ 347 -411 -65 96 -492 -126 376 -185 -114 -22 273 -170 121 101 -438 -116 72 -121 -39 387 149 72 148
6240A48k44Jj37O73l97l75L35L04o16N10J28o49L04N8l21R2N95k80m58L36M08
$$ 148 -96 -95 -232 441 44 -331 4 308 -308 202 330 -319 -15 43 -278 -186 409 129 -329 7 415
6261D15n59r8Q19m96k76O29m85k00J64K26m09K2O44l38m53L10L12m98M84j52j70
$$ 415 -144 -242 577 81 -195 434 -51 -251 -87 139 -270 -248 396 58 -395 -85 227 -271 213 61 -109
6282a09K01M03m12m06P44j28l68J1k14L8R8O12m70p09N39K82m80n6N89l07N7L21
$$ -109 92 495 83 -323 421 293 -75 -64 -278 -240 -142 470 0 -709 -170 112 -368 -424 165 -142 -85 236
6304B36l09n59O34J33k41K39m0j90k09P69p30j85Q66k91l48N9L65l52L8L61k48
$$ 236 -73 -632 2 135 -106 133 93 -97 -306 463 -267 -452 414 123 -225 -166 199 -153 -115 246 -2
6325bn25O18L34q61M30J50k98%N15j30o70M70j28k42M17J12k14P0J13m14p9L38
$$ -2 -527 91 425 -436 -6 144 -154 -154 361 231 -439 31 -97 -339 78 190 -24 46 159 -255 -334 4
6347DL96m85J02N7j4j0L20l92j83L62L71o20j06K97j25j04J32M3j63P6M41n94
$$ 4 400 -85 17 74 60 50 370 -22 -205 157 528 -92 -198 99 -26 -130 2 45 -118 -42 399 -195
6369a95J38K26l29l40P50k40j7J09k3j01K93J3k31k60J30M67q66N12J39p8j27
$$ -195 -57 169 -160 -500 250 10 -7 102 79 -22 271 284 53 -207 -77 390 -476 36 175 97 -30
6390c0O23n44j64K91R9m54M09j64l88l2O25o8m62K48L21k41J78Q4o03P4M49k39
$$ -30 593 49 -115 176 275 -179 230 66 -322 -354 271 203 -259 -11 310 69 247 331 -272 -198 251 12
6412A2l17O57q1m02o4M37k76m22M32J23n91O67J44q23M36L84k93j04L10O8p59
$$ 12 -305 352 271 -131 -195 242 -34 -456 -24 99 -492 175 319 -504 -68 316 23 -81 229 297 -462
6433d62P18k83m1j21L49l93q4N92k99l48K29K79k02oL60k67k64N47j80k76J26
$$ -462 256 -27 -68 -189 160 -233 -317 275 -24 -372 -143 136 -66 -72 288 21 -243 304 124 -152 -26
6454b6L13n05k56Q78m46n8N4J48k89j19N70o25K33K18k82q5K66L95p23L76J51
$$ -26 287 -218 -474 404 -42 -100 -46 102 -187 -306 264 -361 -128 90 -192 -277 -11 384 -339 37 188
6475A88l39N3O33n28j59J98L05l01k30L38o15N67K71k62m92N23j13m48L49N5l23
$$ 188 -151 -98 535 7 -152 46 351 50 -180 158 -457 110 381 119 -373 150 37 -411 -62 -7 -330
6496c30L06J53j92m78O80K17o31L15M37q09L17M71n15n1K84J87n87k2N02l93O7
$$ -330 -24 129 -63 -541 139 356 -275 40 477 -332 -15 456 -59 -110 174 361 -226 -248 254 -139 -72
6517g2L97l78O4K77P1p89M60N4J32l33N11m82O7J29k00n4j2P49o96L4K49k6m29
$$ -72 325 -53 11 288 359 -430 30 84 216 -117 394 -88 -21 108 -92 -146 -158 591 -105 -71 178 152 -277
6540b77M08O1o02J35O81l50l30N33l24j96L78j11k61K9P04o63j97P14k42k91P6
$$ -277 131 192 -410 -275 406 56 -274 259 -65 -261 117 6 -255 -226 478 -185 -382 332 90 -201 -125
6561a25O08p21J71O30o52m35P92k94k92N42L50p40K25M6l08j79O19n1o07L70L03
$$ -125 483 -238 -67 563 -89 -524 268 -26 -318 224 574 -166 59 105 -203 -382 237 186 -421 -51 252
6582B52l37j63N26l17k15N01l59j65K67K74m11q3L89l85J85J36k6l26J92L69m80
$$ 252 -85 -248 278 -39 -254 247 -112 -277 -10 264 -147 -230 159 -226 -41 95 69 -257 -65 304 -176
6603a76j01O92j2o45K77n7j25J13K7r0J06K04J8m20K87J54o39L02K34k28J75K03
$$ -176 -277 415 403 -242 35 -22 -147 -34 -7 -97 9 213 231 -189 98 252 -387 -85 149 -79 96 299
6625B99k32j41L27l04m31P91Q3n96N1N53l44n68N61R8k00J39K38q72J99P56l57
$$ 299 67 -74 253 -51 -482 309 392 -204 -153 400 56 -512 49 147 -53 86 324 -548 -349 407 50
6646E0l66K50K79n41L66M46l85j99K43l9n16M66J0l73K11M77k20o15N03L20p68
$$ 50 -316 -66 213 -328 38 484 99 -100 143 104 -412 54 64 -309 -98 379 159 -456 47 367 -401
6667d01M41L27n17P5L33m49kM22k19k61M12j54o8r1J72n0m17P29J08n32N09l04
$$ -401 40 367 -150 -75 258 -191 -193 229 10 -251 161 7 -61 -152 20 -30 -447 282 390 -142 367 63
6689F3l12J10L64j93m53N25r1j86j6J15j01K08j14O3%O4K66o48M55K03o50J47
$$ 63 -249 -139 225 32 -421 104 13 -173 -189 -74 -175 33 -81 -18 -18 46 312 -336 119 322 -328 -181
6711a81N12k66l33J49L48m99J86K24l86K73L58k02l41M38n2m01L29J90k52k0O7
$$ -181 331 65 -268 -119 229 -270 -84 140 -246 27 385 183 -158 280 228 -173 156 346 94 74 141
6732A41J10m84N40mn10J75L31l92m20P84j15l22N02n28np8J56l3n1N66j83n63
$$ 141 251 -233 307 303 -207 -32 299 -93 -513 271 156 -166 336 -192 -197 -275 -119 -152 -203 363 180 -383
6754c83N45Q2k80k1L38l80j07M82k01j36J65L64p24M24Q1m60k89Q65k38n98Q62
$$ -383 162 244 -36 -57 281 -99 -206 276 75 -61 104 468 -256 168 249 -211 -500 365 127 -471 391
6775C91O6r13L90L96m75J65K31j44l40K96J98n55L08K60k94m27O66Ll01LK17l36
$$ 391 457 -456 -66 330 -145 20 251 107 -233 63 261 -294 14 274 -20 -447 219 222 -79 -76 141 -195
6797a95K16L18n25o1K37J25m68L31K20m64L2N81m08k39Q77k71l84K37o7l15K33
$$ -195 21 339 -186 -247 -10 115 -353 -22 198 -266 -234 347 -61 -300 577 306 -78 159 92 -223 10
6818A0K17p05K56L80K6m58L9M55l78j43M23o3l12K49N6k03N18k26l2J58m8k4n15
$$ 10 227 -478 -222 158 184 -274 -235 220 -158 -301 122 59 -253 -4 52 -151 367 141 109 267 219 195 -320
6841c20N13k79m34N65J80n94K72M17n14j78P09j93o82P86O7n74k43N43n9k41J57
$$ -320 193 -86 -520 45 225 -369 -97 320 -194 -372 337 144 -538 248 315 -259 -502 41 -18 -259 -102
6862a02M60p60L94J42k58o7L83k25k05L61j08r4j15L50m41j43O10r1o7L55n4n32
$$ -102 358 -402 -8 134 -124 -191 192 -33 -238 123 15 -79 -194 156 -285 -428 182 91 24 379 325 -207
6884b07P9L18k66k00L40j60n0J72K15m10M42J20m51J67L17l51o02O24J85m38l02
$$ -207 -128 190 -76 -276 64 -96 -146 26 241 -169 273 393 -58 109 426 75 -527 97 282 -156 -458
6905d58R83p53J80L14l55p3K26K58o28j23P81m70m9J45L04n5J0k96l22O5N90l95
$$ -458 525 -228 -48 266 -89 -162 64 322 -306 -429 352 -118 -167 -22 282 227 237 -59 -381 -316 274 -121
6927a21l74N86k5j64K44k03J79k27L52k54l39N26k0l67o1P47p96M03N51p30j32
$$ -121 -495 91 66 -98 146 -57 122 -105 247 -7 -346 180 160 -207 -268 479 -317 86 637 -93 -225
6948b25L93P0n47M91r0j69l01Q30o38l28O17J31m56J35L85k62n98O16k6j72M5
$$ -225 168 238 -309 182 92 -77 -378 452 -186 -514 103 234 -222 -87 298 36 -562 54 28 -144 -99
6969i9L05k92r5P90o66k89O42k42k91K64J35n01K38O60l45l42M71j52p14N48L1
$$ -99 206 -86 -181 609 -57 -346 296 54 -237 27 162 -339 -101 559 214 -128 343 191 -523 25 56
6990E6m90J99M34l73J78L25K99j154O98J09m19n0P25m11m91O09Po59M42Q8k32
$$ 56 -434 -235 199 -174 4 329 628 -526 172 281 -138 -188 537 126 -365 244 251 -408 34 122 -110
7011a10J30P4k04k97N59n3k21J21J38j34j49M54m18k85N72j13j95J9M37m90J22
$$ -110 20 94 -110 -407 152 99 -122 -1 137 3 -146 308 -110 -395 177 64 -131 -112 325 -165 -43
7032d3L16l6l82L88J52n71J54L57m27l7M64m65l32O35k49j4l5O07l33o93R13m53
$$ -43 273 237 -145 243 395 -176 -22 335 -92 -129 335 -130 -462 173 -76 -90 -125 482 149 -544 369 -84
7054h4j35L77J07m11L24Ll71R9N08l69Q7j86%Q2k26L45l26j03L45K60m42Q1K75
$$ -84 -219 158 265 -146 178 181 -190 -91 417 48 135 -51 -51 31 -195 150 -176 -279 66 326 -116 -35 240
7077B40q45L21O37p40J93L75K66p66N55m4n55Q8M18K4k62K54J6n24R6K00m64M49
$$ 240 -605 -284 353 -387 -194 181 447 -319 236 192 -363 -275 143 167 -95 159 175 -349 -253 -53 -517 -68
7099f8M48n66J24O24m44n02K91j88Q3L28l6L4k87M96j69l50l3L63k82j69L15k78
$$ -68 380 -186 -62 562 118 -384 -93 -281 -198 130 94 128 -159 337 168 -182 -215 148 -134 -303 12 -266
7121b66j80Q05m66l15L64L54n05j30O27k35j57K52K86m50n5J24j51L7K81o02l8
$$ -266 -446 359 -107 -422 -58 296 -209 -339 288 53 -104 148 434 -16 -71 53 -98 -61 220 -382 -420
7142d20O71J3n42K47L24p45L90K31l55R9L1P0k84M23m9l00Q3K47p0l99N21On13
$$ -420 251 264 -278 -31 293 -452 -62 169 -186 -87 -56 14 -270 153 104 -196 -113 134 64 -335 186 192 -321
7165c21L33K34n23k0L98j87j64M31k3n67L04L57l91j54P03m70n27P96r0o07M21
$$ -321 12 246 -277 -297 101 -86 -250 181 158 -409 -105 252 -139 -293 410 -60 -587 209 119 -488 -67
7186f7M66n22j02N24k57m63N97M5m32Q3M10n47K68M03o39j90N79j4l89K66J96
$$ -67 399 -123 -225 299 42 -421 176 221 -211 -128 282 -265 3 406 -233 -423 156 142 -247 19 215
7207B15l53N2K87Q8n12M76m6m34J06O03n32O3J48J78m02K54J23k23l76M68m37
$$ 215 -138 -86 201 289 -223 253 207 -227 -121 482 -50 13 161 339 -63 191 314 91 -285 183 -254
7228b54J04M83m95n77N42P40o97J58K86j52n49O03K67r52L89K90l69M5L56j93
$$ -254 -150 333 -162 -739 -197 543 -154 4 290 138 -411 192 459 -493 -104 186 -183 -138 218 25
7248B5m23P10m5p94L26L84m41J84M76n61m0M84m13j1K23K46m88j65R72o08l13
$$ 25 -398 312 267 -527 -201 183 -258 -74 402 -159 -199 285 -128 -139 84 330 -158 -323 649 41 -272
7269b72N77P7m71N0J60k09j70M83k77o8M85l70m61N16L19r16L2L91M17p60N18
$$ -272 305 382 -89 -39 121 -88 -258 225 -52 -120 365 -5 -466 50 369 -547 -515 -124 293 -467 51
7290E1J71k38j33P59p32LQR0n98R20n2o50J23L73p0j42K88j42m49N41J66p34N34
$$ 51 222 -16 -149 610 -122 -119 -111 -21 -619 301 249 -401 -278 95 25 -117 171 29 -420 121 287 -447 87
7313H7J18j98l92Q60l52o44L93N55p81M68J9k31J00J57k08k98L85O6m06M7L40
$$ 87 205 7 -385 475 123 -521 -128 427 -354 114 133 -98 2 159 -49 -347 38 104 -302 -255 85
7334H5l42j3M78kp10O33K65l79j93L25o3l59J58K48j91J86j0l76M6M40m54j12
$$ 85 -257 -270 208 206 -504 129 394 15 -178 147 84 -275 -117 131 -60 126 116 -260 -214 226 -228 -340
7356c40J70M52o38P2Q09p06l10Q87n46m77Q50j7l18L2K41l58%P12n64p6M22k06
$$ -340 -170 282 -356 -284 525 -181 -491 396 -150 -627 223 206 -112 -80 161 -197 -197 515 -49 -125 297 91
7378I1m23M36K65m61m4L37m65J37J86J03m33M66K65p30n1O33k64l31O75k03o89
$$ 91 -332 104 369 -92 -136 201 -264 -127 59 162 -271 195 460 -270 -321 312 48 -283 392 189 -500
7399e00K54M41m95N48J17l27m66M54J81n07J43N20p31L37K23l13j85L57L74m81
$$ -500 -246 195 -300 248 365 38 -428 26 207 -300 -157 363 -368 -31 192 -121 -306 51 425 -56
7419e6K85K7l56L16j17J80o48L11L52o15M97K65l65l43Q58n32k60K11L64p42L07
$$ -56 229 256 -100 216 99 279 -369 -58 294 -321 176 441 76 -267 591 59 -201 10 374 -368 -61
7440f1R9N7l05L12j29m16N87J94n44K5Q03q12pO07m66N2J73n0l25o4N52m93K12
$$ -61 38 95 -210 102 -27 -443 144 338 -206 -181 622 -190 -197 410 -56 -4 169 119 -206 -270 282 -211 1
7463AM7j67l7J4L79o96J88L14j11j08N02l31j62K48K81n77J25L85m95j42Q21k31
$$ 1 48 -119 -156 -142 237 -459 -271 43 -68 -176 326 -5 -167 81 362 -215 -90 295 -200 -342 479 248
7485B48o69J19O30m10J55J67k85q9J70J77p05M08K84k65K33K12j91l01L58k28
$$ 248 -421 -302 328 -82 73 240 -45 -134 36 213 -492 -84 200 -65 168 380 189 -112 246 18
7505A8j65K18J49l5k81J28J27l50K20K48l52M33k05l66M44L19o36k93N58J06k60
$$ 18 -147 71 220 185 -96 32 159 -191 29 277 -75 358 153 -213 231 550 -86 -379 179 285 25
7526B5J60o8l32j1M64J6m78K32j12k08J19L51m6j12J97j6l82M14k04n51M19K68
$$ 25 185 117 -215 -226 238 254 -224 8 -104 -312 -193 158 112 0 197 181 -201 213 9 -542 -123 145
7548A45l05l58P02j50l69M92k0j63LJ46m0j28J83L3k86P4K0q7j3M48o81K1M48
$$ 145 -160 -518 184 34 -335 157 137 -26 -23 123 83 -45 138 171 -115 -41 -21 -108 -121 327 -354 -333 115
7571A15J12m43pN38m04j61L75k25q3O68m26l41M04O5k01m05O26p9o23O97q3l76
$$ 115 227 -216 -223 315 -89 -250 125 -100 -183 485 59 -282 122 187 -14 -419 207 128 -495 202 119 -257
7593b57L92K13n62J34L45j76o25N52m0l00J81L92n39L12M97l63j84j2K6l51J66
$$ -257 135 348 -214 -80 265 89 -536 16 -24 -324 -143 249 -290 22 519 156 -28 -40 -14 -365 -199
7614a99N04n24K4N89m61k06K20K85n09K34M14l86l59M11P2l04K34J05m41M26K88
$$ -199 305 -219 -195 394 -67 -273 -53 232 -277 -43 371 -15 -374 37 109 -195 39 144 -297 129 417
7635D17n11P7K37O5m93L75Q0l25O4J69k87j38L18J16o30M61J28n59N31K04j89
$$ 417 -94 -17 220 285 -208 167 247 -78 -14 155 -132 -270 48 164 -466 -5 123 -436 95 299 110
7656A10o0N8o5m85N54K31q57K85L09k2oK7L44q84O61K48o09Q3N93n09k25N05j90
$$ 110 50 108 43 -442 112 343 -514 -229 80 58 52 79 423 -461 200 448 -161 -78 515 6 -219 286 96
7679I6l84K47L20m78J65K26l55J48L99r5m70K8L99l43M7J2J96l60K75l9j88J77
$$ 96 -288 -41 279 -199 -34 192 -163 -15 384 289 -181 -153 246 -97 -50 -38 158 -202 73 34 -154 23
7701B3j6Nk73M82o9m61M93K55q64L33K36l00o2O55k99m68L25L18n08K50K86l07
$$ 23 7 12 -261 221 152 -309 184 439 -425 -92 144 -156 -218 437 138 -330 -5 313 -195 55 341 34
7723C4rM08l34j74J64J16l68L8N01p97J97M29K4o70J90M75m89J21M56j36k09K96
$$ 34 25 433 99 -75 89 205 -163 -125 376 -421 -224 205 229 -441 -251 224 -265 -144 312 176 -33 263
7745B63m3m55K57J86n21P8L10k06o9J80J09o06P64k5m28K9L79j27j01K27lm27
$$ 263 220 -235 22 208 -313 -235 75 -131 -200 -20 89 -517 247 222 -206 -177 202 75 -26 201 198 -229
7767b29K93P5j2l70N66m88k96M83j06k45O37m5o57o4L43K16m17O63l34l92O35
$$ -229 64 139 127 -243 323 -165 -461 22 -84 -329 308 263 -394 -458 -115 101 -316 347 13 -379 256
7788B56j09j29k23M90j49m24O04j41l12J25K49n06m9O43J76o15L05n8n49L42J56
$$ 256 147 18 -205 285 136 -288 316 175 -137 -12 237 -269 -318 325 501 -114 191 133 -416 -74 82
7809H2j25j6Q4j40p6K86M06o44N0K83l33k2L31l0o46N81K46p20L28L00k91k9L33
$$ 82 -43 -59 25 -115 -191 95 501 -143 -93 190 -143 -165 166 136 -510 71 317 -403 -75 225 -66 -95 238
7832B38j54m15O52j66n51K64L3k68j04M67N9j41L00P3n13K85N5r4k79L41J11m39
$$ 238 84 -331 321 155 -396 -132 -99 -367 -471 -4 55 -86 214 287 -226 59 114 20 -259 82 193 -246
7854b46K33L04q25L71M42m27M6p7M34j72j3j2n22M37M64n07k69L76J68k70K54
$$ -246 -13 291 -534 -163 279 -148 -102 -179 255 83 70 58 -464 -27 437 -70 -339 37 205 -65 189
7875A89L2n07K50M70n90m09P54j0j96K03J83n12j15N10k63m99N82l56J34K95J51
$$ 189 221 -286 -36 434 -156 -565 189 179 -17 186 369 -143 -258 252 -11 -510 72 -284 -150 145 296
7896B96n59O8L96l32L38r4J58m65JM60m47J00N45p16K9P21l05k82R0j22j83J86
$$ 296 -263 -195 201 -131 207 113 271 -194 -193 267 -180 -80 465 -251 -222 499 194 -88 2 -120 -303 -117
7918a17L98l92J16K10m1k39K80K70p77M18K74m19k15M70l01j32J70M4L0j25J22
$$ -117 281 -111 5 215 174 -65 215 485 -292 126 400 -19 -234 236 -65 -197 -27 17 47 -78 44
7939D4J72m54L68J17j67QM08m06p10Q17k37l65M93K9j73J97K89n72J36K95l72
$$ 44 216 -238 130 247 80 88 496 90 -620 197 -40 -405 88 117 -56 141 430 -142 -6 289 -83
7960h3n10R60l41m19l0Q15q23R9N36j68n50R41P4j022L91L17o16L15N31m12k75
$$ -83 -593 367 26 -393 -423 392 -431 -332 204 36 -514 427 501 -521 -130 187 -429 -114 417 5 -270
7981b70M54k18l13N23J92l30k00L56m22J0J64j94P9r0N40j62m25M14K84q29O13
$$ -270 184 -34 -347 176 368 38 -162 194 -228 -218 -54 -248 -169 -259 281 119 -306 108 392 -437 176
8002A76N07p98j37L68q3k05K57Om72L13K75m91K01L41k61n97P65m37j85O04J61
$$ 176 683 -115 -252 116 33 -172 85 91 -381 -68 207 -284 -83 258 -3 -600 165 -272 -457 147 308
8023C08n56J7N9l4l2M70k98k30L15O00n62m34O18m56K9O23l01p55O52J91l17r
$$ 308 -248 -231 -172 -206 -238 232 -66 -296 19 619 57 -377 241 -215 -186 437 136 -619 33 224 -93 -102
8045a02J57%P7M6k3k06k07O71q86L18N78n55k06L76n5k03J03O45m90O1L55l09
$$ -102 55 55 132 178 155 -51 -258 413 -473 -155 423 -132 -338 38 -17 -220 -117 528 38 99 454 145
8067A45m40N37j10l27K77J58m70j43N50j56M2K1J19k95K14k42P9j22N2J23k62
$$ 145 -295 242 132 -195 82 240 -230 -373 177 21 63 84 203 -92 122 -120 -41 -163 -111 12 -250
8088b50o7M23j97o9M04l91k27N88k12r7K67j44l62J09P85o98N2K17l67J35L06
$$ -250 -317 106 -91 -160 244 -147 -374 214 2 -95 172 28 -334 -225 560 -138 -86 131 -236 -101 205
8109B05l24q6K01K73n90P3N31k33j30J83J82o31j1M16j77K20P9J18n54J74J81
$$ 205 -119 -205 -4 269 -321 -248 283 50 -80 103 285 -346 -357 59 -118 102 181 299 -255 -81 100
8130A00j73j06L65j53m23N22P1m05RM62m47jL68l64L08J72l02p5J87Qk33o6L39
$$ 100 -73 -179 186 33 -390 132 203 -202 -193 269 -178 -179 189 -175 133 305 3 -72 115 123 -110 -176 163
8153A63k87M7K22mm20L07j5j4r0M63m74j96M42j27J39n20M77n6J04j12%m26R55
$$ 163 -124 -77 145 141 -279 28 13 -1 -91 372 -102 -298 144 17 156 -364 113 57 161 49 49 -377 578
8176E78k85m18Q0L16p0j27J69k38o07Q15r5k57L56N7l40
$$ 578 293 -125 -45 271 201 74 243 5 -602 213 118 -139 217 274 -66
8191f6
$$ Imaginary data points
##PAGE= N=2
##DATA TABLE= (X++(I..I)), XYDATA
0@%%%%%%%%%%%Lj1J6j6J6j7K5l2L3l9M6n3O2p1Q2r1J02j18J34j50J69j89K13k37
$$ 0 0 0 0 0 0 0 0 0 0 0 0 3 -8 8 -8 8 -9 16 -16 17 -22 24 -29 33 -38 44 -47 55 -63 71 -79 90 -99 114 -123
35a23K59k88L21l58L97m39M85n35N94o59P31q13R07j017J144j294J476j705J997
$$ -123 136 -152 169 -189 208 -231 254 -281 313 -346 385 -428 479 -538 606 -688 788 -917 1080
54A080k381K914l705M996p431J3460n1781o4185J85857l4723j44225J14563O5437
$$ 1080 -1301 1613 -2092 2904 -4527 8933 -42848 -107033 78824 44101 -100124 14439 79876
67G9876j56450L8922J31528j22024o0283J63622l8319j42586J19640P3718j60441
$$ 79876 -76574 -37652 93876 -28148 -88431 75191 36872 -105714 13926 87644 -72797
78g2797K3413J40335j08233p1849J52769k3350j39701J08007P6774j53510J3775
$$ -72797 -49384 90951 -17282 -89131 63638 40288 -99413 8594 85368 -68142 -54367
89e4367J42007r6390q0139J43390j0329j36015R4952P8672j44040Q326J40202
$$ -54367 87640 -8750 -88889 54501 44172 -91843 3109 81781 -62259 -53933 86269
100H6269r1481q5668J40722K481j38073Q1447Q5696j33315k219J34591p9204q5822
$$ 86269 -5212 -90880 49842 52323 -85750 -4303 81393 -51922 -54141 80450 1246 -84576
112h4576J32516N416j36313P7297R0873j30298j2607J37224p0087r2845J26373
$$ -84576 47940 53356 -82957 -5660 85213 -45085 -57692 79532 9445 -83400 42973
123D2973J6545j36007O5994R6168j22748k1361J34230n9206r6857J18304K3812
$$ 42973 59518 -76489 -10495 85673 -37075 -58436 75794 16588 -80269 38035 61847
134F1847j32562N8345R7336j17648k6734J34028n3195j02228J14616L2894j32598
$$ 61847 -70715 -12370 84966 -32682 -59416 74612 21417 -80811 33805 66699 -65899
145f5899M6874J02725j08761l5296J29619m3832j02651J06275L7738j29252M0203
$$ -65899 -19025 83700 -25061 -60357 69262 25430 -77221 29054 66792 -62460 -22257
156b2257J04770j02800m2009J26555l5225j04363R8735M3996j25475L1274J05466
$$ -22257 82513 -20287 -62296 64259 29034 -75329 23406 67402 -58073 -26799 78667
167G8667r4540m7098J21635k7606j04278R0989M8526j20481K3787J05309q8243
$$ 78667 -15873 -62971 58664 31058 -73220 17769 66295 -54186 -30399 74910 -13333
178a3333n1654J19002k0296j06809Q3952N5093j16712J5735J05204p9988n5870
$$ -13333 -64987 54015 33719 -73090 10862 65955 -50757 -35022 70182 -9806 -65676
189f5676J13782j3522j05822P6949N8347j12337R675J06059p4298o1241J10990
$$ -65676 48106 34584 -71238 5711 64058 -48279 -38604 67455 -6843 -68084 42906
200D2906n869j07370P0624O3965j08857J825J07317o6646o6575J06551J603j07792
$$ 42906 37037 -70333 291 64256 -44601 -42776 64541 -2105 -68680 37871 39474 -68318
212f8318O4140O9092j05795m787J08260o0517p1406J03638Q501j08320N6600P3965
$$ -68318 -4178 64914 -40881 -45668 62592 2075 -69331 34307 42808 -65512 -8912 65053
224F5053j00799j2267J07714n2677p4885R8303J5095j07814N0401P7112r6395
$$ 65053 -35746 -48013 59701 7024 -67861 30442 45537 -62277 -11876 65236 -31159
235c1159j8750J07624m5990p9051R3326K2911j05972M1180Q0833q9577k5731J04668
$$ -31159 -49909 57715 11725 -67326 26000 48911 -57061 -15881 64952 -24625 -50356 54312
247E4312l7618q1027Q7193K7730j03089L4275Q2612q3699l1096J02322l0665q2993
$$ 54312 16694 -64333 22860 50590 -52499 -18224 64388 -19311 -50407 51915 21250 -61743
259f1743Q0777L4582j00895K6382Q4586p7125l7042R8990k3035q4627P4094M0017
$$ -61743 19034 53616 -47279 -20897 63689 -13436 -50478 48512 25477 -59150 14944 54961
271E4961r8073J9398Q6163p1362m2704R7199j5793q7366O8376M5681r5626J2133
$$ 54961 -43112 -23714 62449 -8913 -51617 45582 29789 -57577 10799 56480 -39146 -27013
283b7013Q7524o5117m7918R3835q814q8492O2352N0231r2370N845Q9044o0251
$$ -27013 60511 -4606 -52524 41311 32497 -55995 6357 56588 -35782 -29937 59107 -1144
295a144n3000R1855k538r0584N6793N5900r0359j429R0583n3593n7868Q8467L720
$$ -1144 -54144 37711 35173 -55411 1382 57282 -33077 -34506 56077 2484 -55384 33083 36803
308C6803r0378N0381N9315q6751o952R0924m8348o1799Q5526R554r1439M5573
$$ 36803 -53575 -3194 56121 -30630 -37582 53342 4994 -56805 28721 38275 -53164 -7591
320g591O3503q3370j3380R0254m1121o5342Q0187J6265q9836L8361O6142p8464
$$ -7591 55912 -27458 -40838 49416 8295 -57047 23140 39405 -50431 -12070 54072 -24392
332b4392j8299Q8969l5360o7983P6012K1808q8730L1406O9389p3402k4361Q7572
$$ -24392 -42691 46278 10918 -57065 18947 40755 -47975 -16569 52820 -20582 -44943 42629
344D2629k8313p0216P0614K7321q6503K5079P0884o8107k9365Q6084k2967p2074
$$ 42629 14316 -55900 14714 42035 -44468 -19389 51495 -16612 -45977 40107 17140 -54934
356e4934O6340L2433q5449J9268P3258o2746l5635Q4666j5595p4561O0725L7854
$$ -54934 11406 43839 -41610 -22342 50916 -11830 -47465 37201 21606 -52955 7770 45624
368D5624q3027J2394P5679n8310m0212Q2592r446p6752N6294M3206q2024O366
$$ 45624 -37403 -25009 50670 -7640 -47852 34740 25294 -51458 4836 48042 -33982 -27616
380b7616P8367n3389m5702Q0601k573p8585N0584M7608p9172P76P9288m8230n0359
$$ -27616 50751 -2638 -48340 32261 29688 -48897 1687 49295 -29877 -29101 50187 1957 -48402
393d8402P8353L120p9994M5452N2691p7093n767Q0204m2190n4696P5195R107q0087
$$ -48402 29951 33071 -46923 -1471 51220 -25873 -31640 48564 6374 -48322 26873 35980 -44107
406d4107L9172N6167p2421j2238P9513l6301n7806P1552J4445p9685L3087N9685
$$ -44107 -4935 51232 -21189 -33427 46086 9785 -48021 23531 37976 -41709 -8622 51063
418E1063o8844j8166P9167k9924o0564O6115K0387p8475K7234O1711o4410k2799
$$ 51063 -17781 -35947 43220 13296 -47268 18847 39234 -39241 -12007 49704 -14706 -37505
430c7505P7901k4309o3151O2042K4996p7271K1622O4508o0747k8269P7138j8314
$$ -37505 40396 16087 -47064 14978 39974 -37297 -15675 48833 -11914 -40183 36955 18641
442A8641o5779N7714K9845p5646J5733O6075n6334l1999P5288j3371o7526N4228
$$ 18641 -47138 10576 40421 -35225 -19492 46583 -9751 -41750 33538 20167 -47359 6869
454F869L4249p5047J0999O8543n2951l6167P4533q781o9471N0499L8630p4313
$$ 6869 41118 -33929 -22930 45613 -7338 -43505 31028 22247 -47224 3275 41905 -32408
466c2408O556O9938m8897m0153P3554m884p0719M7431M2266p3169K038P1774m5510
$$ -32408 -25852 44086 -4811 -44964 28590 23706 -47013 418 42684 -30485 -28447 43327 -2183
479b183m3676P1999k12p1656M3376M5300p0837k162P2048m1106m6719O9715M201
$$ -2183 -45859 26140 25928 -45728 -2352 42948 -27889 -30051 41997 891 -45828 23887 28088
492B8088p2342L9917M7815o8517o412P2751l7151m9820O7268R122p2362L4565
$$ 28088 -44254 -4337 43478 -25039 -31451 41300 4149 -45671 21597 30719 -41643 -7078
504g078N0881o4976j0885P1680l2202n2000O4172J3285p1554L0185N3433o2509
$$ -7078 43803 -21173 -32058 39622 7420 -44580 19592 32877 -38677 -8492 44941 -17568
516a7568j5244P1726k8040n4388O0597J8177p0984K5157N5595n8841j9576P0693
$$ -17568 -32812 38914 10874 -43514 17083 35260 -35724 -10567 45028 -13813 -33389 37304
528C7304k3157n6590N7443K1858p0800K1598N7902n6434k4040P0257j8287n9173
$$ 37304 14147 -42443 15000 36858 -33942 -12344 45558 -10876 -34916 35341 17054 -42119
540d2119N4400K6268p0457J6508O0648n3191k7991O9559j4199o1064N1601K9439
$$ -42119 12281 38549 -31908 -15400 45248 -7943 -35934 33625 19426 -41638 9963 39402
552C9402o9819J2666O1985m9985l2075O9339j0119o2897M7753L3929o8636Q115
$$ 39402 -30417 -17751 44234 -5751 -37826 31513 21394 -41503 6250 40179 -28457 -20342
564b0342O3388m6515l5427O7435n565o4450M4471L7083o6890L647O4524m3433
$$ -20342 43046 -3469 -38896 28539 22974 -41476 2995 40078 -26812 -23165 41359 -2074
576b074l8197O5660p13o5656M0715M0285o4937j093O4724l7954m2080O3775K672
$$ -2074 -40271 25389 24676 -40980 -265 40020 -24917 -26010 38714 760 -41320 22455 25127
589B5127o4962L6384M2680o2580m740O4678l4016m3899O0348P113o4773L2018
$$ 25127 -39835 -3451 39229 -23351 -28091 36587 2571 -41328 19020 26133 -38640 -6622
601f622M5662n9796r343O4949k9884m6504N7821J1492o4950K8200M7707n7097
$$ -6622 39040 -20756 -30099 34850 4966 -41538 16283 27775 -37175 -8975 38732 -18365
613a8365j2626O4640k6413m8401N5722J4955o5220K4795M9987n4670j6881O4867
$$ -18365 -30991 33649 7236 -41165 14557 29512 -35708 -10913 39074 -15596 -32477 32390
625C2390k2164n0936N3276J8517o4386K0601N2226n2259k0024O4782j9058n2927
$$ 32390 10226 -40710 12566 31083 -33303 -12702 39524 -12735 -32759 32023 12965 -39962
637c9962N1308K1754o4439J7299N4299m9818k3771O4092j4650n5249M8609K5287
$$ -39962 11346 33100 -31339 -14040 40259 -9559 -33330 30762 16112 -39137 9472 34759
649C4759o3674J3478N5844m6696k7750O3599j1129n6529M5549K9030o2609R001
$$ 34759 -28915 -15437 40407 -6289 -34039 29560 18431 -38098 7451 36481 -26128 -17127
661a7127N7112m3674l0225O1622o840n7112M1139L2035o0765N142N7611l9961
$$ -17127 39985 -3689 -33914 27708 20868 -36244 4895 36930 -23835 -18693 38918 -1043
673a043l3616O0533l188n8146L8145L4608n9052J022N7684l5737l5916N7372J085
$$ -1043 -34659 25874 22686 -35460 2685 37293 -21759 -20737 36947 1210 -34706 22666 23751
686B3751n7804L3875L6741n6269k681N7628l2432l8090N5175M686n8410L1107
$$ 23751 -34053 -178 36563 -19706 -22387 35241 2809 -35281 19894 24580 -33830 -2723
698b723L9128n4576o353N7972k9039m0349N3203P961n8268K7257M1404n2817r334
$$ -2723 36405 -18171 -24524 33448 4409 -35940 17263 25224 -33044 -5787 35617 -17200 -26534
711b6534N8749k6394m2718N1456J1365n8598K4340M3683n0804j3216N8460k1912
$$ -26534 32215 5821 -36897 14559 25924 -32674 -8334 35349 -15455 -28671 29789 7877
723G877m5407M9620J4881n8610K1012M5616m8848j5886N7937j9096m6872M7695
$$ 7877 -37530 12090 26971 -31639 -10627 34989 -13859 -29745 28192 9096 -37776 9919
735I919J8354n8870J7427M7582m5639j9869N7692j5452m7910M4178K1403n6919
$$ 9919 28273 -30597 -13170 34412 -11227 -31096 26596 11144 -36766 7412 28815 -28104
747b8104J3520M8860m2931k2220N6109j1644m8937M1075K4214n5766J0033M9787
$$ -28104 -14584 34276 -8655 -30875 25234 13590 -35347 5728 29942 -25824 -15791 33996
759C3996l9685k5414N4739p469m9657L7940K6441n4088O585M9783l6687k7316
$$ 33996 -5689 -31103 23636 16167 -33490 4450 30891 -23197 -16612 33171 -3516 -30832
771c0832N3372m696n0156L5033K9255n2499L010N0485l3171l0454N1801q89n0918
$$ -30832 22540 17844 -32312 2721 31976 -20523 -17513 32972 -199 -30653 21148 20259 -30659
784c0659L1610L1439n0567p62N1372l0705l2230N0427J916n1557K9471L3312m9578
$$ -30659 951 32390 -18177 -18939 32433 1728 -30502 19925 21841 -29716 -245 33067 -16511
797a6511l735N1911k7790l4884M8690N772n2064K6241L5864m8166o531N1546k4683
$$ -16511 -20246 31665 3875 -31009 17681 23453 -28611 -2370 33494 -14672 -21203 30343 5660
810E660l6605M6856Q237n2297K3339L8165m6178j0522N2327k1104l9508M4687
$$ 5660 -30945 15911 24148 -28149 -4810 33355 -12823 -23345 28982 7878 -31630 13057
822A3057J2058n2517K0117L9738m3766j3342N1691j8016m0942M2894J4317n1708
$$ 13057 25115 -27402 -7285 32453 -11313 -24655 27036 9020 -31922 10972 25289 -26419
834b6419J6835M1047m1505j5646N0152j4146m2147L9437J7951n0018J1838M2718
$$ -26419 -9584 31463 -10042 -25688 24464 10318 -31829 7608 25559 -24459 -12621 30097
846C0097l8290j9133M9562j0572m2789L6102K0862m8800Q483M3441l4867k2603
$$ 30097 -8193 -27326 22236 11664 -31125 4977 25839 -22961 -14478 28963 -5904 -28507
858b8507M8643p091m3980L3596K3540m7509N148M4626l2540k4569M6993m249m4226
$$ -28507 20136 13045 -30935 2661 26201 -21308 -16160 28466 -4074 -28643 18350 14101 -30125
871c0125L0840K6143m6987K622M5457l0013k6857M5861n83m5585K8532K8252m5434
$$ -30125 715 26858 -20129 -17507 27950 -2063 -28920 16941 16358 -29227 -695 27557 -17877
884a7877r29M6323k6786k9588M4651K213m5781K5154L1026m4213l758M6327k4274
$$ -17877 -18806 27517 731 -28857 15794 18007 -27774 -2620 28406 -15807 -19565 26762 2488
897B488l1177M3113N881m6654K2464L2967m2173p207M6183k0599l3788M1503Q424
$$ 2488 -28689 14424 20305 -26349 -3885 29082 -13091 -20298 25885 5286 -28502 13001 21425
910B1425m6003J9348L4658m0432r623M5824j7521l5453L9205J1832m6257J6355
$$ 21425 -24578 -5230 29428 -11004 -20627 25197 7676 -27777 11428 23260 -22997 -6642
922f642L6080l7798j3054M5562j4818l6116L6601J3917m5378J3462L6963l5334
$$ -6642 29438 -8360 -21414 24148 9330 -26786 9815 23732 -21646 -8184 28779 -6555
934f555j5701M4940j1569l7636L4272J6668m4577J0090L8392l3409j8098M4159
$$ -6555 -22256 22684 11115 -26521 7751 24419 -20158 -10068 28324 -5085 -23183 20976
946B0976q580l8634L1487J9491m3377O664L9193l0686k0786M3403n811l9961K9828
$$ 20976 12396 -26238 5249 24740 -18637 -11973 27220 -3466 -24252 19151 13340 -26621 3207
959C207K1901m2903L852M0477k8922k2702M2108k649m1002K7885K3598m2197J612
$$ 3207 25108 -17795 -13943 26534 -2388 -25090 17018 14369 -26633 1252 24850 -17347 -15735
972a5735M1582k7163k4880M1858n39m1606K5556K5868m0890j221M1636k3981k7387
$$ -15735 25847 -1316 -26196 15662 15123 -26483 -927 24941 -15949 -17170 24466 485 -26902
985b6902M0860K423m2333K2619K8686m0247l744M2010k1671k8731L8989N387m2309
$$ -26902 13958 16381 -25952 -3333 25353 -14894 -18638 23372 1701 -27030 11959 17346 -24963
998b4963K0366L0166l8304p001M2079j8475l1175L7641Q106m2307J7596L1733
$$ -24963 -4597 25569 -12735 -19736 22343 3868 -27307 10334 18440 -23867 -6271 25462
1010B5462l6495r474M2151j5931l2331L5481J1110m1810J4248L2775l4135j2059
$$ 25462 -11033 -20507 21644 5713 -26618 8863 19973 -21837 -7589 25186 -8949 -21008
1022b1008M1853j3208l3525L3242J3483m1078J1560L3816l1575j4902M1447j0351
$$ -21008 20845 7637 -25888 7354 20837 -20241 -8681 25135 -6440 -21342 20105 9754
1034I754l4973L1365J6128m0954Q873L5581l0427j6798M0689p455l6130K9169
$$ 9754 -25219 6146 22274 -18680 -9807 25774 -4653 -21451 19238 11783 -24347 4822
1046D822J8333m0207O035L6929k8617j9362M0208m789l7495K7544K1099m0273
$$ 4822 23155 -17052 -11017 25912 -2705 -22067 18141 13352 -24143 3401 24500 -15773
1058a5773L344L8092k6592k1620L9234j945l8011K5092K3011l9266N79L8862k4235
$$ -15773 -12429 25663 -929 -22549 16685 14740 -23271 1821 24832 -14434 -13855 25007 772
1071G72k4033L8555R06l8973K2805K4984l8050k458L9297k1473k6141L6896L897
$$ 772 -23261 15294 16200 -22773 32 25016 -13034 -15492 23805 2332 -23809 13087 16984
1084A6984l9576K0321K7182l7072m428L9166j8721k8277L5767O100l9282J7481
$$ 16984 -22592 -2271 24911 -12161 -16589 22577 3856 -24421 11346 17446 -21836 -4355
1096d355K8713l4978p773L9295j5981k9571L3420R242l9144J5019K9893l3375
$$ -4355 24358 -10620 -18393 20902 4921 -24650 8770 18012 -21132 -6113 23780 -9595
$$ [...]
8191a32
##END NTUPLES=NMR FID
##END=
