##TITLE=1H_Pr 4759
 CDCl3, 8 sc, 
 6.5.2019
##JCAMPDX= 6.0         $$ Bruker NMR JCAMP-DX V2.0
##DATA TYPE= NMR FID
##DATA CLASS= NTUPLES
##ORIGIN= UXNMR, Bruker Analytische Messtechnik GmbH
##OWNER= root
$$ XWIN-NMR		Version 3.5
$$ Mon May  6 17:11:57 2019 Russian Standard Time (UT+4h)  she@DPX200
##.OBSERVE FREQUENCY= 200.1315
##.OBSERVE NUCLEUS= ^1H
##.DELAY= (6, 6)
##.ACQUISITION MODE= SIMULTANEOUS
##.ACQUISITION SCHEME= undefined
##.AVERAGES= 8
##.DIGITISER RES= 18
##SPECTROMETER/DATA SYSTEM= spect
##.PULSE SEQUENCE= zg30
##.SOLVENT NAME= CDCl3
##.SHIFT REFERENCE= (INTERNAL, CDCl3, 0, 15.7039)
##AUDIT TRAIL= $$ (NUMBER, WHEN, WHO, WHERE, WHAT)
$$ ##TITLE= Audit trail, XWIN-NMR		Version 3.5
$$ ##JCAMPDX= 5.01
$$ ##ORIGIN= Bruker BioSpin GmbH
$$ ##OWNER= she
$$ F:/spectra/data/she/nmr/H-F/1/audita.txt
$$ ##AUDIT TRAIL=  $$ (NUMBER, WHEN, WHO, WHERE, WHAT)
(   1,<2019-05-06 17:10:52.23 +0400>,<she>,<DPX200>,
      <created by zg, POWCHK disabled, PULCHK disabled
       configuration hash MD5:
       00 E9 B6 7A A2 85 ED C7 34 08 36 98 17 FE 4E 26
       data hash MD5: 16K
       0B 54 1D E9 09 B0 30 A2 72 A9 93 1A B4 92 1B 26>)
$$ ##END=
$$ 
$$ hash MD5
$$ B5 BE E2 8E A5 21 EA 87 B6 BB C8 63 C0 B2 47 B5
##$RELAX= 
##$RELAX= 
##$RELAX= 
##$RELAX= 
##$RELAX= 
##$RELAX= 
$$ Bruker specific parameters
$$ --------------------------
##$DU= <F:/spectra>
##$EXPNO= 1
##$NAME= <H-F>
##$PROCNO= 1
##$TYPE= <nmr>
##$USER= <she>
##$AMP= (0..31)
100 100 100 100 100 100 100 100 100 100 100 100 100 100 100 100 100 100 
100 100 100 100 100 100 100 100 100 100 100 100 100 100 
##$AQSEQ= 0
##$AQ_mod= 1
##$AUNM= <au_zg>
##$AUTOPOS= <>
##$BF1= 200.13
##$BF2= 200.13
##$BF3= 200.13
##$BF4= 200.13
##$BF5= 200.13
##$BF6= 200.13
##$BF7= 200.13
##$BF8= 200.13
##$BYTORDA= 1
##$CFDGTYP= 0
##$CFRGTYP= 5
##$CHEMSTR= <none>
##$CNST= (0..31)
1 1 145 1 1 1 1 1 1 1 1 1 1 1 1 1 1 1 1 1 1 1 1 1 1 1 1 1 1 1 1 1 
##$CPDPRG= <>
##$CPDPRG1= <>
##$CPDPRG2= <>
##$CPDPRG3= <>
##$CPDPRG4= <mlev>
##$CPDPRG5= <mlev>
##$CPDPRG6= <mlev>
##$CPDPRG7= <mlev>
##$CPDPRG8= <mlev>
##$CPDPRGB= <>
##$CPDPRGT= <>
##$D= (0..31)
0 1.2 0 0 0 0 0 0 0 0 0 0.03 0 0 0 0 0 0 0 0 0 0 0 0 0 0 0 0 0 0 0 0 
##$DATE= 1557148251
##$DBL= (0..7)
120 120 120 120 120 120 120 120 
##$DBP= (0..7)
150 150 150 150 150 150 150 150 
##$DBP07= 0
##$DBPNAM0= <>
##$DBPNAM1= <>
##$DBPNAM2= <>
##$DBPNAM3= <>
##$DBPNAM4= <>
##$DBPNAM5= <>
##$DBPNAM6= <>
##$DBPNAM7= <>
##$DBPOAL= (0..7)
0.5 0.5 0.5 0.5 0.5 0.5 0.5 0.5 
##$DBPOFFS= (0..7)
0 0 0 0 0 0 0 0 
##$DE= 6
##$DECBNUC= <off>
##$DECIM= 24
##$DECNUC= <off>
##$DECSTAT= 4
##$DIGMOD= 1
##$DIGTYP= 9
##$DL= (0..7)
0 120 120 120 120 120 120 120 
##$DP= (0..7)
150 150 150 150 150 150 150 150 
##$DP07= 0
##$DPNAME0= <>
##$DPNAME1= <>
##$DPNAME2= <>
##$DPNAME3= <>
##$DPNAME4= <>
##$DPNAME5= <>
##$DPNAME6= <>
##$DPNAME7= <>
##$DPOAL= (0..7)
0.5 0.5 0.5 0.5 0.5 0.5 0.5 0.5 
##$DPOFFS= (0..7)
0 0 0 0 0 0 0 0 
##$DQDMODE= 0
##$DR= 18
##$DS= 0
##$DSLIST= <SSSSSSSSSSSSSSS>
##$DSPFIRM= 0
$$ [...]
##$SUBNAM2= <"">
##$SUBNAM3= <"">
##$SUBNAM4= <"">
##$SUBNAM5= <"">
##$SUBNAM6= <"">
##$SUBNAM7= <"">
##$SUBNAM8= <"">
##$SUBNAM9= <"">
##$SW= 24.9337058887773
##$SWIBOX= (0..15)
0 0 2 0 0 0 0 0 0 0 0 0 0 0 0 0 
##$SW_h= 4990.01996007984
##$TD= 16384
##$TD0= 1
##$TE= 0
##$TE2= 300
##$TE3= 300
##$TEG= 300
##$TL= (0..7)
0 120 120 120 120 120 120 120 
##$TP= (0..7)
150 150 150 150 150 150 150 150 
##$TP07= 0
##$TPNAME0= <>
##$TPNAME1= <>
##$TPNAME2= <>
##$TPNAME3= <>
##$TPNAME4= <>
##$TPNAME5= <>
##$TPNAME6= <>
##$TPNAME7= <>
##$TPOAL= (0..7)
0.5 0.5 0.5 0.5 0.5 0.5 0.5 0.5 
##$TPOFFS= (0..7)
0 0 0 0 0 0 0 0 
##$TUNHIN= 0
##$TUNHOUT= 0
##$TUNXOUT= 0
##$USERA1= <user>
##$USERA2= <user>
##$USERA3= <user>
##$USERA4= <user>
##$USERA5= <user>
##$V9= 5
##$VALIST= <valist>
##$VCLIST= <CCCCCCCCCCCCCCC>
##$VD= 0
##$VDLIST= <DDDDDDDDDDDDDDD>
##$VPLIST= <PPPPPPPPPPPPPPP>
##$VTLIST= <TTTTTTTTTTTTTTT>
##$WBST= 1024
##$WBSW= 4
##$XGAIN= (0..3)
0 0 0 0 
##$XL= 0
##$YL= 0
##$YMAX_a= 126335
##$YMIN_a= -182393
##$ZGOPTNS= <>
##$ZL1= 120
##$ZL2= 120
##$ZL3= 120
##$ZL4= 120
##$ABSF1= 10
##$ABSF2= 0
##$ABSG= 5
##$ABSL= 3
##$ALPHA= 0
##$AQORDER= 0
##$ASSFAC= 0
##$ASSFACI= 0
##$ASSFACX= 0
##$ASSWID= 0
##$AUNMP= <proc_1d>
##$AZFE= 0.1
##$AZFW= 0.1
##$BCFW= 1
##$BC_mod= 2
##$BYTORDP= 1
##$COROFFS= 0
##$CY= 11.3945322036743
##$DATMOD= 1
##$DC= 2
##$DFILT= <>
##$DTYPP= 0
##$F1P= 18.9103706918063
##$F2P= -1.10871071338519
##$FCOR= 0.5
##$FTSIZE= 0
##$FT_mod= 4
##$GAMMA= 1
##$GB= 0.15
##$INTBC= 1
##$INTSCL= 1
##$ISEN= 128
##$LB= 0.24
##$LEV0= 0
##$LPBIN= 0
##$MAXI= 10000
##$MC2= 0
##$MEAN= 0
##$ME_mod= 0
##$MI= 1.114404
##$NCOEF= 0
##$NC_proc= 0
##$NLEV= 6
##$NOISF1= 3.799351
##$NOISF2= 2.8
##$NSP= 1
##$NTH_PI= 0
##$NZP= 0
##$OFFSET= 15.70392
##$PC= 1
##$PHC0= -8858.224
##$PHC1= 19.60026
##$PH_mod= 1
##$PKNL= yes
##$PPARMOD= 0
##$PSCAL= 0
##$PSIGN= 0
##$REVERSE= no
##$SF= 200.130013532006
##$SI= 16384
##$SIGF1= 3
##$SIGF2= 2
##$SINO= 400
##$SIOLD= 16384
##$SREGLST= <1H.CDCl3>
##$SSB= 0
##$STSI= 0
##$STSR= 0
##$SW_p= 3612.71676300578
##$SYMM= 0
##$S_DEV= 0
##$TDeff= 0
##$TDoff= 0
##$TI= <>
##$TILT= no
##$TM1= 0
##$TM2= 0
##$TOPLEV= 0
##$USERP1= <user>
##$USERP2= <user>
##$USERP3= <user>
##$USERP4= <user>
##$USERP5= <user>
##$WDW= 1
##$XDIM= 8192
##$YMAX_p= 0
##$YMIN_p= 0
$$ End of Bruker specific parameters
$$ ---------------------------------
##NTUPLES= NMR FID
##VAR_NAME=  TIME,          FID/REAL,        FID/IMAG
##SYMBOL=    X,             R,               I
##VAR_TYPE=  INDEPENDENT,   DEPENDENT,       DEPENDENT
##VAR_FORM=  AFFN,          ASDF,            ASDF
##VAR_DIM=   8192,          8192,            8192
##UNITS=     SECONDS,       ARBITRARY UNITS, ARBITRARY UNITS
##FACTOR=    0.0002004,     1,               1
##FIRST=     0,             0,               0
##LAST=      1.6414764,     0,               0
##MIN=       0,             -182393,         0
##MAX=       1.6414764,     126335,          0
$$ Real data points
##PAGE= N=1
##DATA TABLE= (X++(R..R)), XYDATA
0@%%%%%%%qJ6j6J7k5L2m0M8n6P2q6J01j19J38j61J86k14K50k87L27l73M23m79
30b54N40o08O82p64Q54r53J061j180J311j455J615j786J975k186K420k684K979
47A567l312L693m132M647n258N995o911Q080r633J1812j5116K0785l3115J07655
61H6757q3369j21555K04839j9158q4499O6039O658j11435Q6978N6062j34669J5245
73c2107J58442j13346j30640J49680O4694j53831K3459R6849q9429k0596J13119
84F6294p3255q7127J34427K4005j55777N2326J24663j04436n3004J19845l9356
95H605r2820J11371L3449j40033M0823J18387r8876n2805J23185k5231r9137R1602
107A8520L3512j26313M6563J20123j02388o2387J26777j7916j13455Q7396O6033
$$ y = [0, 0, 0, 0, 0, 0, 0, 0, -8, 8, -8, 9, -16, 16, -24, 24, -32, 40, -46, 55, -64, 74, -87, 99, -115, 135, -152, 175, -198, 225, -254, 286, -322, 360, -404, 450, -503, 558, -622, 689, -766, 849, -937, 1038, -1148, 1272, -1412, 1567, -1745, 1948, -2184, 2463, -2795, 3200, -3711, 4369, -5264, 6548, -8568, 12217, -20898, 86757, 3388, -118167, 86672, 67514, -16985, 49054, 55712, -55723, 31255, 87317, -47352, -32107, 126335, 12989, -117651, 32029, 96723, -57108, -33649, 63200, -26229, -46825, 66294, -6961, -94088, 40339, 64344, -91433, -39107, 85556, -18880, -71884, 47961, 8605, -84215, 27156, 60605, -79428, -38605, 79782, -19094, -71899, 51286, 26055, -73082, 18520, 52032, -74281, -27718, 92405, -9983, -72370, 54407, 36491, -76964, 10432, 76465]
118G6465j13673N687Q8378q0723k5899J34243m3498j40348R0341Q9052j14739
129c4714j0567R9939o5245n1396J06833k1901j06635Q7297O2275j29237K235J23111
141F1995o5622p4130J08057N001j07437O0516O2797j02116J1225J10412q0567
152i869p8498J23348K5622j13356L9804O2300r1454O776J09885o8261p7798J08644
164C7143J5927j13165N3528Q4049r6998k7519R8025m0840o0015R8984N807j15343
176f0417N1197Q5887r4935k5524J08229m0708q5544Q4903L2318r2416L6781O3433
188F3204r6604j7290J17446l9701r6212Q1550M0485r5500K6134P3707q2799k7629
200e3209J04261l3591q6787Q2389L7648j01492K7366Q7831q1146m5072R9684j4472
$$ y = [76465, -37208, -31521, 56857, -23866, -49765, 84478, 40980, -99368, -9027, 80025, -34714, -45281, 54658, -10587, -61983, 44850, 22949, -83686, 3611, 65886, -63351, -61116, 61995, -3627, -77757, 30300, 35301, -72136, -11620, 51177, -50939, -39714, 70698, -9869, -88367, 34981, 60603, -52753, -12949, 49351, -42103, -35327, 74558, 6297, -71501, 37143, 53070, -60095, -6567, 77482, -19516, -47035, 50990, 10150, -49865, 49119, 54926, -60417, -9220, 76667, -18268, -43792, 64437, 23729, -61815, 23088, 55406, -37010, -229, 63204, -33400, -50690, 66756, 27055, -69157, 12393, 52878, -42622, -16488, 57219, -25580, -53209, 51052, 17461, -69326, 13063, 50711, -50781, -23415, 64416, -16730, -61802, 37882, 23410]
212B3410p9550P1419L1141j02245K9235R6862p5603n3498R3468j3648q1652P2617
224A1956M4136j00584J1992Q9522o5798m6806R5888j1924r2382O3057N1876r0684
236c9751J1030Q8780o6436n5693R3839N57q7837N5705N0685r1237M252R2756n4694
249A956n7328Q5595j459q9134N5055O0331q6991q023Q8151m6127n7242Q2215N230
262C2229q8098M8581N9659q4390j0502R2142l8902o2510P5724R610q6191M4194
274h454O5742p9665j8510Q6340l4622o0970P7476J5105r0637L3250O7718p0992
286a8219j9431Q5500l4002o8079P5218K5790q7589K4980O6688o7288k2408Q4992
298D6152k8659o8001P1561K7522r0227K2178P4540o3096l2635Q0656j9544o7374
$$ y = [23410, -56140, 15279, 46420, -55825, -26590, 70272, -5331, -58829, 34639, 20991, -60661, 11956, 56092, -44492, -32500, 57022, -8776, -55582, 40306, 28382, -64000, -943, 50933, -39751, -28721, 60059, -6377, -62070, 31769, 32326, -55511, 194, 50879, -40358, -36106, 56650, 1956, -55372, 30223, 28764, -60370, -5315, 55016, -31975, -39998, 48153, 2026, -55216, 26999, 32229, -55869, -7288, 52371, -32019, -42521, 49621, 10719, -51791, 23933, 33543, -52648, -8454, 57288, -22377, -40887, 45453, 10831, -50139, 27337, 42442, -48195, -14945, 52773, -18219, -37650, 47850, 13848, -54231, 20987, 46777, -40812, -15832, 50856, -16432, -38840, 46152, 17493, -50508, 21053, 48575, -41652, -19474, 55066, -8030, -40665, 39991, 20447, -46927]
310d6927O5346K8480q5345K0744P2861o5624l7106Q6230j1247p2648N4850L4141
322D3755p8975J5916P0945o0403l6691Q2234j1563p5433N6367M4027p8081L398
334b4504O7696n0989l4596P9664j0661p7569N1679M7907p4489l12P0103m6789
346b860m2690P2910k083p0424M7584M3184p5937q01P7203m2770n1207O7807O823
359B6739o8480L9616M4518o8938k047P3033m3260n1900P1846J2059p5306L2129
371i991N1546o1990q666O9194l7173n0329O8200R939p5757L4190N8498o3974j9376
384c5689P0099k6518n1049O1051J1992p2543L1254N7730o3583j9842P4885k2762
396A5025o0221N4753K1151o6442K5580N3862o1560k0150P6090k0405o2847N3199
$$ y = [-46927, 18419, 46899, -38446, -17702, 55159, -10465, -47571, 38659, 27412, -45236, 9614, 43755, -35220, -19304, 51641, -8762, -45453, 36781, 25218, -50215, 6152, 50179, -27902, -24504, 43192, -7797, -42393, 37271, 26610, -50959, 720, 48627, -25862, -26174, 43929, -2860, -45550, 27360, 25277, -45147, 2437, 45621, -30316, -31117, 46086, 3316, -47891, 19916, 26739, -41741, -2125, 42393, -26545, -28592, 44441, 1181, -50719, 21127, 33186, -42120, -9991, 41555, -20435, -29101, 40093, 2920, -47409, 20791, 30730, -45027, -10837, 47661, -16313, -35689, 34410, 7892, -43157, 17894, 29886, -42657, -11403, 46327, -17256, -37098, 37787, 15025, -45196, 9557, 30708, -35734, -10154, 43708, -17852, -38002, 38088, 17683, -45164, 8035]
408H035K6952o7779J6535N6225n1862k1652O8761k0469o0707N5348K9776p0696
420c1533J0224O0789m4729k8634O4021j2716n6637M9155K7156o9139J1511O4306
432D3774m5160l5675O3174l559n6745M1351K9594o3282P238O0740m3381l4617
444c6548O5722j734o3174L5751L7862n7621P96N7118l9443l5277O3066L44o2932
457c6070L5995M0769o0311o775O0677l0064l8119N5794J924o0586L5587M2705
469D1526o0702r795O2362k7092m3933N3537J0063n7968K8324M0863n7104r120
481b9039O4300k6878m8962N2490J6887n8377K1931M3393n0881j2684N9073k4945
493F308m6320N3735J7927o2419J6664M9314m4644j8160N4693j9634m5801M8430
$$ y = [8035, 34987, -32792, -16257, 39968, -11894, -33546, 35215, 14746, -45961, 9387, 39163, -31533, -21309, 39480, -5249, -33883, 30138, 17422, -39215, 9940, 37096, -32043, -20532, 43774, -1386, -37061, 26113, 22554, -34191, 7160, 36754, -26528, -19290, 41450, -1931, -36548, 29174, 27440, -35734, 17, 37879, -19742, -18946, 38172, -1271, -36548, 26518, 26862, -36070, -75, 40694, -19617, -26392, 34285, 4221, -33898, 21896, 23820, -36766, -1179, 41526, -19176, -28971, 33391, 6299, -37634, 15903, 25966, -32002, -3678, 37185, -19919, -29039, 35261, 8383, -40579, 11911, 28798, -29579, -7648, 35745, -15136, -27820, 31253, 6308, -40012, 13723, 31650, -30769, -14105, 35209, -9435, -27595, 27098, 7464, -38337, 10093]
505A0093J8782n9363J7043N0027m6103k3862N6213j1508m6120M1151J9335n6149
517c0461J5358N0784m3762k5498N6578r773n0431L8418K6530n2015Q570M7060
529C1358l9270k4250N6324q029n2264L6359K9574n1910L810M9873l3374k7298
541b9097N0589n558m9847L6291L1054n3948m73N2986k9238l1629M8438o04m9459
554c0495L1041L0737n1433M47N3882l0542l6644M9070O838n0095K4661L1373m7385
567a8545k520N2458k7658l5899M8537P565n3440K2096L8365m3050q982M8097k3253
580C771l4850M7566R218n3076J9521L9585m2994j2590M9828j6542l6910M0364
592A2891J0547m8619J9183L9726m3188j6246N0372j3409l8969L7905J5398m7392
$$ y = [10093, 28875, -30488, -13445, 36582, -9521, -33383, 22830, 11322, -34798, 6353, 25688, -30461, -15103, 35681, -8081, -33579, 22999, 13226, -37205, 1213, 27743, -24272, -15702, 31358, -7912, -32162, 24162, 16133, -36131, 228, 29802, -22108, -18298, 31575, -1799, -29097, 21492, 15934, -33913, 2378, 33432, -20516, -20989, 31997, 2759, -28870, 19568, 18964, -30495, 546, 31283, -20150, -19703, 34179, 3637, -33007, 16063, 22901, -27194, -2533, 28840, -18545, -21065, 31393, 3735, -32164, 16373, 23938, -29502, -7406, 30959, -12091, -21073, 27024, 3771, -31079, 16487, 25705, -27371, -7850, 31735, -11259, -23849, 25979, 9437, -27473, 12891, 23438, -25181, -5998, 33728, -9460, -25706, 24666, 11257, -27712, 10193, 25591, -21801]
604b1801J3566L8143l9330j4975M9249j3222m2379L6729K0098m6324R211L7895
616B6860l4985j8257M7101j0693m0855L6013K0636m8703O604M2944l0960k2516
628b6811M3110o952l9534L3935K1722m7063N790M3661l1828k5536M5383j194m1286
641b6603K7742K2247m2847N739M3035l0666k7358M4930N11m3391K6481K7357m0950
654a3773q35M0326k6490k4930M4260rm6008K4198L0773l8980m775M0881k1923
667B715k8054L9122L123m2041K3398K9583m0987o782M4039j7549l0972L5127N730
680A6452m0187K0511K9562l7911p290M2855j7693l2673L5890J1069m0764J3253
692f926L0446l2942p780M0910j6423l2818L5083J2441m2243J2658L4355l1476
$$ y = [-21801, -8235, 29908, -9422, -24397, 24852, 11630, -30749, 5980, 26078, -20246, -11035, 26860, -8125, -26382, 20719, 10026, -30829, 5184, 25820, -22883, -16279, 26665, -4295, -26811, 16299, 9347, -30187, 3748, 25470, -21593, -15803, 27858, -3970, -29506, 15877, 14683, -26603, 1139, 23386, -19461, -13722, 29313, -1353, -28711, 16219, 16730, -26661, -180, 27177, -13773, -14608, 25718, -772, -25702, 18558, 18549, -27459, -3261, 27512, -11468, -16243, 24638, 2715, -25339, 13783, 16906, -25135, -1737, 27846, -13141, -19923, 24116, 6567, -24405, 10722, 16452, -23735, -3224, 26338, -11573, -18863, 23992, 6299, -26374, 9516, 20585, -20179, -6926, 23520, -9422, -17202, 23708, 7285, -25533, 9550, 21991, -20252, -7594, 26761, -4715]
704d715j3663L8809j1226l1549L2573J2583m2229J0927L4855l0757j5701M0464
716B0371p963l4909K8198J5153l8793R644L3967l1025j7404M0656n213l5268K6461
729C875J7378l8933O254L4068k7288j7423L9717n432l7815K6435K1739l6777R00
742a3302L3235k4056j8027L8193m117l6440K4911K2019l8271J6L7422k1028k2995
755b2440L3184M36l3019K3691K0847l7869j389L8017j9663k5275L4100M122l4911
768b0169J7257K3305l1957k142L4791k0484k5732L4918O943l6593J5381K5915
780B1433l1307o233L4531j5684k4792L1033N954l6204J5989K8420l1196r374L4645
793A7215j2242k6446K9074Q228l4048J3858K6909l0060j0380L6248j0433k9293
$$ y = [-4715, -18378, 20431, 9205, -22344, 10229, 22812, -19417, -8490, 26365, -4392, -20093, 20371, 12408, -22501, 5697, 20850, -17943, -8299, 25668, -5357, -22761, 17895, 12682, -22586, 3875, 21253, -17680, -11426, 22642, -4646, -22069, 17648, 12216, -25599, 836, 22575, -14202, -13302, 19933, -4123, -22150, 16043, 11926, -24514, 397, 22416, -15855, -15839, 21583, 555, -22440, 10744, 11180, -21839, 1852, 22699, -15170, -16559, 21458, 1795, -23480, 10620, 14742, -20169, -2912, 20393, -11564, -13706, 21085, 601, -25131, 9787, 16730, -19863, -4482, 21433, -9874, -16107, 18424, 2740, -22052, 8981, 14935, -21269, -5280, 23140, -8056, -17430, 17215, 4973, -21473, 7601, 15829, -18219, -4361, 22548, -7512, -17892, 18356, 7923, -21370]
805b1370K7184J0854l3040J0750K7379k7867j0785L5238j0285l0529K7690J4056
817A9275l4146O521K8754k4289j1881L3692r045l0148K5730J5446l3978N250L0876
830B2057k3422j6173L1869m174k8230K3435J4015l4978N097L2746k1109j8666
842a7533L0542j977k9584K0679J6836l1040K208L0394k1848j7614L2865o2l1824
855a7958J6942J9113k8557L45K9444j9130j8740L0709R96l1511J7505K0856l0658
868a0644l327L0604j4751j9511K7657J835l0467J6481K1465l0014m119L1179j3395
881B993k2759K6997O225l0016J3486K0848k7761m861L1975j3479k4130K7267Q110
894A4895l1018J0643K3198k5326p166L0160j2516k3503K6650J0072l1559Q208
$$ y = [-21370, 5814, 16668, -16372, -5622, 21757, -6110, -16895, 18343, 8058, -22471, 5219, 19275, -14871, -8350, 20404, -3885, -15766, 17926, 8881, -21267, 4463, 19909, -14069, -8819, 22057, -1365, -17538, 14331, 10157, -18073, 5362, 19377, -15601, -10504, 22242, 1133, -17533, 13009, 11032, -18552, 2127, 18963, -12077, -9869, 20525, -1323, -18937, 13928, 13866, -17958, -1016, 18097, -10460, -10115, 19329, 199, -18541, 12168, 13164, -18347, -842, 20014, -10644, -13971, 16633, 1882, -17629, 10028, 11863, -18604, -2123, 19342, -10672, -14791, 16388, 2993, -19766, 7231, 13456, -16560, -3074, 17774, -9987, -14848, 17127, 3648, -20482, 6785, 14895, -16123, -5480, 17718, -7608, -14774, 15386, 2870, -20633, 6017, 16089, -15470, -7262]
906g262K5006k3960r828K9828r089k3780K4319R227l0742R071K6860k3452j3207
919a7009K9157n955k4051K1985J1239k9422O980K5176k2088j2506K9961m774k7178
932a8485J9581J4551k6668L895K4672k0760j3680K9021k343k7145J8962J4781
944A6382k7293J319K7316j7580j4976K5813k005k6004J8893J6154k7315o81K6751
957A6774j5230j6879K6245J61k6437J5316J6842k5721m77K7369j5444j9192K6169
970I496K520k6386J3400J7703k4775k054K6989j4237j9031K6007L650k8275J1893
983c100K0059k3342m535K6396j2171j9195K4267M491k7853J1410K0832k3521o944
996a3206K6937r380k0054K1922O046k7465J0796K0902k2394q501K7470q231k1527
$$ y = [-7262, 17744, -6216, -16044, 13784, 4695, -19085, 5234, 14461, -16281, -7210, 19650, -3802, -17009, 12148, 6193, -17858, 4127, 15366, -14056, -7076, 18100, -3988, -16494, 13467, 8693, -18485, 1096, 15647, -11021, -7126, 17546, -3214, -16894, 12127, 9784, -17361, 1601, 16382, -10911, -9592, 17724, 144, -14832, 10981, 8976, -17028, 1865, 18019, -9296, -9977, 16774, 1544, -15335, 10910, 11071, -15366, -50, 16792, -8929, -9406, 17963, 2519, -16673, 9496, 12016, -14370, -970, 16733, -8042, -10096, 16893, 2656, -16375, 9632, 13282, -14993, -3100, 16959, -6383, -10918, 15478, 3307, -15888, 8379, 12870, -14983, -3573, 17259, -6262, -13206, 13731, 4351, -15703, 6219, 12265, -15200, -4404, 16498, -5896, -14397, 13073, 4842, -16685]
1009a6685K0996Q668k6284P867K0200k1050q296K7482p016k3124J9190J0520k4466
1022a1998N057K1875j9849r976K5398n436k1857J9566J1044k6397L481K2888j6792
1035b996j1340K3972l498k2061J7423J2067k4616K778K3732j7508j4176K5394
1047I171q07k2504J4862J3198k4189J931K3403j5742j4672K4346k6k3964J4422
1060e71J5505k2831j139K3096j4110j4322K3537P69k4477J3316J7033k2876k446
1073i516K3683j2289j5826K1894K085k3758J3294J6925k2780m701K4965j0017
1085C959j7630K0409L902k3136J0965J6685k0960m175K4494j0123j9237K0123
1097E276O764k2629Q000J7168j9574n242K3446q706j8502J9568O670k3906P293
$$ y = [-16685, 4311, 12979, -13305, -5438, 14762, -6288, -14584, 12898, 5882, -17242, 1948, 12468, -11998, -6941, 14934, -4915, -14891, 10507, 5071, -16786, 2780, 13824, -12573, -9092, 13796, -2996, -14336, 9636, 6138, -15923, 1500, 13567, -11049, -8271, 15461, -2047, -16223, 9171, 8364, -14140, 722, 13920, -10269, -8338, 15065, -677, -15349, 8997, 8971, -14993, -571, 14934, -7897, -9036, 14060, -50, -14372, 9165, 9934, -14543, -1227, 15806, -7070, -9516, 14167, 1878, -13948, 7946, 10031, -13727, -433, 16492, -6288, -10989, 13976, 3959, -13671, 6738, 10640, -12496, -1531, 15154, -5806, -9981, 14513, 4390, -14847, 5276, 12040, -10589, -2589, 14579, -4995, -10237, 13209, 4503, -13999, 5569, 12239, -11667, -4374]
1110d374J9593j7854p812K1884o678j8502J8643P653k3552N589J9815j6977r426
1123a1998K2724m876j9414J6142Q687k1958M692J9687j6913j0336K3127k939k0818
1136a4193J5350J0390k1870K909K0085j5628r781K2279l275k1665J5202J2544
1148A2347k1732P24K0202j3569j1319K1322j590k0390J4278J2239k2555M02K1862
1161A2221j1943j3649J9941L56k0010J2706J3026k1138m57K1551j2267j4159K0588
1174F766K437k0937J0191J3915j9287j281K0694j1151j4985J9867L627k1145R313
1187a976J5369j8594l646K0009r271j4263J8797M133k1901Q548J6948j8232n387
1200i466K0078p095j5951J7260N476k0257P362J6090j7756o307K1445o082j7170
$$ y = [-4374, 15219, -2635, -10447, 11437, 4759, -13743, 4900, 12553, -10999, -5410, 14405, -2572, -11998, 10726, 5850, -13564, 2578, 11265, -10693, -6001, 13686, -3227, -13563, 9564, 6625, -14193, 1157, 11547, -10323, -7414, 12671, -2957, -12738, 9541, 6266, -15399, -197, 12347, -9385, -8661, 11541, -2028, -13347, 7975, 6385, -14005, 273, 12512, -10043, -9641, 12221, 278, -13371, 6570, 6926, -13084, -378, 12648, -8490, -8947, 12604, 337, -13822, 6766, 9203, -11734, -1543, 12372, -6915, -8196, 12498, 1347, -13638, 6229, 9856, -11289, -1976, 13393, -5201, -8847, 11162, 1891, -12372, 6425, 10558, -11343, -2795, 14153, -4079, -9466, 10612, 3517, -12434, 4826, 10302, -9955, -2593, 13497, -4259, -10566, 10879, 4797, -12373]
1213a2373J5881O427j9287N677J6762j6139o897K0306n790j7489J6191Q718k0613
1226h626M162J6906j4311p549J9622m879j7599J5388Q686k0399L712J8264j4168
1239g91r899J9107k655j7063J3705R360k0610K980J8525j3392j0768J9167j031
1252F635j8454J2058J0460j8459J573J7679j2342j1599J9462J34j9196J0869J1416
1265A0236j7814k12J8291j1009j1336J7806M91j9207J1268J3039j8145j983J8269
1278I694r357j2147J7536J417j8408R408J2803j7466k252J9161q720j3536J6363
1291D496L265j7960Q424J2733j6348l517J8976p730j3560J5753M240j8656O599
1304c285J4357j5534m293J8269p285j3893J5751N128j8992O190J4734j4884n639
$$ y = [-12373, 3508, 9935, -9352, -3675, 13087, -3052, -9949, 10357, 4567, -12922, 3269, 11987, -8626, -4464, 12442, -1869, -9418, 10204, 5325, -12274, 3114, 11800, -8599, -4887, 13377, -791, -10690, 8417, 5762, -11301, 2404, 11764, -8846, -5866, 12659, -733, -11501, 7666, 6635, -11819, 239, 10699, -7760, -6187, 11492, -850, -12449, 7013, 7147, -12049, -1180, 10236, -7578, -7790, 10501, -508, -11844, 5962, 6453, -12754, -1486, 11553, -6592, -8575, 9694, 337, -11810, 5726, 7143, -11265, -1857, 10946, -6520, -8772, 10389, 1669, -11867, 4496, 7761, -10199, -1775, 10958, -5390, -8907, 10069, 2339, -11221, 4532, 8772, -9884, -3285, 11072, -4462, -8755, 9514, 2229, -11664, 4087, 9215, -9777, -3587, 11147, -3737, -9376]
1317i376J8097n356j4164J4604N043j8530O005J5372j4715o922J8093m034j4731
1330a0614J3886O272j7658L883J5593j4134o684J8154l592j5854J2372Q288j6884
1343f972L720J4895j3576p751J7456k181j5795J1999Q909j7134J239J5753j1121
1356e59q459J6799k190j6175J1575R499j6610O38J6112j0499r722J5983k43j5472
1370i323R708R925j6744J77J6540r913j0153J5202R86j6480R485J0596j5175j032
1384f201J5773r105j0898J5888J678j6675Q134J1160j4827j594J6098q265j1405
1397a0239J5024K025j6330P649J2275j4957l281J6537p022j1642J4168K668j6429
1410i554O786J2720j4208m079J6653n742j2825J2955M903j5591N308J2200j3580
$$ y = [-9376, 8721, 3365, -10799, 3805, 8848, -9682, -3677, 11695, -3020, -9942, 8151, 4117, -10614, 3272, 9544, -8114, -4231, 11362, -2772, -9456, 8698, 5106, -10748, 1624, 9912, -6972, -3252, 11643, -1933, -9684, 7772, 5591, -10204, 1795, 10704, -6430, -5191, 10562, -559, -9018, 7781, 5591, -10584, 991, 10490, -6120, -5482, 10630, 131, -9591, 6392, 6149, -9323, 385, 10310, -6434, -6257, 10283, 370, -9783, 5419, 6405, -10075, -590, 10006, -5169, -6201, 9572, 467, -10431, 5457, 7135, -9540, -1406, 9754, -5073, -6667, 9431, 1166, -10239, 4785, 6810, -9520, -1871, 10404, -4553, -7834, 8703, 1681, -9961, 4207, 6875, -9554, -2768, 9952, -4256, -8335, 8318, 2576, -10249, 2706, 7609, -7982, -2674, 9526, -4054]
1423d054m212J6410m756j3375J2187N757j5646L914J3101j2050n336J5490m656
1436B774j2839J2503O201j5899K591J3694j1138n862J4871l220j3038J1007O865
1449H510j5503K523J4422j1446p261J4682j259j3206J0310O262j4808K318J3947
1462I491j0395q011J5491j347j3873R213Q427j4447Q98J3571r724p833J5000r73
1476E488j4428R619Q641j4553m46J4504q135q851J3336J92j4041R425Q834j4643
1490e058p07J4774p895r876J3823J144j3896P270R389j3678p00J4485p712j0172
1504h809J3108K525j4428O629R537j2407j851J3823o688j0439J3112K940j5523
1517h471O142J0935j1496l464J3599n692j0283J1954L302j4329N090J1440j1883
$$ y = [-4054, -8266, 8144, 3388, -9987, 2200, 7957, -7689, -3775, 9326, -2724, -8060, 7430, 2774, -10065, 2438, 8639, -7260, -4669, 9025, -2113, -7975, 6896, 3676, -9362, 1645, 8510, -6993, -4470, 9952, -1494, -8755, 5927, 4668, -8538, 1772, 8034, -6774, -4456, 9491, -904, -8915, 6576, 5229, -8644, 569, 8996, -5451, -4553, 9018, -706, -8539, 6461, 5488, -8940, 679, 9320, -5233, -5679, 8825, 690, -8161, 5175, 5367, -8674, 751, 9585, -5058, -5765, 9009, 1114, -8762, 5061, 6205, -7691, -421, 8968, -4710, -5410, 9075, 1363, -8809, 4299, 6824, -7604, -975, 8562, -3845, -5696, 8127, 1439, -9000, 4112, 7052, -8471, -2329, 8606, -2890, -6354, 7245, 1553, -8730, 3224, 6526, -7803, -2713, 8727, -3156]
1530c156m243J4015l726j1471J0975L231j2888M500J1127j1076n006J4264l605
1543B941j1907J0403N262j3335L276J1001j0143m647J3790l534j2411J0128O303
1556G127j3644K430J1844r598o064J3573k272j1846R867N726j3671J754J3127
1569H353r141o885J2840r60j2138Q613O714j2962J189J2484q634p502J3250k55
1583D966j2527P310P628j2049P5J2350p941p530J2683J75j2703P267Q578j2237
1597c955j216J2397o577p855J1889J037j2733O549Q758j2030j350J2699o126q947
1611g460J1088K170j2193N812Q470j1370k264J2518m886r154J0662K912j2594
1624f289M645R404j0653k678J2482n096r908J0977L670j2319L608R905j0187l322
$$ y = [-3156, -7399, 6616, 2890, -8581, 2394, 5625, -7263, -2763, 8364, -2712, -7718, 6546, 2941, -8966, 1437, 6699, -6636, -3360, 7641, -2502, -7149, 6641, 3107, -9304, 824, 7127, -6517, -4087, 7757, -1841, -7905, 5668, 3396, -8450, 1417, 7143, -6528, -4774, 8353, -788, -7673, 5167, 4207, -7931, 682, 7396, -5566, -4377, 8107, -527, -8029, 5221, 4966, -7561, -251, 7377, -4672, -4597, 7753, -188, -7718, 4965, 5140, -7563, -296, 8282, -3955, -5171, 7226, 649, -7206, 4683, 5720, -7013, -464, 8294, -3736, -5086, 7613, 1487, -7460, 3628, 5798, -6395, -583, 7887, -3483, -5747, 6771, 1885, -7269, 3393, 6305, -6289, -1644, 7760, -2893, -5571, 6911, 1815, -8093, 2884, 6554, -5765, -2157, 7748, -2439, -5761]
1638e761J2066m034r881J0095L546j2388L854J0530r607n066J2220k851r867R011
1652A867M456j2563K980J0851r608m708J2324k640j0677Q883N190j1455J999J0440
1666G339r127n118J1856j681j0958Q489N695j2029J614J0414p616n367J1281j632
1680C160j0686P757O303j1554R70J0838p282o526J1139o83j0835P736O398j1832
1694e097O48J1226p180o470J0850oj0656O845O420j0770q4J0751o400o825J0636
1709C888J104j1359N878P250j0456o06J0892n629p610R954J602j0994N313P762
1723F989j0268j549J1171n062p620R825J344j1062M974Q568r866k161J0399m249
1737A433q269R652K410j0738M245Q013r474k530J1461l971q675Q678L427j1072
$$ y = [-5761, 6305, 2271, -7610, 2485, 6031, -6357, -2503, 8027, -1580, -6646, 5574, 2723, -7144, 1867, 6323, -6240, -3260, 7591, -2017, -6725, 5599, 2959, -7718, 1165, 6355, -5100, -3101, 7339, -1788, -6906, 4950, 3269, -7689, 800, 6495, -5534, -3920, 6494, -1122, -6489, 4792, 3160, -7526, 231, 6534, -5020, -4050, 6788, -494, -7020, 4119, 3436, -7399, 337, 6735, -5097, -4449, 6777, -403, -6873, 3977, 3971, -6685, 160, 6580, -4190, -4274, 6477, 77, -6748, 3888, 4992, -6367, -489, 6761, -3695, -4301, 6591, 962, -6648, 3306, 4908, -6086, -773, 6989, -3279, -4828, 6343, 1281, -6339, 3486, 4830, -6232, -1258, 7310, -2556, -4717, 5682, 1433, -6836, 2816, 5226, -5512, -1267, 6746, -2728, -5258, 6203, 2232, -6443, 2235, 5662, -5410]
1751e410L500Q831r009l147J0995l641q954R167L782j1286K696R239q299l796
1765e332J0654k595r537Q470M541j0842K007R309p724m770J0456j623r320P609
1779A303M249j0563J786R686p022n429J0295r71r602O684N426j0125J039Q966
1793E722o789n080R774l16r790O346N758r930K24R847o038o047R678j89r839O254
1809d15O475j0083l95R734n204o685R906L67r755N569O431r513k63R881n399o994
1825f343R446R63r616M867O593r231j045J0213n113o897R111J515j0005M361P548
1840F367q795j942R822m743p008R089J991j0344L971P754q427k335R956l749p234
1855e627P890K232r935M013Q187q333l142R448k619p676P414L225r722K818P781
$$ y = [-5410, -1910, 6921, -2088, -5235, 5760, 2119, -6835, 2332, 6114, -5172, -2476, 6763, -1536, -5332, 5322, 2727, -6810, 1660, 6201, -4641, -2634, 6675, -1049, -5819, 4637, 3014, -6306, 1303, 5552, -5011, -3225, 6461, -561, -5990, 4305, 3334, -6268, 416, 5842, -4283, -3244, 5722, -1067, -6147, 3627, 3311, -6479, -133, 5625, -4305, -4081, 5766, -272, -6319, 3359, 3170, -6669, -415, 6060, -4023, -4418, 5316, 112, -6573, 3333, 3700, -6055, -486, 5945, -3568, -3831, 6050, 651, -6343, 3103, 4066, -5550, -683, 5910, -3321, -4366, 5847, 734, -6163, 2948, 4463, -5542, -1181, 6367, -2428, -4370, 5452, 709, -6299, 2790, 4781, -5563, -1592, 6162, -2265, -4600, 5356, 1607, -5627, 2263, 4495, -5440, -1427, 6760, -1573, -4715, 4733, 2114, -5562, 1852, 5077, -4645, -1827, 5954]
1870E954p459l411J0070k726q286P384L658r028K038P791p338l753R782k168q281
1885e773P344L868r240J127Q778o681l982Q833j902p753O648M006r104J164Q513
1900E846o597m615R280o79q556N604M945r041P96Q904o192n331R079o5q998N723
1916A03N209q818J06Q323n009n459Q700mq868M756O497q714n43Q527m770n445
1932e409P863N16q421N071N559q346r68Q596m036o116Q380O93r086M625O342p871
1948b608j449Q955l880o418P707J738q620L267O700p550j858Q919l974o700P811
1963B040K392r015L376P051p238k633Q416l037o606P294K332q939K722P364o863
1978a344k844Q780k244p683O854K904q552K540P489p046l498R059j865p689O345
$$ y = [5954, -1505, -4916, 5154, 2428, -5858, 1526, 5184, -3844, -1806, 5985, -1353, -5106, 4676, 2508, -5773, 1571, 5439, -3801, -2674, 6104, -577, -4559, 4274, 2372, -5381, 1267, 5273, -3831, -2667, 5846, -751, -5366, 3914, 3235, -5321, 283, 5228, -3813, -3017, 5887, -305, -5636, 3443, 3378, -5620, 103, 5312, -3506, -3400, 4923, -86, -5545, 3155, 3151, -5717, -961, 5536, -3178, -3721, 4806, 36, -5409, 2454, 2970, -5451, -380, 5179, -3167, -4135, 4461, 425, -5691, 2689, 3382, -5704, -1079, 5263, -2608, -4057, 4898, 1018, -5400, 2307, 4045, -4575, -1308, 5392, -2158, -4016, 4903, 929, -5771, 2040, 4432, -4583, -1207, 5844, -1394, -4027, 4389, 1352, -5254, 2040, 4372, -4567, -1845, 5519, -1344, -4188, 4592, 2348, -5335, 1519, 4423, -4129, -1589, 5900, -1146, -4644, 4415, 2550, -5139, 1206]
1993A206L454q498J980P502o397l888Q710j380q026O556L849q724J486P318n927
2008g79l584Q250j190p735N851M292q544Q08P779n167m785Q189m78p543N201M640
2024E205q729N76Q159n121n141Q247k11p636M542M850p677m2P916m872n031P737
2040B772O66q183M280M991p013j320Q257l927n514P537M25p544L562N911p452
2055b552j312Q197l963n493P073J606q273L587N633o964j359P975l106o082O651
2070A618J868p796L295N767p005j666P967k991o034O452K567q635L165O310o426
2085a544k323P799k532o590O561K813p894K008O615o417k745Q468k506o634O547
2100A626K736p963J684P395o419l058P608j505o689N639L341p651J552O436n434
$$ y = [1206, 4660, -3838, -1858, 5644, -753, -4641, 4069, 2689, -5337, 1219, 5068, -3656, -2170, 5148, -779, -4363, 3887, 2697, -5038, 813, 5105, -3439, -2631, 5148, -19, -4804, 3385, 2907, -4636, 565, 5205, -3524, -2948, 5211, 90, -5051, 3196, 2985, -4651, -109, 4741, -2936, -2978, 4938, 66, -4965, 2772, 3438, -4745, -465, 4526, -2487, -3807, 4450, 523, -4991, 2546, 2971, -4573, -1011, 4900, -2552, -3864, 4333, 370, -5123, 1950, 3556, -4717, -1130, 4503, -2461, -3820, 4155, 1049, -5033, 1618, 3486, -4310, -1015, 4752, -2253, -3919, 4048, 1057, -4977, 1475, 4042, -4593, -1428, 4882, -1544, -3867, 3932, 1400, -5190, 1371, 4184, -3710, -1702, 4913, -1504, -4249, 4219, 1713, -4921, 1626, 4362, -3601, -1917, 5478, -941, -3999, 3609, 2104, -4585, 1054, 4395, -3256, -1704, 4732, -702]
2115g02l311P478q67p377N595L802p637P85O883m997l680P430r49o789M871M416
2131D951p806O62P126n116l853P123j06p453M507M751p394K9P182m431m503P192
2147B861M2p197M108M739p310l55P641m250m873O960P77p834M079N152o796q85
2163c141P347l654n645O979J280p378L181N170o564r55P160l460n206O497J474
2178C085p296L286N474o413j875P069k506n190O118J341p531K829O104o042k274
2193c821P266k015o085N657K666p167J877O149o116k644P456j493o206N230L272
2208D026p304J347O287m967l082P090j570o578N318L469p039J008O476n049l376
2223c944P040p77o625M830L952p657J015O925n018l758P019n88o466M580L844
$$ y = [-702, -4013, 3465, 2598, -4779, 816, 4618, -3019, -2234, 4649, -348, -4028, 3402, 2453, -4336, 535, 4951, -2855, -2193, 4933, -183, -4036, 3087, 2981, -4472, 35, 4786, -2608, -2579, 4603, 172, -4331, 2861, 2903, -4294, -186, 4553, -2757, -3112, 4529, 279, -4594, 2366, 3143, -4691, -612, 4540, -2256, -3141, 4206, 552, -5093, 1886, 3166, -4212, -1031, 4139, -2425, -3380, 3780, 320, -4886, 1611, 3085, -4211, -925, 4549, -1864, -3739, 3330, 824, -4366, 1752, 3093, -4438, -1609, 4495, -1547, -3821, 3445, 1430, -4655, 1002, 3668, -3499, -1622, 4527, -1589, -4233, 3223, 1730, -4476, 754, 4026, -3278, -1931, 4356, -611, -3693, 3397, 1827, -4751, 567, 4036, -3003, -1995, 4481, -568, -3944, 3096, 2319, -4306, 524, 4476, -3181, -2166, 4759, -259, -4017, 3002, 2414, -4052, 528, 4372]
2238D372o986N01O585m631l747P138j81p046M157M268o925K74O538m087m699O956
2254B487L06o689L921M378o624n34O633l419m536O066N93o826L796M973o358j305
2270c138P068l331m984O176J174o765K992M930o459n91O747l189m902N752J549
2285C029o959K717N219n635j687O831k561n543O011J968p150K379N444n427j905
2300c269O925k795n125N383K218o892K177N580n598k145O379j333n358M750K285
2315C182o615J617N848n089k618P012k125n626N087K793o600J480N614n138k730
2330c908O937j076o441M967L222o618R70N818m528l056O136p36n501M384L181
2345C751o609Q60N885m063l309O011n43n965M306L617o362j08O541m023l790O258
$$ y = [4372, -2614, -2113, 4472, -159, -3906, 3232, 3051, -3995, 162, 4430, -2495, -2221, 4317, 230, -4469, 2487, 2793, -3896, 25, 4403, -2221, -2755, 3878, 459, -4077, 1989, 2582, -4244, -448, 4525, -1833, -3138, 3930, 599, -4385, 1791, 2965, -3800, -808, 4122, -2337, -2928, 3819, 630, -4272, 1480, 3029, -3930, -1213, 4006, -1629, -3316, 3515, 954, -4589, 1422, 3390, -3760, -1381, 4063, -1364, -3269, 3656, 861, -4264, 1119, 3337, -3555, -1378, 4202, -1396, -3541, 2838, 1505, -3853, 897, 3182, -3433, -1816, 4032, -1057, -3675, 3337, 1212, -4414, 673, 3466, -3134, -1654, 3960, -1178, -3908, 3029, 1953, -4488, 479, 3701, -2917, -1947, 3871, -657, -3713, 2423, 1687, -3814, 570, 3751, -2858, -1998, 3887, -176, -3485, 2526, 1983, -3982, 324, 3941, -2421, -2529, 4012, -11, -3801, 2457]
2361B457L96o375L991L574o316k13O410l689m353O461L86o275L259M370n853o76
2377b446O570l699m388O263L02o324L345M276n677r04O566l184m566N712O80o136
2393c610K731M785n430j671O782k573m982O034Q02o404K882M500n541j083O231
2408C453k547n012N284K052o459K396N090n600j835O369k293m840N486J505o285
2423c236J690N660m830k572O281j780n209N014K169o212J611N237m999k123O374
2438C075j412n898M578K806o498J900N429n005k890O642j291n540M940K329o278
2453c113J024N803m567k593O269r74n915M304L178n954N08O080m304l449O134
2468B431n58n636L830L635o165o9O217l480l911N813M8n844L680L755n826j89
$$ y = [2457, 2853, -3522, 469, 4043, -2273, -2486, 3924, 235, -4118, 2343, 2729, -3546, -287, 4083, -1770, -2446, 4124, 425, -3963, 2300, 2602, -3722, -377, 3899, -1778, -2682, 3884, 700, -3866, 1846, 2526, -3610, -879, 3906, -1524, -3195, 3587, 1014, -3968, 2066, 2868, -3536, -654, 3846, -1695, -2778, 3453, 906, -4106, 1178, 3230, -3229, -833, 4257, -1343, -3178, 3191, 898, -3942, 1544, 3049, -3236, -1546, 4114, -716, -3288, 2993, 1213, -3996, 1018, 3187, -3025, -1414, 3823, -1176, -3299, 3075, 1663, -4235, 343, 3149, -3349, -1449, 3980, -1025, -3915, 2727, 1436, -4104, 836, 3165, -3113, -2089, 3714, -853, -3446, 2823, 1849, -4066, 238, 3416, -2538, -2030, 4050, -254, -3703, 2431, 1873, -3763, 67, 3702, -2463, -2532, 3685, 205, -3706, 2107, 2155, -3689, -9, 3746, -2080, -2269]
2484b269N848l493l663N678M78n975L171L804n681J2N855l206m291N640J139o184
2500c137L053M249n899q73N867k815l887N281J012o205K573M467n421j028O367
2515C604k654m741N132J504n718K280M920n697j382N985k030m752M951J479o010
2530c129K070M867m833j804O008j806n154M792K410n828R20N196m550k108O196
2545C247j751n475M916K322n718O74N285m239k666N963j208n232M471K752o001
2560b660O52N432l683l439O210q85n536M167K985n910O56N342m034l155O046k92
2576A896n562L950K839n657K47N505l527l281N994m85n695L382M034n609l47N726
2592C410l427l659N687J79n633L162L718n484n27O314l278m216N665N74n957K981
$$ y = [-2269, 3579, 86, -3577, 2101, 2579, -3396, -225, 3579, -2102, -2090, 3765, 559, -3732, 1908, 3047, -3137, -84, 4165, -1734, -2607, 3260, 445, -3442, 1839, 2851, -3354, -781, 3686, -1735, -2763, 3604, 950, -3791, 1341, 2845, -2873, -593, 4327, -1370, -2752, 3233, 1203, -3549, 1402, 2881, -3129, -1059, 3808, -1025, -2829, 3179, 1373, -3781, 1011, 3421, -2407, -1487, 3709, -841, -2949, 3247, 1496, -3979, 937, 3259, -2459, -1785, 3500, -739, -3405, 2558, 1350, -3882, 589, 3341, -2660, -2008, 3424, -259, -3698, 2512, 1627, -3909, 258, 3243, -2667, -2011, 3331, -703, -3858, 2188, 1896, -3666, 284, 3123, -2534, -2287, 3218, -309, -3590, 2404, 1919, -3776, -394, 3640, -1969, -2316, 3410, -17, -3676, 2011, 2190, -3443, -281, 3437, -2047, -2574, 3740, 462, -3754, 1911, 2485, -3472, -491]
2608d91M458n752j029N999k525m045N126J117o171K626M332n177r22N618k619
2623E45m154M934J993o669K513M455m960j329O015k219m655N056J777o037J855
2638h80M628m353k203N763j506n064M629K187n630J240M956m638k184O101j471
2653A575n225M728K174n759R71N466m348k831N930j022n245M318K422n602P31
2668a717N314l854k731N410j030m666L619K941n527N38N342l856l229N972o08
2683A918n591L898L185n739K00N740l554l478N187J98n555L449L288n137l94N526
2699C141l594k918N208J62n475L047L644n361l63O016l226l946N283K92n398L116
2715c72L906n288j039N867k860l748N138N65n357K445M273n009j332N657k257
$$ y = [-491, 3967, -1785, -2814, 3185, 660, -3385, 1741, 2858, -3313, -687, 3645, -1532, -2454, 3164, 545, -3609, 1325, 3318, -3351, -838, 3617, -1343, -2672, 3343, 1124, -3531, 1525, 3302, -2735, -880, 3748, -605, -2808, 2955, 1449, -3615, 1014, 3201, -2429, -1189, 3767, -871, -3055, 3046, 1575, -3650, 1078, 3252, -2507, -1536, 3930, -418, -3249, 2681, 1659, -3586, 732, 3154, -2448, -1717, 3597, -257, -2988, 2422, 1392, -3274, 345, 3286, -2241, -1703, 3639, -217, -3446, 2526, 1918, -3673, 225, 3410, -2329, -2129, 3611, 57, -3421, 1766, 1964, -3591, -142, 3146, -1991, -2385, 3141, -453, -3371, 1837, 1999, -3476, -429, 3215, -2146, -2509, 3507, 281, -3665, 1618, 1910, -3488, -372, 3534, -1754, -2793, 3074, 214, -3534, 1604, 2169, -3188, -743, 3530, -1479, -2811, 2846, 589]
2730E89m520N015J597n641K235M351m946j410N993k270m187M794Q88n681K630
2745e63M441m729k070N970j858m704M676J839n596J620M628m489k040N840j279
2760A686m936M286K056n760J667M966m598k212N486q21m969M012K415n900J278
2775a344M944l998k450N402p05n187L741K931n770Q73N315m273k664N461j58n182
2791c064L794K840n562n1N605l317l722N939o03n404L597L548n579l18N629l300
2807C2l665N607M65n894L192L563n242m30N670l041l744N291O75n618K588L828
2823C277n199p61N546k248l971N005O50n720K495M545n087j262N464k064m344
2838c674M739J644n505J805M537m914j741N993j924m278M199J600n275J328N035
$$ y = [589, -3931, 1084, 2681, -2960, -725, 3626, -1320, -2730, 3263, 993, -3194, 1600, 2488, -3193, -563, 3878, -851, -2921, 3049, 1191, -3513, 1163, 3002, -2594, -974, 3654, -835, -2875, 2965, 1686, -3250, 1036, 3092, -2668, -1001, 3965, -633, -2845, 2641, 1820, -3149, 863, 3278, -2622, -1344, 3600, -398, -2848, 2554, 1849, -3338, 403, 3334, -2436, -1563, 3752, -521, -3185, 2276, 2118, -3064, 730, 3570, -1992, -2043, 3562, 245, -3477, 2462, 1859, -3545, 52, 3600, -1979, -2297, 3332, 32, -3633, 1974, 2439, -3455, -263, 3300, -1942, -2372, 3298, 257, -3487, 1804, 2479, -3139, -551, 3277, -1922, -2683, 2863, 615, -3356, 1649, 2299, -3421, -926, 3619, -1468, -2730, 2734, 670, -3674, 1065, 2709, -2796, -991, 3546, -1368, -3109, 2884, 960, -3318, 881, 2481, -2794, -1466, 3569]
2853C569m544j833N719k099m279M363K047n857J712M507m685j677N974j477m953
2868c513L807K670n555J137M957m169k441N358m83m911L819K470n523Q86M887
2883C396l784k741N291l08n337L752L073n204K71M832l443k821N113N7n247L359
2899B59L123n324N11N064l337l189N048L57n734L456L608n599k27N256l086l356
2915c170N032N18n523L065L252n158m17N573k529l860M718O90n115K433M120n223
2931a594r11N665k637l974M949J348o107K263M139m667j022N466k363l754M508
2946A309J303n457J921M137m417j684N616j300n121M539J648n534J639M770m191
2961h22k284N906j654m965M585J986n288Q71M761l851k114N303j090m962M112
$$ y = [3569, -975, -2808, 2911, 812, -3467, 896, 2943, -2914, -1202, 3305, -1380, -3057, 2917, 1440, -3513, 294, 2964, -2591, -1454, 3503, -666, -3107, 2251, 1768, -3143, 676, 3146, -2377, -1491, 3396, -388, -3129, 2162, 1854, -3483, 269, 3342, -1862, -1591, 3241, -202, -3023, 2090, 2147, -3100, 259, 3382, -1942, -1431, 3633, 296, -2893, 2155, 2512, -3222, 234, 3842, -1757, -1984, 3272, 186, -3170, 1862, 2380, -3143, -78, 3174, -1984, -2401, 3172, 643, -3217, 1501, 2191, -2924, -491, 3629, -1594, -2505, 3160, 523, -3451, 1498, 2846, -3261, -998, 3141, -1526, -2548, 2918, 555, -3199, 1309, 2612, -2845, -924, 3213, -1204, -2888, 2728, 1428, -3693, 846, 2494, -3040, -1401, 3369, -822, -3106, 2800, 1146, -3819, 766, 2752, -2536, -1665, 3096, -755, -2869, 2434, 1344, -3618, 494]
2976D94J968n067J114M544l492k871N715r00m776L489K833n503O67M667l449k394
2992b961N101m55m927L249L191n372L51N271l477l414N510J97n374K932L499n066
3008a745k47N338l158l594N357J23n120K913L558n189m90N151k486l601N189O13
3024B612n484K472L428m711k72N191k670l835M900R40n509K541L750m528j539
3039b714N666k062m040M656J269n751K143M230m184j910N226j750m054M610J528
3054B863n670J921L864m113j772N525j538m281L957J508m937J578M255l907k229
3069b976N335j068m741M330K002n340Q90M527l646k509N448q02m962L665K271
3084B424m729L36N257l635k775N115k28n003L430K772n535P33M604l229k818N284
$$ y = [494, 2462, -2605, -1491, 3053, -439, -3310, 2405, 1505, -3271, 218, 3051, -2452, -1785, 2882, -567, -2961, 2140, 1685, -3242, 7, 3198, -2174, -1823, 3448, -29, -3443, 2067, 2264, -3110, -178, 3321, -1745, -1992, 3346, 188, -3406, 1951, 2074, -3046, -133, 3425, -1764, -2254, 2897, 411, -3190, 1999, 2612, -2872, -400, 3028, -1683, -1955, 3236, 566, -3269, 1631, 2571, -2938, -397, 3353, -1175, -2714, 2952, 890, -3150, 1506, 2775, -2976, -833, 3397, -787, -2697, 2529, 779, -3275, 1335, 2863, -2807, -886, 2978, -1135, -2907, 2618, 1080, -3201, 756, 2264, -2673, -1095, 3160, -747, -2976, 2359, 1291, -3450, 880, 2882, -2458, -1568, 2959, -687, -3196, 2252, 1450, -3512, 153, 2424, -2305, -1969, 3288, -347, -3122, 1993, 1765, -3238, 192, 2964, -2571, -1838, 2766, -463, -3281, 2003]
3100B003m18m976L224L096m838j07M900k979l083N082P3n347L392L127n006p30
3116b587N423k578l653M495J173n274K700L589m845n50M705j972l858M865O61
3131B294n115K247M064m681p20N015k198m107M596J107n307K323L841m591j082
3146b314N099j841m090M306J614n075J408M196m090j601N172j936l728L815J673
3161B608m705J173M115m139j678N371j583m282L758K126n032Q84M736l839k056
3176b543M909q32m901L662K881n214P54M332l699k025N219p98n058L583K690n029
3192b069N07M736l530k342M466J34m950L337K767n054J83M744l136k920M954K4
3208A851m815K830K960m625M7M654k665l384M807N04n138K735L023m270q54M913
$$ y = [2003, 1585, -3391, -167, 2929, -1909, -2016, 2884, -95, -3178, 1904, 1977, -3370, 22, 3149, -1857, -2587, 2836, 258, -3395, 1100, 2273, -3001, -301, 3288, -1557, -2107, 2598, 626, -3232, 1633, 2294, -2821, -574, 3490, -1191, -1911, 3104, 906, -3201, 1395, 2502, -2805, -482, 3359, -1232, -2314, 2785, 944, -3146, 1160, 2774, -2301, -893, 3303, -787, -2388, 2784, 848, -2880, 935, 2608, -2097, -924, 3191, -948, -2626, 2745, 1162, -3120, 638, 2764, -2268, -1384, 3352, -487, -2543, 2366, 1534, -3367, 295, 3176, -2038, -1284, 3048, -651, -2676, 2543, 1745, -3313, 270, 2960, -2069, -1562, 3174, -356, -2698, 1768, 1902, -3048, 289, 3056, -1998, -1815, 2929, -207, -3127, 1827, 1851, -2964, -134, 2826, -1799, -1752, 2902, 237, -3147, 1660, 2164, -2974, -239, 2784, -1486, -2340, 2573]
3224B573k276l535M683O24m968K491L688m701r19N085k395l663M410J352n282
3239b833J876L864m357r54M965k112l741M600O37m581J790L841m087j339M925
3254B494j711l517L852J415m891J118M303l455k279M991j196m320M150J471m577
3269b152J252L918l449k304N174j140m335L697K102m806Q05M230l588j813M297
3284A888m56m368L536J858m458M18M510l075k493M568m73m385L531K155m682Q67
3300a059L992l134k971M926k3m561L135K429m275r4M514k807l008M751K15m802
3316b772K726K949m491m63M694k335l156M371N80m827K225K970m137l57M692k137
3332E32l538M581M53m815K380L322m228j095M917k205l312M103N82m238J881L503
$$ y = [2573, 297, -3238, 1445, 2069, -2899, -408, 3280, -1421, -2340, 2745, 350, -3313, 1097, 2449, -2833, -957, 2907, -1450, -2404, 2561, 449, -3292, 1308, 1945, -2636, -846, 2995, -1092, -2431, 2494, 783, -2734, 1118, 2533, -2358, -1240, 3063, -392, -2671, 2320, 1124, -3196, 954, 2425, -2152, -900, 3018, -431, -2735, 2439, 1299, -3036, 661, 2763, -2043, -1238, 2992, -596, -2409, 1888, 1432, -2936, 600, 2458, -2000, -1582, 2928, -147, -2640, 1928, 1455, -2930, 601, 2756, -1926, -1059, 2933, -201, -3172, 1754, 1731, -2830, 305, 2734, -1541, -1635, 2879, 72, -2936, 1815, 2030, -2772, -46, 2903, -1588, -2051, 2643, 308, -2848, 1523, 2103, -2724, -499, 2471, -1666, -2023, 2669, 532, -3006, 1575, 2028, -2787, -407, 2915, -1313, -2408, 2509, 304, -3008, 1095, 1677, -2561, -680, 2823]
3348B823l941j502N220j891l455L808J104m853J903L630m013j006M339j449l709
3363b992L640J809m841J175L900m058j078M763j505l713L801J323m121R43L769
3378B815l590j808M814j350l514L419J514m445J075L662l203j982M419l61m147
3393b682L074K379m525M60M004l072k089M339l42m306L180K373m235j4M411l002
3409d7k363M166m7m544L067K431m494K45L858k376k135M154j43m381K488K779
3425B658l919j77M302k825k592M529j10m372K179L155m237n21M426j955l107L905
3441A339L28l967J719L381l691j115M233j531l313L600J088m384J642L440l804
3456a035j192M713j823l394L495J262m267J479L634l767j630M723j725l022K981
$$ y = [2823, -1118, -2620, 2600, 709, -2746, 1062, 2166, -2687, -784, 2846, -1167, -2173, 2166, 717, -2992, 648, 2457, -2384, -1209, 2691, -1367, -2445, 2318, 813, -2900, 901, 2224, -1897, -954, 2815, -775, -2583, 2231, 881, -2633, 786, 2300, -2145, -1070, 2592, -611, -2593, 1826, 1465, -2682, 392, 2771, -1754, -1294, 2710, -362, -2451, 1888, 1546, -2760, 420, 2793, -1442, -1456, 2955, -47, -2410, 1756, 1709, -2835, 232, 2663, -1831, -1586, 2272, -104, -2239, 1915, 1772, -2609, -121, 2658, -1261, -1438, 2864, 39, -2553, 1976, 1866, -2506, -327, 2828, -1409, -1930, 2496, 541, -2566, 1339, 1667, -2300, -581, 2800, -891, -2006, 2227, 696, -2617, 983, 2071, -2313, -671, 2769, -1035, -2227, 2486, 663, -2731, 764, 2026, -2241, -762, 2872, -895, -2525, 2198, 473, -2549, 432]
3471D32J776m212R09M102l810j541M551j455l777L429J786m170O45L957l534j425
3487b337M098r17l534L317J410m118Q80L505k718j706L990p28l820K768K237m368
3503b041P22L822k937j846L944m71l951K865K173m049K15L865k249k350L702Q2
3519A496m289L073K296l948k25M015k027k563L612Q9m244L041K307l476r61M164
3535B360j961k769M121N9m042K078K826l735l06L421j469k853L549R03m406J741
3551d83L072l586r01M099j674k651L439O06m141J517L218l290j141L921j125l325
3567b445L384J230l942J060L402l030j978M258j076l062K950J300m414J440L476
3582B553l096j571M015o88l692L131J520m147Q59L389l061j367L985q95l233K470
$$ y = [432, 2208, -2004, -1095, 3007, -803, -2344, 2207, 752, -3025, 404, 2190, -1980, -1335, 2622, -912, -2337, 1761, 844, -2690, 627, 2037, -2081, -1201, 2304, -414, -2120, 1870, 1142, -2678, 90, 2327, -2041, -1319, 2503, -434, -2280, 1664, 1193, -2758, 107, 2280, -1769, -1554, 2311, 62, -2288, 1414, 1496, -2793, 280, 2576, -1372, -1597, 2418, 391, -2172, 1440, 1529, -2715, 326, 2633, -843, -1804, 2360, 399, -2370, 1751, 1810, -2232, -154, 2672, -1063, -1369, 2052, 583, -2270, 1279, 2182, -2224, -483, 2589, -997, -1898, 2201, 527, -2124, 1315, 1921, -2220, -703, 2515, -775, -1916, 2005, 880, -2445, 939, 2169, -1773, -713, 2689, -341, -2319, 1939, 863, -2199, 751, 2051, -2363, -923, 2553, -543, -2114, 1901, 1213, -2479, 652, 2172, -1975, -1116, 2273, -788, -2155, 1830, 935, -2298, 172]
3598A72J890l954P62L304k563j825L634j14l987K996J885l764J66L660k435k097
3614b270L844m37l619K515J787l350P6L718k297k509L760K54l928K528K117l836
3630a647m20M209j974k566L816J0l872K128K813l567o05L779j929k784L675O72
3646A738l699J302K985l637n15L947j526k709K845J104l800J689K738l662l97
3661a597L689j593k945L355J219l992J106L233l019r85L592j249l235L233J004
3676A816l743J390K971l140j385M025j013l043K978J049l771Q97L554l124j246
3691a785L744j057l178K873J547l610M87K839k147j896L687k30l682K602J917
3706B111l837P06L294k283j819L274k94l283K240K014l629M19L098k124k107L644
$$ y = [172, 2062, -1892, -1130, 2174, -389, -2214, 1420, 1306, -2681, 315, 2200, -1564, -1398, 2262, -173, -2270, 1574, 1137, -2482, 33, 1820, -1530, -1454, 2264, -33, -2542, 1218, 1472, -2456, 72, 2189, -1647, -2067, 2142, 168, -2398, 1418, 1428, -2444, -316, 2497, -1070, -1675, 2104, 175, -2609, 1066, 1738, -1961, -659, 2326, -1311, -1826, 2121, 595, -2114, 731, 1835, -1965, -276, 2462, -1200, -1597, 2092, 499, -2446, 909, 2128, -1864, -758, 2475, -544, -1529, 2063, 814, -2421, 812, 1816, -1927, -537, 2434, -706, -2091, 1934, 921, -2122, 856, 1905, -1866, -969, 2585, -539, -1785, 1959, 902, -2276, 597, 2144, -1466, -979, 1860, -287, -2183, 1504, 1274, -2408, 194, 2111, -1726, -1020, 2274, -9, -1828, 1446, 1152, -2131, 109, 2123, -1506, -1087, 2011, -113, -2220, 1424]
3722A424J00m034K266K454l546j85L629k360k120L443M39l775J966K404l782N5
3738a622L971k300k632L700J64l595J931K430l319m12L670j704k745L419Q17l913
3754b140J833K362k836j211L892j700k764L317P90l550J470K752l058p46L102
3769A513r99k896L029Q78l546J137L048k992j022L497p33l075K604J295l227O16
3785h73L070k940j409M024j099k467K312J574l859O92L341k320j974L489m23l347
3801b209K982J455l690L89L114k187j882L535l2l456K061J956l435K38L394k348
3817a15j828L531l75l179J956K473l582k6L069j901k250L493L17l447J901J918
3833A955l229k41L472j892j747K869R1l453J985K537l607l61L743j530k859L237
$$ y = [1424, 1524, -2510, -244, 2210, -1336, -1521, 2108, -252, -2372, 1071, 1510, -2265, -299, 2105, -1677, -1622, 2349, 49, -2583, 1117, 1281, -2314, -383, 2047, -1272, -1684, 1986, 282, -2463, 956, 1773, -2140, -307, 2055, -781, -1992, 1900, 200, -2564, 753, 1543, -2007, -537, 2215, -843, -1589, 1513, 514, -2382, 647, 1525, -2021, -884, 2164, -828, -1850, 1647, 914, -2161, 443, 1738, -1489, -873, 2197, -743, -2152, 1872, 773, -1694, 618, 2192, -1667, -975, 2366, 46, -1928, 1561, 1138, -2209, 773, 2228, -1462, -1073, 2041, -146, -2028, 1507, 1475, -1981, 80, 2036, -1399, -1161, 2233, -115, -1943, 1588, 1213, -1966, -10, 2463, -1119, -1145, 1924, 23, -2227, 1266, 1583, -1864, 37, 1955, -1274, -1515, 1957, 65, -1682, 1187, 1278, -2175, -190, 2347, -1260, -1621, 2122, 592, -2267, 970]
3849I70N32l536J396K776l274n02L633j690k718L233O91l236Q75L149l184q79
3865a764L924j558k794K924J016l717J325K733k581j353L581j143k956K872J192
3880A701l819J168L025l003o74L548r83l193K655J685l800Q15K802k166j679L509
3896A591o94k885K622J201l420L27L234k294j655L248k63l212K637J725l489J75
3912a152L238k254j603L028J9l391J999K181l303J54L452k325j919L234Ll261
3928a900J880J969l053n8L385k251k054L311M4l366K074K272l296j33K967j578
3944B13j910K689M63l109J480K053k699o62L314j238k458K605J010l504J378K335
3960A960k966l78L111j128k680K739R71l185R40K771l173p18L601j385k531K675
$$ y = [970, 1502, -2034, -638, 2138, -1136, -1638, 1995, 305, -2413, 820, 1511, -1725, -850, 2299, -885, -1764, 2160, 602, -2192, 732, 1748, -1969, -644, 2089, -492, -1845, 1736, 593, -2363, 509, 1701, -2118, -950, 2075, -928, -1602, 1946, 963, -2230, 425, 2110, -1690, -875, 1927, -239, -1918, 1591, 897, -1988, 634, 1835, -1585, -1258, 1976, -318, -1973, 1275, 1012, -2200, 437, 2162, -1327, -1152, 2086, -168, -1771, 1257, 1276, -2115, -116, 2065, -1238, -1084, 2368, 43, -1876, 1358, 1361, -1900, -20, 1949, -1104, -1162, 2223, -28, -2082, 1229, 1273, -2093, -19, 2253, -1043, -1176, 1791, 213, -1697, 992, 1455, -1654, -174, 1879, -820, -1482, 1832, 594, -1864, 741, 1751, -1753, -375, 1960, -1006, -1384, 1727, 599, -2081, 658, 1629, -1556, -616, 2155, -1018, -1736, 1865, 480, -2051, 624]
3976F24J065l490J003K887k777j123L296j194k317K506J446l765R69K763k568
3991f75j221L338m69l355K714J408l430M54L124k357j514L431k92l394K286J516
4007A564k971n6L528k556j294L157p67k830K461J353k991L05L169k511j335K977
4023A203ol282K005K265l803L60L209j916j872K938Ml035J853K460l635n9L149
4040A838j679k276L472K50l432J616K024k981r4L176j634k192K625O21l233J884
4056a5J937k753p32L322j398k282L131L18l446J643K405k824o32L230j338k648
4072b082L338P59l548J196K356k947p55L670j308k646K444J446l494Q08K871k640
4088e32j139L550q49k856K419R56l057P11K634k043j299L241o54l083K360J139
$$ y = [624, 1689, -1801, -798, 2089, -688, -1811, 1485, 291, -2026, 480, 1926, -1839, -870, 1893, -675, -1896, 1442, 973, -2382, 332, 1740, -1690, -1236, 1888, -469, -1983, 1448, 1156, -2238, 48, 1564, -1407, -1463, 2065, -491, -1785, 1372, 605, -2225, 236, 1589, -1402, -1097, 2072, -439, -1774, 1203, 1197, -2085, -80, 2185, -1618, -1258, 1951, 35, -1837, 1101, 1105, -1930, -77, 2383, -1252, -1311, 1838, 159, -2117, 1355, 1605, -1827, -211, 1813, -1168, -1262, 1914, 280, -1912, 713, 1334, -1899, -15, 1922, -831, -1563, 1759, 361, -1921, 1210, 1528, -1918, -275, 2130, -694, -1326, 1904, 566, -2082, 1256, 2015, -1533, -337, 2019, -928, -1683, 1987, 679, -1967, 477, 1923, -1571, -763, 2108, -532, -1671, 1879, 1030, -1826, 593, 1549, -1508, -797, 1837, -206, -1505, 1736, 1082, -2001, 359, 1498]
4104A498k640K89K795k280j723L070l27k611K225J505l205K09K860j936j679L116
4120A166m23k687K093J353k906L30K694j912j567L456n70l076J853K071l201j93
4136a519L361j985j770L050o3k983K042K077l394l2K954j830j607K850o5k796
4152a710J532K129k785j29K824j466k141K606P38l424J629K149k853n86L355j615
4168B53k524L116M08l067J622K052k750o92L042r42k791L281N33l231J295K271
4184A876k489q61L439j357k309K317J109l380J135K800k806j046L323j091k530
4199a870K513J228l248R34K395k197j517L194k84k808K484R42l094O23K768k516
4215d53j287L338p92k535K309J316l301L13L115k414j215K787k7k844J865J771
$$ y = [1498, -1142, -853, 1942, -338, -2061, 1009, 682, -1929, 296, 1801, -1404, -1195, 1665, -271, -1950, 1166, 743, -1944, 149, 1502, -1404, -1074, 1620, -292, -1859, 1597, 1027, -2049, -196, 1875, -1326, -1519, 1842, -143, -1913, 1137, 1074, -1909, 133, 2210, -1184, -1216, 1738, -92, -1699, 1151, 1086, -1710, -178, 1951, -834, -963, 1861, 395, -1746, 860, 1598, -1826, -197, 1952, -901, -1487, 1868, 253, -2271, 845, 1253, -1814, -192, 1860, -890, -1582, 1460, 518, -2273, 1008, 1541, -1690, -395, 1876, -613, -1474, 1965, 608, -1701, 616, 1725, -1655, -520, 2280, -526, -1572, 1751, 660, -1870, 643, 1871, -1377, -443, 1952, -245, -1762, 1432, 1148, -1660, 824, 1766, -1328, -705, 2063, -453, -1740, 1598, 806, -1729, 580, 1896, -1405, -1092, 2023, -391, -1606, 1181, 1154, -1690, 175, 1946]
4231A946l197L38L088k375j874L445j51l086J697J845k962K90K799j854k173L134
4247I10J02l041J938J988l320p3L291j544k016K700K73l328J960J930k707l19
4263a256L095j865j905K885M69k999J134K511l161l88L291j675j797K699K47k989
4279a704J209K624k944o96L361j536k409K528J227l083O65K777k880n99K808p02
4295F46k733K580R77l211J313K311k687q52L107r58k495K642P19k896P17K551
4311A731k199j215L417r29k844K075J505k942P56K802k306j517L369o54k764K075
4327C60J209k989P37K480j924j775L544o23k785K061J765k717l15K625k032j370
4343a749K951J75l151J822J674k688j38K663j735j602L275j57l442K088J980k910
$$ y = [1946, -1251, -913, 2175, -200, -2074, 1371, 1220, -1866, -169, 1676, -1286, -996, 1803, -51, -2224, 910, 1012, -2029, -91, 1897, -1423, -1496, 1795, 251, -1765, 935, 1208, -2120, -160, 1770, -937, -1256, 1839, -26, -1931, 954, 1423, -1576, -442, 2069, -1092, -1480, 1811, 136, -1661, 1038, 1285, -1704, -495, 2129, -815, -1511, 1850, 314, -2095, 433, 1660, -1423, -758, 2019, -861, -1460, 1348, 646, -2087, 493, 1470, -1741, -428, 1883, -804, -1656, 1451, 493, -2002, 640, 1359, -1537, -820, 1731, -468, -1683, 1734, 805, -2039, 36, 1541, -1401, -645, 2157, -149, -1666, 1703, 1049, -1715, 360, 1569, -1420, -683, 1797, -127, -1902, 1642, 1019, -1766, 295, 2060, -657, -972, 1653, -379, -1749, 1202, 1377, -1774, 48, 1722, -966, -1104, 1559, -176, -1778, 1497, 1340, -2102, -14, 1966, -944]
4359i44k11K708j593j907L081L09l103J771J514k532k16K793j484j826K677L5
4375A072l016J554K299l181k41L363j425k484K843O00l209J479K137k502o68K931
4391A552j196k289K847N28l108J482K024k605n84K882j004k454K503Q68l004J071
4407d87K350k618p50L145j141k288K409R53l166R78K426k408q97L228r79k635
4423a880K201J288l191P52K667k567j013L030q31k365K328J516l295N62L020k618
4439c96r66K682m94k832K514J379k918L4K880k262j292L187m81k644J559J995
4455A945k979M5L114j911j762K773J32k928J790J658k884j48K874j711j894L044
4471A158J21k927J422K049k726j64L100j746k199K783M90l270J649J992k488l05
$$ y = [-944, -1155, 1553, -40, -1947, 1134, 1443, -1660, 111, 1625, -907, -1123, 1670, 186, -1640, 1037, 1072, -1944, -390, 1909, -1272, -1513, 1850, 425, -2059, 784, 1384, -1825, -346, 1791, -711, -1379, 1552, 356, -1933, 914, 1442, -1666, -184, 1840, -765, -1349, 1533, 529, -1925, 578, 1446, -1558, -487, 1863, -755, -1505, 1640, 499, -1789, 620, 1573, -1593, -615, 1811, -597, -1494, 1734, 755, -1880, 321, 1609, -1582, -830, 1837, -730, -1743, 1287, 456, -1909, 419, 1935, -1360, -798, 2222, -396, -1362, 1320, 826, -2006, 508, 1887, -1031, -997, 1883, -379, -1671, 1516, 1035, -1609, -50, 1945, -1034, -989, 2125, 214, -1548, 1225, 1357, -1571, 219, 1877, -1007, -1155, 1719, 8, -1886, 1158, 1279, -1648, -226, 1823, -903, -1067, 2033, 287, -1912, 871, 1361, -1909, -260, 1732, -756, -1061]
4487a061K947j871j908K654N88l195J500J872k265p53K942r65k241K383Q00l153
4503a726R77K712k713o88K894r74k393K422Q36k929J016K403k432q84K962r66
4519E17k515K523Q19k962P62K502j870j223K768o36k302K011J379l306M63K660
4535A590k338p23L020n45l077K311J069k755M31K722k145j185K719k55k676J693
4551a44J832k947J92K865k179j697L444q5k894J747J843l017j04L091j746k046
4567a845K737K38k755J508J842k790j75K703j356j592K662J21k864J469K116k870
4583h51k4K598j444k013K656O94l521J694K215k711p02L125j618k200K636Q15
4599A349k794J132K227k620n60K899j189k333K775O92k925R61K149k381q74L063
$$ y = [-1061, 1886, 15, -1893, 761, 1349, -1846, -346, 1526, -739, -1492, 1450, 485, -1756, 627, 1427, -1726, -749, 1963, -750, -1438, 1456, 482, -1911, 511, 1347, -1582, -566, 1837, -595, -1479, 1483, 517, -1998, 525, 1344, -1618, -856, 1646, -224, -1447, 1321, 685, -1617, 394, 1773, -1533, -1070, 1590, -748, -1471, 1549, 1004, -2073, 238, 1307, -1448, -1017, 1705, -440, -1625, 1094, 839, -1837, -144, 1688, -1259, -1067, 1798, -381, -2078, 1366, 1281, -1613, 134, 1977, -1040, -1144, 1947, 201, -1845, 892, 1130, -1625, -117, 1725, -1065, -1240, 1463, 107, -1485, 1177, 1298, -1566, -97, 2019, -851, -875, 1723, 279, -1734, 922, 1616, -1905, -211, 2004, -707, -1409, 1716, 98, -2102, 534, 1349, -1445, -313, 1914, -706, -1266, 1633, 444, -1889, 886, 1578, -1347, -386, 1763, -618, -1492, 1571]
4615A571j221j847K260O23k692P05K665k699q24L170j245k513K512J301l026N67
4631f93K336k484o96K772p63k506K379Q53k582Q44J918j886j064K738m43k580
4647a857K049J310k985N18K654j879j451K773n40k520K244J208k626J75K446j718
4663a99j727L112n03k127J341J941k923J28K754j922j924L174k55k846K266J008
4679A298k431k06L399k063j818K723J6k445J301K037k718j46K820j685j703K442
4695H21J94k591J467K010k869k19K827j165j888K145M29k801J338J987k390k91
4711i96K460q60k129K045N69k615J302J999k474n53K518r56j862K379N49k735
4727a359Q79K413k489n12K281n23k298J952J252k978R05K093k122r43K686n41
$$ y = [1571, 350, -1497, 763, 1386, -1306, -601, 2064, -635, -1459, 1711, 466, -2047, 465, 1766, -1260, -693, 1643, -841, -1537, 1235, 472, -2034, 345, 1198, -1384, -540, 1378, -508, -1572, 1166, 723, -1857, 192, 1502, -1483, -965, 1689, -190, -1641, 1132, 592, -1928, 316, 1524, -1102, -927, 1519, -199, -1926, 1186, 683, -1444, -103, 1838, -1085, -957, 1797, -125, -2049, 1125, 870, -1976, 290, 1298, -1133, -1339, 2060, -3, -1821, 902, 918, -1527, -226, 1811, -907, -1053, 1767, 82, -1621, 821, 1015, -1576, -109, 1901, -968, -1187, 1640, 475, -1413, 732, 1161, -1640, -302, 1685, -705, -996, 1464, 604, -1525, 520, 1089, -1526, -224, 1775, -699, -1252, 1266, 310, -1552, 827, 1376, -1359, -480, 1933, -556, -1068, 1213, 690, -1608, 344, 1596, -1382, -477, 1616, -506, -1449, 1237, 696]
4743F96k142K073P95k537L15K581k215q12K049j33k555K142J036k299L41K125
4759A460j803j100K508j93k463J654J234k396L12K190j281j671K514j97k345J540
4775c7J228k164k0K682j631j745K589k40k139J473J444k633K82K400j561j247
4791a319K093J67k297J345J735k589j40K259j315j809K701K25k512J203J934k172
4807d91p44K635j108k002K633K82k732J312J600k132k76K498j127j810K151O61
4823A350k524R13J973k178o50K359j143j876K542N25k382N16K214j856j010K188
4839I61o16j846J913R94k931J027J999j896r32K606m44k361J909J110k580O53
4855d34K237k194r48K627m99k238J630J443k812N47K210j680j171K196j93k280
$$ y = [696, -1446, 627, 1422, -1115, -800, 1781, -434, -1246, 803, 670, -1885, 257, 1293, -1006, -665, 1460, -343, -1443, 1065, 872, -1591, 63, 1297, -1099, -787, 1403, 122, -1549, 965, 768, -1577, -37, 1191, -973, -993, 1689, 58, -1687, 902, 662, -1477, -4, 1440, -1193, -911, 1489, -72, -1319, 774, 941, -1356, -11, 1724, -865, -1005, 1254, -61, -1870, 831, 1056, -1456, -253, 1681, -491, -1235, 1400, 292, -1710, 923, 1205, -1527, -215, 1385, -747, -1023, 1475, 348, -1462, 689, 1350, -1174, -261, 1712, -466, -1116, 1243, 100, -1776, 766, 1291, -1091, -575, 1639, -217, -1227, 961, 345, -1501, 412, 1406, -1525, -498, 1501, -395, -1327, 1279, 835, -1526, 383, 1493, -1087, -434, 1803, -391, -1339, 1288, 789, -1449, 181, 1624, -1188, -641, 1569, -111, -1282, 914, 721, -1559]
4871a559J727J200k282R3K074j451j213K444m99k313J970J259k172q5K116j454
4887a45j470K378j10j980J159J528k152o64K898j228j674K294L04k712J467J423
4903A316k326J26K288j365j717K597J50k420J547J472k544j4K371j282j822K045
4919D22M83k424J083K045k390l54K520q94j988J955N09k366J153J850k444m41
4935a281K448p13j774J624J211k845O89K360k135j007K714p12k194K522K72k458
4951a279N15K511k204o30K436q92k059J780J330k687M57K435k045r38K072k14
4967E88j848J588J211k317M5K414j687j366K488m24k068J856J124k535L07K099
4983A475j547j047J996K49k411J323J314k232J58K156j376j620K632j03k244J177
$$ y = [-1559, 168, 1368, -914, -821, 1253, -198, -1411, 1033, 534, -1779, 191, 1450, -722, -807, 1309, -145, -1615, 763, 653, -1327, -168, 1360, -792, -1456, 1442, 214, -1460, 834, 1138, -1574, -107, 1316, -1010, -884, 1404, 39, -1678, 919, 1069, -1351, 196, 1668, -876, -890, 1481, 199, -1623, 422, 905, -1519, -436, 1609, -781, -1135, 1385, 491, -1497, 458, 967, -1399, -246, 1604, -840, -1281, 1167, 454, -1320, 304, 1515, -1330, -641, 1719, -416, -1423, 1291, 579, -1615, 907, 1179, -1279, -764, 1747, -457, -1087, 1349, 457, -1602, 178, 1508, -1179, -722, 1713, -332, -1270, 802, 588, -1260, 328, 1539, -778, -733, 1681, -6, -1372, 1116, 692, -1376, 480, 1604, -931, -624, 1475, -72, -1119, 877, 1126, -1285, 38, 1352, -880, -722, 1434, 58, -1562, 1070, 967, -1277, -100]
4999a00J167j637L4J650r84j552K196R8k247J517J355k238j32K148j140j548J921
5016E08P63k285R74J406k162j78K454j222j828K324L10k356J108J656k190m43
5032a161K272r30j864K343M29k433R20K130k350n48K674j329j785J686J094k500
5048a352P33J963j700q75K507q87j912J558J214k448P36J944j836o17K140m10
5064G58k360J739J233k585M21K244j624j079K063j03j725J189J232k359J14K450
5080A608j740j182K374k89k133J763Q67j854k8J892j044j675K235L35k357J394
5096A66J088j913l5K183j552j113J943K40k299J426J247k143J8K146j152j267
5112a017J923K26k361R75J770k136j42K049j079j729K280P5j958Q13J500j635
$$ y = [-100, 1067, -570, -536, 1114, 130, -1422, 774, 872, -1375, 142, 1497, -741, -873, 1275, 135, -1413, 508, 1271, -1014, -40, 1366, -796, -974, 1480, 258, -1570, 754, 1064, -1292, -184, 1472, -718, -1161, 1111, 181, -1683, 660, 1089, -1344, -424, 1706, -644, -1192, 1482, 153, -1632, 54, 1148, -1352, -619, 1344, -356, -1231, 1276, 389, -1523, 35, 1249, -1199, -463, 1481, -355, -972, 1168, 758, -1602, 137, 1370, -1215, -794, 1450, -174, -1253, 810, 707, -1018, 171, 1403, -956, -842, 1608, -132, -1314, 1060, 771, -1362, 401, 1268, -586, -614, 1278, 234, -1441, 794, 1129, -1228, 166, 1254, -659, -694, 1489, -63, -1176, 767, 1007, -1292, 134, 1381, -762, -744, 1402, 250, -1017, 906, 1132, -1229, -254, 1516, -620, -762, 1287, 208, -1521, 759, 834, -1124, -311, 1189, -446]
5128d46m10K229r11k111K251L98k331J282J610k041l09J817q80j607K044M60k243
5145a198O74J656j563q66K320n55j938J881O00k027J94K226j852q63K282p75j761
5162a565J608J016k211N23K175j564r92J956l01k008J506R78j919M74J399j156
5178h1j177J867J04j988J413J165k397M79K162j345j636K308k09k038J397J021
5194A045k037j33K509j509j058K037j23j949J466J084j998n04K422j140j502K101
5210G11J65j895J164J172k450k0K473j147j731K398K5j874Q15J519j876j43J993
5227A299j405j206K148K95k153Q45J716j972p44K364p83j888J938O16k057R50
5243c7J309j857k47J887p06j606J625O81k097P19J588j475o93J761n07j548J174
$$ y = [-446, -856, 1373, 462, -1649, 602, 1000, -1331, -49, 1561, -480, -789, 1028, 148, -1459, 585, 1045, -1198, -524, 1132, -431, -1297, 1023, 468, -1470, 411, 1011, -1016, -822, 1404, -448, -1311, 971, 196, -1565, 43, 1059, -1152, -629, 1546, -18, -1010, 946, 645, -1363, 143, 1121, -798, -324, 1075, -81, -1258, 609, 713, -1275, 138, 1303, -1094, -615, 1547, 202, -1434, 874, 665, -1373, 24, 1045, -992, -1125, 1384, -125, -1183, 854, 731, -1218, 248, 1332, -666, -1170, 1252, 112, -1390, 711, 876, -1019, 145, 1317, -1133, -1153, 1320, 173, -1558, 840, 865, -1009, -194, 1325, -551, -694, 1299, -106, -1312, 836, 1131, -1022, -177, 1539, -433, -1177, 1187, 404, -1484, 454, 1070, -987, -37, 1272, -585, -832, 1055, 349, -1257, 368, 1049, -1048, -329, 1259, -216, -909, 852, 345, -1203, -29]
5260b9J069k021L09K153j613q35K150q69j372J440Q06j989K71J944j634o54K046
5277A172o02j943J513J029k134L39J549j277r27K183K5k051J310O60j721L2K043
5294A200j447j029K049l25j672J359J093j946j07K022j286j093J976k16j963J336
5310d9J379k029j97J910j030j545K377Nj794J054J114j958j13K317j522j224K108
5327H03o3k221J313J378j588n34J889q98j440K050L38k207P64J873j821p14K332
5344A254q01j593J769K79k124J061J590k031k05K097j001j503J727L54j883O48
5360c62J864j689q52K087o71j651J466J024k239L69J954j549r25K179m22j988
5376a405K164M57k078K97J917j570j093K020K3k031J355P88j878O30J461j350
$$ y = [-29, 1040, -981, -672, 1481, -132, -967, 1183, 314, -1058, 382, 1188, -801, -530, 1414, -220, -874, 1172, 570, -1373, 140, 1169, -965, -626, 923, -354, -1281, 902, 927, -1124, 186, 846, -875, -843, 1200, -247, -1276, 773, 448, -1224, 135, 1228, -718, -825, 1197, -89, -1182, 794, 578, -1385, -49, 1330, -699, -896, 1014, -16, -1561, 816, 821, -973, 81, 1195, -763, -876, 1441, -81, -1305, 803, 740, -1481, -168, 1210, -378, -912, 977, 79, -1361, 689, 1027, -1180, -416, 1457, -364, -1078, 1254, 453, -1140, 629, 908, -1216, -155, 1435, -596, -801, 1296, 295, -1208, 519, 873, -1010, -362, 1502, -187, -1039, 1048, 377, -1274, 192, 1216, -1023, -654, 1300, -249, -1174, 1005, 583, -1405, 759, 1216, -862, -565, 1352, -218, -1311, 709, 732, -1299, 56, 844, -1034, -404, 1057, -293]
5392b93p07J797k44j870J699N18j811L50J894j768p52K098j86k065J271J466k492
5409a095J78J863r63j192K013J68k098J061J500k246Q7J949j215j236K066p7k050
5426a287J128J343k078o2K075j092j189J801L8j899R04J635k034j12K088r25j367
5443a033J637M85j965N92J702k169J34J717r12j518J816K23j805J139J377j918
5459d98l82K215q78j502J549J08j332L76J556j802k90J972q62j359J375R56k272
5476a070P19J715j620q38J934k07j865J550R89k195M60K069j849o09J963p38j413
5493a005J065J037j769J33J770j618p48K244l93j785J405P74j889kK254j532j065
5510a124J830P9k049J373R84j673l6J972j186j391J995L20k498J495J003k062
$$ y = [-293, -1000, 797, 553, -1317, 382, 900, -911, -561, 1333, -435, -1187, 911, 725, -1340, -69, 1397, -1095, -917, 946, -17, -1209, 804, 972, -1126, -65, 1435, -811, -724, 1225, 10, -1226, 840, 763, -1287, -159, 1184, -894, -956, 1119, 27, -1162, 639, 677, -1222, -318, 1317, -717, -829, 1259, 334, -1033, 604, 1089, -876, -284, 1418, -751, -617, 1100, 188, -1330, 486, 709, -1096, 43, 1420, -498, -880, 1335, 457, -1045, 504, 612, -720, -344, 1212, -590, -880, 1092, 230, -1129, 246, 1202, -1070, -351, 1364, -256, -1094, 840, 633, -1232, 318, 1307, -888, -428, 1641, -208, -817, 1146, 408, -1005, 60, 1097, -672, -539, 1231, -387, -1135, 1109, 716, -1069, 336, 1110, -779, -781, 1473, -59, -1124, 706, 785, -1264, 109, 1093, -580, -616, 1356, 170, -1221, 774, 1094, -1404, 91, 1094, -968]
5526i68K94J826r36j455J802J46j981J125J384j850k64J970j109j362J698O32
5542I52k066R73J387j976r3J756j133j214J909J29j794J033J122j665j87K094
5558A227r47j356J445M79j629K76J422j338m98J891o89j566J886N71k236R11J332
5575A181j534n19K029p33j509J114J080j858M43J767j654r20J809j90j694J464
5591B76R35k124N49J389j194r58K099m75j593J395R82k144K26J890j497j079J966
5608F43J60k053J354J138j875j31J924j156j436K429k63j602J029J024j816j6
5624f47J908j385j036J521K00j609R66J316j985Q2K159j540p33J768l15j813J148
5641EJ377k085j91J865p56j457J968K9j906J198Q31j453l33K174q24j566J712
$$ y = [-968, -674, 1152, 216, -1239, 563, 709, -1272, -147, 1237, -613, -877, 1093, -16, -1378, 320, 952, -1114, -141, 1246, -730, -823, 933, -200, -1414, 495, 624, -1170, -137, 985, -680, -867, 1227, 280, -1076, 369, 848, -781, -505, 917, -421, -919, 972, 283, -1283, 603, 1174, -1062, -151, 1181, -353, -872, 1157, 424, -1085, 29, 1109, -749, -306, 1461, -193, -1113, 696, 506, -1188, 276, 1211, -913, -364, 1025, -169, -1127, 972, 497, -1096, 299, 1281, -863, -637, 1253, -244, -1323, 643, 803, -1250, 104, 1242, -633, -764, 1160, 4, -1432, 997, 734, -868, 161, 1185, -631, -647, 1261, -124, -1160, 361, 561, -1048, -82, 1234, -751, -669, 1490, -50, -783, 985, 670, -1143, 5, 1382, -703, -894, 971, 215, -1242, 726, 755, -1151, 47, 878, -575, -908, 1266, 442, -1124, 588]
5658E88L48k167Q74J545j874m33K310j032j337J600J23j759P88J509j658n56K048
5675I17o52j498J685M40j848N73J551j735n28J832l48j554J341Q75k212O18J698
5692A155j326j103K299n03j793J386O41j813M59J758j130r16J741j44j876J141
5708b4J106j831K32J653j398o10J766j74j951J355Q54j796M12J382j272q11J954
5725H47J65k185Q52J676k203L59J608j279p33J769k00j851J068J094j578j21J774
5742A062q16j587J754N72j849J052J286k197j80K126q07j653J827K85k142R56
5758c11J272j776k31K258o66j706J543M89j736O46J568j862o63K245r58j182J153
5775H3Q03k119Q55J526j587j73J460l71k184K170O88k307P22J507j491n99K177
$$ y = [588, 936, -1231, -357, 1188, -686, -1119, 1191, 159, -1178, 422, 545, -1214, -426, 1083, -575, -1131, 917, 265, -1233, 452, 892, -956, -383, 1168, -567, -1095, 737, 389, -1165, 176, 1051, -1161, -543, 1155, -171, -1274, 1025, 522, -1271, 115, 756, -1057, -598, 1160, 30, -886, 855, 711, -1165, -24, 1082, -749, -517, 1136, -262, -872, 894, 720, -1231, 124, 978, -818, -406, 976, -296, -1107, 847, 1012, -1173, -321, 1355, -848, -489, 1119, -160, -893, 876, 676, -1175, -107, 987, -591, -712, 1062, 246, -1341, 413, 985, -864, 188, 1474, -723, -903, 1223, 416, -1237, 590, 875, -1267, -311, 961, -815, -1046, 1212, 546, -1160, 383, 872, -864, -218, 1350, -512, -1175, 1070, 112, -1070, 83, 886, -1233, -378, 1148, -439, -612, 848, 477, -1707, 463, 1151, -1156, -434, 1073, -418, -1017, 1160]
5792A160p99j595J491P99k042M58J678j227j253K279l08j867J651O57k023M46
5808d95J864j568q03J804m70j439J297N99j635K38J701j170j011J746M0j941Q31
5825d12J432j727r6K048j260j033J972l22j833J300R89j388o84J877o96j038J511
5842F40j09j679J035J039j430k99J819r21j260J503N41j852O55J658k135kJ922
5859A125p85j489J522L21j546O64J206j504m53J939o48j677K024L36k090P69J568
5876A282j672o40K045o21j391J349Q50k327P75J466j563o80J934j22k113J995
5892E67O66j919K92J703j466o13J808j92k172J501J006j655n4J639j144j081J816
5909G02l01j513J417R30j963M4J742j228j132K157p7k064J360J211k005OJ713
$$ y = [1160, 361, -1234, 257, 1056, -986, -528, 1150, -77, -1330, 949, 641, -1226, 425, 1082, -941, -495, 1369, -199, -1002, 802, 332, -1107, 190, 789, -846, -608, 1093, -77, -1088, 658, 698, -1243, -412, 1020, -707, -803, 1245, -15, -1048, 924, 602, -1231, 69, 1058, -330, -1014, 863, 167, -871, 640, 531, -1148, -113, 926, -504, -803, 1016, 95, -1165, 338, 879, -973, -318, 1340, -795, -797, 1125, 340, -1149, 373, 694, -852, -188, 1018, -486, -939, 1000, 352, -1325, 699, 1035, -1055, -286, 1282, -390, -1030, 1015, 394, -997, 352, 1202, -1125, -350, 1116, -447, -1127, 807, 685, -1428, 567, 1233, -686, -394, 1309, -157, -770, 1038, 846, -1326, 175, 1181, -474, -528, 1111, -33, -1114, 702, 401, -1112, 305, 1235, -728, -684, 1058, -170, -1302, 855, 778, -1286, 74, 1285, -720, -714, 999]
5926I99j180j227K194k16j594O75J563j865N1J686j010j214J931j04j705R07J355
5943A246j808PJ704j211r54J317N01j579P87J005j567n30K040o62j651J670M78
5960G93j998J203Q31j548j95K092r07j579J689O08k010O27J705j776n78K055p23
5977B89j468J369Q76j864N49J555j642o97J972o24j747J750Q00k072M58K047j863
5994c12n39J706l06j614J466O35k018M61J744j368q24J839j45j907J389R31j918
6011g80N3K068j351j244K102j43j535J111P03j694J08J664j018j195J884L0k063
6028a300J179J435k074J78J608q71j356K014p9k193J540J052j770J0J688r45r47
6045h31J281K17j350P17J053j706j62J677m93j302J540Mj595O29J507j611j78
$$ y = [999, -181, -1408, 786, 570, -1024, -349, 1214, -651, -600, 1086, 76, -1138, 793, 689, -1016, -109, 1246, -562, -555, 1149, -62, -1016, 301, 802, -777, 10, 1015, -552, -1082, 958, 296, -1355, 315, 793, -1205, -2, 829, -719, -914, 1178, 271, -1308, 381, 989, -1021, -394, 1311, -465, -1043, 1012, 289, -1179, 190, 1066, -798, -249, 1306, -336, -1033, 939, 315, -1432, 318, 1118, -954, -496, 1551, -312, -851, 855, 549, -1065, 401, 1036, -982, -521, 1223, -145, -969, 870, 725, -1182, 207, 1138, -780, -727, 1341, -10, -1254, 848, 705, -830, 281, 984, -710, -602, 1062, 44, -1151, 733, 763, -1300, -121, 1314, -760, -582, 1026, 155, -1201, 813, 734, -1459, 81, 1133, -637, -627, 1061, 116, -831, 450, 667, -683, 34, 1087, -619, -781, 896, 403, -899, 641, 645, -950, -321, 1186, -425, -603]
6062f03J851r40j261J407L50j813R57J090j641o28K419q14j618J529L00j377M28
6079c64J293j348m79J783n41j655J830L87j797O30J376j761m60J901j42j820J124
6096d3R74j556J85J584j372p30J948p45j383J171Q44j664K65J664j189r32J706
6113G27J6j684Q90J128j529M9J614j272r11J600k80j571J369P92j510OJ290o13
6131A11j440J864K34j650R79J191j697l25J722j025j259J649M17j609O75J145
6147I82j458R1J800j032j559J656M93j948R36R83j368l26J846j061j250J902j19
6164E68j419Q72J104j608k47J912r84j152J397M09k055R99J254j635k8J501n19
6181C69j645J577O63k074P34J613j647p27K016o00j274J278O76j588J95J447j293
$$ y = [-603, 1248, 308, -953, 454, 804, -1009, -52, 1038, -603, -1231, 1188, 374, -1244, 285, 585, -792, -364, 929, -419, -898, 885, 344, -1311, 519, 906, -891, -261, 1115, -646, -1106, 795, 653, -1167, -43, 931, -625, -440, 1144, -228, -958, 990, 245, -1138, 33, 877, -787, -522, 1142, -47, -979, 727, 743, -941, -51, 1077, -452, -403, 1211, -61, -972, 628, 348, -1223, 146, 938, -572, -566, 724, 111, -1329, 535, 769, -881, 98, 1289, -408, -733, 989, -36, -1295, 354, 771, -838, -163, 982, -476, -385, 1415, 383, -1176, 480, 973, -975, -39, 944, -424, -750, 1096, 35, -1215, 687, 568, -851, 21, 1125, -483, -730, 1182, 198, -954, 443, 852, -1203, -204, 1050, -585, -613, 888, 369, -1276, 301, 964, -1110, -376, 1237, -410, -1137, 879, 279, -995, 283, 959, -629, -434, 1013, -280]
6198b80o93J484j90j691J686J70j183K16J707j562n89J462l69j125J218Q81j912
6215g70M30J499j322n79J287k8j573J241Q62j792Q7J489j127p46J757l2j756J285
6233B12P57j556J1J514o87j212J390J96j569P45J154j556K3J615j027r13J471
6250E68Q1j626Q43J197j402m71J894j075q07J367L08j801Q60J093j178o33J431
6267F49n72j055J581O5j440O79J160j740m31K071o59j144J231L07j617R42Q63
6284H90j053p31J873o75j144J203N78j569M95J177j342l52J412m76j355J375N81
6301H87j804O73J414j627m58J778p5j774J540J25j709P04J125j085n15J306o7
6318D38j406R19P85j482L10J448j031p91J423l55j375J314N60j082j58J443j091
$$ y = [-280, -973, 511, 321, -1370, 316, 486, -697, -481, 1226, -336, -925, 537, 168, -957, 261, 1142, -770, -340, 1159, -163, -742, 545, 517, -1056, 185, 1047, -745, -658, 831, -296, -1042, 715, 683, -1073, 212, 969, -587, -576, 938, 251, -961, 429, 625, -944, -199, 955, -601, -578, 1037, 10, -903, 568, 649, -977, -134, 1063, -339, -810, 1084, 9, -798, 569, 877, -924, -64, 1029, -149, -782, 649, 77, -978, 603, 668, -772, -93, 1067, -673, -1104, 967, 308, -836, 395, 702, -915, 27, 890, -163, -894, 979, 304, -840, 363, 941, -628, -133, 1044, -298, -650, 762, 286, -1069, 306, 887, -917, -244, 1170, -457, -915, 863, 788, -986, 554, 679, -1030, -326, 799, -286, -801, 505, 438, -968, -49, 736, -746, -436, 1012, -19, -810, 613, 258, -1117, 197, 757, -325, -483, 960, -131]
6335a31r69J530J85j482J041O93j375O2J287j031p16J331j36j229Q33J190j641
6352e58l9J357r33q95J691j16j363P50R09j238j09J501o80j353J669L5j425N79
6370b18J019j241j00J242n40j217J319N38j595Q72J084j234p38J733q65j193J478
6387C44N10j293L51J170j334m08J432k01j558J532L68j956O39J286j395k21J723
6404I89m87j271J070M90j241K08J289j461m56J838m42j653J405P46j941Q77Q37
6421G97j244n26J678k09j553J150N97j339Q4J482j043n12J336p4j464R60P27j545
6439f98O2J360o45j139J605K41j821R99Q00j765N90J381j239n09J176o7j446J306
6457A91M88j159j01J325p37q54J137M52j816J189N58j342Q9J418n55j198J223
$$ y = [-131, -1100, 430, 615, -867, 174, 867, -508, -446, 841, -190, -906, 425, 289, -940, -107, 1083, -558, -597, 760, -173, -1068, 623, 507, -856, -106, 803, -435, -544, 957, 277, -1076, 593, 628, -797, -218, 801, -440, -540, 702, 162, -1055, 264, 802, -793, 79, 1163, -71, -809, 924, 59, -1134, 344, 854, -439, -88, 1082, -252, -660, 772, 571, -987, 545, 913, -1043, -404, 882, -513, -734, 989, 502, -769, 301, 791, -450, -242, 1047, -414, -870, 968, 526, -1127, 278, 1024, -917, -40, 797, -447, -973, 705, 496, -1057, 93, 690, -649, -565, 917, -126, -638, 698, 624, -840, 120, 847, -698, -636, 724, 79, -1060, 545, 786, -1035, -36, 764, -1001, -411, 970, -269, -778, 398, 331, -1115, 191, 679, -480, -581, 744, 7, -847, 290, 742, -1074, 115, 673, -669, -580, 838, 283, -915, 308]
6474C08K22j208M68R92j445J11J416o30j111J131M39j353QJ796j345m45J197j86
6492C65j121J093J2q78L22J312j266m56J020k95j048J292K15j581O00J163j023
6509b74o98J619n33q86J177L03j290L28J325j213o01J557k46j491J007O85j578
6526h09K34J634r59q51J375j85j198Q60O49j517M32J401j231m30J090J76j678
6543a007J031P43j268K19J030p11q84J386n6j175Q75M98j158l70J762q17o46J074
6561E26j9j215R73Q30j484l42J201l61n92O17K76j109M81Q74j167n2J242m29j315
6580a065J499L75j779N58J002j003k69J226l28j302J567K63j717Q05R47j442j9
6597f82J384n27q83R61N18j379L06J281j379k79J307m85q15J010N51j348q1J109
$$ y = [308, 530, -678, -210, 782, -663, -552, 864, 234, -877, 254, 693, -660, -652, 1144, -201, -646, 551, 365, -756, 337, 349, -529, -207, 1105, -161, -617, 403, 108, -940, 352, 567, -1014, -414, 749, -274, -972, 647, 114, -772, 405, 708, -582, -254, 1071, -142, -743, 814, 568, -923, 84, 769, -809, -575, 1059, 100, -751, 624, 439, -759, 101, 750, -767, -335, 1066, -165, -595, 495, 671, -1007, 24, 767, -501, -282, 748, 37, -847, 539, 483, -692, 183, 681, -477, -847, 915, 98, -548, 526, 507, -708, 265, 1095, -389, -731, 470, 109, -483, 134, 410, -699, -218, 656, -511, -563, 679, 250, -1065, 434, 809, -970, -412, 590, -413, -682, 544, 216, -1086, 481, 744, -973, -168, 779, -663, -682, 702, 175, -708, 253, 771, -608, -302, 979, -400, -679, 628, 143, -672, 338, 889, -459, -540, 569]
6615E69p69n85J158k26r92J114K84j065K2J277r06p18J302m2j102Q04N00j351
6633g26R5J404n13j028J418j87j348J024O63j360L29Q34m87j136J658j52j272
6650g84J185O83j557L00J220q31r48J044L25j453O42J056j090m04J312m63r88
6667g51J072K88j324O10J195j384k73J120o17n24O62N56j198N27R29j213j27R36
6685D84o03n32R71J15j229O48Q64j176R7J001m32j190J293M89j355L87Q66p97
6703i9o13J298m34r71J236%j551R42R26j210p3J138l92p78P56L96j411M24J054
6722F38q41o26J301j9j151Q19N37j366K42J401j324k23J052j27j191J116K66j083
6740e79Q8J320p87q18J175M3j081P03N67j175k1J534r06q37J044K59j002O11P11
$$ y = [569, -200, -785, 373, 147, -845, 269, 553, -512, -490, 787, -119, -837, 465, 423, -679, 125, 625, -726, -631, 773, 260, -768, 650, 463, -885, 139, 802, -558, -229, 605, 118, -1018, 640, 488, -784, 401, 1084, -473, -173, 1047, 216, -732, 312, 637, -816, -174, 882, -208, -612, 700, 237, -751, 321, 609, -715, -105, 1090, -294, -567, 553, -64, -588, 74, 630, -568, -41, 888, -325, -452, 484, -119, -651, 320, 435, -794, -146, 718, -458, -361, 640, 208, -982, 311, 800, -555, -168, 698, -99, -712, 586, 152, -819, 417, 417, -1134, -192, 734, -476, -549, 589, 197, -581, 175, 571, -840, -416, 638, -203, -829, 472, 453, -698, 121, 658, -708, -466, 935, -389, -612, 440, 313, -878, 238, 504, -579, -491, 829, 42, -776, 399, 442, -639, 64, 631, -544, -565, 969, 63, -774, 270, 529, -473, 138, 849]
6759H49j430N39N08o82o30J470j33j176O51R30j158l93J469r07p60J193J15j263
6777h08P56P86j008r4J204n33q99J127J35j236N70Q89j141l16J245m50j051J217
6795C93J75r01J69O78r82J86R58n65j137J353O38j428M80P83j163k16J212o31
6813Bo87O77Q38j517K27J111p97k40R41j53r77P06J52j148M90Q70n82n65J055
6832D03l45j006J361M13j376M13P81q22m45J365l25j197O10O21j350M97J216r57
6850a43o82J367n5j246J059L06r13k4R92q32l63J060k68q17O28P26j298J45J187
6869H29p35r42J455k61q91K63Q21q92j00J061q11m73Q60K48j316J005O67j089
6887c01m75J178n80o75J027K59j141O14P06j086O8J143p57m33N85K68r11M70Q03
$$ y = [849, -581, -42, 466, -216, -846, 624, 491, -685, -34, 896, -262, -655, 814, -93, -853, 340, 455, -808, -52, 734, -274, -368, 836, 303, -596, 531, 666, -570, 0, 889, -252, -568, 677, 227, -824, 393, 568, -333, -164, 514, -468, -282, 676, 111, -1026, 327, 965, -463, 17, 800, -363, -579, 633, 2, -685, -8, 830, -687, -460, 651, -146, -386, 555, 402, -575, 131, 283, -865, -375, 495, -87, -652, 403, 58, -948, 413, 826, -550, -137, 644, -178, -623, 742, 417, -780, -170, 451, -899, -402, 814, -143, -825, 542, 487, -759, 300, 606, -307, -331, 661, -171, -534, 526, 258, -559, 69, 795, -503, -358, 829, 94, -848, 607, 346, -545, -282, 539, -353, -453, 608, -203, -676, 184, 432, -884, 121, 788, -301, -776, 402, -178, -853, 174, 433, -708, -94, 612, -474, -406, 737, -20, -453, 132, 400, -511, -41, 762]
6906G62j209j33R67k02j063Q70N36j108P01M93p60l50R83k87r02Q13N38j115M98
6925C2Q27j241k11J219m41j095J249K83r99J90P68j029M4Q25n77l58O63L53j096
6944e94O9J279j034m67J606q09j204J350K03j100R2J091n79n96R90J38r02Q28
6962C61L10j307J1J075n83n32J062J11j099K94P88r07k38J248o92l37J122l6j355
6981g04P39M41q91N5Q95p93o08J252K36j161N65N43j025P9R82o60o71Q02L39p60
7001c45K92N50n56k14P19m53o79R15M05j082K88O91n89l87J018j79q57N86M29
7020E52j323L90J001n84k73Q01l20p92P36N90j352O18L54k63m42N58j68p63R99
7039C19mq57L64Q72r31l01J070j07j189J137K53r87p1J304j064m88J141j60p46
$$ y = [762, -447, -580, 387, 185, -878, -8, 528, -580, 121, 614, -146, -496, 487, 200, -702, 111, 649, -466, 32, 859, -382, -593, 626, 185, -910, 339, 622, -377, -187, 581, -448, -404, 421, -156, -514, 149, 502, -594, -525, 754, -280, -747, 859, 50, -1154, 196, 399, -701, -609, 482, -97, -693, 297, 435, -467, 361, 671, -636, -625, 450, -133, -665, 397, 508, -591, -297, 491, -416, -654, 594, -98, -435, 687, 651, -704, 35, 476, -415, -360, 535, -258, -866, 386, 622, -539, 26, 569, -456, -377, 605, -55, -726, 76, 415, -345, -53, 497, -59, -273, 446, -7, -686, 229, 634, -448, -160, 531, -58, -445, 573, 394, -463, 123, 552, -771, -381, 620, 36, -237, 564, 244, -548, 188, 778, -574, 44, 398, 135, -307, 251, 83, -680, 319, 315, -542, -178, 694, -237, -538, 532, 425, -764, 373, 626, -361, -432, 872, -192, -680, 461, 301, -445]
7058d45P72L99j434P91N99r21l61J340n21o96O29N75j081J7R54p77l86Q42pr96
7078g07R47O16j448K40R37n45k50M83K82j126O44L52n53j51Q94p54o92J343O6
7097E78j406Q75N58q36m37J103l89p86R81Rr95Q65N16j073J21Q29l79j028J057
7116A63J12q09N02P77q92n50J359m95q02P58N46j391L43J031r01m04J048k72n63
7135d40Q59J01q81K03O16m57p23Q20n6p44Q09L72q20j33J043p18m48Q20L49j351
7155g79N83P05j208M91P41o68j78R70n24q53J153K42r60J34R63p06r21J387j03
7174D69q52N16K12p87J75J152o91q62J483l09j373R32N64q14K2P96o34o63J128
7193D64N2p99L20O51q40j96Q15j65p67R56p2o95M11L14o28r6R33n19n02J032o0
$$ y = [-445, 327, 726, -708, 83, 682, -239, -600, 740, 219, -477, 152, 727, -354, -337, 617, -160, -546, 296, 289, -707, 240, 856, -592, -352, 585, 40, -210, 273, 555, -571, 73, 425, -128, -279, 615, -139, -831, 512, 578, -828, 47, 605, -231, -668, 435, 46, -740, 241, 250, -745, 120, 636, -437, -316, 513, 134, -894, 163, 275, -534, -32, 745, -147, -697, 662, 167, -635, 123, 669, -722, -379, 652, -249, -653, 395, 123, -440, 419, 520, -361, -158, 458, 1, -722, 98, 42, -702, 107, 479, -341, -474, 569, -149, -597, 223, 572, -779, -196, 509, -699, -208, 533, -135, -313, 657, 133, -720, 433, 675, -285, -151, 812, 106, -815, 572, 469, -383, 133, 345, -442, -267, 885, 194, -668, 815, 506, -867, 65, 629, -185, -163, 633, -1, -664, 464, 516, -283, 37, 688, -152, -348, 467, 302, -465, 491, 419, -276, 135, 449, -179, -275, 658, 139, -363, 669, 609]
7214F09r98N53L94q06j66J018m40p26O72L99j099O23Q14j133l43J503r28n26J074
7233D94j8j105M86Q66p89m47J254n59j072J310j4r05J52R29q34mQ65m83o28O01
7253I9K58j022L49J109j158j44J018r6q59P26K92r21L07O44q80k41R20j30q67
7272e96N79N85j023O0J120p49o10J069j25j171R25O19j198L20R05p11o23J148
7290E24j78o58M29N74j139K96O24n27n80R76k09p40O32P18j056L08N60l55o56
7309d57P01K42j093Q28N48j104k87J534q30o44P09K41r28M73P74r64M0Q27l58
7328B52q95J115j9j091O57N66q41m47J117l25q04J150J48j010j13R82n93n2N75
7347C72m23n06M60M21r60N73P60m84p40J074l76n49M89L78r03j01Q47p09K0P70
$$ y = [609, -389, 164, 558, -248, -414, 604, 164, -562, 110, 509, -590, 33, 847, -286, -629, 874, -54, -580, 494, 476, -629, -143, 723, -66, -513, 741, 182, -890, 420, 406, -499, -347, 582, -252, -256, 609, 126, -502, 99, 357, -665, -316, 793, -365, -509, 509, 413, -446, 280, 572, -349, -42, 602, -278, -519, 401, 271, -596, -17, 568, -455, -395, 725, -24, -634, 435, 310, -861, 64, 683, -515, -195, 710, -1, -624, 524, 346, -312, 117, 691, -448, -152, 472, -55, -635, 341, 132, -608, 24, 742, -314, -6, 554, 199, -457, 244, 486, -607, 221, 769, -335, -622, 912, 82, -562, 147, 388, -540, -67, 707, -257, -217, 610, 252, -643, 472, 453, -638, 19, 585, -256, -703, 414, 89, -715, 435, 583, -427, -540, 442, -151, -203, 372, -51, -557, -97, 324, -636, -63, 697, 213, -527, 547, 171, -378, 111, 489, -414, -515, 332, -377, -357, 413]
7367D13k96r33Q10N80j310j31J387p42l67J060r6q99L66M03r46R9J052p23l56
7386f29J189l66q41O96L08q05L50M52n26m14J000j06j076P22M71p51K00O72p50
7405b04l26Q21J96j000L78P24r59pP74k05p54R62J38r80O89K10o32l14J006n94
7425g7n41J269j58j046L84O60q97P1Q30m44o08J021k3q44L00Q52p25m44J185p42
7445B3o47R86J76j143O47N82o47j98P05k04q93Q15J87q54O07M18o57l94R56m16
7465D9n08M61M63p40R9N90l12m31P65j24r46P35N18j121J65R78q29j80R60l00
7485B92j150Q96J81q32M93Q35r78m25J535n01r90N57R02j374o8J276o57o76J086
7504D02k43q92O04J63o48J50R68o45m11J089k74n06M72N84j279Q6R54n33p22Q75
$$ y = [413, 117, -816, -6, 574, -736, -867, 520, -222, -589, 471, 375, -524, -158, 245, -701, -602, 450, -273, -629, 560, 194, -647, 49, 357, -448, -98, 354, -172, -586, 414, 308, -768, -46, 425, -326, -126, 546, -204, -530, 291, 487, -513, -135, 589, -370, -377, 397, 192, -562, 400, 538, -442, 247, 457, -175, -489, 517, -77, -618, 651, 493, -553, -169, 491, -406, -335, 495, 51, -557, 464, 441, -403, -103, 749, 24, -420, 765, 23, -624, 362, 538, -605, 42, 624, -23, -221, 484, 280, -613, 202, 389, -465, 142, 560, -97, -491, 465, 49, -459, 2, 465, -275, -176, 414, 102, -329, 436, 312, -634, 101, 619, -502, -337, 641, -188, -368, 592, 292, -858, 38, 219, -613, -120, 715, -263, -688, 847, 346, -644, -87, 815, -559, -627, 649, -8, -684, 402, 159, -733, -129, 34, -614, -464, 504, -141, -552, 537, 263, -243, 229, 813, -466, -380, 574, 41, -681, 194]
7524A94J66p15K87O26j150L31N22l78k57N45K85r47M33O75j086K04Q44o83m49
7543e53P45K63r30L7J370j113k26O48n50n27J094L53r78L05O56o95l96R69l02
7562A70j011P47Q51r80L9N44m48k60O91k6j214J233K54j073J38Q59m87l38P44
7581D33k28p44P10K80p25J77K79l87l88J387q28p07P04M08o47J0O21q77m2Q56
7601B92r0o57O92J69p15K23N31m17n98J179j49q92N28O20j192n5J343m79q22P87
7621B98l97l47K35O05o14j57Q14o50k93Q29n4n60K94P92q70l25Q98o08l76P48
7641B62P2p92N41M97j313K45R98l72p26R71l0q13M66P20q09l46J013n15k75M56
7661B50Q8p76L28O43q43o5R09j84r88Q69K67j127M71O82o54l27R22j55r46Q29
$$ y = [194, 360, -355, -68, 558, -592, -261, 261, -117, -374, 171, 456, -491, -58, 617, -469, -265, 579, -104, -553, 192, 455, -475, -438, 932, -181, -407, 241, -309, -836, 258, 611, -367, -62, 594, -101, -497, 472, 170, -841, -94, 757, -223, -184, 360, -88, -348, 343, 317, -897, 336, 590, -483, -345, 514, 27, -311, 433, 205, -539, 171, 451, -274, -97, 182, -205, -593, 794, -34, -741, -37, 371, -276, -266, 355, -522, -564, 292, 202, -455, 237, 406, -309, -86, 445, 28, -570, 609, 460, -432, 96, 716, -476, -531, 812, 333, -489, 298, -99, -446, -211, 394, -220, -377, 437, -213, -506, 323, 269, -291, 3, 795, -75, -400, 498, -110, -486, 262, 334, -458, 83, 580, -733, -488, 510, 138, -588, 383, 353, -460, 6, 726, -83, -429, 584, 69, -206, 250, 338, -438, -110, 533, -310, -375, 534, 350, -638, 231, 498, -629, -158, 524, -130, -457, 465, 310, -636, 193]
7681A93N66j200L92P84p67m25Q54j76q83Q20K58m91l94J132o56m02P76r2q15P86
7701B60K07q91J97J078q86l09Q82j50q91O33N72j090J85N84l03n32O94K0q46M71
7721a15N66r34M16O88o24m31N22J60o54J98M91q08K3Q11l49m12P52r7o40M90P28
7742G81j000m1N08j90n92P38L50p01O7L12l85l70J089o98m95J086j73n25M16M23
7762F00p48k45O91m42l61Q31J14j006L29P84q48r9Q81m21o06Q16K25j018N09O85
7782F71j245L33R53m90n46N08L64r27L32Q79j017o1P55k45p36P45L91r12J78O51
7802E81l43m47N25k31n78Q05o4p40N35K94l81m58N70J00n74N67K06p06M8R04p23
7823a10n9N20O4o85L61M38j126R1J238o71m74P90j55p64P72K29o87K55L91m06
$$ y = [193, 759, -441, -49, 735, -32, -457, 397, 221, -662, 158, 416, -75, -469, 663, 7, -395, 381, 289, -526, 260, 467, -424, -227, 851, -35, -344, 538, 388, -503, 130, 702, -388, -203, 381, 78, -454, 240, 260, -586, -115, 451, -483, -67, 621, -3, -434, 88, 248, -406, -208, 283, -525, -502, 309, -40, -452, 300, 203, -437, 53, 781, -219, -260, 248, 58, -534, 204, 554, -147, -80, 232, -153, -523, 566, -132, -627, 459, 286, -239, 177, 600, -148, -393, 298, -144, -505, 326, 440, -566, -237, 547, -301, -400, 481, 60, -546, 270, 495, -523, -14, 671, -574, -241, 712, 222, -324, 184, 548, -379, -47, 832, -185, -246, 509, 264, -472, 273, 664, -248, -70, 581, 238, -209, 316, 85, -493, 312, 248, -492, 43, 337, -44, -502, 68, 168, -406, 161, 367, -339, -291, 613, -110, -169, 351, 415, -270, 91, 529, -597, -506, 732, 61, -413, 377, 222, -542, 230, 459, -228, 27, 418, 12]
7843A2m44P69j0p23K54N58o34k67Q29j84n56O08O0n35M08M47o73k50J100o86o72
7864e89R77r5m81J86K97l52j34M30j45q03J273m74m65N62K29o13j49P82m39n80
7884e83O84j8o53N58L08n00k54N77J12m78j1N24n73J10O44n70m12J156l87o23
7904c89L04L78n31k19J111j072l39J136J3q53P93K79q19k00O82l06j33M60j27
7923A68o47O98K68p48O4Q48r50k45Q14j67m39N71M68j215K00N70n96j52J101q25
7943b14q8L37K59p25K24O24k49o24O54R5r37P94L57p08J80N39l72k93K90L5p88
7964f10N40L69m71M3N33n09j98M91K6p87K50M66n59J42R85n27o89N89R8o15K63
7985a70M28k75l28P93l90m95O32L59r37M7P94p05J3M68m55j89L75N49q34L54M67
$$ y = [12, -432, 337, 327, -396, -142, 416, -218, -485, 344, 160, -396, 212, 272, -263, 145, 592, -81, -331, 769, 83, -589, 388, 293, -188, -2, 295, -57, -191, 239, 94, -709, 564, 90, -375, 187, 416, -197, -346, 436, -3, -583, 101, 83, -570, -12, 296, -204, -458, 119, 231, -247, -258, 266, -307, -197, 447, -123, -535, 621, 234, -389, -85, 293, -238, -457, 654, -418, -757, 379, 392, -461, 332, 611, -208, -408, 274, -32, -165, 295, 168, -479, 219, 487, -261, -197, 651, -299, -544, 270, 103, -336, 235, 703, -512, -312, 258, -338, -490, 611, -214, -302, 35, 294, -431, -207, 417, 168, -456, 198, 293, -644, 150, 507, -201, -21, 518, 146, -147, 143, 178, -610, -70, 299, -172, -129, 404, -105, -303, 188, 214, -573, -323, 143, -416, -274, 711, 184, -505, 84, 182, -433, -170, 258, -17, -345, 448, 58, -437, 195, 554, -383, -336, 458, -247, -234, 234, -221, -410, -35, 514, -320, 34, 501]
8006E01n43l14N99j63l87M56J27n18L05O33p35k74O25Lp01M57K94j044N28K66
8026A15k17m49O70J78n17K05M57o78Q3P30q32m4P27l39m44L31O33j153M44M74
8046C74m46J11K11n3o75N64J22m13lP82q26l42O99L8m54M06L24q62J49M97j79
8067B4j87M70j3n60J84N16l86n12O83k40m03N59J92n48L84L87q49J36M10k33m76
8088d62P63k97m85R9Q43o81L9O48k51q63R82J3j094O82L78o58k55R75k87m89L08
8109i2L14n04J22N49l60k54N91l14m19P54k5p64J72P78n36k24Q00p69n28P54n3
8130hl85K92O20n45n65Q48n24k46P30K18r16K12N34n86R0J64M12o16K42P6l65
8151c18L11M56o46k44O43p1m45N46K14o03k87Q98m60j74M54K2p37M26M08n02j87
$$ y = [501, -42, -356, 243, 80, -307, 149, 276, -242, 63, 696, -39, -313, 312, 315, -386, 71, 365, -679, -151, 115, -102, -551, 119, 297, -220, -15, 442, -236, -153, 577, -255, -299, 428, 89, -355, -24, 609, -544, -100, 374, -72, 39, 250, 197, -478, 86, 208, -205, -208, 574, -252, -594, 105, 143, -311, 95, 419, -443, -294, 203, 24, -163, 307, 294, -266, -82, 434, 48, -464, 219, -21, -424, 135, 327, -221, 163, 550, -299, -163, 247, 14, -462, 301, 4, -481, -382, 461, -220, -181, 467, 216, -647, 335, 348, -746, -64, 314, -344, -599, 376, 89, -400, -92, 222, -282, -160, 389, 29, -225, 366, 52, -367, 387, 362, -402, -230, 548, 12, -212, 588, -181, -709, 45, -8, -393, -101, 519, -26, -591, 257, -267, -513, 217, 435, -481, -269, 265, -321, -231, -67, 345, -271, -29, 47, -318, -7, 449, -197, -441, 202, 131, -314, 232, 446, -157, -444, 454, -6, -180, 274, 296, -441, -15, 393, -109, -296]
8172b96O08m69j65P40q5n32o2N76p17J54L96kn13O41R5q65M89L75q89
$$ y = [-296, 312, -157, -322, 418, 333, -199, -261, 315, -402, -248, 148, 146, -367, 274, 369, -496, -7, 368, -521]
8191e21
$$ Imaginary data points
##PAGE= N=2
##DATA TABLE= (X++(I..I)), XYDATA
0@%%%%%%%%%Qj6J6j6J6k1K9l2L4m2N1n9O9p9R0j04J19j34J53j75J98k22K48k78
33a47L11l46L86m29M74n29N89o50P17p93Q80r75J080j201J341j502J688j907K174
52A161k504K923l478M245n377P216j0676J9282p5864j19321K23601L9103j36467
65e6156M0500M9980j01385M5442Q8168j12730k5548J53844o7917j48186J36235
76B247J03561j58731j9660J29039o0862o3037J07071k8284j05476J07941N9989
87G3798j51270J5533J46519q1814r3201J17863O316j10842P9907O6914j31854
98f2131M175J35517p2856q9270J16465J3352j17396O1165O9876j13053P365J29303
110H2512p8161r6915J19543K3393j24382N7167R3945j05887l0587J07832m3406
$$ y = [0, 0, 0, 0, 0, 0, 0, 0, 0, 0, 8, -8, 8, -8, 8, -13, 16, -16, 18, -24, 27, -32, 37, -42, 48, -56, 63, -71, 82, -93, 105, -117, 131, -147, 164, -182, 204, -225, 249, -280, 309, -341, 376, -417, 463, -512, 568, -633, 708, -794, 894, -1013, 1161, -1343, 1580, -1898, 2347, -3030, 4186, -6490, 12792, -63072, -182393, 41208, 80311, -56156, -15656, 34324, -67061, -21619, 66549, -46181, -71729, 82115, 14198, -133988, 2247, 105808, -52923, -72583, 56456, -4406, -67443, 39628, 11344, -94132, 13809, 73798, -77472, -61939, 84580, 2766, -90435, 27428, 33744, -77098, 2809, 69723, -62131, -57956, 77561, 4705, -84565, 31900, 45252, -72144, -10979, 58897, -54156, -46791, 82512, 4351, -92564, 26979, 50372, -74010, -16843, 77102, -28785, -59372, 48460, 5054]
121E054n8784J12403r082j43467P0898J21231j05603n0346J12502k9368p8969
132e3531R0882J5824j12545N6175Q8374j12962l1693J31990l5279j03518R0245
143B3962M0268j13984K9169Q9826q5736k6969J11385m7891r8375J07619N4553
154H3827j24579O642R2079o8348k8242J07061l9153r9015R1741M9253j15684K0091
166b4327J02302q0162n8916J03050o506q2800P3170L3455j13856K3456J05251
177G4117p5746n8223J06025q563j01401O6722O2045r3557J422Q1703p0395m2051
189e7902J12559j1953j11390O2724P1469r3944p593Q8277n8333n3729R8181l486
201C4880j00242O0812O4579r6613n439R8049n7475o9590R5324J6821r4073M5518
$$ y = [5054, -53730, 58673, 49591, -93876, -22978, 98253, -7350, -57696, 54806, 25438, -53531, 37351, 53175, -59370, -3195, 85179, -27783, -59476, 72514, 37235, -66283, 23962, 64230, -49754, -20585, 69241, -16495, -43464, 67921, 20030, -78345, 29274, 83827, -40752, -34110, 57969, -10379, -38621, 68440, 29287, -69728, 22013, 71266, -44418, -24327, 77975, -2187, -61103, 41947, 35441, -47359, 25811, 59266, -54590, -31134, 74117, -1629, -59852, 46173, 37610, -63791, 2931, 64976, -28581, -27159, 54544, -15851, -57902, 54657, 42704, -68686, -5962, 65507, -28437, -36030, 52247, -6086, -59815, 38366, 34880, -65362, -4550, 60029, -36584, -42023, 56026, -1449, -71039, 24285, 41106, -52967, -7449]
213g449N7901r0570m15J04928n5115p9329Q8582K1907r0786M5935O6470r1327
225b9268j6943R9621m0979p1446Q4844J7808r8939L9796P6242q0122k1712R3172
237E2074m0925p6388Q4331L0161r4987K9264P2303p6521k3830R6832l0815p9371
249e7872P3096K9474r1458L0430P9216p4873l5797R1633k0198p6363O7349L2744
261D7381q9715K2626P7672o9306l6385R2914j5838q1130N9719L7637q4992J8726
273b0691P9970o4700m3954Q6898q030p6949N8418L9608q8179R307Q3197n3910
285I85m5226Q1685q226q0803N6788M8842q5546o70Q0766m8459m6683Q0332l347
298C0438q0606N1885M9629q5153k738Q6755m5072n5592P5841O489p7857M4755
$$ y = [-7449, 50452, -40118, -40533, 64395, 9280, -70049, 18533, 40440, -50346, -4411, 62059, -29268, -46211, 53410, 12431, -59015, 25829, 43637, -55302, -15506, 60736, -19386, -41098, 52074, 11149, -65239, 19092, 49253, -45734, -16470, 55833, -20688, -44518, 52314, 21499, -57872, 15224, 44698, -46760, -16330, 62886, -11987, -47784, 43849, 23651, -52712, 14637, 47381, -42334, -19708, 57964, -11342, -47727, 45187, 29349, -51781, 7938, 45575, -39417, -20691, 59279, -5421, -49375, 37523, 29493, -47456, 10962, 50570, -37609, -28302, 54895, 985, -44241, 37444, 29218, -51585, 5203, 54045, -31501, -32171, 48595, 136, -46547, 33785, 30438, -50168, 1717, 51346, -33807, -36545, 50210, 5138, -50454, 25387, 31876, -45981, -1226]
310a226N0479p9760m601Q3171m5007n6743P9613J2924q3156L4479N5734p0672
322b4765r964P9158m0290n6740P4756J3643q2312L5610O2240p1263k1412P6309
334C4970k8356n3529O8963J2717q2463L2643O5839o6273k5799P5819k4351n9109
346d8929O3350K1794p4889K5364N9937o5006k3600Q0121k2192o6769N8039L0189
358C7409p0994J7215N9508n7416k4616P4441k1451o5710O0791L3935p6580J0744
370b2724O6221m9407l1532O8863j5409o2608N5163L2089p4733J3190P0168n1773
382b492m0708P0189m070o3073M5730L3367o9870R746O8871m9503m0426P2507k413
395B7855p0680M1199M2503o3230K423O3324m5747l8294P1861n49p2843L8635M6936
$$ y = [-1226, 49253, -30507, -35108, 48063, 3056, -53687, 25926, 38850, -44306, -9827, 45907, -24765, -34729, 44429, 4139, -52601, 22155, 35798, -46514, -10904, 51336, -19927, -41339, 34970, 6614, -46915, 22048, 34765, -47698, -15055, 50784, -15489, -41288, 34531, 10180, -48929, 14421, 36215, -38674, -13310, 46627, -18379, -41979, 38142, 15950, -50819, 7220, 37409, -33585, -16370, 43138, -14278, -38894, 35547, 14096, -51614, 9177, 43112, -33468, -22724, 43497, -5910, -37442, 31421, 16012, -46596, 8567, 40656, -34077, -20887, 49281, -2492, -43200, 26989, 22919, -40154, 5576, 38943, -30927, -21181, 47690, -1813, -42239, 30268, 27855, -42825, -1626, 40877, -22353, -19930, 43394, -2353, -40647, 31214, 30665, -42178, -3543, 43393]
408D3393o3304m899O4837l5639m1114O2849O63o8073L9489M7203o6083j0505O9657
421C8474k9067m6777N6743Q000o3602L2078M4019o1463q264P0345l0358n2487
433d2359N7024J6972o3151K3344M5580n5095j1812O5755k6323m9823N6979J7317
445C4408o7954J9423N3167m9368j9071O0295k0833m8682N4423J8808o6386J8072
457a3698N3868n0252k4934O3364j2098n1850M4875K1377o1565J6987N4197n0726
469a0455k8081O4685r109n6312M2825K8358n9399R716N1143m4696k6738O3952
481B5889r745n8882M1979L4480n8404K840N3062l8007k9772N7735n965n4648M1362
494A924L4121o0941j38N8576l2486l4888N2577p03n2655L6360L4305n6116r50
$$ y = [43393, -19911, -24810, 40027, 4388, -36726, 26123, 26786, -41287, -1798, 45405, -20678, -31183, 38474, 9407, -37370, 19373, 27373, -36229, -4151, 39868, -21595, -29859, 40486, 10128, -42359, 14665, 31637, -31514, -8170, 37410, -17685, -29497, 36258, 9935, -39888, 17091, 34408, -33546, -14123, 39044, -10324, -29395, 30900, 10067, -38615, 15808, 34616, -31770, -13698, 40170, -10082, -35016, 28348, 16250, -35600, 9275, 30652, -30913, -13926, 40271, -10455, -38536, 26149, 17040, -39272, 3553, 31911, -27488, -17772, 33371, -11325, -38063, 25889, 16144, -42738, -759, 33721, -24683, -21843, 31219, -6788, -36560, 21175, 15210, -39438, 1924, 36045, -24896, -25034, 33542, 1056, -33832, 18745, 18042, -34613, 1747, 36052, -20064, -21014]
507b1014N7809l3429l8675N3730O954n4152K7566L5013n0705k173N5831l0855
519E900m0426N1993Q479n6024K5226M0649m8023q972N1543k5642l7703N0380Q191
532B5571n7344K3255M2988m6362j3291N3325j9961m0633M4249J1018n2767K2316
544g636M2652m7344j6160N6248j4936m4447M0949J5853n1123J7065M2346m3014
556i547j5516N5423j6337m7591M2143K3024n2294R655M2885l7822j7647N2486
568B8862j2763m6510L9324K2667n3759P873M7583l4585k4680M7810p659m3245
580b9082L6594K2642n3101M985M8312l3050k7067M8550k411m5665K9550K4990
592B5247m7260M456M6373l2909k9487M9026J537m6562K6735K8356m4702j140M4659
$$ y = [-21014, 36795, 3366, -35309, 18421, 25375, -28777, -1211, 33802, -16903, -19076, 36755, 5900, -34526, 17467, 25946, -30078, -4852, 35797, -12226, -21198, 30345, 4703, -33000, 17380, 25571, -31773, -8518, 34470, -11892, -25183, 28142, 8181, -32452, 11797, 22815, -29952, -7636, 35016, -12328, -28488, 27760, 12824, -31623, 9326, 25179, -25944, -8879, 33467, -9547, -25063, 30360, 14023, -33568, 8575, 31599, -20695, -11040, 31845, -5977, -23624, 28862, 16099, -30411, 8913, 31580, -22179, -14306, 33277, -1308, -25988, 21822, 14163, -29082, 7512, 30154, -22947, -17962, 30350, -2700, -29767, 18783, 16372, -29293, 257, 25247, -22013, -17557, 28816, -4093, -33580, 15446, 16983, -29579, -2844, 25512, -19190, -20330, 24329]
605B4329k7070k7846M6558J196m8035K6458L2805m3197o017M4548k2892k9339
617b8502M3196M433m5876K4574L1887m4314o803M7747j9712l3936L8578Q070m3094
630b3752K1682L2412m2948q627M7165j9504l5771M0151J2714m5463J5211L3222
642B6492l7106q934M5245j9662l6683L9505J4323m5875J3702L7247l5809j4964
654b2519M2589j3317l4163L6955J2763m6650J2544M0762l3734j8001M1805r590
666I444l6597L2639J6654m2797J0940L7695l3646j9133M4742n616l9353K7581
678B553J9369l9300P995L6921l0774j9644M2406n634l9555K7817K3480m0659J172
691a3853L7404k4319k0084L8429m294l9112K6793K3538m0658K39M0279k3171k5389
$$ y = [24329, -2741, -30587, 15971, 17167, -30868, -4410, 28395, -14802, -20819, 23729, 837, -28502, 14694, 19127, -26749, -2175, 29712, -14602, -21405, 26342, 6630, -27306, 11272, 19342, -23752, -2070, 30342, -12606, -21233, 25932, 6428, -29343, 10808, 23522, -21941, -6730, 26492, -10614, -19548, 25697, 6035, -30648, 8857, 23180, -22695, -8993, 28254, -7555, -22519, 20070, 6753, -27410, 9545, 22308, -24342, -11798, 28964, -4770, -22771, 19034, 9444, -27153, 5486, 22140, -20657, -9717, 27978, -5668, -24801, 19941, 14325, -25028, 2553, 21922, -17378, -9383, 27538, -3236, -22880, 19526, 13892, -25663, 2154, 25634, -15025, -13853, 23551, -768, -20852, 17577, 13283, -25829, 964, 24502, -16156, -15917, 24362, 1191, -24198]
704b4198L7065J007l7172K2999K2548l8999m95M0028k2083k6205L7595L658l9917
717b4169J9312K6223l5488k735L8333k1480k6987L7722O150l9670J6969K7029
729B1209l4660n839L8831j7282k7105L5400N811m0292J7129L1050l3257j0694
741a9699L6878j3368k6229L2843P629l9303J5205L0689l3310j1134L9203j0573
753H831l1997K8964J1881l4460J2224K7652l2222j1784M0113r589l2924K8336
765E025J5120l6253O775L0597k5310j3663L5046r982l1324K9412J6818l7417M840
778a0316L2333k4533j6787L4300m928l0945K4645J6106l5102N190L3823k4922
790a136j9904L4582j376l1914K1720J8043l2883L271L2427k3518j9432L4955m68
$$ y = [-24198, 12867, 13874, -23298, -299, 22249, -16750, -17245, 22783, 700, -25505, 12090, 15748, -24169, -4857, 21366, -14122, -16857, 21476, -4, -26991, 10731, 16881, -22789, -5820, 21209, -13451, -19290, 19541, 2259, -24846, 10554, 16365, -23927, -6798, 24252, -9005, -19699, 17179, 3811, -22418, 10425, 18054, -21249, -6044, 24645, -8665, -19799, 19404, 8831, -23166, 5798, 17679, -16781, -4557, 23095, -9127, -20911, 19202, 9613, -23311, 5025, 20145, -16108, -9333, 21264, -4046, -17709, 17337, 7355, -23969, 5443, 22261, -15156, -10316, 22017, -2516, -19303, 14997, 10069, -20876, 3769, 19875, -15227, -10037, 23786, -1136, -21040, 13542, 12166, -19748, 1972, 20015, -12868, -9597, 22830, -688, -20120, 14835, 14367]
803A4367l4191K0204K1671l1967m19L2202k0326k0401L3205K36l4724J9832K3548
816B3237l2358m220L2942j6172k1591L0336J518l4197J8223K4498l1384n139L3696
829A9389j5368k4526K9190O049l1735J4172K2100l0051m842L5643j3878k6866
841b0723K6800Q490l1632J1993K4119k6984p557L2174j2498k5272K8468R389l4520
854a7753Q951K7023k4143r389L0368j0095k5278K6210J0084l2344Q685K7504k5069
867e246j3122L2348n641k6555K2247J1482l0842P552K7210k4057j4082L2074m796
880H572k7987K1368J4888l0215L895K6641k1539j3537L1304m051k9206K0876J6783
$$ y = [14367, -19824, 380, 22051, -9916, -10335, 21867, 1541, -18860, 14345, 14581, -20143, -311, 23237, -9121, -13341, 19601, 3429, -18162, 12174, 13692, -20505, -2282, 22216, -9168, -14307, 19389, 4021, -20505, 8685, 14734, -17001, -2829, 19271, -10780, -15622, 20021, 6143, -20723, 6077, 14567, -17065, -5072, 19047, -7937, -15494, 16680, 4182, -21090, 7378, 16767, -17753, -8802, 18221, -5922, -15311, 15057, 4962, -20316, 5894, 15978, -16366, -7681, 19823, -5246, -18368, 13980, 8339, -18216, 4031, 15513, -15329, -7777, 19433, -4624, -18706, 13368, 8572, -19415, 1953, 16841, -13374, -9479, 17162, -4377, -17914, 13390, 9339, -19867, 1009, 17792]
$$ [...]
8191d89
##END NTUPLES=NMR FID
##END=
