##TITLE=1H_Pr 4687
 CDCl3
 8 sc, 
 19.4.2023
##JCAMPDX= 6.0         $$ Bruker NMR JCAMP-DX V2.0
##DATA TYPE= NMR FID
##DATA CLASS= NTUPLES
##ORIGIN= UXNMR, Bruker Analytische Messtechnik GmbH
##OWNER= root
$$ XWIN-NMR		Version 3.5
$$ Wed Apr 19 14:27:18 2023 Russian Standard Time (UT+4h)  she@DPX200
##.OBSERVE FREQUENCY= 200.1316
##.OBSERVE NUCLEUS= ^1H
##.DELAY= (6, 6)
##.ACQUISITION MODE= SIMULTANEOUS
##.ACQUISITION SCHEME= undefined
##.AVERAGES= 8
##.DIGITISER RES= 18
##SPECTROMETER/DATA SYSTEM= spect
##.PULSE SEQUENCE= zg30
##.SOLVENT NAME= CDCl3
##.SHIFT REFERENCE= (INTERNAL, CDCl3, 0, 15.7039)
##AUDIT TRAIL= $$ (NUMBER, WHEN, WHO, WHERE, WHAT)
$$ ##TITLE= Audit trail, XWIN-NMR		Version 3.5
$$ ##JCAMPDX= 5.01
$$ ##ORIGIN= Bruker BioSpin GmbH
$$ ##OWNER= she
$$ F:/spectra/data/she/nmr/H-F/1/audita.txt
$$ ##AUDIT TRAIL=  $$ (NUMBER, WHEN, WHO, WHERE, WHAT)
(   1,<2023-04-19 14:26:03.96 +0400>,<she>,<DPX200>,
      <created by zg, POWCHK disabled, PULCHK disabled
       configuration hash MD5:
       00 E9 B6 7A A2 85 ED C7 34 08 36 98 17 FE 4E 26
       data hash MD5: 16K
       22 22 C7 16 CB 8D 50 BB 66 60 2E A4 7D 46 CA 51>)
$$ ##END=
$$ 
$$ hash MD5
$$ DF 5C 24 FF 04 DB 68 9C 32 58 B9 56 37 F1 B5 30
##$RELAX= 
##$RELAX= 
##$RELAX= 
##$RELAX= 
##$RELAX= 
##$RELAX= 
$$ Bruker specific parameters
$$ --------------------------
##$DU= <F:/spectra>
##$EXPNO= 1
##$NAME= <H-F>
##$PROCNO= 1
##$TYPE= <nmr>
##$USER= <she>
##$AMP= (0..31)
100 100 100 100 100 100 100 100 100 100 100 100 100 100 100 100 100 100 
100 100 100 100 100 100 100 100 100 100 100 100 100 100 
##$AQSEQ= 0
##$AQ_mod= 1
##$AUNM= <au_zg>
##$AUTOPOS= <>
##$BF1= 200.13
##$BF2= 200.13
##$BF3= 200.13
##$BF4= 200.13
##$BF5= 200.13
##$BF6= 200.13
##$BF7= 200.13
##$BF8= 200.13
##$BYTORDA= 1
##$CFDGTYP= 0
##$CFRGTYP= 5
##$CHEMSTR= <none>
##$CNST= (0..31)
1 1 145 1 1 1 1 1 1 1 1 1 1 1 1 1 1 1 1 1 1 1 1 1 1 1 1 1 1 1 1 1 
##$CPDPRG= <>
##$CPDPRG1= <>
##$CPDPRG2= <>
##$CPDPRG3= <>
##$CPDPRG4= <mlev>
##$CPDPRG5= <mlev>
##$CPDPRG6= <mlev>
##$CPDPRG7= <mlev>
##$CPDPRG8= <mlev>
##$CPDPRGB= <>
##$CPDPRGT= <>
##$D= (0..31)
0 1.2 0 0 0 0 0 0 0 0.06 0 0.03 0 0 0 0 0.0002 0 0 0 0 0 0 0 0 0 0 0 0 
0 0 0 
##$DATE= 1681899963
##$DBL= (0..7)
120 120 120 120 120 120 120 120 
##$DBP= (0..7)
150 150 150 150 150 150 150 150 
##$DBP07= 0
##$DBPNAM0= <>
##$DBPNAM1= <>
##$DBPNAM2= <>
##$DBPNAM3= <>
##$DBPNAM4= <>
##$DBPNAM5= <>
##$DBPNAM6= <>
##$DBPNAM7= <>
##$DBPOAL= (0..7)
0.5 0.5 0.5 0.5 0.5 0.5 0.5 0.5 
##$DBPOFFS= (0..7)
0 0 0 0 0 0 0 0 
##$DE= 6
##$DECBNUC= <off>
##$DECIM= 32
##$DECNUC= <off>
##$DECSTAT= 4
##$DIGMOD= 1
##$DIGTYP= 9
##$DL= (0..7)
0 120 120 120 120 120 120 120 
##$DP= (0..7)
150 150 150 150 150 150 150 150 
##$DP07= 0
##$DPNAME0= <>
##$DPNAME1= <>
##$DPNAME2= <>
##$DPNAME3= <>
##$DPNAME4= <>
##$DPNAME5= <>
##$DPNAME6= <>
##$DPNAME7= <>
##$DPOAL= (0..7)
0.5 0.5 0.5 0.5 0.5 0.5 0.5 0.5 
##$DPOFFS= (0..7)
0 0 0 0 0 0 0 0 
##$DQDMODE= 0
##$DR= 18
##$DS= 0
##$DSLIST= <SSSSSSSSSSSSSSS>
$$ [...]
##$SUBNAM2= <"">
##$SUBNAM3= <"">
##$SUBNAM4= <"">
##$SUBNAM5= <"">
##$SUBNAM6= <"">
##$SUBNAM7= <"">
##$SUBNAM8= <"">
##$SUBNAM9= <"">
##$SW= 18.0517057926174
##$SWIBOX= (0..15)
0 0 2 0 0 0 0 0 0 0 0 0 0 0 0 0 
##$SW_h= 3612.71676300578
##$TD= 16384
##$TD0= 1
##$TE= 0
##$TE2= 300
##$TE3= 300
##$TEG= 300
##$TL= (0..7)
0 120 120 120 120 120 120 120 
##$TP= (0..7)
150 150 150 150 150 150 150 150 
##$TP07= 0
##$TPNAME0= <>
##$TPNAME1= <>
##$TPNAME2= <>
##$TPNAME3= <>
##$TPNAME4= <>
##$TPNAME5= <>
##$TPNAME6= <>
##$TPNAME7= <>
##$TPOAL= (0..7)
0.5 0.5 0.5 0.5 0.5 0.5 0.5 0.5 
##$TPOFFS= (0..7)
0 0 0 0 0 0 0 0 
##$TUNHIN= 0
##$TUNHOUT= 0
##$TUNXOUT= 0
##$USERA1= <user>
##$USERA2= <user>
##$USERA3= <user>
##$USERA4= <user>
##$USERA5= <user>
##$V9= 5
##$VALIST= <valist>
##$VCLIST= <CCCCCCCCCCCCCCC>
##$VD= 0
##$VDLIST= <DDDDDDDDDDDDDDD>
##$VPLIST= <PPPPPPPPPPPPPPP>
##$VTLIST= <TTTTTTTTTTTTTTT>
##$WBST= 1024
##$WBSW= 4
##$XGAIN= (0..3)
0 0 0 0 
##$XL= 0
##$YL= 0
##$YMAX_a= 262768
##$YMIN_a= -348432
##$ZGOPTNS= <>
##$ZL1= 120
##$ZL2= 120
##$ZL3= 120
##$ZL4= 120
##$ABSF1= 10
##$ABSF2= 0
##$ABSG= 5
##$ABSL= 3
##$ALPHA= 0
##$AQORDER= 0
##$ASSFAC= 0
##$ASSFACI= 0
##$ASSFACX= 0
##$ASSWID= 0
##$AUNMP= <proc_1d>
##$AZFE= 0.1
##$AZFW= 0.1
##$BCFW= 1
##$BC_mod= 2
##$BYTORDP= 1
##$COROFFS= 0
##$CY= 11.3945322036743
##$DATMOD= 1
##$DC= 2
##$DFILT= <>
##$DTYPP= 0
##$F1P= 15.7292609196834
##$F2P= 12.9074282941183
##$FCOR= 0.5
##$FTSIZE= 0
##$FT_mod= 4
##$GAMMA= 1
##$GB= 0.15
##$INTBC= 1
##$INTSCL= 1
##$ISEN= 128
##$LB= 0.24
##$LEV0= 0
##$LPBIN= 0
##$MAXI= 10000
##$MC2= 0
##$MEAN= 0
##$ME_mod= 0
##$MI= 1.114404
##$NCOEF= 0
##$NC_proc= 0
##$NLEV= 6
##$NOISF1= 3.799351
##$NOISF2= 2.8
##$NSP= 1
##$NTH_PI= 0
##$NZP= 0
##$OFFSET= 15.70392
##$PC= 1
##$PHC0= -19831.46
##$PHC1= 13.00081
##$PH_mod= 1
##$PKNL= yes
##$PPARMOD= 0
##$PSCAL= 0
##$PSIGN= 0
##$REVERSE= no
##$SF= 200.130013532006
##$SI= 16384
##$SIGF1= 3
##$SIGF2= 2
##$SINO= 400
##$SIOLD= 16384
##$SREGLST= <1H.CDCl3>
##$SSB= 0
##$STSI= 0
##$STSR= 0
##$SW_p= 3612.71676300578
##$SYMM= 0
##$S_DEV= 0
##$TDeff= 0
##$TDoff= 0
##$TI= <>
##$TILT= no
##$TM1= 0
##$TM2= 0
##$TOPLEV= 0
##$USERP1= <user>
##$USERP2= <user>
##$USERP3= <user>
##$USERP4= <user>
##$USERP5= <user>
##$WDW= 1
##$XDIM= 8192
##$YMAX_p= 0
##$YMIN_p= 0
$$ End of Bruker specific parameters
$$ ---------------------------------
##NTUPLES= NMR FID
##VAR_NAME=  TIME,          FID/REAL,        FID/IMAG
##SYMBOL=    X,             R,               I
##VAR_TYPE=  INDEPENDENT,   DEPENDENT,       DEPENDENT
##VAR_FORM=  AFFN,          ASDF,            ASDF
##VAR_DIM=   8192,          8192,            8192
##UNITS=     SECONDS,       ARBITRARY UNITS, ARBITRARY UNITS
##FACTOR=    0.0002768,     1,               1
##FIRST=     0,             0,               0
##LAST=      2.2672688,     0,               0
##MIN=       0,             -348432,         0
##MAX=       2.2672688,     262768,          0
$$ Real data points
##PAGE= N=1
##DATA TABLE= (X++(R..R)), XYDATA
0@%%%%%%%%%Qj6J6j6K4l2M0n6O4p2Q8j12J36j60J92k24K64l11L59m14M76n44O21
32C31p06Q02r10J025j152J294j449J618j804K007k229K469k732L023l338L681
48A930m057M470m925N426n978O591p274Q042q912R902j1041J2374j3953J5857
62H452j8212K1206k5162L0662l8876N2632q1315K41131l19580j64072N55902k67010
74d242q2847J15713m0675l3553P2050K6642O619j73900l8985L02722j9773l49972
86b20201K03556J76804k01606M615Q1643q6415J7769O9032q497k9002l9657K2322
98i637Q4423j07984j6103J12345j05666K6632R2422j42261O2385N2250j59198
109a10392J24758R5439j98026M6471J08491q8829N1412j1211j17161J37829M3639
$$ y = [0, 0, 0, 0, 0, 0, 0, 0, 0, 0, 8, -8, 8, -8, 16, -16, 24, -32, 32, -40, 48, -64, 72, -88, 104, -120, 144, -167, 192, -222, 254, -290, 331, -375, 427, -483, 542, -610, 684, -765, 853, -951, 1056, -1173, 1296, -1436, 1587, -1751, 1930, -2127, 2343, -2582, 2844, -3134, 3457, -3817, 4225, -4687, 5215, -5826, 6548, -7405, 8452, -9760, 11446, -13716, 16946, -21930, 30702, -50613, 190518, -129062, -293134, 262768, -4242, -87089, 28624, -12051, -45604, 26446, 53088, 59707, -114193, -153178, 149544, 129771, -220201, -16645, 160159, -41447, -36832, 44811, -41604, -23835, 45197, 36700, 7698, -31959, -9637, 74786, -33198, -49301, 63044, -42622, -15990, 76432, -65829, -3444, 48806, -110392, 14366, 109805, -88221, -41750, 66741, -22088, 29324, 18113, -99048, 38781, 82420]
120H2420j26059O4371j8690p9748J68944j0058k17356J07635J22153j10715K6427
131I324j6211r2940J48851L1529j52142L7721M1386o816N4807p0958m6541Q4223
143B2233o29K577m101q7863O9638Q6131j06241k1942N9724k0186J1605J53l8610
156b7511K9834O63k7433M6702k0040n1311P2873n695o9956P9926L701q7497O7795
169A2051K0385n3903N6676l7233n9211J14841K79j02928L1333K7721O168J6317
181C2496o6403l433N9648k3336J4103N233r4207M8655J24541q6112j01890Q0552
193a0153O4682l5571l3718j448J7091O037J2357J7317o7772l0762J22561P856
205F8477j33954K5357Q0531l2458j5396K321j4483J7501M297M731K004m6275K4581
$$ y = [82420, -43639, 20732, 2042, -77706, 91238, 81180, -136176, -28541, 93612, -17103, 9324, -6887, -99827, 49024, 80553, -71589, -33868, 7518, 702, 55509, -15449, -61990, 22233, 21604, 24181, 20080, -67783, 1855, 87986, -18255, -40197, 19527, -659, 10946, 11099, -27511, 2323, 2986, -24447, 22255, 2215, -49096, 23777, 18082, -51874, 28052, 31753, -55744, 12051, 32436, -21467, 35209, -2024, -61235, 53606, 53885, -49043, -17710, 10011, 16179, 32496, -33907, -37340, 22308, -1028, 13075, 18308, -75899, -27244, 97297, 11185, -90705, -10153, 54529, 18958, -14760, -16208, 883, 6920, 19277, 36594, -31178, -61940, 60621, 68477, -65477, -40120, 40411, 7953, -7443, -5122, -19605, -2104, 2193, 6924, 8928, -37347, -12766]
218a2766O0411n5540k4982O1143j9393k8501L7032m500j9972J0609q787R143J9019
231B2916k9327j2405J9668O76J0701p657m1153K3156M1500k1357j7670j0808N4
244b1706N4728k09o7556Q601M5187N644o507l3650j6077M8949K0613l3065k7509
257b2557m708M1277K9681n4401l2863M1889J7665p505p187k9869Q153M6597q285
270A7887l5341k55J7223K0790n835k9667J0266J9063j2024M931J324k1074J3386
283F74J2933j9249L451P096j4594L290P810j224K920j5334n240K8245L591k2105
297g736m499L788J8690J6243k9784k1868K8052J9869o253j8748k2487J8445L8294
310C2006j5531l8944k255K6793K3146j6196l8581O192L5097O636j4638k3779m463
$$ y = [-12766, 47645, -7895, -32877, 28266, 8873, -19628, 17404, 12904, -7068, 3541, -5246, 3897, 22916, -6411, -18816, 852, 1528, 12229, 4572, -36581, -13425, 28075, 6718, -10952, -21760, -21706, 33022, 32813, -34743, -26142, 19045, 24689, 18182, -15468, -31545, 17404, 38017, 4952, -22557, -27265, 14012, 43693, -10708, -43571, -1682, 15983, 8478, 1291, -28578, -20425, 26172, 17887, -17454, -17709, -486, 20304, 14469, -15198, -4932, 14131, 2107, 7038, 8362, -12712, 674, 13607, -5642, -2191, 4905, -9689, -6399, 1411, 187, 3107, -12227, -17467, 10778, 14369, -7736, -12235, -8447, 10243, 26486, -3298, -25166, 2886, 22755, 16502, -2246, -24733, -6288, 32006, 16475, -22469, -24724, 2069, 25215, 9019, -29562, -23370, 11727, 18363, 3725, -20054, -24517]
323b4517L8581J7067l6795j7915K0249K0542K891k1684j5322J7160J4871m674
335A0454j1125j2869O952K0581q084j8533M817O526k12L174m203l686L844o27
349b991M699O697r766o155Q033N942M854n768j6390N763J8208L01j3665j4494
363a4732M056K4954K928k8672j2124J8775K0574m445k5304r783K3179K1672j0936
376A0142k4366m825K2889K2307j5197k9402M875K6273J0050j6354k5037N655K8829
389A5839R45k2349j0401P578J5951L160j6116j0529P662J5703L485j7146p607
402a3825J4834R138p172n737L881J292k856O432L010j1113l796Q041M702m580
416B251n312n41k485M241J2114j0408j8068R948J7159R94j3714j3795J3565K0886
$$ y = [-24517, 14064, 31131, -5664, -23579, -3330, 17212, 20103, -1581, -16903, 257, 15128, 10454, -671, -13540, -6588, 13993, 5909, -12624, -7807, -1281, -1493, 1681, -2522, -6208, -2364, -2991, 1708, 8405, -1361, -7516, 517, 6459, 11313, 5545, -10845, -5082, 13126, 13427, -238, -14732, -10676, 14278, 17206, -11466, -23590, -4815, 15759, 11314, -13990, -23773, -594, 21078, 10142, -14224, -19049, 3840, 26147, 10950, -18452, -13577, 12696, 22746, 6392, -18645, -12990, 15839, 16784, -5565, -15966, -8388, 7563, 10723, -5393, -15922, -8260, 7443, 10928, -6218, -13825, 1009, 10147, 2975, -2762, 1119, 2411, -445, 5987, 8997, -2116, -5912, 2129, 6831, 2251, -3061, -3602, -6087, -1846, 10268, -140, -18208, -8260, 8899, 9893, -3821, -17616, -4051, 16835]
430A6835o365j5632p396J0162K1469l965k5148n055J8798J4854r306k0443o490
443a7682J7479K1994j4703l3217J0926K8518k896j5117q764M975J4407M844o883
456C881j4094k299K4834Q104k4749j1223J8097J5172j4788j2508J3896k825j0468
469h970J7246j185k1413O658J4141m027q856R22O381k980k032R353N0j1678k073
484h463J8128P747k4089n268K1366k051m360K027j5718L352K0346m714j5158o988
498a3843Q005J8016m067k0129n016J7607J5486j4188j5104O493R448J0939o291
511G356k0916Q793J5897l331k472j0108o754J9010Q699j9375j2816J4675J2501
524A1159j3718m423O942n590M377N319p381K457l499J061J5156j1896r607J9086
$$ y = [16835, 10470, -5162, -12558, -2396, 19073, 15108, -10040, -15095, 3703, 18557, 9251, -11192, -17682, -203, 21791, 7088, -26129, -15203, 13315, 10419, -4698, -13462, -8487, 5920, 10764, 3881, -10213, -12512, 12322, 20426, -4323, -15546, 2551, 17723, 2935, -9573, 4323, 1498, -8970, 8276, 7091, -14322, -7664, 6477, 2450, -6406, -5484, 897, -2083, -4115, 5238, 5288, -6390, -8463, 9665, 17412, -6677, -11945, 9421, 7370, 3010, 5037, -10681, -7329, 13017, 8303, -6855, -13843, -5838, 12178, 8111, -12018, -17034, 573, 16059, 1871, -13233, -6740, 2708, 13647, 7356, -13560, -4767, 11130, 7799, 5327, -4781, -11535, 7475, 16174, -3201, -16017, -1342, 11159, -2559, -6982, -40, -5630, -1253, 4066, -3315, -858, -4357, -3296, 11860, -36, -9643, 9443]
538I443m129j3485J3948O755j7113o390J8756N183j8258k891O271K351O163p809
552a205r346N398L747J0135k009k5839P803K8271n551j8703l798J1257J2227k231
566A0156j1659j1365J0629K2077j3071j8581N917M646J0054J624k4050k162K1133
579E348N457r955j4769M065J8501q39j1144k863N459M461P3L463q491j0831K0982
594H917P104k4649L265J3056q187j436L984j521n147l259J1243K629j3000o80
608g681O757L862n37m414J352m195L825J6312j1584j8214J4347J2098m286q882
622a240q280P865J1356k927j0958q679J0068J3904p370j2147m328J0531J5673
635A3468j0240j5408N438R206Q269m902j7084N810J5265p21q551p172M876Q637
$$ y = [9443, 5314, -8171, 5777, 12532, -4581, -10971, 7785, 12968, -5290, -8181, -1910, 441, 6604, -1205, -10551, -5153, -1406, 8729, 6720, -19119, -11316, 16955, 11404, -7299, -11097, 160, 12387, 10156, -1503, -12868, -2239, 19838, 6767, -11814, -5897, -1251, 8803, 10427, -13623, -15785, 5348, 10805, 850, -13919, -9854, 8647, 7808, -3336, -6199, -740, 3721, 3794, 7257, -1234, -12065, 8917, 16021, -8628, -5363, 7693, -494, -1930, 2054, 533, -4614, -7873, 3370, 5999, -7001, -7681, -924, 2938, 2401, -2013, -661, -4856, -1031, 15281, 3697, -14517, -170, 11928, 7642, -1240, -9520, -1655, 9701, 6774, -4184, -12863, -2795, 11109, 3739, -8408, -12736, -2205, 13468, 3228, -12180, -6742, 2464, 10733, 5831, -11253, -5443, 9822, 9101, 550, -6622, -1746, 6891]
649F891j606m911o664J558J1220m116p593J141P34N469j419p051O313J780n987
664d241M474L364k123k559n52N264J181k969q58m399L225Q497m859r174j749R553
680B075Q476j2382j1167Q885Q775J080p598r739O917J2115J293j0586j0554J1182
694a228J5492p410j2474j857R126J0959p182j3871J709R986O021p712j1589L736
708f294R967J561o656o980L558Q462O88n990m520N382O985m603k762K577p24J159
724A810J272j740k5j836j94J791q24J072j849n719M280O979m090p362k60Q210
740A515M816o290o554J669Q826M963p356r220L843J2457K303j3015p582R221R391
755H987k540j1190n676R461R814n945j0912j826J0707P672p914r688L265R575
$$ y = [6891, 5285, 374, -6290, -4732, 6488, 2372, -5221, -4080, -3346, 2123, 704, -6347, -34, 1746, -4241, 233, 3597, 1474, -1085, -1637, 3627, 4808, 1839, 981, -3418, -193, 8304, 3445, -5729, -7478, 2075, 10551, -1831, -12998, -4113, 4662, 5742, -1856, -11595, -4678, 7437, 8730, -1856, -12410, -1228, 14264, 6854, -5620, -7477, 1649, 12608, 5426, -8445, -6736, 3250, 9271, 1559, -10030, -6294, 3673, 5234, -1422, -8402, -4844, 3618, 4306, -1684, -6204, -822, 6163, 1560, -1202, 1375, 651, 1810, 3082, 1342, 1317, -519, -713, 1078, 254, 1326, -523, -6242, -1962, 5017, 927, -6435, -6695, 1515, 6331, 41, -6513, -4844, 3982, 8945, 1589, -7631, -3788, 8669, 10972, -2043, -9625, -404, 8987, 6447, -4743, -10419, -958, 8856, 2911, -8001, -9827, 880, 8552, 638, -9050, -5785, 3790]
769C790L464o703p484M308R135k43o979l160M256M675j455n509q76L672J051k644
785g02j587R75J007j146j323K380J724k802j694K074L622J027m474l568N415O421
801G349l193p778r30P974M952o426q610J951Q728K672p809q316L843J1500M74
816F381j1167n107Q068R415k441j0400k336R343P226m689r569q5R534M777p308
831A642p311K820P480Q88o969m571M015N205j909m849n82L471K134k153j577J478
847g88J831n90p35K85K295j34k921m31M245J702m994l619L401N115j621o988j693
864e640N660M438l141p109j148Q335N560o461q716L182J0658K318r285o086O656
879g79Q735j378r256l702O903P026k960r249k356Q627N458o642p428J582P609
$$ y = [3790, 7254, 551, -6933, -2625, 6510, 6267, -712, -3872, 384, 5059, 3604, -1905, -2781, 891, 1942, -702, -2289, -1314, -307, -1453, -2776, -396, 1328, -1474, -3168, -1094, 2528, 3555, -919, -4487, 928, 7349, 4156, -3622, -4552, 3422, 8374, 1948, -6662, -4711, 4017, 6689, -1120, -9436, -5593, 5907, 6381, -4786, -9893, -1825, 7590, 5149, -5251, -7587, 1756, 8982, 4293, -5276, -5361, 4173, 8950, 1642, -5669, -2849, 4631, 5519, -1450, -6021, -2006, 3199, 1290, -3559, -4141, -670, 1464, -689, -2266, -788, 1043, 453, -282, 3, 2298, 2164, -757, -1188, 3057, 4759, -235, -3854, -453, 4662, 3041, -3947, -5640, 20, 4458, 1317, -5792, -6940, 1395, 6955, 494, -8222, -5040, 5618, 7936, -1349, -7435, -779, 7956, 6578, -2678, -6380, 523, 7549, 4589, -4660, -7016, 1611, 7069, 427, -7001, -5419, 2190]
894B190K098o187l919L859M821j93m020j256L469K399j471k269j57K962k77k580
910e31Q23J026m05j697j723K810K709m276l785K307N524J2o621j758N625M351
926D391j109o370k226P540N118l980p825r59J0579M428j0545o517N442P575n0
941E492q426m408M799P146J75r683l697Q976N615l434p656r02R198L463o859k850
957c051J746L920L082n385l566L000L020q9m129j222L020m5o64o47j174K435j138
974h87k022L745N29k436q38M53M444M54n177o65L400L577j076o437O2M467K678
991D271q53q837j025J1036O00p901l377K022Q105R12q732k031M654N859K91q296
1007c302k269O565N959k542r401P97R040J1m650l302j68O490N37o344q11J227
$$ y = [2190, 4288, -1899, -5818, -1959, 2862, 2669, -1351, -2607, 862, 3261, 1790, -479, -636, 2326, 2049, -531, 292, 1318, 913, -784, -2507, 303, 3012, -1264, -5049, -2742, 2782, 2794, -3827, -5585, 40, 4391, 3282, -3088, -5314, 2226, 7344, 3364, -4461, -5420, 5159, 9587, -958, -7475, -2033, 5542, 5492, -2934, -7342, -2543, 4603, 4778, -4905, -8602, 374, 5989, 2555, -5101, -6003, 3195, 6658, -201, -3051, -1305, 2615, 5697, 312, -3254, -254, 2766, 2677, -1452, -2674, 346, 301, -363, -1010, -2184, 251, -887, -2909, 836, 1365, -1071, -1909, -1456, 2988, 3442, -1735, -2400, 1000, 4577, 3501, -2936, -2874, 1593, 4271, 3418, -5419, -6444, 4592, 5192, -2709, -6086, -4064, 4041, 4953, -3779, -5810, -1156, 4703, 4994, -3302, -5571, 994, 6953, 4411, -4990, -4193, 4847, 4858, 208, -3094, -3262, 3228, 3765, -2579, -3390, -2163]
1023b163L856O73n956J51L931P31p99k829J467M070l415k64J948p05K125k594
1039B27k677N069L44l547j025j93L889L44m929j374K091M781m29p437M66N406
1055A006K780j575p253R21R358r43m628k099j90P280J163p458k302K928N613k22
1071D379q893j52N862J455j271n389L2N371J17j637k171q06N228N92l546r0R72
1088E3K032k37k382J641j62j484J868j737O65Q26l783J668K360j749k17k301L55
1105b584N424j528m204N83J841M314j137n887O70M498L074k883o565K398N842
1120C856J47l435n469K367O806j433m924l035K398P150k012o875M57M101L875
1135C974j789o598K152M777O87j137m491N65N546j107k788j322O70L401j347l099
$$ y = [-2163, 1693, 2366, -3590, -3439, 492, 1223, 424, -2405, -938, 3132, -283, -547, 1401, 696, 2821, 227, -2450, 2619, 2963, -584, -1609, -1802, 2087, 2431, -2498, -3872, -1781, 3000, 2571, -4866, -4400, 1006, 3786, 2211, -5042, -4121, 5237, 4294, -334, -2433, -2623, 4657, 5820, -1638, -3940, -1012, 4601, 4379, -4514, -4666, 1196, 2651, 1380, -4009, -3977, 1394, 1511, -126, -2297, -3103, 2125, 2717, -829, -919, 53, 2085, 1848, -534, 1107, 945, -539, 1329, -408, 257, 1083, -2700, -1032, 1328, -421, -638, -2939, -2584, 2840, 1312, -2892, -2309, -468, 3846, 2709, -3178, -2508, 1990, 5064, 2181, -4384, -1986, 3856, 4003, 568, -4901, -2534, 4272, 2839, -2085, -5120, -2722, 4428, 2416, -4459, -4002, 99, 3974, 2185, -4413, -2261, 2516, 3203, 2066, -2425, -1860, 3686, 2579, -209, -1531, -861, 2540, 1193, -1906]
1151a906Q79P10Q22n61k096J653M00o10J74q63K103P00k897J375J960l84k00k775
1169a516J123L778j755k652q26J142L738j671m660P16K960J843j839m672J534
1184b757M282P27k361l464J919M829l98l569j592K380M107j751l898K13J787K357
1200B811j416l933Q43K311L68q36k654Q20K785j179q25j04P6J536l20p43J044
1217E84j50j13l5L11J117o45j823N17J259O91j901k192J544K175k97k375j894
1234c227K204L251j442k944o09K709L200k024l520Q12L525J795k809l550J400
1249a229M038M16l322k767J699L463o20l373j447K129L048j103l325k53K490J936
1265A780j177k243L39K080J052r02j691P05J130J77o76l92m50P76k08n49M55q25
$$ y = [-1906, -1027, -317, 505, -56, -2152, -499, -99, -709, -535, -1398, 705, 1405, -1492, -117, 1843, 1459, 1259, -1516, -393, 3385, 1630, -1022, -1848, -706, 3032, 1361, -3299, -2583, 377, 2220, 381, -4291, -2757, 1525, 2252, -109, -3573, -1654, 3175, 2777, -792, -2384, -4, 4103, 2352, -1546, -1333, 454, 2811, 1395, -2538, -1695, 616, 984, 148, -2506, -1686, 1099, -80, -905, -1009, -933, 603, 283, -460, 584, 434, 321, 286, 597, 1714, 1069, -754, -237, 1022, 1713, -188, -2380, -836, 1339, 1042, -1333, -3227, -1023, 2228, 786, -2158, -2767, -58, 3142, 1118, -2402, -1590, 1935, 3730, 921, -2629, -1229, 2809, 3225, -97, -2864, -1165, 2298, 1678, -1695, -3142, -1013, 2035, 932, -2393, -2646, -156, 1780, 603, -1640, -1301, 779, 1831, 929, -762, -57, 1073, 1250, 574, 182, -268, 508, 300, -249, 206, -619]
1283f19l56J85P99J24o49j087P42J572K42j742p13J607J983n41j925r55K189J836
1301B692j054k862m86K767J835k549l010O42L081R03k627k595J607K849O41k731
1317h97j945K043K841k49k430j125K024K198p21k467n12J881J318j195j820k25
1333a281J467R59j249j192L4Q53M03l30o06L48M72K30J16J2J0j77J49R99J79j133
1353B63q87R61Q65r8j542r30J039J521n49k238m91J643J774j138k351J20K548
1370E10J641j745j927N47K482R23k032k004J388K083M90k529j928J739K358o14
1386A382k445j170J730J849j010k070K3J389J170n93j463L56J243P76m95q70L78
1403A80N86K06l64o23O5J72k66M02r2p35j58K47J85M49p86p87Q32Q41M82j288
$$ y = [-619, -975, -790, 9, 133, -516, -1603, -861, 711, 953, -789, -1502, 105, 2088, 1547, -378, -1333, 856, 2692, 1638, -1224, -1710, 1057, 2892, 343, -2667, -2025, 1056, 1959, -668, -3263, -1656, 1193, 1834, -897, -2842, -799, 2042, 1793, -637, -1762, 262, 2460, 1739, -728, -1240, 641, 1959, 764, -1056, -1281, 186, 1145, -104, -1296, -1262, -409, -6, -336, -942, -594, -122, 108, 224, 236, 246, 69, 218, 1217, 1396, 263, -624, 337, 1202, 1104, -438, -1368, -329, 1192, 643, -1595, -2086, -443, 1331, 193, -2158, -2038, 510, 2151, 406, -1521, -974, 1508, 2431, 399, -1605, -217, 1866, 2356, -173, -2101, -362, 1996, 1382, -1063, -2233, -503, 1346, 336, -1734, -1711, -322, 848, 255, -1208, -852, 391, 1167, 672, -198, 180, 766, 972, 608, -15, 50, 222, -44, 358, 266, -469, -627, -380, -195, 254, -532, -1319, -487, 354, 836, -452]
1423d52q42J220J668n65j676m97J834J408j141j792k73J776J382j795j949N42
1439a152J653J008j589k349J167K040L13j619j674J570K182l70j188j237J346
1454A01K132j086j451m2M56J678j121j645Q55K62L47l22j381Q21K60m10M07m46
1472e85k18O46n65Q23N16r87L31J51L78J060j587o95J128O44K77j503j133J379
1490F0R14l50j540j184K001J460j496j212o39K263J898k122j597P49J666J327
1506B198k073k109J858J726L22j854j916K075J583j120j121j414J558J893j932
1521c26j195M06Q29J361j297j359J432N49K91m11r47J267K65n48J73n77P01L21
1539I35j521O04P48r16K56r70K26J669j837m29O96K64J379j166j685J723P45K03
$$ y = [-452, -1294, -74, 1594, 1029, -647, -1144, 690, 2098, 957, -835, -1108, 668, 2050, 255, -1694, -1152, 501, 1509, -80, -2429, -1262, 778, 1091, -528, -2202, -632, 1550, 1180, -8, -1245, 101, 2233, 1147, -304, -346, 110, 1788, 667, -978, -123, 139, 486, 164, -1217, -396, -136, -546, -139, -585, -803, -157, -722, 101, 617, -370, -39, 112, 490, 1550, -37, -732, 396, 1040, 1317, -186, -1319, 60, 974, 624, -916, -2100, -99, 1361, -135, -1347, -1986, 277, 2175, 53, -1544, -795, 871, 2198, 125, -1984, -126, 1600, 1922, 68, -1848, 227, 1810, 690, -431, -1845, -287, 1606, -326, -1521, -1115, -286, 1075, -222, -1581, -149, 400, 691, 280, -667, 600, 865, 317, 490, -87, 614, 935, -586, 18, 766, -150, 106, -864, -638, 1031, -806, -1235, -539, -275, 1104, -62, -1747, -24, 721, 924]
1557I24q71j648K244J305j186r80q47J553J673k217j176N84O83J432j704j972
1573b203J828P40L61j231j522J907J013p04l06q18J121J491j391m23M89j7Q67
1590A202j093n12P85n77J62Ml92P86o88q62J173j21J97o16q17J782O45j127l07
1609c76l51J595J156k202o13Q39R44R02k385j285K138R21l93j802j567K700J605
1626A826j786j631m47K353J613k476q73O15J707J106k210j198J674J248Kj731
1642b08j602K300R18r02j150r76J750J128j759l28L27J26J137j359m82J339j54
1659A05q4j51j27R49j65p69Q00J98l52l85o45J285J97r30n35j61J075O17j854
1678i32n45R01J066L59j837o11J897O10l30j349m34K178Q53j505q47m7J796M55
$$ y = [924, 53, -1595, 649, 1954, 768, -212, -1059, 494, 2167, -50, -1226, -642, 41, 1473, -231, -2203, -375, 365, 726, -505, -2027, -120, 893, 189, -117, -935, 186, 1677, 286, -137, 352, 335, 1202, 109, -403, 382, -195, -33, -29, -421, 365, -323, -1185, -12, -133, 64, -552, -1369, 413, 1058, -69, -376, -727, 868, 2024, -178, -791, 48, 992, 1894, -491, -1776, 362, 1283, 890, -912, -2479, 221, 1826, 40, -1591, -2038, 315, 1928, -548, -1421, -806, 901, 2007, -203, -1401, 273, 1521, 1523, -208, -1810, 490, 1408, 506, -644, -1620, 130, 1258, -501, -829, -502, -376, 761, -598, -1080, 259, 105, 21, -130, -257, 692, 527, -242, 558, 756, 404, 19, -626, 659, 856, -74, -609, -770, 305, 922, -932, -1477, -576, 490, 849, -988, -1599, 298, 908, 578, -771, -1205, 973, 1826, 321, -526, -573, 1223, 1678]
1696A678j926q81R29R36K08k011m15J409O94n40j057k66J748J30q69m01J19J323
1714H08j59r86M19L50J06n3q28N20O68p35p41K90N96L78j064n51O12Q49k87r21
1734g29l33J275O14j002p60L32J723N5j295p45P39J493k7j705o74J364R98r73
1752C50j660o9J851O64j360j409O80J566K66j540m46J033Q60K1j380O9J172M60
1770A128p51p47L48P42j29o75l67L87N43n08o28L47L31j5n47p5O07L55n94l08
1790e56L11Q80Q7r77j75R64O61p61r53p9J442K74j119r58O30J201k01j401p03
1809a433J262J002o33j361o3J454Q00q00j356M92J652Q6j005r84R87J145j77j361
1827b93k37O50O62n89q03R0O33r0l96l28L21N26j39m35J69M02R0l48j36O77Q4
$$ y = [1678, -248, -1129, -200, 736, 944, -1067, -1482, -73, 621, 81, -976, -1242, 506, 636, -233, -634, -515, 808, 649, -337, 82, 432, 538, 485, -343, 177, 845, 110, -631, -341, 255, 633, -431, -982, -370, 479, 192, -729, -1062, 213, 827, -175, -935, -603, 1120, 1175, -120, -865, -126, 1367, 1340, -365, -1039, 325, 1323, 350, -1310, -1379, 472, 1136, -224, -1633, -953, 613, 879, -661, -1107, -74, 786, 807, -573, -504, 668, 1128, 377, -370, -22, 720, 591, -84, -451, -64, 479, -29, -657, -310, 21, 6, -541, -616, -9, 346, -248, -556, -245, 635, 722, -255, -430, 534, 1195, 434, -519, -598, 844, 1118, -1, -959, -329, 872, 671, -730, -1433, -171, 831, 198, -1163, -1226, 228, 1028, 228, -1128, -636, 1016, 1102, 97, -887, 100, 1245, 1068, -293, -530, 120, 782, 193, -610, -520, 113, 23, -373, -701, -380, 146, 7, -428, -259, 143, 233, -115, -251, 426, 510]
1848E10j65n58L17N93p7p40l18O69N35m34j253J86J022M12p50j291O08J265L5
1867E66r43o85J126Q95j21j136m74J234J050j130r44L1J010N16r67j012P89O97
1885E02j16r26m68N87R68m38q14k2O57P30o62m48L30O41j08k56j18J96J42l29
1905D8k96M90M3k00m18l0M88k3m79j58K73N52oj025Q7Q77N73o48j071P33R32K12
1927I54q80p90N74J187m52r37l54O36Q06l56j200j48J215K26o58j063O24J268
1945F52j86m95p06M15J143l91n43j29M43O73n55p06L99J31O3j84m81M66J12m57
1965c36m4J92J98j00l37J60M41J48l28l95L26Q33l26n45j53N33N29n54r04M22
1985b40O60L1m23r25M69J108n00p63j52M58J198o12q49j80Q00P72n06j070K58
$$ y = [510, 345, -213, 104, 697, 620, -120, -438, 231, 766, 332, -921, -735, 287, 699, -51, -1342, -734, 531, 566, -377, -1062, 64, 959, 838, -298, -772, 462, 1512, 382, -562, -531, 479, 995, 28, -984, -195, 502, 386, -540, -1008, -421, 547, 109, -705, -727, -70, 660, -2, -450, -120, 521, 413, 157, 39, 235, 377, 48, -248, 242, 285, 85, -333, -363, 125, 102, -377, -535, -262, 290, 284, -741, -654, 223, 796, 148, -923, -190, 742, 954, 74, -716, -142, 1045, 593, -344, -698, -62, 744, 388, -812, -960, 255, 481, -177, -1240, -616, 652, 466, -29, -735, -320, 823, 432, -111, -240, 203, 876, 321, -385, 14, 145, 208, 24, -457, 9, 121, -336, -380, -188, 10, -90, -427, -267, 174, 322, -6, -401, -75, 758, 432, -113, -266, 267, 796, 242, -662, -240, 420, 451, 28, -897, -428, 680, 180, -583, -735, -277, 921, 309, -540, -720, 80, 852, 346, -724, -466]
2004d66R87J92l94r67N76Q38q0p59m51M18O55o30l68K8L30M64m52n26M29P5K51
2025A50k07m02O36J13m04K02M7N8n8j40j43O34n29K26k33M1L57n73l57J85K70
2046a27K62j15p10O02K70K14m46n18M94Q86m71l47j89L38O26m51o52J81L06L92
2066E45n05p68Q06J63l33j68l74O30L12m39j76p9M51N41r50K20L59j7K22l84j88
2087a32P18k57l35j15j18O09k75o56K93L26O6l50l84M50L74q5K5m90K84P26m77
2108A97l60n6M21M50m14p08M32M23Q1k36q58O13M33l79k31l33J55P46m83l17O3
2129c61J31M65j15o24P06L0K38k15m82K80K96k50K06k85R3J61l64R0ml61N22j44
2151A3j06J55l05KJ25M6K41k10j87N06j09nq5j72M32q0k1k28j71J86K02n46k36
$$ y = [-466, 521, 713, 319, -648, -72, 766, 686, -73, -524, -106, 549, -81, -449, -421, -91, 373, -79, -605, -176, -101, 150, -57, -459, 177, 290, -114, 88, 135, 193, 135, -5, -148, 486, -43, 183, -50, -9, 348, -225, -582, -397, -127, 135, 20, -690, -88, 182, 396, -50, -568, -74, 812, 341, -6, -195, 143, 769, 318, -334, -153, 153, 545, 40, -728, 78, 241, -92, -260, -634, -4, 308, -131, -307, -386, 65, 606, -344, -124, 235, 218, 440, 56, -132, 586, 329, -6, -121, -239, 370, 95, -561, -268, 58, 124, -226, -610, -160, 214, 129, 154, -336, -52, 674, 197, -163, -219, 202, 652, 238, -470, -38, 385, 466, 230, -628, -15, 418, 39, -192, -525, -370, 376, -107, -424, -361, -230, 235, 120, -504, 202, 232, 470, 255, -227, 53, 349, 99, 305, 20, 113, 274, -90, 0, -4, -365, 157, 13, -93, 62, -243, -241, -116, -70, 171, -39, -226, 280, 171, 166, 81, -91, 341, 261, 240, 12, -159, 27, 229, -317, -553]
2174e53N48k11N53o04l48N81J7K53m05k23M40K50j83j23k93M37M03o13k27K83
2194a8R6K09l95j00J07q6J94r0k72K18J13p3N7j59J43K14j29mJk5M25l12k6O0
2218A48q5j03J33r1J05k49j66K53N0l6l56J94O7K00k86r5q7M84K76l82r9J32J95
2241B02K14m53k98N27Q9p7l90j4J42L61k12m29r3L96J18k78l6J70L1K40l20n5
2263a65K17r5K83j88K4j0J75l2p5j61O6p2j14J07j36K4q1J17Pk0N9k40L12Q4j5
2288G1j63l5J93K98k99O4j93K39O5L1l35o4J68P9q0l68J05K50L01o87K54r9K87
2311H2J25m02J6O2K62O1j56j87K48K34k12k97J42K10L72m25n04K22J1J56k5q5
2333i0KQ4N1k06R5k8R2PJ42j53K18j44Qo4J0K49p3k01KP6lq4P7n2j28o9j64L29
$$ y = [-553, -5, -216, 337, -267, -615, -34, -17, 236, -169, -392, 48, 298, 115, -8, -301, 136, 539, -74, -301, -18, 78, 287, -108, -208, -101, -187, 7, -83, -355, -137, -24, -97, -40, -199, -56, 158, 29, 25, 26, 1, 426, 114, 88, 148, 63, -40, 93, 2, 107, -142, -308, -55, -5, -41, -397, -203, -136, 64, -222, -317, -404, 80, 356, -26, -125, 7, 202, 416, -37, -335, 192, 281, 204, -186, -200, -58, 303, 91, -338, -431, -35, 83, -195, -231, -61, -30, 210, -110, -165, 52, -43, 240, 52, 76, 66, 241, 209, 134, -27, 39, -33, -147, -40, -176, -152, -233, -116, -109, -129, -70, -310, 2, 86, 71, -92, -127, 66, 364, 65, 129, -64, 175, 240, 271, -64, -128, 40, 119, 39, -329, -224, 26, 327, -360, -106, -205, 82, 207, -195, -179, -117, 145, 206, 50, -137, 111, 345, 133, -164, -22, 188, 560, 135, -369, -147, -136, 20, -5, -90, -88, -4, 47, -159, -64, -92, 0, 7, 149, -4, 214, 70, 78, 14, 24, 273, 200, -1, 1, 77, 74, -10, 67, 15, -113, -182, -346, -17]
2361a7j15Q8j19q5J85K77n5l73J18L15q8J14m50K85K13k64p6k08J41K44k44j52
2383b66m8L60L7k1l15J21J0M01l15k76K03J98o0J81l65L87q4m7j11K8J76p1n1
2406G2k16LL0R4j83K44N4k13j13O7pK14lo1j27L28k9k32P3K60J16k51r3k14K44
2431E7N0m1m11L08K83p5l40k04P9K97K30m15m1J04K39n3n3k97K58K74l76R6K03
2454A72Nlr7j64J82J9P3k67q5J21n1j16J81j98K01j46L8jK18K2j04r7J66K81m06
2479e6J38j71L62k5k93j09L0J21Mj93K0P4K75j8k97o4K35L0k44j15j7M61J77m00
2503g5J06N7r2J76k97q9L75Q8l56J37m0JK9o3j3K3j09K60l43q5M89j50M8j63j80
2528b66N67k07p1O4J2J78k31r8J27j41J00K1n7J82j44k51J58k75L96N0j92n8J27
$$ y = [-17, -132, -44, -163, -248, -63, 214, 159, -214, -96, 219, 131, 245, -205, 80, 293, 29, -47, -255, -114, 130, -114, -266, -314, 46, 83, 62, -253, -132, -122, 279, -36, -312, -109, 89, 29, 210, -155, 232, 148, 101, -10, 18, 194, 123, 72, -144, -141, -111, -17, -200, 44, 98, -115, -228, -161, -168, 46, 43, -18, -145, 183, 154, -78, -5, 255, 371, 120, 27, -187, 57, 107, 66, -345, -37, 246, 171, -169, -373, -294, 3, 233, -182, -223, -119, 120, 67, 14, -283, -25, 249, -127, -31, 172, 177, 174, 77, -87, 95, 114, 187, -80, -165, -44, -95, -211, -30, -228, -27, -173, -135, -136, 82, 104, 0, -97, 69, 350, -56, 82, -89, 273, 248, -45, -154, -124, -3, 1, -192, -172, -98, 177, 159, -138, -202, 33, 63, -181, -296, -313, 148, 325, -75, 31, 88, -4, 172, -125, -214, 161, 249, -107, 30, -10, -9, 20, -43, -56, -33, -142, 118, -225, -310, 179, 29, 77, -86, -266, 301, 94, 23, 87, 99, 277, 46, -52, 75, -66, 34, 55, -2, 180, 36, -215, -57, -332, 64, 114, -78, -136, -9]
2551ij6K20j2m17L23J08m15K21o0L32r7j37k05J32J89J3n11rK49J87o8j13k98
2574c93M68K9k33l0P3J07K12k85J11o9J94K4k64j53L55o2j41K2p3L35j50k05J80
2597E2o3l0j32j6M14l12K1j4K03j06J51k56Pj02K8M71q5l84M2J55j2m17M4K62
2621g9K29j51m5j21K39Q5k55l3P9J65p8j75l4J61J63K4k16Q2J06o4k21J46j54
2644a47J46J21j35j50l7PJ67l9m4J25j69Q7k56L26K04k31j48K45j1l6j19p5N04
2667C35k15q7m4l2L10n01K7m9K09J44j4l08n4L75J46k23k19K22K58r1k85K7r5
2690a64L54R6n00M1K93j3J51l30LL0L1j74N5N3J87m6k32J6K12N1l51K33R7K1Q7
2715B01l37J13L59k37j88J67k09K28j44k6q4K30l1p9k85K18J40pp1j85M4K04J7
$$ y = [-9, -25, 195, 183, -234, 89, 197, -218, 3, -57, 275, 178, 41, -164, -32, 157, 170, -341, -350, -101, 86, 18, -95, -393, 75, 104, -129, -159, -86, 21, 233, -52, 59, -10, 184, 208, -56, -209, 146, 84, -57, -35, -108, 227, 77, -128, 52, -11, -41, -173, -189, 225, -87, -66, -80, 123, 17, 168, -88, -81, -183, -155, 316, 231, -153, -111, 44, 32, -385, -341, -79, 150, -1, -46, -167, 72, 157, -98, -131, -52, 113, 35, -140, -174, -13, 150, 174, -42, 40, 146, 82, -139, 7, -147, -1, 120, -15, -165, -202, -195, -28, -67, -111, 14, -155, -68, -324, 2, 206, -25, -173, 72, 61, 25, -94, -169, 335, 120, 33, -11, -43, 267, -234, -207, -256, -47, 97, 83, -225, -279, 96, 242, 19, -200, 22, 280, 189, -96, -69, -164, 190, 286, -214, -173, 120, 107, 258, -72, -69, -39, -8, -182, -127, -74, 113, 67, -165, -149, 63, 114, -237, -4, 93, 114, 201, -136, -23, 336, 99, -89, 78, -131, 97, -47, -73, -157, 73, 42, -37, -322, -104, 36, 29, -42, -227, -183, 21, 38]
2738C8j39J32Q3J54j17k01j49K38L9q6Nj54L20j11j55L1p8M52l27r1j57L73J0
2761A10k21K1m3M01o3j90j62O2k7K03k18j0K81o8j05j90J57J07K6p5k16J76K06
2784A62j03p9J13J66j49R2j88J3J56k63K05k18K43j36L9l09K11O8l7o7j45K53
2806B7n7L0p7J03j61K46k26J0J87J34j95p3J98j35K62j1l40q4J29R6j34j5j25
2829b11L68j37p3k0J80j45L5k8K50j16J64l07K13O2M2l08J59j10N8p7K3L8k2J98
2853B36l44k5R3M2J65k57n6KJ77J24j86j5j19K52k9j53K15j0L3j45j24k0P2P4
2877BJ19q6K4j7J2j84J6K68j30p5J38j07p6J09k64M7L19L0o0J19j37l7J71l11
2901a10l7J14N1L9o6J34j16j07p4m3J33K19r0M0j16J51r4JO5j10K06j33j84J66
$$ y = [38, -101, 31, 114, 268, 151, -50, -199, 39, 78, -8, -3, -157, 163, 52, -103, -72, -150, 302, -25, -116, -273, 100, 110, -111, -90, -133, 268, 205, 15, -147, -85, -112, 91, -127, -137, 144, 76, -29, -219, -62, 45, 71, -4, -220, -44, 162, 59, -20, 93, 259, 110, 202, 14, 27, 183, -80, 125, -93, 150, 14, 53, -256, -45, 23, -14, -81, -226, 27, -30, 0, -77, 26, -135, 111, -115, -105, 82, 216, 21, -52, 146, 11, 273, 262, -78, -162, -33, 63, -71, -86, -211, 157, 20, -53, -73, 107, -38, -3, -31, 219, 103, 267, -40, 173, 235, 277, -31, 128, 18, 76, -1, 22, 60, 38, 236, -108, -133, -40, 2, 167, -90, -146, -144, 33, 157, -29, -44, -163, 89, 60, -93, 122, 112, 145, 0, -124, -144, -72, 2, 121, 35, 59, 42, 54, -130, -114, 154, 24, -51, 87, -20, -96, 13, -251, -204, 115, 145, 85, 204, 67, 30, 201, -110, -147, -33, 18, 57, -9, 125, 9, -98, -172, -215, -82, 137, 47, 87, -29, 122, 28, 29, 94, -16, 190, 57, -127, 39]
2925C9o3J50q8p8mpJ78k15K8j2J27L2K0k25Q8l1L7j87K12j42L45r1k36J35k36
2950b24K38j8k20L04m7j15OQ5L9K8kp2Q8j20m7N0p6N1J80j12r3J33pM0k63K61
2976H7j53o0J03K19r2k33K03m5k14J86q9k0j33J28l2J17J39j88J67k2j4M7k17
2999a16K32n6rR1r8r0Q4o6J18j03J56j14j91L03k05N1N9p7K8o6j40L08r6j56K42
3024H9q9j72J79n2R2M3j56J76K5j01J94l84J73K6k81K62r4N5O3N9N0k55O2K04
3048A68j11l9J8l3J24J88m17K70M3k64Qq9OL93l14k09J84k40L47j70J37j76J08
3071f8m1j5L3K9L8J45j40Q1j83K51J14l63J75n1O0o0k16J71l5k0j7L4L6j02q0
3096b24K07L1J48k16K40j66Mm0J62j27o2R2p4%J39k16p6J06NJ43j91J52N0J14
$$ y = [39, -24, 126, 38, -40, -44, -51, 127, -88, -60, -72, 55, 87, 107, -118, -30, -61, -24, -211, 1, -141, 204, 113, -123, 12, -224, 14, -4, -224, 80, 33, -82, -76, 9, 48, 76, 74, 2, 90, -30, -77, -27, -103, -52, 128, 16, -77, 56, 49, 89, -174, 87, -66, -126, -23, 196, 104, -129, 74, 29, -185, 1, -88, -108, -241, -113, -145, -28, 111, -77, 90, 68, 54, 101, -116, 116, 60, 51, 142, 44, -46, 38, -28, 90, -13, 143, 29, -162, 141, -64, -13, 46, -31, -3, -69, -209, 99, 3, -153, 89, 0, -172, 7, -45, 47, 90, -66, 110, 135, 34, 228, -156, 17, 43, -238, 24, -70, -15, 48, 107, 157, -98, -36, 168, 57, 18, 36, 3, 127, 315, -102, 168, 211, -53, -45, -134, -128, 265, -49, -258, -74, -314, 33, -137, 0, -176, -68, -109, -124, -91, -62, -24, 121, -19, 62, -121, 130, 244, -119, 56, 5, 65, 5, -211, -40, -75, -95, -112, -78, -42, -144, -224, -17, 14, 162, -54, 186, 20, 24, -16, 146, 19, -43, 49, -25, -25, 114, -102, -178, -72, -67, 76, -115, 37, 87, 201]
3120B01l08O3J7r8oL8J6J33k0k4p3J59n4n5J54k25J7R3m0n8O1J01j25j25P5J83
3146A00n0j10J89l14R7P4M2K25j20r2n9P0J1k11K09k0r6Rk5Lj9K07j3k13J21j20
3172a05J04J24j62N9j39K62k48N9J26m4j46K57j30K17k80J42Q3l02oJ13r6J13
3194Ajk38J44K13k11L2O6J1J79l83J42k4P4j5p8K63k92K41L2Pk22J78j6j34l2
3219f3J98j5j28k8k1j5J42m0q3J09j03q0m8K43m04M47j87K06j92J51j40R5j56
3242a12J63K5j33L8l3M2m9lMJL3L9O5qK0r1J1r4K46j92j58L25j78j33R3J97j18
3269@O6P0J15k43J4Q4j95J9J09r8J52q6JK4j26L8l1P0J80j10J7j72J02Q2j33r9
3295a50M3Q2L28l79k6P1k07K42j9MP0L1k04J38L7j75J50K2K47k48r8N9j12L17
$$ y = [201, -107, -44, -27, -125, -131, -93, -77, 56, 36, 12, -61, 98, 44, -11, 143, -82, -65, 28, -12, -70, -9, 92, -33, -158, -83, 100, 50, -60, 129, -185, -88, -14, 28, 253, 133, 41, -18, 52, 63, -148, 61, 41, -55, -46, -71, -68, -87, 120, 107, -106, 15, -105, -1, 123, -39, 20, -119, 143, -105, -46, 80, 36, -110, 147, 17, 234, -46, 96, 179, -123, -129, -16, -112, 1, 0, -238, -94, 119, -92, -60, 6, 17, 196, -187, -45, -69, 5, -10, -88, 175, -117, 124, 156, 163, -59, 119, 103, -31, -63, 135, 120, -8, -36, -57, -72, 70, 30, -53, 56, -47, -127, -175, 68, -336, 111, -76, 130, -62, 89, -51, 44, -112, 51, 76, -57, -19, -52, -10, -59, -62, -58, -57, -24, 15, 80, 72, 92, 1, 12, -82, 164, -28, -186, 139, -39, -172, -79, 118, 0, 66, 136, 251, 8, 22, 106, -89, -70, 39, -59, 93, 7, 8, 32, -94, -56, -87, -17, 163, 53, 70, -102, 0, 82, -51, -150, -107, -25, 303, -76, -102, -31, -238, 4, -15, -11, 59, 90, -114, 24, 61, -114, 36, 58, 305, 57, -41, 18, -94, 223]
3319B23k67Q9q1L49m99K53r8Q9M8k56O9J81r2P1lj15P8m9k31K49j5J48n0j11O3
3344D3m8O6j04n0K04j28J5j62M00l14J62k11Q2J26Q3J8k4k34j03J67J53r8k43
3367b00J64P9j3k30K20l0m4n6R0r1R1K28j70j77Q7J05L2m0j83J92K30l54R6JJ02
3392A29j19j4o1J09j5N8j73n3M3L8O0j60K49oR3l04K32j07p0P1k2J40k4r4J49
3417A49l39M0L37o3l73K83J47k97j4L9J37q5J4k4p1L1Q1j14J71j25K71l95L66
3440A66n2j06K4J16m1O7M0j80q2r6J01j4J72j52j40J51QJ38k03J19k5J16j24M4
3464D7j19O3J20j60J25k49K96j55P2P5k4l4m0p3m3M9Q8j13P9L12rm67J45J18M1
3489A44q4o5N0K7j48m7K42k69K03J61j48n6o6K03j40k0j2mM3p4pJ03J54r7J2j5
$$ y = [223, -44, 45, -36, 313, -186, 67, -31, 58, 106, -150, -81, 100, 8, 79, 76, -39, 39, -10, -241, 8, -7, 141, 91, -20, 43, -5, 61, -43, -93, 111, -17, -2, -164, 236, -78, 84, -127, -45, 81, 164, 182, 158, -76, -179, -12, 141, 43, -200, -36, 43, 30, -200, 20, -10, -54, -110, -20, -111, -20, 208, 38, -139, -52, 53, 85, 45, -138, 54, 284, -70, 26, 27, 129, 10, -4, -65, 44, 29, 87, -86, -139, -96, -58, 2, -158, 91, 85, 178, -126, 106, -1, -71, 0, -22, 118, 94, 0, 149, -190, -150, 187, 124, -249, 34, 181, -116, -130, -91, 46, -39, -25, -49, -120, -89, -8, -122, 49, -76, 195, -200, 166, 114, 8, 32, 148, 107, 174, 214, 34, -48, -144, -43, -57, 115, -37, -177, -26, -18, 120, -83, 36, 11, 127, 3, 47, -72, -9, 111, -49, 76, -173, 123, -32, 40, 115, 91, 57, 17, -56, -99, -50, 38, -75, 4, 316, 307, -160, -15, 103, 144, 60, -5, 45, 72, -76, -123, 119, -150, 53, 214, 66, 10, -56, 147, 7, -13, -25, -29, 14, -60, -67, 36, 190, 93, 105, 90]
3515I0rJ67k54K07l15J08Q8j86K7K00kj85j4j28K40m2J62j01J48j25j31O7Q2j64
3539g0M1R4n5q3o2J19R6n4k9J49j10p0Q3n5o0J89r1N2j88RR4j2j6M11j60j33j30
3566d1l9M7K60k48J42j22n7k0M7mJ8L3p1J81k97J90m0N4Q3j62K08j6k85J18L3
3591A2p2J83k11J77k2j09m0J25o6J8M0o1Kl4J24j83K47k69L42k85J55j17N8J42
3615A56k62j27K27K4l1j2J47k52L3J01r9J26J22n6j60P3j8rQ0j50M1J31j87Q0
3639b2n4K22O0k40J37n8n4k7q0N1J71j17J1r0K12k8qr2P2j18j40K95j77J26J42
3664A94k64P1j81J04NQ0J59l78J45J82j93J74l23L21j15J03j6o2Q8l7j74J46J32
3687A61j91L2O6j60K82n9j3j39p1K5R7mp6J18j77K13k63Q9o4L7n2J61l3r9L28
$$ y = [90, 81, 248, -6, 201, -114, -6, 82, -104, -77, 123, 121, -64, -78, -206, 34, -8, 154, 53, 201, 76, -55, 12, 94, -70, -29, 65, 10, -73, -135, -16, 80, 26, -3, 146, 36, -34, 49, -6, -66, 123, 32, 84, -104, -95, -1, -13, -29, 382, 222, 89, -41, -80, -33, 227, -21, 121, -1, -58, -78, -31, -35, -17, 16, -55, 126, -171, 19, -21, 33, 116, -46, 162, 146, -139, -21, 12, -60, 123, -88, 89, 67, -42, -82, 43, -23, -5, 35, -26, -24, -58, 66, -117, 130, -139, 203, -82, 73, -44, 14, 156, -106, -233, -6, 18, -13, -25, 122, -130, -97, 4, -95, 31, 153, 97, -63, 10, -8, -17, 63, -87, -46, 85, -102, -22, -76, 146, 206, -34, 103, 45, -9, -36, -116, -65, 106, -11, 0, -90, 122, 94, 86, -6, 66, -52, -192, 103, -74, 52, 194, -70, 1, -180, -76, -71, 9, 168, -210, -65, 117, -76, 98, -225, 96, -19, 84, 68, 6, 94, 57, -117, 29, 161, -30, 2, 68, -92, 190, 131, 118, -21, -92, -67, 30, 26, -50, 68, -109, 104, -159, -70, -134, -97, -149, 12, -21, -120, 208]
3712B08m63J01K96j24J0o1K87j94J23j73O1m31K94K63k07M9j32N7j35J25k17M83
3734B20k77J3j08J00P8j57R5k5r7K54j09k09K35J63j77k1J07k32P3J8m6K05j54
3757e1Q4j21o4J18N4j71R7O7J34r6r1j5J39Jj46N5m6J80M3k54K27l89L51L1l6
3782A01k49J75O0o9m2j10M8J67j51j3J29N0k52K19J3j60J78j68J76j24K9O6k7
3805D6l9J03k12N7Q6j00K58k54m9J02j02J23n9J48j72rJ96j82j62K53l6j16J27
3828GJ04L6j78O2o9q1J47j16Ok1K4l9J78j37J99o9j99K66j82K45O8k94o9J28N
3853B1M1j67rJ57L2j10L7j65J65j11K0j62L26J01j79Rk01J41m2K67j05M7J45l58
3877a00N7j39L29o9P0q4j35pM7J29r7O6r5m8n2J19p0L7K10N5l18KJ04k6q0R0Q6
$$ y = [208, -255, -154, 142, 18, 28, -33, 254, 60, 183, 10, 71, -360, -66, 197, -10, 39, -93, -36, -171, -46, -263, 220, -57, -44, -152, -52, 26, -131, -36, -61, -158, 96, -13, -222, 13, 176, -1, -22, 85, -147, -74, -56, -102, 103, -51, 33, -88, -152, -34, 20, -151, -54, 13, 147, 51, -40, -55, 84, 85, -61, -6, -52, 128, 171, -83, 144, -245, 106, 137, 101, -148, 27, 87, 18, -24, -134, -86, 81, -70, -83, 46, 96, -156, 63, 76, -84, 94, -74, 102, -22, 7, 73, 46, 7, 110, -102, -45, 41, -59, 199, -55, -104, -2, -104, 19, -40, 108, -64, -73, 123, -59, -221, 32, -4, -120, 7, 111, 147, -31, 31, -38, -119, 28, -88, -82, -103, -79, -118, 60, -77, 122, 53, -146, 120, -62, 183, 251, -43, -112, 16, 21, 62, -105, -114, 43, 75, -35, 2, -163, 2, -109, -89, -251, 75, 176, -3, 6, -195, -54, -96, 171, 66, 113, 258, -100, -43, -182, 147, 78, 148, 64, -71, -78, -31, 98, 1, 67, -28, -76, -128, -9, -79, -42, 168, 223, -95, -93, 11, -15, -95, -5, 81]
3904H1Q1l71K33J63j71%k7k23K12j55R1M0RQ3j60K20k20q8J71J0oK44l42q2K88
3929H1o0q3K2N1q6J29j67J18L0p1J53j57MO7o4J9P1o2N2Q4j32j03K24j52j8k9
3955g9K83j19r2n1m2J18J55j25o1l7p1K13r2m8n9J93j20J73j72Q5j19M9J73k08
3979e3J33j29R9q2r1K8K35k68PJ36j05J09l6Q4j01j6O7J11o5J18l46K19j97J5
4003a28K05j27q9R9m0mQ0j12j74L57Q4k10M0J97k55J42J64k24l5l7K34k92J73
4026D8j42J69j46J1M10m25J55j62%M8OM1q7O6P3q6k4L22m41PJ78j09J98k8o1K07
4052B28j48M6j59m1j38J57J33j48J51N7l60K16j03J88m7k12J55j85K28k36K82
4073F4j66O8k04J14J65M3r3J05j06N0q3p3J11p4K2J15r5j7K45k13L0j40M5k7J19
$$ y = [81, 162, -209, 24, 187, 16, 16, -11, -234, -22, -177, -86, -46, -37, 46, -114, 106, -114, -202, -31, -21, -27, 217, -125, -207, 81, 21, -62, -40, 11, -75, 54, -113, 5, 35, -36, 117, -40, -36, 31, -33, -14, 57, -5, 47, 131, -1, -104, 120, -32, -50, -79, 204, 85, -7, -58, -100, 18, 173, 48, -13, -50, -121, 92, 0, -48, -107, 86, -34, 139, -33, 52, -67, -18, 155, -53, 80, -49, 50, -32, -123, -95, 140, -128, -121, 15, -90, 19, -17, 67, -34, -50, 17, 128, 63, 181, -165, 54, -143, -128, 77, -50, -139, -40, -80, -84, -4, -116, -290, 67, 151, -59, -19, 178, -77, 65, 229, 5, -30, -67, 167, -125, 48, -94, 75, -71, -60, 350, -75, 80, -82, -82, -34, -28, 13, -74, -8, 65, -21, -45, 277, -164, -157, 21, -88, 110, 82, 21, 228, 80, 126, -33, -74, -212, -55, 78, -70, 81, 138, -222, -6, -109, 79, 32, -180, -25, -210, 18, -218, 64, -102, -34, -238, -124, 41, 84, -9, 96, -10, 40, -43, -116, -5, -79, -57, 58, -37, -54, 191, -22, 8, -132, -87, -114, 5]
4098EK1KK5k53J81j61J08N3m2J31m7m1n3J88r3L1j89K88j75ML6j67P0rR1K17k48
4125b7q3Q0P6l10R9mN2j24J86n8L4J1lK8p2L41k24N9r2K9m6M58m54j34J00J31
4151E3p6M0JJ45j05j27J49%j4j1N9k13J42j21J08j59L20q5m6r5p4J41k02J58R0
4176G8j78J28K0k30K62n2n0kj51J54j66J68O9Q9o2j5q2k5K09j17j63K33k2M6k04
4201f3J86j93J88k4r7rj75l8K17j32J12j2J35pj89rJ09q6J08R4j33J69j48K12
4225B15k08q9J00o7J3l1J19j73J62j14Q7KK5J68k28J11p2j55j04L97rj62m3K20
4249A64o4j77Oj68L19K4Lk01J46m7Q4k22K10L2j86R2k60M10k01P9j43P5Q4M7L2
4274A38o7j90o9K33j39L0J5R3j2J9k19K20rj91P3O0l5J4j6P0o8K39r1j49M8Nn0
$$ y = [5, 26, 28, 53, -200, -19, -180, -72, -19, -61, 70, 23, -18, -71, 117, 24, 55, -134, 154, -21, -17, 19, -148, -78, -87, 4, 221, -27, -110, -30, 46, -264, -165, -169, -117, -241, -55, -113, -79, -68, -71, -43, -115, 226, 2, 61, -31, -2, -48, 410, -44, -178, -78, 53, -23, 17, 18, 163, 58, -69, 80, 80, 66, 55, 114, -99, 43, -78, 30, -129, 191, 106, 60, -35, -109, 32, -170, -12, 78, -100, 28, 48, -182, 80, 28, -22, -24, -175, -21, -187, -19, 50, 139, 77, 62, -20, -45, 164, 47, -116, 117, 95, 141, -63, 123, -70, 118, 94, -3, -12, -187, -225, -8, -140, -28, -40, 95, 88, -101, -110, -1, -87, 21, 115, -18, 151, 3, 215, 7, -82, 18, -49, -36, -67, 52, -121, 41, -73, 14, 16, 41, 209, -19, 92, 20, -135, -239, 158, 149, -13, -56, 164, 100, -77, -71, -239, 80, 104, 107, -94, 52, 5, 89, -133, 77, 109, -77, 15, -245, 165, -36, 43, -100, -25, 59, 106, 138, 71, -119, -188, 45, -94, -64, -49, 44, 32, 51, -168, 52, 43, -148, -75, -15, -50, -36, -52, 18, -50, 189, 98, -51, -3, 2, -48]
4301d8J77k59j2O3N4j58L26k58j25J52K6L2p8K74j25q5K9O1J72p9j92J37q2r7
4325i5mJ73O2k89J96j45j3J04K4J5j18K02k10R0J11k65M74l27r3N1K2J47k9k0
4349F3k71K02j36L19r1N6N7K2j91k7n5j2K08l5q9l9J26j31J31k68M4K70k99J56
4373A0o1Jq3J45L8Lm6n2J26k1j25Pm3Q5P2j56N8J40k84J33M7j52J84J46k23K74
4399B23k37r1N2K6J28j19k7nl4J77j64J04Mj35J52P6k65M1j54L49p7j13N1R2r4
4424d0kK57j08j72K3J23r9j25K23O1j94P8J09k99M9k1L6J68j20J70m7j84J18N7
4448F1m3j05q9K59r5J2K13k51J15p1n4L6QQ7j62J74j56J64k29nn0K38M7r2p1R5
4474C6N7p0K7p9nK28k48J66J7j60J64K7k04j59P1K50k95k3J02m6J66J2Q5l24K18
$$ y = [-48, 129, -130, -142, -79, -25, -183, 143, -115, -240, -88, -62, -30, -108, 166, 41, -44, -15, 46, 218, 139, -53, 84, 2, -95, -99, 74, 136, -153, 43, -102, -115, -11, 13, 28, -90, 112, -98, -8, 103, -162, 312, -15, -108, -57, -35, 112, 83, 63, -208, -6, -142, 177, 86, 142, 199, 221, 30, 3, -52, -64, 144, 109, 20, -19, 107, -24, 107, -161, -117, 153, -146, 10, -51, -50, -133, 12, 50, 53, 7, -45, 81, 60, -65, -58, -101, -16, 56, -100, -42, 98, -186, -53, -6, -158, 26, 172, -51, 223, -14, -105, -53, -27, 101, -18, -45, -50, -84, 93, -71, 33, 37, -98, 54, 130, -135, -94, -248, 101, 24, -89, -38, 54, -40, -42, 215, 107, -65, -42, 81, -18, -143, 80, 141, -53, 25, 134, -165, -116, -137, -101, 67, -53, 117, 70, -114, 4, 61, 18, -87, -176, 83, -12, 0, 213, -38, 77, 6, -48, -12, -4, 83, -79, 95, -61, 103, -126, -131, -181, 57, 104, 12, -59, 36, 93, 23, 50, -29, -34, 194, -54, 112, 129, -31, 133, 160, -44, -203, -132, 118, -177, -200, -98, -144, 22, 34, 119, -205, 13]
4499A3M9m1J38j32k6M7PR5L4j13o3j11rJ23L2k5L3o2J01r4J42o6l0J67k08O8j21
4526e2J21o1o6K22R9k57o6j10L01l2l3N7j94O9J13k81K92O5N5k42m4m5j06K25
4550C0o4p0J33jnj15P0O5J83k47R0m3p4n5J70j88jJ76k01J58j3J68j97j3K05j66
4576ej26L18r7k61O1K23o3j17K2m4J45lj45P9k12K19o7R1L1K49k66k10K93j45
4600c0L9j41P3L2O7R9j05J54j49k5j44J98j49J6J10J1j25j9Q3j0Q1O4o5j2j00
4625d7j04J55J51j38k6J72j28k6k9N5p1o6K80k54l0J81Q0j28j27L6J48M7q3j98
4649a50J31RMk57L19q6n5J66k70R1J76k06L09j90J00l4j5m2o2J04o1L5j49Q7p5
4674a21K44l7k46J63j02J38M0kN3n7l4Oj23J79j47J38n4J56p0r2j27J71J3o3j15
$$ y = [13, 62, 21, 159, 27, 1, 48, 55, 150, 184, 71, 8, -103, -112, 11, 43, 18, 51, -11, 90, -4, 138, 72, 42, 209, 1, 69, -52, 69, 8, -58, 164, 263, 6, -60, -170, 131, 99, 66, 123, -71, -2, 111, -170, 122, 187, 242, 0, -44, -89, -195, 30, -34, -104, 29, 28, 23, -92, -22, 43, 226, -21, 69, 26, -48, -103, 67, -121, -122, 54, -147, 11, -2, 166, -31, -44, 161, -5, -131, 187, 90, -171, -110, 113, 50, -67, -45, -89, 56, 53, -92, -13, -225, -6, -73, 18, 49, 298, 32, -178, 115, -30, 9, -132, -59, -27, 40, 139, 34, 188, 39, 14, -130, 68, -81, -65, 45, 56, -69, -88, -5, -15, 66, 130, 65, 53, -47, -151, 4, 155, 17, -9, 163, 35, 9, -20, 35, -36, -102, 178, -76, -106, 75, 155, 27, -100, -64, 84, 131, 48, -150, -19, -10, -6, -263, 56, -30, -85, 81, -189, -98, 78, -128, 181, -9, 91, 57, 42, 0, -62, 42, -19, 16, -133, -46, -121, 123, 86, -160, 3, -99, 39, 79, 77, 130, 73, 39, 45, -78, 101, -46, 92, 38, 194, 124, 32, -95, 76, 89, 26, -89]
4699h9R7o1Q0R7k57J74j08J6M3n9rJ02J2j49J17k1J13n6M4l4l7l8Q5P1p8N4k00
4726i1Q9p0P3R4k42q2K51l1O9j07N4J48j4q8m0o3J04j2K6n2l5o4J79mj30K00k24
4753f2J41J1j12R8l3j24K51m38L03j00J91j35Rj4j60P2J07j04J02J4m4n6J17j20
4777h6L9K10j65J15j10J1n1j19J68O3j3o5N1j60J13J55j71P5J0j65J35q0J6J05
4801H1j22K16l04n3N8l6R6Q8k13J98j33P2k9P5o1l7K64j76mN6P4L3k00Q5k45K56
4827C9J0p7j1R7j56P1l8M4J3K01k75R2Q3j28K26j77rr8J25J9k8R2r0j52MJ19n6
4854f0m3r5lK40R0k94J76%r0J46m2J17j92j05J30J02k19R8p2m7q1J50J47o8K31
4879B16l01o9J74R6j49N2j3M1k9l4p1J02J21l12J87Kqj43N2J60N1r7Jl1P2j24
$$ y = [-89, 8, -53, 27, 124, -133, 41, -67, -51, -8, -67, -76, 26, 38, -111, 6, -15, 98, 42, 86, 52, 15, -23, 62, 133, 55, 109, -91, -2, -72, 1, 95, -147, -229, 22, -9, 60, -47, 7, 155, 141, 53, 13, -50, 54, 42, 68, 16, -19, -83, 96, 92, -38, 162, -62, 79, 90, -22, 76, 43, -81, 170, -268, 35, -65, 126, -9, 0, -14, -174, -102, 5, -99, 3, 17, -27, -83, 34, -86, -47, 163, -2, 113, 3, 14, -37, -156, 12, 75, 62, -3, 48, -112, 1, 156, -15, 60, 70, -95, 40, -40, -24, 81, -41, 175, -129, -182, -124, -160, -64, 24, -189, 9, -124, -52, -81, -6, -67, -104, 160, -16, -20, 36, 110, 143, -57, 28, -217, 39, 49, -28, -39, 58, -98, -27, -65, -21, -8, 193, -82, 10, 93, -35, 191, 14, 5, -93, 32, 51, 23, 115, 25, -127, -123, -4, -60, -103, -198, -201, 39, 129, -165, 11, 11, -79, 67, 25, 142, -50, -155, -25, 77, -142, -44, -116, -163, -244, -94, 53, -15, 216, -85, -154, 20, 116, -33, 19, 6, 47, 18, -16, -87, 15, 136, -176, 11, 13, 5, -138, -86, 74, 125, 28, 29, -2, 70, -54]
4905e4N1O2o6K7O4Jk7p9P9r4L41k62J7p4j5J04k16K26k12O9K07j75j88J90Q2Q3
4931A41j47j73P6N4P8J0p6J03k60J76K0k19L23j46J02J28j31o8o3o1NJ98qj9J
4956D4j71J46j09J52n6J3K6j99M15l64K8J13k46J86o0K09j86J43N5j76M5O3j84
4979a13R5n4M5J65qr8j39L19j28n9j5J31r8M6n2m5J22j11n7R6J3j7K2J5k9K2j28
5006f0k0M3l9J51n5JR0j17Mj1m9M0L32l40nK00k14r2K24oj9j17oJ21lJ30j76R6
5034A03J0k68L24k73J71r2J26l7j16l9J31m1n4K0M1k0o2o9J17p4J61M1r3n6K09
5059A60p0k76K51o4RP2k15J2J36J4O1n7j43J53l8Q8O1j79K17k23n9K78k95K20
5083A13j61K54j61l9Q4j99L10l65K75j06N9oj18L8l9o1Q3K01p5r7J10j52J86N2
$$ y = [-54, -3, 59, -7, 20, 84, 85, 58, -21, 58, -36, 305, 43, 60, -14, -29, 75, -141, 85, -127, -58, 149, -26, -214, -24, 58, 141, -6, -179, -103, -49, 29, 39, -37, 66, -194, -18, 2, -217, 106, -40, 62, 190, 59, -9, -72, -133, -128, 70, 62, 43, 44, -127, 19, -90, 62, 6, 19, 45, -154, 261, -103, -75, 38, -208, -22, -82, 127, -59, 84, 139, -37, 8, 71, -113, -18, -72, -27, 138, 130, 32, -107, 212, 84, 25, 10, 141, 43, 89, 37, -8, 114, 3, -54, 42, 55, 38, 60, 75, 46, 68, -60, -80, -37, -76, 75, 20, 21, 111, -6, -2, -13, -62, -22, 310, -30, -35, 165, -49, -141, 83, 77, 58, -59, -65, 56, 53, 183, 7, 103, 113, -155, 169, -104, 67, -25, 101, 64, -52, -91, 40, -1, -55, -35, 6, -14, -76, -145, -28, -102, 59, 100, 7, -49, 160, 90, -186, 65, 1, 10, 82, -133, -121, 15, 29, 90, 33, -110, 43, 5, 93, 154, -25, 192, -31, -90, 188, -107, 113, -48, 206, 45, 6, 90, -109, 201, -164, 111, 5, 64, 58, -60, -22, -61, -122, -39, 162, 87, -10, 100, -52, 134, 186]
5107A86k3k29K5qNJ14j00K07k23q3m0J53J6p7K42k25M2qK02j12j9r0J90q2k9n4
5133b0kO5j83K10J7L3K9k82m2J41K0P1M0o8N5p6j47J55M7k01o9J05J9O4M0l0J03
5160I4J06j66j81J00J09o7o5rr2J6K86k83J02J07j3J3j41J6J32j60K7P1O3m6N
5185B4K8j05j6Q7k94J71J82J45j97k8j15J29j42%R8M7K7q2lK1J17o8J51k1k79
5210a23J77N3j33R4j32K4j26M6J65m4k94M70j63m4J46k81K56j42l3M0L0j50J57
5233gq2J57L6Pp1M5o4l3P2N1l00K30n7m5O5j49K92l69L74k63J52K12j40j02J3
5258B4J01L6k83o0K94j0j52JJ10m1ln3j0Q7Q1k01K11k39M2j7J60m5pQ3l29J78
5284d2o5R1k6O0J09J27m8k21o4J66k93J98J3l13L45M9P9k6j11jK39l49j2q0Q9
$$ y = [186, 163, -66, -41, -49, -44, 70, -30, 177, -46, -129, -169, -16, 0, -77, 165, -60, -18, -26, 176, 64, 45, -45, 145, 63, 34, -20, -22, 43, -140, 70, 87, 120, 149, -133, -175, -34, -14, 57, 97, 29, 84, 8, -139, 16, 63, -138, -207, -102, -83, -19, 21, -9, 94, 200, 34, -147, -47, 62, -5, -70, -79, -171, -155, 131, -152, -50, 57, 44, 57, -84, -68, 64, -96, -69, 2, 65, 19, 24, 52, -53, -69, 18, -276, -105, 77, 222, 25, -3, -118, 11, -131, -131, -33, 14, 41, -41, -44, -23, 94, 26, 177, 156, -123, 54, 107, -26, 68, -64, -40, -166, -120, 45, 1, -293, 177, 14, -30, 116, -165, 91, -51, -84, -44, -14, -164, -7, -89, 68, 104, 111, 40, 85, 21, -12, 60, 111, -189, 41, -16, -61, 4, -145, 147, -222, 152, -111, 41, 253, 113, 11, 24, 125, 161, -122, -182, 112, 102, -50, -49, 61, 20, 17, -36, -46, 41, 122, -79, 132, -107, -65, -82, 78, 33, 26, 109, -220, -42, -107, -16, -42, 18, 127, 254, 206, -15, -79, 87, -206, -8, 5, -308, 37, 86, 165, 139, 28, 27, 266, -83, -95, -175, -86]
5309h6J25k57L73k48J6R5m0L03o2k17J34j88K3m2j04j23L93K2j26n5J3m5K9Q5
5333A8Q1q7Qo5K14Lj84j23J58j9Q1k8l8j01Nr1K91k53J15q5m7J12q3J37J3j13
5359h1NK33j83r8J84j17J11J18k33K09k79L22j48k4l4k4PM7l1J9O9j55J55P4j53
5384gL8j0j67J49J97j58O9k55K07q8R4n8n5J5K72k66J57j22n3N8m4J04r7J25k04
5409i9K9k9N3j26J34k15K47J05k59J88J6j44O7M8k6K27j26j43L1j21J29p4%Q1
5433gQ9o6L9l5l33K57kJ34l9k9rn9J1L3k8j7P8j07P4j69N2j0K08M8q7n0k20P3
5461a71K00l12K08L2J21k8j84P3M6j5Q6PR5k02M3Q3q4rqL9q0N3j28K48k37N0J65
5488I1k01L4K10l24J36J46p5N5J4m0L3j08l8J43j15M9p7K04l01J85J05k68K33
$$ y = [-86, 39, -218, 155, -93, -77, 18, -22, 281, 219, 2, 136, -52, -29, -71, -175, -298, 95, 117, -9, -64, -51, -96, -67, 18, 99, 12, 20, -45, 169, 172, -12, -135, 23, 4, 85, 57, 19, -82, -77, -168, 123, -130, -15, -100, -147, -35, -118, 19, 32, -81, -76, 157, -26, -124, 60, -57, 54, 172, -61, 148, -131, 191, 43, 19, -15, -39, -32, 15, -16, 3, 72, -83, 72, 146, -7, 31, 21, -146, 3, 200, 42, 111, -144, 63, -25, 69, 11, -44, -29, 243, -23, 134, 12, -41, 17, -27, 77, -20, 105, -99, -70, -99, -46, -172, -38, -253, -6, 99, -160, 28, 44, -100, -33, 15, -11, 216, 90, -53, -22, -143, -14, -88, -88, -7, 82, 16, 55, 20, -313, -56, -58, 76, 37, 8, -1, -60, -49, -16, -44, -61, 17, -90, -16, -185, -133, -143, 65, 113, 26, -24, -244, -171, 29, -283, -75, -43, 78, 50, -134, -61, -15, -30, 56, 63, 158, -44, -1, 82, -2, -11, -19, 20, -60, -7, -135, 113, -124, -74, 91, -110, -76, 134, -190, -54, 92, 17, 72, 86, 46, 79, -29, -67, 76, -39, 10, -67, 137, -164, 21, 126, -142, 91]
5511I1o8p5J54k39J67M1k4p5q1J29j01Q2k9K13m26K81Q6q3L9Mk04J90m2j42R4
5536a8k55K95j39K97j02l2r2J60j23L3K44j20j38Q5o9M7j01J4J34j55q4N4L1k6
5560f0m3K17m5j7O3n5NJn7J46j68M8J88j48k15K77J0j67J54l26J57o5O9J21N2
5585A42j58Q6n8j09K14p9k43J66j55K63l35M17j17j84j8K00P1m0N6k03L21k71
5607c4K18k52m8J69k76K71M9k45K59q3r4N3L2l3Q2r7j56O4J41J70l35J03L55k65
5631D8l0O0j24M9p5O5Q1M0o3Q9j41j01K18j88PJ36j76K1J69K50m29P0Q9j42R2
5656A5r2P3j07L70k51o9K4J71j8j20J04j94o5J5J43k6m3K03j78K36l00l3j8L05
5680A45m7j75J35J07J3k3q7L2Q2j21q4j67K2L54k70J22j59J77j17j1O0r7K35j3
$$ y = [91, 23, -52, 102, -137, 30, 71, 47, -28, -109, 20, -81, 1, -28, 185, -241, 40, 126, 43, 82, 86, -118, 72, 30, -112, -18, -273, 22, -117, 180, 78, 46, -46, 114, -9, 24, 268, 148, 10, 95, 26, 73, -28, -14, 120, -35, -119, -65, -34, -60, -103, 114, 69, 52, 115, 60, 65, 66, 9, 155, -13, 35, 223, 75, -140, 137, 147, -20, 134, -192, -35, -100, -31, 90, 142, -16, 70, 12, -97, 117, 38, -205, -39, -194, 69, -266, 151, 34, -150, -168, 32, 103, 63, 119, -84, 237, -34, 184, -68, -116, 53, -223, 48, 97, -148, 111, 28, -66, -13, 19, -14, 68, -29, -185, -121, 20, 190, -145, -42, 313, 48, 18, 78, -46, 3, -72, -7, 74, 114, 51, 140, -1, -102, 116, -72, -65, 71, -105, -84, 85, 335, -94, -24, 65, -77, 15, -77, -4, -111, 259, 8, -61, -37, 134, 116, -4, 100, -94, -159, -144, -1, -27, -70, 133, -45, 191, -109, -142, -160, 145, 98, -77, 58, 165, 178, 155, 68, 100, 182, 61, -23, -190, -168, 186, -84, 38, -121, 56, -61, -72, -12, -109, 126, 113]
5704A13m7m4J25r7n9R8r9J69p6j07K15k53J44j97K26j88mJ61k42K5L33k42q9J45
5728A0m5Q6M6j48M1q9J4K11Mo5k49J09j29K50m1NQ5j13N3j69K02R3l04R3J43j60
5754f7K05j21k2J89q5j34J03j1j97J60R9l2k08K48p2j39J52q6J81m0q5O3j55K5
5778b9J18j28J31k18J82q0J6l0PK3R7r9JQ1j41J03n2l5J92j15M8j21M6K2k01K23
5804D1r6J60k05K01j62R9R2k66J28j15K13j0r9rQ5J0ql6J15k7j84J32M6q1J4L3
5830G1n9l8Q1q0j15K12j78J40Q5j47j74J42J00q4L1J65k04J31k05N8J08l4oj08
5854a08J42o6N2j44P3J51l7J12M4l60J77J24j04O6o2m6n8J10r1j58J76M4k82M57
5878B12l89K12j3j72J46j06j70L31j02Q1koq6J28ql19L81k01R0R7q8O4l4j39L03
$$ y = [113, 66, 22, 147, 50, -9, 89, -10, 159, 83, -24, 191, -62, 82, -115, 111, -77, -81, 80, -162, -137, 196, -46, -135, 10, -35, 51, 97, -51, -10, -99, -85, 126, 130, 65, -184, -75, -204, 46, 5, 10, 95, -18, 35, -134, 68, 161, -143, -50, 93, -67, 138, 17, -5, 184, 99, -35, 68, 57, -140, 20, 119, 87, -121, 127, 55, -84, 68, -18, 163, 123, 38, 101, -54, -29, 89, -39, 92, -126, 56, -24, -8, -38, -31, -8, 89, -10, -9, 72, -69, 34, -18, -53, 139, 24, 72, -49, -3, 19, -182, 41, -55, 105, -100, 101, -61, 38, 130, -136, -8, -123, 90, 80, -19, -28, 57, 67, 59, 23, 138, 111, -73, 59, 105, 24, 38, 71, 12, -26, 55, -25, -140, 72, -106, 34, 119, -28, -202, -60, 40, -44, -13, 152, -52, 79, -126, -68, 40, 6, 0, -108, 34, -32, 20, -124, -51, 100, 63, 175, 219, -141, 36, 160, 56, 122, 60, 14, -44, 66, -25, -183, -7, 37, -245, 212, -177, 35, 22, -150, -4, -110, -280, 51, -51, 30, 28, 22, -64, 64, 56, -263, 118, -83, 7, 104, 16, 80, 46, -93, 210]
5903B10k27o1j87K37j62L4L40j73j41K0J78K48m12M9J23j65k2L4Kj6J3N7K63k92
5927e0M9J30n2qk1j76K17j15J10p5r6J40j7k9l7m4J60k73K95j41O3k84K83K2r
5952D2K10l70K7J8J30j51M5LQ8j59J19J56k76o7P7J20O4j77J13J47l77L57j41
5975bJ46k7k06R1JQ0m11K88l5J1Or2J23K9P1J1j66J04L1j12Q7J7j27J32r1M1M3
6002D3j2q1j37L95j52p8K6k66M33n8j15Q2K5j55j02K41k20K24k38K70k24J49L8
6025H8n5j32m5K57q1K06o1n4q4j08q2L79j82K3J01j15j28J30M0J9j28o5K4K51
6049A98l72J76J39p4j09j59J67j30K95j85Q3j72l6J81q7J35k48J19J76k0l3O7
6071A11j94Q5k0J6N8R5k71R6j08J17p3K70k24Q6n8M3P9K9j12p4J83j27j32kK36
$$ y = [210, -17, -78, -265, -28, -190, -156, 184, 11, -130, -110, 68, 316, -96, -47, 76, -89, -111, -77, -75, -91, -78, -21, 242, -50, -1, 129, 77, 69, 48, -128, 89, -26, 84, 9, -87, 53, 36, 7, -30, -74, 86, -187, 108, -33, 30, -254, 29, 51, 42, 252, -118, -91, -73, 57, -94, -49, -46, 42, -117, 2, 158, -118, -185, -108, 12, 76, -101, 12, 159, -218, 139, -2, 144, 117, -89, 2, 3, 83, -328, -40, -75, -64, -58, -150, -27, 2, 73, 84, -82, 22, 53, -59, 28, 45, -82, 50, -41, 0, 43, 31, -50, -187, 208, 56, -22, 4, -262, 171, 113, -2, 80, 105, -50, -152, 89, -131, 93, -145, 125, -99, 50, 88, 33, -99, -144, 113, 32, 238, 177, 123, 39, -69, -151, 228, 46, 69, 170, 55, -73, 57, 97, 116, -12, -77, -53, 198, -174, 2, 141, 67, -42, -201, -34, -164, 131, -54, 29, -143, -179, 2, -85, 50, -198, -79, 97, 77, 44, 111, -83, 2, -18, -2, 56, 151, -120, -24, -132, -15, -88, 182, -42, 44, -14, 29, 108, 137, 25, -49, 134, 7, -125, -127, 109]
6096A09l4M9m4l30J56m2J63q0J12k46K23M9k02K86n1j02J15j57R2Q8k32J13j41
6119a06P6j29K1L6J52k60J65p2q1n6N58m08J16K5r2J8J23k31J47k5o4J50k7lo3
6144c0k5o3J95j92L2K10k41q6M34k93O1l9K43j70k8L9j38R8m3r0j1J94j11P5l3
6169a2P4k06K39L1n2q8n1K33k93J25m9K3J18O7R5j66p1j1j99K39j24J0n2K07k19
6194a32R3J87j68R3k65L15j83k5M6J83nj63NMP4n2kj8K7M6m4N1k9j62L45k38L5
6221A8qk21J18p9J66J11j38j2P9K4J34o8o4J77j20k36P2K08o4j98O0J54j07r1
6245h5L13o7mj06lk1j79J08P5K4j61J73m9J57j53j4J02k19R4j85J34R7o6m0O0
6270a5m6Q2Lkj3MQ8J41l84K50o9j36R0j09Q0o3L1M5R5j07J84o5M3k29J12j16M7
$$ y = [109, 75, 124, 80, -250, -94, -136, 27, -53, 59, -187, 36, 85, -117, 169, 118, 16, 131, -26, 66, 154, -78, 35, -106, -30, -159, -138, -102, 50, -210, -45, -117, -198, -254, 304, -104, 12, 37, -55, -37, 86, -145, 2, -23, -87, 63, 36, 33, -30, -55, -118, 77, -115, -83, 127, -114, -200, 234, -59, 2, -37, 206, 36, 8, 47, -91, 7, -36, -126, -137, 57, -54, 21, -12, 62, -144, 95, 126, 74, -14, -65, 168, -125, 0, -49, -26, 92, 159, 254, 88, 17, 6, -193, 46, -78, -68, -120, 87, -132, -39, 148, -20, 73, -192, 123, -60, -85, -39, 144, 139, -24, -19, -15, 59, 7, 5, -13, 14, 60, 16, 67, 38, -124, 221, -17, 18, 10, -211, -93, -172, -6, 105, -33, -45, 34, 58, 192, 124, 60, 237, 117, -119, -47, 161, 97, -101, -41, 113, 6, -85, 228, 161, 157, 51, 48, 27, -152, -44, 31, 55, -106, 67, 18, 175, 22, 8, 110, -109, -15, -200, -66, 31, -35, -75, -15, -61, 21, 24, 22, 9, 13, 101, 242, -142, 108, 39, -97, -7, -116, -36, -99, -68, -23, 72, -35, 149, 84, 127, -102, 10, -106, -59]
6297e9m5O0l2j03L46k39J71J01j15k11J23l1m6M9J08j55r9M71q8k41J42r8J40
6320A49k4k86K09Q2P7l16K6J37k5k0J13k02J26nJ5J44j11j86P2qo8o9K35j50K24
6345A39l08J45J21k21J65M7j20J27k45J92k78J05J18j74L49j07j34R4RR2j19P8
6367G5P8r6j79J62o5J0P1R1k91J99J16k40j3K63j60j81K10q1J65k51K32n4r4k12
6391b45L69j35j53M16l32Kq4K54O3j77K05k67J17o9J80m08M67l26P0n1J35p6j00
6414a45N5K76p9q1J4o2K0L2j71K80N7k83m0O3pl8J9J99q1j39K48k33N1K3njQ7
6441E9M0J0%j86J41N5J59j22n0N8k50J53m8J7M9j13J46j54N4m9J57L1l20J64J42
6466A43R3j70o5n5J93lj57J23k69R9n1l2R2J25q5j4kJ33k9l28L11j63N6p6Q5M8
$$ y = [-59, -104, -44, -76, -179, 167, -72, 99, 200, 85, -126, -3, -34, -80, -31, 77, -78, -177, 294, 206, -35, 107, 9, 149, 125, -161, 48, 130, 207, -109, -83, 54, 29, 9, 122, -80, 46, 41, 56, 200, 89, -97, -25, -33, -101, -170, 65, -85, 139, -169, -24, 97, -124, 41, 88, -32, 95, -150, 42, -236, -131, -13, -187, 162, 55, -79, 15, 24, 116, -3, 75, 153, 57, -122, 40, -25, -15, 56, 147, -144, 55, 171, -69, -82, 181, 21, -160, 50, -31, 134, -117, 115, 61, -33, -245, 124, -11, -164, 252, -80, -78, -162, 92, 155, -22, 183, -84, 33, -36, 144, -264, 203, -123, -53, -104, 31, -45, -145, -90, 186, 107, 26, 40, -22, -2, 30, -141, 139, 196, -87, -127, -64, -71, -109, -90, 109, 28, -111, 137, -96, -45, -22, -27, -28, 59, 99, 109, 109, -77, 64, 119, 278, 156, 106, 164, -86, 67, 19, 36, 85, -28, 118, -36, 18, -31, 126, 157, -163, 1, 143, 236, 66, 1, -54, 139, 136, -21, 102, -167, -68, -119, -151, -59, 66, -19, -33, -35, 98, 69, -259, 52, -111, -55, -131, -46, 2]
6492Bj34K15q8o3J03J48j10n4J0j04M3J44k7k91M08j97J09l12K14j25K20J28l03
6515f4J12q8m8K17k99rL22j14L3r4QM7J69m8j16oP2j58Q6o2J99p1k63L31l88K21
6541a1l3l3J64j83M6j23K09j6J81j24Q0k92J01R2k39J91J4o2J56k46P3J40l3J63
6565B15k85Q4N2j77j07K62M0O7k32M2J10j5N8j04K8J09j29K70k45J8j12K54j01
6588A02r6j22J22j7J22j85J71m0O7m4n3r5n5Q0J17R0r6oK4j2k04M9k2M8Q8J38
6614A71j38N5j42p1J65J16K2k00J5k39J64O0n6R8M8o1q4J10r7K4Jjj00pJ93j4
6640C2j34R6K3J23o0J3QJ66j54L5k17K35r5J5O5q2k17K69l14K71j60l0m8K9J18
6665a3L7k12J85j73L4m0J12J07n4QK3J06j57J44j55l8K44q2Lj30J02l6J4j4l4
$$ y = [2, -132, 83, -5, -68, 35, 183, 73, 19, 29, -75, -32, 112, 85, -206, 202, 5, 114, -198, 16, -109, 111, 239, -64, 48, -40, -88, 129, -170, -179, 143, 29, 62, -32, -24, 23, 192, 144, 28, 22, 94, -64, 22, -40, 159, 88, -175, 156, -232, -11, -44, -77, 87, -96, -50, -173, 36, 20, 201, 77, 157, -135, -34, 58, -181, 10, 24, -38, 118, -128, -55, 85, 52, 215, -70, 14, 66, -111, -218, 44, 84, 151, -81, -39, 71, 56, 114, 10, 38, 147, 18, 288, 43, 61, -51, 203, 102, 6, -116, 6, -11, 111, -74, 97, 57, 124, 80, 27, -68, -123, -43, 74, 164, 68, 62, 86, 74, -130, -81, -103, -55, 33, 171, 33, 88, -54, -125, 40, 156, 178, -22, -7, -246, -82, -22, -78, 20, 68, 7, -77, 33, -64, -40, -39, -40, -140, -147, 46, 32, -102, -6, 17, 140, 80, 93, 101, 267, 113, 148, -69, 166, 71, 86, 151, 69, -148, 121, -193, 78, -82, -112, -160, -131, -13, 24, -188, -3, -176, -142, -182, -70, 37, -17, -9, 14, 120, -37, 107, -48, -86, 158, 76, 79, -51, 51, 15, 29, 15, -19]
6690a9n2j56O7J47j5K87k77N2K7l5M3pM1r7k8J00K05k87J89q3Q9k46k1m7L2O0
6716c1j70K36J35j66l8L5J57k22L3L0m6P0J8R1j57L2j97J58j0K05K5j70O8n3j73
6741a40J61L4k6R8l01K20k61L24j09m6J12j86M8O8p7J57L9j47P0K9R1o9p6k5r2
6766a04n2O6R0n7J81R0k73l3J63m1J6j57L2L8k8LJ12j46J93k75Q2K79j48K7k99
6791b41J79L19l86J10L4M9k52K22n7J07k91K87j60J17j24O9N3k00K59l39K22R9
6813G6j72K07j02n7K52l36J23M5kj54mL22k18q5K00n5oj01m8K89j30k5J6J46j92
6838a1P4N6k48K75l00J66k2l0lP6n9ON4o6OJ76p6j56J33K3k27K75q3N4j46J42
6864H9j12J01pj09J51M2Q9o4j96P0k14M3J29o7K30J0j33p4J1R8j26j1O2j4N0j8
$$ y = [-19, -71, -227, -160, -13, -28, 259, -18, 34, 61, 26, 69, 62, 103, 6, -22, 78, 283, -4, 185, 102, 191, -55, -76, -123, -91, -31, -201, 35, 170, 4, -34, 1, 158, -64, -31, -1, -47, 23, 41, 132, -25, 7, -190, -32, -42, 163, 188, 18, 86, 33, -140, 21, 55, 29, 127, -174, 46, -215, 109, 0, -46, 66, -120, -72, -4, -81, 76, 115, -32, 38, 67, 158, 89, 13, -12, -104, -156, -90, 0, -57, 124, 214, -59, -92, 71, 30, 46, -111, -79, -41, -69, -66, 46, -100, 93, -182, -100, 179, 31, 58, -241, -62, 257, -129, -19, 15, 64, -188, 34, -23, 84, -207, 80, -80, 37, -87, -18, 35, -165, 94, -245, -23, 76, -96, 111, 9, -48, 204, -132, -9, 36, 34, -120, -124, 198, -20, -105, 95, 40, 34, -67, -115, 174, 44, 19, 35, 181, -11, 63, 119, -129, 146, -154, 12, -10, -40, -43, 33, -26, -20, 34, -32, -26, 150, 74, -82, 51, 74, -153, 122, 39, 93, -53, 89, -23, 78, 71, -38, 113, 155, 244, 180, -16, 54, -160, -117, 12, -55, 175, 185, 52, -22, -11, 87, -39, -50, 12, -2, 48, 30]
6890C0L1k6L0l8j37m3j9n1M0J66K0J4j32J52L9p5M4k48K76m6n6q7K8J01K1j79
6916a45K7%J40m2J66p6j05q8N1l3J62r9LM4l0M7m5N8k09K60j65K29j97q5n2J03
6942h1K22j77R6oN8j04p6mQ8j65L16j96R0j61M4l6J47k03R1Q3o2N8j13J48rQj15
6969e9pp8J44J4J61l04q6L09j52J86R3r8p0K5j18L6J56j62O0o7N0o3n1Q1o0J15
6995E5Q3m15K30k8R7k17J79R3k91K79l73L50N0n3j65M2J05n2No2J93n5k51K42
7019D1k59K16j27J38j69P4K26k55L58j37l6j11J50j80J64lj43%m9%J36j66J61
7042B9j39J07J82k74N1M1K1L9J3j17j31J03Oj20K34L4m6J90j27r3J39k03P1m3
7066c3q1K41k4l6l4pL9J14j52ko9Mn0J66j78P0P4K10m25K16jJ4l8m8r5J38Rn8
$$ y = [30, 61, 35, 65, 27, -110, -153, -172, -223, -183, -17, 3, 17, -115, 37, 76, 1, 45, -203, 73, 27, -29, -116, -88, 13, 34, -145, -118, -118, 22, -20, 146, 70, -35, -123, -72, -105, 57, -42, -39, 5, -25, 22, -23, 35, -174, 86, -79, 150, -47, -132, -184, -81, 141, -36, 60, 54, 112, 8, -68, -72, 16, -149, 167, -29, 61, -100, -56, -92, 55, -148, -57, 26, -36, 22, -91, 57, 48, 56, -59, -66, -144, 0, 14, 175, -129, -215, 94, -58, 128, 221, 123, 53, 78, -40, -4, 152, -10, 50, -17, 33, -30, -81, 0, -60, 55, 138, -277, -47, -75, 22, -195, -16, 77, -214, 65, -308, 42, 92, 39, -126, -84, 21, -31, -26, -88, 105, 50, -201, 41, -218, -2, -129, 9, -160, -86, 140, -115, 243, 106, 70, -41, 109, -71, 93, 90, -53, -53, -102, -102, 34, -132, 29, -110, -3, 179, -95, -44, -3, 18, 57, 70, -47, -178, -75, -69, -189, 45, 79, 33, 223, 96, 3, 142, -61, 10, -33, -114, 127, 103, 67, 33, 26, 65, 179, 27, 25, -44, -40, -90, 76, -102, -32, 42, 252, -173, 43, 42, 56, 18, -30, -125, 13, 22, -36]
7094c6O9K0jr2N3l0MP9L2r4J22j40L8m5J62j18r2j1K41O2j63j7j34J58k94K09
7120a8j8m0j47J34K53p7M9k43J56J37o4j47K1j09q4K69M8j43K25j14j6j30Q1p1
7144d8P2o5M7m1O7P2j22k0O5j9J20j07J25k27J73j10K0r3p5J1K6L18k34M5J72
7169A72l14N7J97o9J20j54Q6k77K06n8m4%J31l4n6J58j4%l0j56J00J0kL9J80k64
7195a6R0J13k56K9j2J11O3l8l0m3q8J27L3j44J90l03P1J21nJ96j67q9k4J92K9
7220A50j16J43p6O8k0j31p1M4J42k99J64k26K36q6qL3J5j48K18n6K1K7n4k5J03
7245D8j28p9J43l8k2K01n3M9j58J74l31J27k9k10K52rP9m5J22j95K66j63kOj35
7270a30J87l75O38j64l2j0k74L00m0r0m8N4J18q8P9j28o4J19j3o9J63k66J58L
$$ y = [-36, 33, 53, 52, -40, 13, -17, -13, 66, 98, 4, 126, -14, 24, -21, 141, 23, -69, -80, 161, 223, 60, 43, -91, 67, -227, -18, -36, -76, -223, -89, 164, 87, 136, -107, 49, 186, 122, -25, -4, -113, -197, 72, 120, -23, 202, 88, 72, -58, 23, -48, 24, -41, 6, -35, 32, 104, -18, -38, 27, 8, 128, 21, 146, -81, 92, -18, 2, -91, -166, -155, -129, 189, -45, 0, 172, -142, -85, 112, 43, 163, 9, 95, -182, 24, -34, -78, -78, 53, 19, -37, 121, 107, 107, 77, -79, 21, 31, 29, 68, 248, -16, 74, 187, -69, -40, -52, 59, 122, 84, 54, 11, -77, 50, 83, -61, 129, -174, -103, 18, 13, 209, 42, -47, -71, 121, 150, 34, 177, 101, 169, 149, 18, -53, -9, 133, -166, -2, -228, 8, -78, -86, -53, -38, -186, 32, -24, -3, 24, -30, -55, 48, -80, -159, -16, -54, -76, 125, 72, 121, -37, 137, -194, -67, -96, -306, -54, -63, 16, -29, 93, -102, 164, 1, -1, 5, -130, 57, -318, 320, 156, 124, 114, -160, 140, 100, 10, -38, 16, 134, 46, 125, -3, -67, 52, 39, -30, 133, -133, 25, 28]
7294B8J30r6j93N4O7m4J53o1l00K79M6L0j74R6K9j87q0K87Nk17J75R5o8Qn2k17
7320b07K64o9j01J06j54Q4O6J6J1o5J19j78pK26j09J8j46k3J97M4q8qJ1PQ9p1
7346C2o7J12p7L4M9k90J24L0J04mj98P6O1Q6pj3j65k0J25r2Mo3J43k4j6PO5n4
7374c8k21n0K06R0J59k67R4j95K66p1kM2q7q3J09J59m7r2p5J09P0j04K36l30J65
7399D3L0j69J42m4K1j3mk03K45l8K7j40p3M15j4k11Jpp1M4R8n2n6J76j76Q9q8
7426b8j36J35j05K9O8J93q1J64k60m3R0R0k05k1R6nJ80n2k4k0J71j77j87k5J34
7451a9%P3r6oJ90q0m2N6j55J46R1j37NM3j29jj69K12q9K41j59J82k40k4q0J31
7477e6l8K20j68M8j37m3P6M5J89k40K06R0k19O5J8l7j8L4Q5p9K7j06J3L7J0J6
$$ y = [28, 158, 62, -131, -77, -10, -54, 99, 38, -262, 17, 63, 93, -81, 15, 44, -143, -223, 64, 69, -148, 27, 122, 54, 62, 10, -207, 57, -12, -113, -7, -161, -77, -11, 5, 16, -49, 70, -108, -115, 111, 2, 20, -126, -149, 48, 92, 4, -4, 7, 14, 103, 32, -35, 77, 0, 34, 83, -207, -83, -53, 51, 47, -151, -75, -14, 72, 65, 52, -113, -133, -8, -100, -96, -159, -16, -40, -56, -49, 16, -38, -259, -309, -103, -13, 146, -121, -27, -222, 44, -27, -29, 13, -74, -157, -48, 111, 64, -28, -103, 6, 76, -28, 208, -122, 43, 73, -96, 46, 2, 23, 10, 6, -197, 48, 10, 37, -103, -176, 239, 225, 14, 15, 8, -63, -19, 79, 27, -29, 147, -29, 60, -28, -164, -29, -134, -105, -37, 156, 75, 239, -21, -64, 26, 116, -89, -110, -14, -19, 161, 109, 85, 65, 236, 59, -128, -153, -19, -19, 54, -42, -48, 142, 62, 20, 76, -79, 67, 158, 21, 26, 69, -60, -61, -230, -18, -107, 134, -25, 157, -83, -107, -187, -56, -94, 126, -42, 6, -131, -174, -98, -53, 136, -104, 102, 192, -27, 38, 56, 19, 1, 35, 120, 41, 68, -38, -25, 12, 22, 38]
7503C8J10r8o9j3J44j83MJ1J11k4j6M7O3j56J78k15O6k6RJ54j15j46r2J94J31
7528A07j87L5R7R1k75M31k53j27K22j85J47lj19%p8k3q6K73M0k43K00k7n6k2M5
7553Dq2p9J22J1k4pJ89m0j08N8k11K28q3N2k12J73J52k44j06K56o0mj8J45q0n0
7579a8J63k47J21J06j34l5O8J39p4k5j04J61Mp0m5j7m6R1J08j03j66J25k7L4j3
7604do3K27j58k16K39O0J0n9l11M01j72K3L6q5Q2p9J17o8r4J74pp7J1k04J66o7
7630a18K34j8j79J44n9PJ10r0M0J93m68K74j22J45l5K8r1J17k10n8J89MNj43J2
7655h9K1Nn2L19L6m55Q6K04M4k17J7J73j95J37j92K17k14J50m1QJ08j19o5J90
7679G6j59J07l07J77O8oJ13o8k33K73K02l66k9J15p1J46j18J97l4p0q0N0J11j08
$$ y = [38, 148, 50, -19, -32, 112, -71, -67, -56, 55, 31, 15, 62, 125, -31, 147, -68, -2, -28, -19, 135, 20, -126, -218, -24, 107, -80, -45, 52, 143, -132, 299, 46, -81, 141, -44, 103, 100, -19, -19, -97, -120, -206, 67, 107, -136, 64, 37, -19, -41, 4, -78, -157, -35, -24, -48, -55, 134, 94, -14, 44, -167, 61, -22, 30, -182, -9, 143, -101, -207, 49, -11, -15, -33, 112, 32, -18, 145, -102, 19, 125, -9, -44, 24, 163, 89, 64, -40, 121, 125, 55, 10, -7, -53, 38, 146, 43, -123, 2, -25, 9, -4, -67, 160, 2, -214, 25, 85, 95, 36, -275, 126, -46, -23, 13, -72, 10, -69, 48, -20, -114, 60, 53, -24, -13, -217, -51, -118, 116, 98, -81, 63, 4, 11, 121, 31, 71, 264, -204, 70, -52, 93, 58, 86, -5, 112, -98, -156, 33, 37, 42, -101, -89, -68, -63, -115, 204, 240, -215, -129, 75, 119, -98, -81, 92, -103, 34, -158, 59, -155, -5, -46, -38, 70, -49, -114, 76, -83, 24, -283, -106, -38, -44, 69, 1, -232, 41, 243, -123, -152, -37, -108, 38, -80, 117, 83, 13, -67, -17, 94, -14]
7703a4O0n0m9J03j6j7k2m5NK01j18Lj5m5J20j78J10J19p6p8qJ9n8O9j34K0j7J91
7731H0J57l76P5k9nr3P2J66j05J29j44K6P2J87k54l0JK48j97o2L0L8O3q1L9q4
7757g7K00J06k55p8J57j02J19j21J1J05k18K41Q1k44j1m1K7J63oq7J01o8J29j28
7781DL3r0J01Q1j35j10R0J50L4k99k8Q5K62k28K97j79r3K6j09O5J52O1j60K60
7805B70k73k80M44l98L24l4j00K42Pl54Q3N8l3J81j61M9p1J03k41M1J04n2K17
7828A26P6o1n9l3J12L1k19R7jj11O1p8M7J43j23p2j1K88l43J73Q2p7N8j34J68
7853A40r1q9J49N5l3m0o4j25J47j38Q2Q7j31J67j61j1K57j51N8p1o2o1j42J93
7877c5J4K09k12O3J0J01k12J61r4j34N8K7M3J72r4%K03j77j87k5L8K51k84J79
$$ y = [-14, 46, -4, -53, 50, 34, 17, -5, -50, -45, 156, 38, 41, 26, -19, 101, -77, 33, 152, 76, -2, -10, 9, -49, 20, -114, -94, -111, 80, 237, -139, -64, -93, -98, -191, -119, 47, -58, 71, -73, -47, 25, 212, -42, -72, -71, 177, -20, -82, -52, -14, 49, -32, 7, -77, 123, 229, -26, -104, 53, -49, 70, -51, -40, 65, -153, 88, 169, -75, -86, -127, -100, 63, 57, -30, 71, 3, 132, 4, 37, -53, 48, 129, -6, -116, -26, 124, 158, -141, -169, -84, 178, -50, 247, 68, -25, 1, -108, -43, 109, 170, 10, 270, -3, -283, 161, -237, 87, 53, -47, 195, 202, -152, -69, -11, -44, 137, -24, 25, -46, 57, -184, -143, -39, -91, 126, 202, 141, 82, 49, 161, 192, -27, 70, 69, -42, 19, -59, -12, 131, 8, -64, -75, 213, -130, 43, 125, 48, 106, -28, 140, 49, -40, 109, 164, 131, 91, 27, -98, 49, -89, -7, 80, -51, 116, -45, -56, 201, 50, 108, 37, -25, -86, -228, -35, -21, 188, -24, 39, 49, 150, -62, 99, 5, -129, -71, -44, -1, 171, 77, 77, 280, 103, -84, -109, -71, 180, -104, 75]
7901G5L5j02K6nK9n4q8J19l0Kk12K86k78N6K00q8p0K52p5j60J9J88m7k24J35O3
7927E2n5j35J65l1n4J6q9J80j86J95l4l9j03K23j91j54R3K18r0j24J44nR2M6k23
7952h9N1K62k35J57l60J90J17j9k90J10r9J79l2n5J58QP5k59Q9J7K3J05j60k1
7976g8Q2jn0P9n1k5jj50M18j19q8M8j34j00K05O7m2J36j66k16J49j8J66l23K12
8001@J42r1M8j98J78j02n2J07q9qK72k20o4Q8k23J2K31Mk57k5P2J47k9j37J96
8026Bkj6J13j75J70J63m43J64R4q5J16j00n4jO5j00K73j48k79J85J36l02L67j92
8050d9R3r4j09J41j36J56mn1J19lj3k8q1R5N5k70K13j20k35L93k01J65M5p8mo1
8076f2J9K20j44kK3j67K15j88J45J32j80P0n7QJ02j75J8J24k00P1lK05l01O0m
$$ y = [75, 110, 8, 34, 29, 58, 4, -84, 35, 5, 7, -205, 81, -197, -141, 59, -29, -99, 153, 78, -82, -63, 125, 78, -146, -11, 52, -3, -138, 27, -4, -58, -42, -131, 49, -137, 58, 24, -15, -118, 105, -86, -240, -147, 71, -19, -143, 1, -4, 88, 134, -89, -38, 224, -11, 146, -214, -24, 93, 74, -216, -106, -205, -26, -58, -113, 45, 53, 128, -131, -42, -25, -2, 103, -57, -78, 4, 3, -47, 32, -19, -44, -45, -195, 223, 104, 16, 64, -70, -170, 35, 102, 60, 196, 30, -186, -37, -55, 111, -212, 0, 142, 51, 99, -99, 79, -23, -75, 32, -57, -65, 207, -13, -77, 11, -212, -200, 31, 35, -222, -247, -175, -28, -57, -194, 2, 0, -16, 97, -78, 92, 255, -188, -24, 70, -15, 101, 1, -53, -54, 11, -89, 184, 36, -243, -58, 78, -224, 143, -49, 44, -50, -159, -18, -154, 2, -2, -53, 66, 63, 50, 22, -59, 36, 91, -179, 34, -86, -321, 72, -129, 36, 81, 3, -1, -62, -43, 177, 33, 31, 54, -113, 102, -86, 59, 191, 11, 81, 24, 32, 134, -41, -23, 101, -99, -28, -31, 174, -127, -67, -71]
8101g1r6O8m1J82j21O4J28j85p5O0L8K8Q2J57k00J01R3q6J1k00NM4j8L4J0j03
8127i1L9k1k9J64N0l07J63K4J19q7Rnj80L57j39N6J1q9O1k10J26j82K90j99J53
8152H3J5j88J66j88J85Kj57O7m2P0m3O8M2L3m1k11J66j36J78O0j8j48J32k40n6
8177b01K98p4j51J57JJ23J8n4Lj56N8j55P1O8
$$ y = [-71, -167, -99, -140, 42, -79, -15, 113, -72, -147, -87, -49, -21, 61, 218, 18, 119, 212, 126, 137, -63, -58, -14, -32, 2, 12, -91, -52, -73, -102, 62, 112, -195, -32, -8, 111, 24, 33, 28, -152, 205, 66, 122, 133, 44, 105, -105, 21, -161, 129, -70, 83, 98, -90, 76, -112, 73, 75, -82, -15, -57, 13, -30, 38, 80, 113, 72, -139, 27, -109, 69, 129, 111, -37, 95, -145, -201, 97, 23, -128, 29, 30, 153, 171, 117, 120, -36, 22, -133, -62, 6]
8191F
$$ Imaginary data points
##PAGE= N=2
##DATA TABLE= (X++(I..I)), XYDATA
0@%%%%%%%%%%%%Qj6J6j6J8k6L2m0M8n6O4p2Q8j04J20j37J59j83K07k36K69l06
34a63L46l87M34m86N43o04O72p48Q26r13J011j117J233j359J496j646J813j998
52a047K203k431K688k979L311l695M142m673N314o106P115q445J0285j2998J7385
67A0069k5581M5672j75206k03386N80192n4087l53678J80082K2387j36875J53405
78D2994j3434k770o5467q0299K71838j9675l47120J37054K62379j72798j02615
89h9913J63809p1011n2299J02684m9258k6820k194R193R2774q9992o0056J15650
101D2567n8560l8045J15867q2358k3472J17821j25588J9596J54971j87973j6726
112h1900J83073r1756j7407M2950j07602Q2309Q6277j44701J4319O8636q5703
$$ y = [0, 0, 0, 0, 0, 0, 0, 0, 0, 0, 0, 0, 0, 8, -8, 8, -8, 10, -16, 16, -24, 24, -32, 32, -40, 48, -56, 64, -73, 86, -97, 110, -126, 143, -163, 183, -204, 230, -256, 287, -317, 355, -393, 433, -480, 531, -586, 647, -712, 784, -862, 951, -1047, 1156, -1275, 1413, -1566, 1745, -1950, 2192, -2481, 2833, -3273, 3842, -4603, 5682, -7316, 10069, -15512, 30160, -145046, -348432, 231760, 177673, -176005, 4077, 26464, -110411, 42994, 29560, 26790, -38677, -118976, 152862, 133187, -213933, -76879, 185500, 12702, -89913, 73896, 2885, -49414, 53270, 4012, -22808, -25002, -15809, 76965, -13027, -73083, 42567, -15993, -54038, 61829, -20529, -44001, 73820, -51768, -32172, 122799, -65174, -81900, 101173, 9417, -7990, 34960, -72642, 9667, 95944, -48757, -34438, 34198, -51505]
123e1505R4792M4651k19823O5652J85948j25658l8518N6981p4232R0424O9850
134I8562j68955R561J08843l3168J8680l0747o5894R0845J7928n0048J0158n3876
146d8111L6661R8407r8827n7565Q8201o476k2893J6961l1830J7159K6654l5377
158a7036K5173P792n7074N1950L0167p8973M6985M1905r4900L6741O0457p4017
170b0830K3473J3696o9837Q4072L1384j22353K2943O6983k0279K011l8963j5297
182d2997P3625j2597k8226K1616n7247K1224J18344p1597j17665Q9724Q2834o0310
194A6728m7522J3948K4672Q110o010L181l7996k8518R7365K2925j36542J0045
206e9614J13135l3932m5642J9966n346J2818J2537j0921L238k6079Q304N9878
$$ y = [-51505, 43287, 87938, -131885, -66233, 119715, -5943, -44461, 12520, -61712, 28712, 98562, -70393, -60832, 48011, 14843, 33523, 2776, -63118, 27727, 45655, -4393, 5765, -48111, -11450, 86957, -11870, -69435, 18766, 12290, -10603, 6358, -25472, -8313, 18341, -17036, 8137, 15929, -41145, 10805, 40972, -38001, 8984, 50889, -44011, -7270, 53187, -20830, 2643, 16339, -53498, 30574, 61958, -60395, -37452, 29531, 9252, 11263, -27700, -42997, 30628, 18031, -10195, 11421, -45826, -24602, 93742, 22145, -95520, -5796, 77038, 16728, -30794, -16846, 7826, 15936, 9926, 13107, -24889, -53407, 43958, 66883, -69659, -59614, 53521, 19589, -26053, -6087, -11433, 1385, 13922, 3001, 6239, -19840, -11536, 48342]
218D8342m1748m6989O3081P87m7887L2578R035l2418J1004M396l084J6140k1580
231h343j7272K8376N355o003j437k7831J6593M6082k5365l0437R196P193L4228
244C0335K297o6162N584N9827n041k5789j9970q529M4436J8854m5448k3318J4574
257a8350L3344J9768m9491l3848N1818K6825k6242j0395j2042P169M2118q443
269B2231m3304O247K6054J0177r869k7783O535K6274j2821q191P650j5871O090
282f581J9135j8311n440J4840j0936m18J3570m198j654n313m969K3815N197k7444
296h707k575J3972J0769P199k5686k1064L0882K0779j9435j9612r170J8272L2261
309B7885j8452m0817Q118L3661J2999k0888l1972J1844L9873k3k5351j4600M506
$$ y = [48342, 6594, -40395, 22686, 23473, -24414, 8164, 17199, -15219, -4215, 181, -2903, 13237, -8343, -25615, 2761, 8116, 2113, 676, -27155, -10562, 35520, 10155, -20282, -11086, -3893, 30335, 32632, -33530, -27946, 31881, 26840, 1051, -18919, -27448, 16988, 35842, -9606, -32924, -18350, 14994, 34762, -14729, -48577, 3241, 30066, 3824, -6571, -18613, -11444, 30674, 22231, -21073, -14826, 11228, 21405, 11536, -16247, -9712, 16562, 3741, -4450, 3200, -12671, -6581, 12554, -5757, -11197, 3643, -7293, -7711, 5859, 1661, 7, -5306, -10275, 13540, 18737, -8707, -11282, 2690, 13459, 20658, -5028, -26092, 4790, 25569, 6134, -13478, -22648, -4376, 27885, 9433, -31384, -23266, 10395, 23394, 2506, -29466, -17622, 22251, 22228, -3123, -17723, -13217]
322a3217L2625J2506m0171j8107K9719J8633q463k2006j1502J9810J5890j2238
334C479j3229m701Q599J8357p639k0646P325J3395k349n13j797m074N529K170
348C906K57M197p876p150R788N814k428o398j2025N708J8361m033j7269p017Q693
363g472K0458m42k8214o794K5004J6926j0996k3339k611K5761J6853j7684k3986
376a6536L454K4325J3861j9892k7549J0195K8586J643k1773j8581J0054K8600
388A6387k651k7084n490J5327J3776j212j6500o933J3292J3710j303j6482o333
401a1496J6886Q966j1217q031M732L659l237K120K392j0160l665J0199L530o403
415a725n439J988K267K509P469p008j5552J1754J8920n242j4784p809J4007J8909
$$ y = [-13217, 19408, 31914, -8257, -26364, 3355, 21988, 13525, -8481, -19983, -173, 15717, 3479, -9750, -14451, -5852, 12505, 4866, -15780, -8455, 4940, 2591, 2078, 281, -3793, 1736, 3906, 4163, 8360, 484, -6666, 3122, 8936, 6508, 110, -11915, -6207, 12154, 8121, -9148, -16165, -7472, 12986, 12544, -15670, -22464, 2540, 19466, 8470, -14869, -17480, 8281, 25134, 7450, -16536, -13082, 11243, 25104, 5212, -22337, -12142, 16444, 18087, -3686, -22267, -12213, 16387, 13736, -13348, -18838, -3511, 10265, 9053, -7447, -14380, -1088, 12622, 11319, -5163, -11496, 5390, 14356, 3139, -4892, -160, 3499, 262, 2382, 4774, -5386, -9051, 1148, 4678, -1725, -7164, -5176, -2909, -400, 7069, 61, -15491, -3737, 15183, 9941, -4843, -12652, 1355, 20264]
429B0264j1077j9199r9J2420J4931p483k5425o48K2711J0047j5195j8892K169
442a5476J9169J4778j5826k8748J3560L2725p113k1702k747R702J3664J3j1883
455A16q961K071J9825N284k6371j0018K1376J2888j6103j5280J3713O089j3307
468h678J0495N172k0731N145J8689n440j0607K075P893n65m412O678M72j0815
482d629k26J4298M909k1671p971K4000J181j4637L039p172N11K0035n782j8073
496a2188m75J1713J3949o048j9881O56J9323J0852j5592j6530J1639J2566J843
509A1827p104j8218P171K0772q106r782l258l481J5519P614k0008j0849J6903
522a000J3725j4156r245J1801j052o69P136p540p31L458k140J0478o554j4133
$$ y = [20264, 9187, -10012, -10111, 2309, 17240, 9757, -15668, -16316, 6395, 16442, 1247, -17645, -15476, 3693, 18471, 2645, -26103, -12543, 20182, 13069, -8633, -11380, -1678, 11986, 11999, 116, -8845, -6774, 13051, 18335, -8036, -18054, 3322, 16210, 107, -15173, -1460, 4629, -8678, 1817, 6989, -13742, -8597, 10092, 4652, -5955, -3880, 4013, 3448, -964, 5714, 6186, -4629, -4855, 9443, 14352, -7319, -15290, 8710, 9891, -4746, -1707, -8879, -8368, 11667, 5885, -12188, -12663, -950, 12999, 6951, -12930, -12274, 7049, 17901, 2309, -14221, -2582, 9984, 11827, 4723, -13495, -6324, 14448, 6342, -3440, -6698, -10179, 5340, 12954, -7054, -17903, -1000, 12725, -1431, -10676, 1125, 73, -596, 6540, -1000, -1731, 1727, -413, 10065, 3511, -10622]
536a0622J6844K819j7610R732Q737j6367o179J7746O269j9917l905J3161J767
549B475R22m698r327R187O931J421j591j8774N173K8905p822k3932J198J4675
563D743Q842q086j2685m252J0109J7605j2102k2739J1046J1650J490L7j8547k340
577a5229K5383L103j5525r480O257J8413k193j5826o57Q026M670k993j774l518
591a343q347J4412J0293k5028k057J9736p367o054O265j239l727p79Q594L895
605G254j2765j131J0521K153k813m774J064J079K76J0498p653j9185J4042J5538
619A4104j0930j0047l090Q375J1082o552j1390l150J0855J2700r216j3572K773
632h058J1073J1295j0255j6963R464J2325J148o763j3708N104J7298m312j2282
$$ y = [-10622, 6222, 9041, -8569, 1163, 9900, -6467, -12646, 5100, 11369, -8548, -12453, 708, 2475, 3397, -1301, -10628, -1441, 5490, 6911, 5320, -13454, -8281, 20624, 12802, -11130, -9932, 4743, 13585, 5499, -7186, -11438, -1329, 16276, 4174, -18565, -7519, 4131, 5621, 5658, -12889, -15229, 10154, 13257, -2268, -11748, -5491, 12922, 10729, -5097, -5754, 2272, 6942, 3949, 2175, -1343, -9690, 4722, 15015, -10013, -12070, 7666, 299, -5755, 510, -729, -4456, -5235, 3359, 7254, -5511, -6642, 3879, 6032, 3219, -1555, -491, 588, 864, 11362, 3709, -15476, -1434, 14104, 3174, -6873, -9963, -1588, 9494, 2942, -8448, -11598, -743, 11957, 2741, -10831, -8058, 3015, 14310, 4055, -12908, -3444, 8881, 10029, 3266, -10442, -5338, 11960, 7648, -4634]
645d634l690O215Q698l925p288k255K722R617k809r995L374M252K615L3p046M262
661A46N215o559K026M520l972k452J10L921J078n155p99j086J760O663m711r423
677h718K302Q911N776j1101j0323J1937J0100l625p736n884P856J1488l089j1339
691c445o204J0973J3720j0098j5089L010J0388O875q541j3781M958J2206K051
704G023q579r667O228J1129r09p804m059M954Q877j682p191k603N675O301n424
719B269m939L490L24o65J341k503q42k48n03K199m89q76Rl290L372O874m496o987
737e960K371Q211K768p399n604M198Q031J621q775p464N960J0829j196j3392n412
752a1213J1366Q427n790j0563k067J0632Q426q119j0396K536J1115N448r276r418
$$ y = [-4634, -8324, -2109, 6589, 2664, -4624, -6879, -4157, 5460, 2651, -7344, -3970, 282, 2897, 2930, -4116, 146, 5361, -1198, 828, 5348, 1376, -1076, -966, 2955, 4033, -1122, -1921, -3007, -1247, 5416, 705, -8718, -6416, 2495, 8271, -2830, -13153, -1216, 8884, 5259, -2477, -8361, -505, 10983, 7894, -3445, -9649, 1324, 15044, 4946, -10143, -7133, 3255, 10130, 1589, -12192, -7234, 4972, 7023, -1556, -11223, -4995, 6134, 5225, -2579, -6638, -1684, 7193, 5511, -1680, -4283, 1392, 7693, 2269, -2670, 820, 1144, 479, 1820, -683, -1525, -1773, -2276, -77, -566, -1442, -1433, -4723, -1351, 5523, 1027, -5960, -3589, 4622, 7390, -9, -5613, -1415, 6616, 8237, -538, -8002, -2042, 8787, 7591, -5801, -11213, 153, 8580, 2790, -7773, -9840, 792, 9218, 1099, -9297, -6761, 4354, 9802, 526, -8892]
766h892O546J0216l79p963n857N545Q408k409q403j898N423L768l133n169j51
781d348M581J126l059j194J795J613p81r57K016J769k558j545K813K414o29l952
797h96k357M986M774m735p346J066P744K743p464p208M496Q766M60q565n542N938
813c140J0733j609j1317k833J0277P710n343j0382M54J0097M649p167q816J923
827d764R718K537r026o358N036P509j163p494k771N588N097k771m791O09M330
842A286J824k527j827J730K110r36j470N38J210k95k636m83L444P08m800k890
858e014M101M680k856o218J1O697L535m766n810J462Q122L557p458p327N421R851
874G988n34j0220m363P952P679m452r376j612Q364N346n663q172K5R320M168p634
$$ y = [-8892, -2346, 7870, 7491, -472, -6329, -784, 7624, 5215, -3188, -5086, 337, 4105, 972, -4197, -4348, 233, 1359, -1700, -2894, -1099, 514, -267, -1224, 792, 2561, 3, -1542, 1271, 3685, 3056, -896, -3253, 1733, 6507, 1772, -5574, -4508, 3236, 5979, -1485, -8693, -4197, 4569, 5029, -3536, -9078, -3140, 7593, 5984, -5333, -8166, 2111, 9821, 4478, -5904, -5450, 4647, 9296, 2129, -6687, -4764, 4954, 7491, -1535, -7893, -2857, 4652, 3489, -4005, -6776, -1188, 3909, 1138, -3653, -3044, 1286, 3110, 583, -1244, 486, 2596, 1660, 190, 728, 1938, 1643, -993, -1476, 1968, 2676, -2124, -5014, -913, 3767, 911, -5307, -5296, 1401, 4936, 170, -5640, -4178, 3944, 7501, 43, -7284, -1863, 7988, 7454, -2766, -7129, 823, 8502, 4050, -5326, -6938, 1426, 6772, 1109, -7063, -7038, 2282, 6450, -1184]
890a184o517M323P885M80o866l164N384M809j912m511o71L904J833k646k549L21
906a081K450j44k992M96J563q57j385o34K263K457l418l320L862M771r92o165
922c126o23O251L197l488n336o44P436L721o630o460J480R110K518j1132n664
937i390Q320P137k985q222k287P375N792k176q569j882R799N249o621o574J281
952c753Q898K287q807k868M218K979R65m864l954M089K966j189l684r32L728N55
968F34j619K54q37J878O26k378K727J641l641k13J657K537l07n048n04M682J592
985C681k374n395L41N839J046k921n929k14J0806P14j0089j405M991O150k60q843
1001c862j433P502L708j798p510j501P893L969m873q030J371R609p38p644r99
$$ y = [-1184, -7701, -3378, 4507, 4987, -1879, -5043, 341, 5150, 3238, -1273, -1944, 1960, 3793, 1147, -1402, -1081, 1369, 1225, -1767, -1271, 292, -565, -1950, -2584, -321, 2136, -1282, -4602, -740, 4031, 3039, -3126, -3749, 2502, 5699, 2211, -3125, -3769, 3667, 7388, 758, -5702, -4222, 4888, 7406, -3726, -9390, -1070, 6067, 3082, -5140, -7427, -52, 5740, 3564, -5005, -6887, 2912, 8161, 1540, -5034, -3753, 5145, 7432, -1375, -4243, -25, 2954, 3919, -945, -4899, -810, 2156, 967, -2717, -3649, 79, 634, -985, -731, -1568, 310, 936, -1442, 1285, 2926, -715, -928, 729, 3266, 2959, -2089, -2593, 2089, 3681, 1307, -4088, -3747, 2092, 3138, 217, -5712, -5926, 4880, 5594, -4495, -5900, -909, 5241, 4981, -3862, -5295, 2207, 5915, 4117, -3393, -4894, 2999, 6968, 2095, -5935, -4564, 5045, 4307, -3337, -4336]
1016d336J485N403O35p098l54M109K252K40n108p8N680k00j982j667R24L824k713
1033A016k627L219r29J23o62l218M009J709n154p66J877K643L32m624o73L682
1049d3K943l55o640Q93P199N93l182n326R40R229j313p506MJ156N004J004q236
1066c636j763N463L562j323p588j1P768P59l533l081K07O366K56l875n48j99L850
1083B674J258m928k94K270P68j86l320J207J494k515J404k16j024J942k872L24
1099b014M067k434j006L97k69M800j313m746J471K574K226j276n810J137N302
1114C106Q65l435n602K758O585j839m466k883K537O585j780o449l96L638N734
1129D958k215p581J867N527J777k209n652J672O115j103k852l011N86N584r32
$$ y = [-4336, -2851, 2552, 3187, -3911, -4265, -156, 2096, 2336, -2772, -2850, 2830, 2630, 648, -1019, -95, 3729, 1016, -1611, 1608, 679, 802, 140, -3078, 931, 2640, -2514, -3280, -1403, 1240, 1572, -3052, -3725, -43, 2900, 2545, -4095, -3202, 3997, 4590, 1408, -3918, -2978, 6251, 4938, -2568, -2564, -1408, 3596, 4600, -3636, -5399, 64, 3626, 2303, -5285, -5296, 2472, 3231, -302, -3383, -3176, 3190, 3446, -429, -977, -1176, 2674, 3932, -996, -1290, 980, 1748, 1562, -1758, -551, 943, -1572, -168, -384, -1408, 534, -2338, -2014, 2053, -381, -1387, -990, -1259, 3541, 2228, -2518, -1047, 1527, 3753, 2477, -3333, -2196, 3106, 3971, 536, -5066, -2308, 4277, 2438, -2028, -4911, -2374, 4211, 2431, -4018, -4414, -776, 4958, 2743, -4838, -2971, 2556, 4333, 2124, -3528, -1856, 4259, 3156, 304, -2707, -2121, 3463, 2531]
1144B531m904j08J495K511p96l706J032J969J78o0j544J230J400j224M79l61P51
1161H73J095k451J88K853j453j002j385J55L623j930l239P17J571K286j297m595
1177c991J520L954M57j735l683K049M533k42l420j915K246M159j289m207n52K367
1193B51L353k266m511R12K945J011j461l535J389L113m88j174j530P31K988j058
1209F70j300P90K29R32k30j060Q16K07r20l0K1N26o82j558O42J473J65j696j671
1228b676J811K476j187j906q33K383K894k046k827P18K625K116k394l895J964
1243g77L441M32l215l212K070L832p66l408j853K433L448j448l659j43K842K410
1259B427j417l091N19K878J378j855k374J182J978M33j480j675P03J476m10r22
$$ y = [2531, -2373, -2481, -986, 1525, 729, -2977, -1945, 24, 202, 142, -1402, -172, 1228, 4, 483, 122, 873, 1968, -483, -295, 2558, 1105, 103, -1282, -1127, 2496, 566, -2673, -1956, -385, 1901, 604, -3991, -2471, 1483, 1940, 205, -3478, -1429, 3104, 2862, -558, -2473, -227, 3932, 2643, -1564, -2116, 251, 3604, 1338, -3173, -2261, 684, 1695, 234, -3301, -1912, 1201, 713, -461, -1991, -1260, 1728, 670, -630, 160, 389, 1321, 1091, 31, 847, 1054, 134, 104, 125, 651, -31, -1589, -947, 526, 691, -1005, -2676, -865, 1611, 424, -1482, -2315, 68, 2962, 916, -1911, -1193, 1432, 3548, 1154, -2741, -777, 2664, 3096, -119, -3331, -1261, 2571, 1805, -1603, -3456, -1023, 2425, 977, -2682, -2825, 17, 2427, 1010, -2081, -1562, 1316, 2694, 839, -1535, -353, 1625, 2058, 578, -1097, -394, 1082, 672, -250]
1275b50o23j34R47k89m70L77l36k4O27L76J43o40m14R34J347k77j570p62J759
1294G21J581j166k416k02K541J075j838k609M77K924O57k420k717J545L405J3
1310A571k519k050K536L015n93k830j048K340K616j215k875m16K068J686j391
1325H95k728J46K479O47j869j546M43J532P53j231r64N50J276J37l62n01J83R11
1343G51l9l6K2m70J8J34L45k94j063j93Q95Q05q47j566k11J423J245r88j620k4
1363a713K285J070j314j982P72K772O70k267k035J213K781r5k581j640J610K355
1379A901p24k504j162K165J960j073k477o1J886J715j305j764M80J678R47j086
1395E76j487P08J520K43j036j118O43Q47m59m82m46r3L73pk18K04n80nO93N4K02
$$ y = [-250, -873, -1007, -60, -349, -819, -442, -778, -802, -175, 201, 344, -296, -710, 224, 1571, 1294, -276, -1038, 721, 2302, 1136, -1280, -1482, 1059, 2134, 296, -2313, -1836, 1088, 1745, -675, -3392, -1847, 1558, 1571, -948, -2998, -462, 2553, 1960, -870, -1918, 422, 3038, 1823, -1052, -1468, 600, 2286, 895, -1833, -1687, 792, 1439, -430, -1976, -1533, -1, 752, -479, -1443, -893, 383, 520, 158, -343, -160, 751, 712, 676, 698, 228, 246, 380, 725, 431, -632, -825, 70, 875, 28, -1538, -1749, -326, 919, -69, -1689, -1713, 572, 1642, 328, -1654, -882, 1890, 2560, 293, -1742, -529, 2252, 2157, -424, -2064, -454, 1901, 1177, -1327, -2489, -324, 1636, 563, -1914, -1975, -89, 1626, 321, -1443, -963, 715, 1662, 576, -911, -203, 1317, 1560, 524, -594, 49, 896, 437, -45, -491, -584, -211, -218, -436, -232, -812, -817, -124, -70, 132]
1416A32o61l14J143M18J97j199n63J572J212j269j294k28J650R11j611j883M59
1433a328J810R67k087j676J207J996L92j954j799J958K290l57j901j173J980J973
1449B298j177j630m51J334J712j332j981O42P08Q34p84j947Q20J025k39j82m84
1466h34K39Q59l57O6L6k64N81KQ1L96p26q1N68k74Q82j393j074J449M62j29j337
1487h48r66J693J075r88j130n21J993J558k114j259R28J589J583k462j795J887
1503B23J224K96j825j775J975J670j187j387j178J560J945j766j353K78J152J688
1519A540j764j706J786N69R65r75j725J442J211q43R8j096Q93Q14j139j10j36
1536a76j46R07j517J91J258j265J34L7KJ403r48j167J548J45M87l05j740J683
$$ y = [132, -529, -843, 300, 718, 915, -284, -847, 725, 1937, 668, -626, -854, 796, 1707, 96, -1787, -1328, 482, 1449, -638, -2314, -1107, 889, 1281, -673, -2472, -514, 1776, 1419, -482, -1655, 325, 2298, 1121, -509, -960, 374, 2086, 754, -1227, -585, 123, 957, 173, -1774, -954, 71, -168, -350, -834, -595, 264, -93, -27, 9, -255, 326, 328, 409, 805, 79, -2, 566, 292, 1174, -219, -1293, 156, 618, 489, -848, -1814, -121, 954, -34, -1164, -1685, 308, 1866, -248, -1507, -579, 1010, 2593, 131, -1664, 223, 1447, 1743, -82, -1857, 118, 1788, 601, -786, -1964, -404, 1541, -225, -1578, -1300, -148, 1540, -224, -1930, -144, 425, 1390, 415, -1310, 132, 1343, 500, 598, -498, 395, 1209, 70, -40, -176, -322, 585, -932, -741, 517, -748, -614, -577, -575, 828, -120, -1287, 261, 406, 893, 588, -1152, 531]
1554E31J070q37q95j015J499J707j836j346L64Q06J398j870j560J340Q79N03j258
1571e20j710J930J520p09n70j410J818J614j726m20j94O32J542j681j008J127
1587B35k46K80l56r09J010k41m08L66q7J70O0r30J318K38n46J26p50J407J064
1606A801j783n49O18M79J284k245j295J947P29k08j766j345K436J230j410j134
1622a211p97K509J488k206j466Q19J958J202k469j605K079J256K13j940j753K439
1638E16J059q47j515j075J965J313j776p53J64R81J065j760n84J165M08M50p59
1655A7n81J308j39m53L95o33Q14j14j060M95L11m03j66m96O70N93j217l11L46
1674f24Q33L69j381n13J481Q89l40j256o82K375N31j201j045M2J762M45k071r01
$$ y = [531, 1601, 764, -131, -1146, 353, 2060, 224, -1122, -758, 48, 1446, -424, -1984, -644, 235, 738, -520, -2230, -300, 1220, 511, -59, -1469, 349, 1963, 237, -183, -377, 255, 1797, 116, -892, 235, -11, 269, -87, -996, 14, -227, -635, -269, -356, -186, -126, -1056, 262, 500, -46, 80, -670, 737, 1801, 18, -531, 87, 566, 1850, -395, -1690, 257, 986, 778, -988, -2333, 103, 1333, -77, -1211, -2008, 501, 1989, -217, -1683, -864, 1094, 2296, -173, -1778, 301, 1557, 1770, -170, -1923, 516, 1575, 728, -787, -1862, 103, 1416, -360, -1113, -949, 32, 1097, -663, -1247, -82, 326, 776, 17, -564, 744, 605, 152, 547, -86, 728, 614, -446, 49, 360, -43, -209, -705, -35, 558, -659, -970, -624, 209, 578, -803, -1316, 165, 1054, 714, -542, -1224, 1151, 1682, 481, -564, -522, 1240, 1685, -386, -1287]
1692a287Q03J320M50k107r71J498R45q7j577n27J919P94j107q43J93J440J09j078
1710a13k31N78N72O7j251J34Q94n28j89n86K83P71n87o92O02K95K40q40l33J020
1730A06N42m00q78j49J613M89j393m60N09J362o4j640o58J220J015p13j787j18
1748a404J898M65j119j233L14J741K24j831j69P76J391L6j550m94J398R21p69
1765E95q60l92J373L22j064n20K08Q46l81o30m91P52N38m73o67P58M06j26n25
1784c31j4O71L26p20m23R12M57m31n97m11J205L48q63j212L89J235jj117r20J161
1804c36J195o75r85l84J373R67q04j283L77J423L52q82j272P13J458k83j202p14
1822i62J005R26n68j301j00J216N30p78r34K73J002J78r05j81N18M51K0n80J36
$$ y = [-1287, -484, 836, 1286, -821, -1792, -294, 651, 564, -1013, -1540, 379, 1173, 66, -777, -584, 856, 965, -113, -344, 234, 806, 873, -378, -244, 650, 122, -67, -653, -370, 401, -186, -878, -276, 19, 259, -581, -914, 106, 648, 248, -630, -779, 834, 1323, -70, -530, -21, 1341, 1277, -363, -1021, 199, 1214, 501, -1286, -1404, 494, 959, -160, -1393, -1079, 662, 886, -945, -1114, -338, 1053, 1089, -461, -955, 443, 1364, 595, -265, -657, 716, 1038, -26, -546, -338, 508, 127, -503, -994, -242, 296, -177, -844, -86, 320, 194, -331, -345, 326, 652, -68, -491, 421, 878, 447, -150, -561, 644, 992, 129, -1083, -694, 541, 540, -577, -1497, -336, 859, 184, -801, -1185, 188, 1155, 351, -932, -555, 868, 1220, 338, -934, -221, 1237, 954, -248, -962, 43, 969, 401, -900, -1000, 216, 746, -32, -966, -693, 309, 487, -418, -599, -81, 370, 390, -190, -54]
1841e4P28n7p43m3N70M4m68n36N46O27n13n93j88P09P20q81r04M56J067M20j291
1862c84m69P12J202j34j407k60J155Q85p50j272J45J109O62j132j129N20Q77L00
1880F30j185n32P72J006l00r33l78P92Q25m71o79q2J156K17n13p30K82N67L2n30
1900e4j78M66k6k71k53l2L35j09m05J0O61J85q30J2P17P0p8n97J91P44J89o75
1922G2o00M83R46l00o28p42N99Q73m34j257R0Q91N95n55j091L82J005J87p52o02
1942h38P23R08j20j022J40L48P76l84q40m3O25J81l42q32M46O32l89l08k21M10
1962a50K20l18o7M37j00L8k27L2N54k00j29k30L58M16l75o95L22L06L58l30r66
1983g46J43J134m31l10o86O75Q98l91q95Q4M06J059n26j082M70P04L54n63q28
$$ y = [-54, 674, 617, -126, -169, 401, 445, -23, -559, -13, 614, 101, -492, -680, 29, 749, -132, -1036, -580, 487, 907, -384, -853, -141, 1061, 927, -480, -740, 415, 1300, 550, -722, -577, 532, 1194, 62, -1067, -547, 330, 630, -555, -1087, -315, 691, 391, -542, -920, -128, 697, 226, -453, -535, 621, 838, 325, -405, -123, 444, 476, -54, -232, 234, 208, -63, -316, -348, -13, -122, -527, -517, 144, 329, -501, -489, 228, 298, 220, -377, -186, 558, 747, 72, -528, -45, 901, 601, -27, -769, -170, 703, 269, -988, -898, -7, 588, 33, -1058, -676, 329, 516, -236, -838, -115, 793, 673, -349, -209, 139, 915, 531, -309, -352, 273, 454, 112, -720, -274, 358, -31, -339, -560, -150, 70, -248, -315, 122, 22, 60, -167, -135, 419, 219, 90, -140, 218, 634, 259, -436, -114, 192, 550, 220, -746, -603, 531, 100, -210, -896, -221, 677, 286, -609, -525, -119, 940, 414, -668, -198, 506, 860, 297, -531]
2002e31L40R18k31k99j097N94J005m76q49Q9L38P49m67p60M85J31O26l69p04N20
2022A2L93j22K04o79L76K07n41L02J10k82K59m24K2L87m19k64L59j18M23l15o39
2043g49O09L85k3l54m35N95M32k26k31l93N12P90o50n42N4L59O21p13n86L59K86
2064A00k7l04n03P18K65j30k85k85L59N03o26L5L59N9N69o96l48L99J35j96r2
2085Ik91L45k4k09K2m8L63q4n02J10L38R8l44k10K61P34l65k93K41r2N21m59m24
2108c03L30J67J21l95o89P07L32k22L8q28N49P57p10o7l88M84P77n40m88L82K44
2129B58O3L7n07J03K42O0j26n47L40L85m50J76k52j16L49j96KK60q0o2J69k76
2151a68M38l13o5M16j39j03R3m10N93q7k75k3j80K34J07j86k34J88K00K58o16
$$ y = [-531, -191, 727, 496, 197, -900, -306, 699, 223, -626, -537, -199, 550, 83, -677, -192, -61, 565, 196, -508, 12, 405, 283, 487, -192, 184, 391, -150, 152, 262, -20, 239, -185, -163, 224, -195, -459, -100, -218, 205, -110, -749, -140, 245, 222, -132, -567, 28, 460, 234, 3, -390, 122, 912, 262, -280, -226, 133, 754, 41, -545, -186, 100, 73, -231, -734, -16, 249, 119, -166, -451, -92, 411, -215, -180, 179, 238, 807, 111, -237, 162, 297, 101, 9, -282, 63, 39, -170, -148, -196, 167, 83, -419, -309, 29, 127, -217, -427, -166, 568, 203, -90, 151, 59, 580, 121, -303, 27, 194, 315, -80, -769, -62, 270, 48, 86, -742, -193, 564, -146, -213, -601, -117, 660, 120, -368, 14, 258, 321, 358, -149, -46, 196, 256, 130, -417, -77, 308, -142, 34, -218, -334, 15, -181, -179, 81, 1, -61, 108, -168, 270, -43, -108, 308, 169, 66, 159, -251, 342, 255, -20, -43, -223, 11, 118, -68, -302, -114, 86, 344, -272]
2172b72k33N51J05N8l07k50M90J52pk25l94M95M76o18j46J06J40K73l47m41K18
2193a76K03L93n48k44K07J32n0M5m70O97J83l79J02k34K50qJ22k09N9J45mm49
2215b33K17R7l81J71K00j40J31o3k93L02k9k13j3L6J89M00l09q8J51M6L47m89
2237C6q0J76J3O1m43j42N67n1j78j02j65K41j04M0k01J02L41O1qm18J38L06rp
2261A74l95J70J99K44j60n61L12L24j93j22r1J21j66J2l6O6j59J22O5qK09j20
2283GJO3N1K63l65j03N53l33L4k79l6L31j58j58j32M9M33k27l17P7J03M25k40
2306D2k24j41N36j32M3j01j33J89R8Ll20J46K20M6k58k31K9J31N2o1k93K27O6
2329f6R3K8M9k50R7J59j66m9J14K13j26L0o3k3K84l94o3j2J05J88j59k7o0K99
$$ y = [-272, -505, 46, 151, 209, -98, -348, 142, 294, 287, 62, -332, 163, 639, 21, -125, -19, 121, 394, 47, -394, -176, 27, 420, -128, -372, -165, -33, -83, -38, -508, 189, 372, -7, 95, -139, 111, 103, 225, 16, 75, 220, 216, -233, -16, 81, -300, -129, 71, -69, 62, -1, -294, 8, -21, -234, -247, -211, -22, 378, 69, -19, 132, 178, 525, 36, -44, 132, 145, 206, -237, -379, 188, 137, -41, -143, -308, -67, -171, -131, -332, -230, 111, 172, 164, -254, -116, 190, 181, 174, -221, -51, 148, 392, 232, -329, -17, 307, 114, -8, -99, 22, -144, -132, -168, -102, -261, -139, -74, -82, 127, 7, 8, 71, 122, 385, 20, -83, 470, 137, 171, -108, -144, 187, 29, -129, -261, -212, 221, -6, -323, -246, -143, 282, 42, -182, -323, 213, 81, 124, 23, -110, 79, 177, 180, -140, 6, 226, 272, 14, -217, -188, -57, -5, -66, -359, -132, -66, 27, 55, 104, -146, -49, 110, -56, -105, 9, 222, 96, 126, 63, 40, 324, -70, -133, -145, -40, 148, -11, -38, -98, 201]
2353B01k26j14R8J00k87J08K73j7k9l00K82L36j35l22l2p3M28p0j32k55L30M2
2375B06k46k08j13J90L57j48l36j6M13O8k46M4oJ60Q0l5l25K06K66j51k14m48
2397e02O19J43l74L5Q5k7M1l88K04RL1K58l27R7N4k1N9J06j23L43k51lM8k6M0
2422A30k49n6K18J61m54K07J02k61L89m7l70J47J65m7k45k5J15L68p4l74J76L01
2444B77n3j51j43K2J60j7m9k00Q9K45j86j07k08J75K13j93J6k6J68JM7j33K5M8
2468B0J01o4J88r5n6j54j51K94J10k91M5J06n8K31l70j05L39J54k51l56J13M16
2490A66J01k93r4K9R9L54m64J10M6L5J93l38j68J92J16q5om83N59K6j07j42q3
2513b37K41J34l74m5M36j54K73k92l3O5P1O9n0j95M03j96l49K28J77p2j05j24
$$ y = [201, -25, -139, -41, 59, -228, -120, 153, 136, 107, -193, 89, 425, 290, -32, -64, -137, 291, 221, 89, -166, 164, 206, -40, -248, -361, -171, 186, 38, -298, -314, 99, 167, -79, -35, -41, 119, 199, 164, -161, 45, 311, 160, -54, -502, 117, 260, -114, -79, 6, -21, 20, -368, -164, -155, -124, 134, -193, -96, -42, -63, -4, 102, -21, 322, 71, 68, 116, 90, 130, -119, -175, 43, 204, -250, -43, 59, -202, 187, 140, -230, -83, 82, 35, -210, -235, -120, 248, 174, -200, -24, 277, 224, 73, -70, -48, 112, 95, 46, -154, -65, 180, -6, -113, -321, -146, 67, -126, -110, -136, 32, 33, 80, -53, -28, 20, 121, 57, 245, 150, 94, -60, -211, 83, 193, -98, -53, 53, -5, 226, -144, -249, 90, 244, -7, -363, -250, 166, 267, -26, -120, -91, 8, 362, -102, 8, 54, 89, 282, -56, -224, -32, 84, -1, -7, -490, 69, 95, -12, -154, -237, 4, 138, -236, -281, 155, 1, 274, -18, -51, 14, 85, 154, 104, -91, 312, 116, -233, -5, 172, 100, -5, -129]
2535a29N5J40j6J29l40J98M0r3M4N3O0J28j46k06L87k31n3%l76O38q0j63j68j77
2559c06K78K35l14o7L17o5j4l65L3M87j9q7k94j35N65m7j04q5J07K06k38k01J58
2582D5NK73l41n1O9J67j85P9q6n3L79m83N4J36k19K67M5k37R4J91j86J99l65K05
2606BM03m76q5L48p7m3k28m6K35M6j2l01j5J96J68r3J6j13J23J53j88KnL10l23
2631cq9rK77J3k01j37M6K44j53m0M6j34J84l8jJ06K0j91J08k56K94K7j69J70j50
2656c6K76k7l03j81M23K5kj34j39K21j5k21l1J15J9r2j91L63K1L4m4j86j17L79
2680A57j64K2j0R5Q7rm03J41K04j80N0l76K45K05N6qk39l8L62j89n2m8k9K68l52
2705b05J26Q8L6J30k13j98K83k07J48Q2j63o5L17k45N3N5j88L13k33N9K81k77
$$ y = [-129, -74, 66, 50, 179, -161, 37, 77, -16, 28, 81, 141, 269, 123, -83, 304, 73, 20, 20, -356, 282, 202, 39, -129, -306, -28, 207, -107, -174, 143, 78, 64, -301, -268, 219, 200, 113, -181, -316, 249, 202, 98, 13, 120, 326, 88, -113, 45, 50, 323, -18, -69, 0, 167, -18, 61, -25, -78, 301, -182, -128, 8, -211, 56, 101, -136, -42, 149, -37, 162, -203, 2, 405, -71, -156, 192, 115, 72, -156, -202, 33, 79, 67, -234, -249, -53, 115, 22, 38, -75, 48, 201, 13, 15, 10, 320, -3, -92, -101, 176, 189, -12, -149, -103, 141, -12, -52, -6, -140, 44, 6, 5, 111, 131, -60, 48, -208, 86, 113, -56, 114, -36, 240, 213, -90, -271, 152, 177, 175, 41, -98, 123, 108, -113, -144, -29, -10, -102, -293, 70, 91, 125, 81, -105, -222, 157, -7, 15, 5, 100, 187, 178, -225, -84, 120, -60, -10, -386, -141, 64, 120, 112, -127, -165, 197, 8, -44, -92, -121, 147, -205, -79, 9, 45, 175, -38, -236, 47, -160, -12, 70, -93, -158, 159, -86, -33, 22, -166, 147, -86, -27, 254, -23]
2727b3P2k02J42J72N5k06k18J65L5L41k92k33Q9o3L13m25R6J35J47j12j78K48
2749E8P0r1j52L8j0K48k18Q0p1J34J29l77K06P7J17j82k33J49K41j64O7k72m3
2772a99K73j46Q7l73K83Q7j01P5L0O7j08k0Q7J9n9J39n7P2q9j00O0o0l6J60k10
2797a19J59p9K51j01j97rj35M0K70j77J9k22K99J8j87M4r2L78k40M0Q4J08p7j06
2821c1R6j62K18k80J10N5k45K76P0R6j70r9L80k70j63K78j36M3Ln2K18j74j20
2844e9J29p3O6n5k23N2J7R4p2K6j56N91k83j80k7o8L69q3Kj83L70k06Q9k55N0
2869f8J45P7k01J95m8J6j71j27J81r3K96k51j91L40n5J8j47j89K89q9L81l48o2
2892a02J78n9k7k7QL9J38j16k60J00J42j29nN2k1o0K47j25p3J97k8j23l4J89n5
$$ y = [-23, 49, -153, -11, 161, 216, 10, -208, -43, -8, 333, 41, -192, -103, -166, 147, -278, -182, -47, 100, -12, -190, 58, 128, 37, -115, -77, -87, 161, -57, 23, -48, 86, 215, -162, 44, 121, 238, 56, -177, -28, 213, 49, 116, -156, -199, 74, -72, 15, -358, -75, 12, -89, -14, 16, 83, -25, -45, 42, 61, 2, 141, 84, 156, 67, -33, 27, -33, -69, 91, -119, 40, -39, 212, 111, -86, -95, -230, -190, 80, -97, -78, -300, -1, 17, -170, -126, -218, 160, -80, -40, 44, 152, 75, -31, 65, -97, 121, -159, -49, 6, -239, 37, 107, 203, 33, -66, 314, 44, -119, 159, 23, 66, 69, 17, 235, 61, -59, 70, -3, 63, 8, -215, -163, -146, -52, -124, -98, -254, 337, 54, -126, -153, -221, 148, 65, 67, -116, 254, 48, 137, -118, -68, 77, 154, -47, 148, 100, 116, -55, -182, -1, -94, 202, -49, -240, 100, 45, 63, -84, -273, 16, -73, 308, -40, -102, 76, 17, -10, -37, -29, 10, 148, 32, -228, -128, 14, -115, -120, -68, -89, -149, 98, -27, -100, 97, 69, -54, -88, 101, 46]
2917D6qn9j3K70j51j12l7R8M9L2m5J96l47N5j0q0P6J35K6k51k17L01pJ10q2J0
2943a5kJ85k91O1J03k2J18L6kk14P3m1N2%m2Q8m4P8m22R8M39j52k7M0k50K56m9
2970E4j05K89k70J57P4k44j29Q0Q2K9j19RJ07j64N7O5r6K89j45k14L43k24J33
2993E8o1J02J65j87r5m6L4J82j57O5j05J86p8p7J15O2j46or7J04OM2k29K15J29
3018A81j56q1O6n8Q8q3k0J84k02K48k00J25o3K79l37R1n1r3J01q1l3j40J24J54
3042D3%j03Q0K14k20l1o4J01q8J85j66J40j61k8J17l8j39J29J4q1M3J12j28q1
3066a50K44o4q6m7J48l7J23j05K5N2k39J76Q8J3j17l8K00l25J70J33j05K3k6j10
3090e4J47L1j3kk73K24m3m4K12r8j32M3q8n8N8J61p5j26K21O5L3j93Nk28J59J86
$$ y = [46, 38, -21, -34, 236, 85, -27, -64, 34, 83, 115, 70, 266, -81, -26, -36, -116, -40, 95, 121, -130, -347, -46, -53, 57, -25, -15, -17, 168, -123, -62, 41, 19, 137, 173, 171, -43, 30, -11, 41, 41, -1, 87, 43, 121, -301, -203, 236, 84, 57, 97, -153, 103, 54, -51, 238, -32, 125, 199, -45, -174, -94, -12, 17, -102, -93, 14, -150, -93, -28, -124, 165, 20, -194, 149, -75, 58, -3, 99, 264, 77, -18, -64, -30, 152, -5, 60, -45, 141, 63, -14, 101, 163, 17, 11, -86, 18, 24, 66, -163, 52, 181, 25, -56, 10, -48, 40, -43, -63, 121, -81, 167, -33, 92, 29, 308, -29, 62, 11, -82, 19, -62, -95, -235, -111, 43, 43, -60, 20, 234, 14, -17, -81, 20, -68, 117, -49, 91, -70, -98, 19, -19, -158, -29, -15, -96, -53, 59, -69, -150, 94, 30, -56, -103, 45, 8, 131, 26, 51, 103, -136, 40, 128, 141, 24, -14, 186, -139, 31, 164, 59, 82, 56, -54, 93, 124, 111, 109, -164, 60, 17, -27, 185, 87, -45, -2, -90, -148, -90, 71, -4, -130, 91, 156, 189, -4, 1, -227, -68, 118]
3116A18k80J44j69K71O9k52J6r2J04J2L3l5k3k6L9r4K88PK7j96o4J24mJ52j04
3141F5n1m8K36j48O2k47L14j83j8k2p3K39%j8j24o3L89k27j3P4r7j38N4M2kJ06
3167A09L0j05o5j15K18j87O4R2J35l00K85j26o4J65j41j46K33k4Mj59o0J03M5
3190iM3J18p3L4N0o7m4q4J53J01j82o9j0K1O5m8j26J06n2K2j2M7J21N8k20j61
3216b18L59j54o7K21k88j8K53po4J07j90m7M3K1J2K05k67L3J34q6j85J65Q3j63
3240a18K12j37ko7N7J45J8P9l09K58j41qJ70k49pJ49O8j29J46q2o6o5O5J5j21
3265a19J97k18K12j39K5n9Q9j66K69J06k88P3J7J33j06j44K44L7l00j7J80J4J44
3288A84j46J09j52j18J60j47l8K39l44M03j10j29n3oJ97Q1j71L7N2r8k78L82r2
$$ y = [118, -162, -18, -187, 84, 153, -99, -83, -175, -71, -59, -26, -61, -84, -110, -71, -165, 123, 130, 157, -39, -103, 21, 17, 169, 65, 14, -34, 202, 54, 116, -131, 183, 0, -18, -40, -113, 126, 126, 108, -16, -79, 310, 83, 70, 144, 47, -91, -37, 5, 3, 109, 139, 34, -31, -146, 72, -115, -51, 41, 176, -124, 161, 35, -29, 136, -5, -151, 82, 58, 62, -97, -157, -54, -9, 34, 152, 79, 113, 163, 96, 52, -32, 121, 222, 40, -29, -39, -18, 47, -1, -127, -21, -73, -51, -63, -16, 105, 163, -57, -218, 141, -13, -80, 141, -147, -165, 88, 81, 17, 124, -66, -113, -70, -49, -37, 168, -99, -66, 68, -18, -203, -38, 45, -118, 94, -43, -45, -112, -55, 90, 108, 187, -122, 136, -5, -13, 157, -92, -99, 50, 118, -11, 135, 53, -13, -78, -13, 2, -119, 78, -140, 72, -67, -42, -101, -12, -178, 91, 197, -91, -18, -1, 132, 26, -118, 126, 163, -137, -154, 26, 40, 184, 38, 147, -5, -123, 37, -110, -148, 91, -253, 150, 40, -89, -142, -148, 49, 130, -41, -4, 48, -50, -328, 54, -38]
3311c8J68m8M8j7n5o7L5J00l27K21j0N9q2L14k13j62J23q1o4K3J16l5L3K4q1p3
3337h9N5L8q6j5R6l5K4pJ4J04N0j99K29j81m2k8Q2k3q9L03j43M7j98J86rk14J24
3364fl4L2p3K0K40q5j08J92n7k20K86r2k27j4J91j67j9K59l04J28%q4J19l8J02
3389D1p0Nj42J40L1l9N6O2K7j04O9j90JK7J91R5l0J1j68j19R6N0j90J77J15j04
3415C8j21P1N8p6J91j28j46J95om9K6M9o2qq3J5r0J19p8J93lJ49k32Q7O5k44j74
$$ y = [-38, 130, 82, 130, 113, 58, -9, 26, 126, -201, 20, 10, 69, -13, 301, 88, -74, 49, -32, -96, -73, 43, 8, 41, 65, -16, -89, -34, 4, -82, -97, -1, -36, -12, -19, -5, 99, 149, -50, 179, -2, -44, -72, 10, -13, -102, 201, 58, 105, -93, 93, 84, -130, -6, -40, -8, -81, -61, 179, 94, -14, 178, 121, -99, 187, 95, -132, -146, 45, -122, -141, 118, -186, -58, -58, -142, -23, -61, 41, -29, -24, -166, -26, 5, -34, 22, 84, 111, 7, 76, -114, -113, -86, 105, 200, 170, 181, 13, -106, -10, 40, -150, 27, 142, 38, -83, -12, 46, -30, 161, 33, -113, 82, 76, 27, 53, 102, 40, 32, -51, -36, -126, -7, -85, 108, 105, 254, 22, 109, 174, -70, -244]
$$ [...]
8191g5
##END NTUPLES=NMR FID
##END=
