##TITLE=1H_Pr 4687-tol
 CDcl3, 8 sc, 
 26.10.2020
##JCAMPDX= 6.0         $$ Bruker NMR JCAMP-DX V2.0
##DATA TYPE= NMR FID
##DATA CLASS= NTUPLES
##ORIGIN= UXNMR, Bruker Analytische Messtechnik GmbH
##OWNER= root
$$ XWIN-NMR		Version 3.5
$$ Mon Oct 26 11:16:14 2020 Russian Standard Time (UT+4h)  she@DPX200
##.OBSERVE FREQUENCY= 200.1315066352
##.OBSERVE NUCLEUS= ^1H
##.DELAY= (6, 6)
##.ACQUISITION MODE= SIMULTANEOUS
##.ACQUISITION SCHEME= undefined
##.AVERAGES= 8
##.DIGITISER RES= 18
##SPECTROMETER/DATA SYSTEM= spect
##.PULSE SEQUENCE= zg30
##.SOLVENT NAME= CDCl3
##.SHIFT REFERENCE= (INTERNAL, CDCl3, 0, 15.7039)
##AUDIT TRAIL= $$ (NUMBER, WHEN, WHO, WHERE, WHAT)
$$ ##TITLE= Audit trail, XWIN-NMR		Version 3.5
$$ ##JCAMPDX= 5.01
$$ ##ORIGIN= Bruker BioSpin GmbH
$$ ##OWNER= she
$$ F:/spectra/data/she/nmr/H-F/1/audita.txt
$$ ##AUDIT TRAIL=  $$ (NUMBER, WHEN, WHO, WHERE, WHAT)
(   1,<2020-10-26 11:14:50.70 +0400>,<she>,<DPX200>,
      <created by zg, POWCHK disabled, PULCHK disabled
       configuration hash MD5:
       00 E9 B6 7A A2 85 ED C7 34 08 36 98 17 FE 4E 26
       data hash MD5: 16K
       4B FE 5E 7C B5 85 F1 F2 BE 6E 62 94 36 CF FC 54>)
$$ ##END=
$$ 
$$ hash MD5
$$ EF 51 7F 56 E9 05 59 90 E0 40 8E CE 49 43 B3 32
##$RELAX= 
##$RELAX= 
##$RELAX= 
##$RELAX= 
##$RELAX= 
##$RELAX= 
$$ Bruker specific parameters
$$ --------------------------
##$DU= <F:/spectra>
##$EXPNO= 1
##$NAME= <H-F>
##$PROCNO= 1
##$TYPE= <nmr>
##$USER= <she>
##$AMP= (0..31)
100 100 100 100 100 100 100 100 100 100 100 100 100 100 100 100 100 100 
100 100 100 100 100 100 100 100 100 100 100 100 100 100 
##$AQSEQ= 0
##$AQ_mod= 1
##$AUNM= <au_zg>
##$AUTOPOS= <>
##$BF1= 200.13
##$BF2= 200.13
##$BF3= 200.13
##$BF4= 200.13
##$BF5= 200.13
##$BF6= 200.13
##$BF7= 200.13
##$BF8= 200.13
##$BYTORDA= 1
##$CFDGTYP= 0
##$CFRGTYP= 5
##$CHEMSTR= <none>
##$CNST= (0..31)
1 1 145 1 1 1 1 1 1 1 1 1 1 1 1 1 1 1 1 1 1 1 1 1 1 1 1 1 1 1 1 1 
##$CPDPRG= <>
##$CPDPRG1= <>
##$CPDPRG2= <>
##$CPDPRG3= <>
##$CPDPRG4= <mlev>
##$CPDPRG5= <mlev>
##$CPDPRG6= <mlev>
##$CPDPRG7= <mlev>
##$CPDPRG8= <mlev>
##$CPDPRGB= <>
##$CPDPRGT= <>
##$D= (0..31)
0 1.2 0 0 0 0 0 0 0 0.06 0 0.03 0 0 0 0 0.0002 0 0 0 0 0 0 0 0 0 0 0 0 
0 0 0 
##$DATE= 1603696490
##$DBL= (0..7)
120 120 120 120 120 120 120 120 
##$DBP= (0..7)
150 150 150 150 150 150 150 150 
##$DBP07= 0
##$DBPNAM0= <>
##$DBPNAM1= <>
##$DBPNAM2= <>
##$DBPNAM3= <>
##$DBPNAM4= <>
##$DBPNAM5= <>
##$DBPNAM6= <>
##$DBPNAM7= <>
##$DBPOAL= (0..7)
0.5 0.5 0.5 0.5 0.5 0.5 0.5 0.5 
##$DBPOFFS= (0..7)
0 0 0 0 0 0 0 0 
##$DE= 6
##$DECBNUC= <off>
##$DECIM= 32
##$DECNUC= <off>
##$DECSTAT= 4
##$DIGMOD= 1
##$DIGTYP= 9
##$DL= (0..7)
0 120 120 120 120 120 120 120 
##$DP= (0..7)
150 150 150 150 150 150 150 150 
##$DP07= 0
##$DPNAME0= <>
##$DPNAME1= <>
##$DPNAME2= <>
##$DPNAME3= <>
##$DPNAME4= <>
##$DPNAME5= <>
##$DPNAME6= <>
##$DPNAME7= <>
##$DPOAL= (0..7)
0.5 0.5 0.5 0.5 0.5 0.5 0.5 0.5 
##$DPOFFS= (0..7)
0 0 0 0 0 0 0 0 
##$DQDMODE= 0
##$DR= 18
##$DS= 0
##$DSLIST= <SSSSSSSSSSSSSSS>
$$ [...]
##$SUBNAM2= <"">
##$SUBNAM3= <"">
##$SUBNAM4= <"">
##$SUBNAM5= <"">
##$SUBNAM6= <"">
##$SUBNAM7= <"">
##$SUBNAM8= <"">
##$SUBNAM9= <"">
##$SW= 16.880792210976
##$SWIBOX= (0..15)
0 0 2 0 0 0 0 0 0 0 0 0 0 0 0 0 
##$SW_h= 3378.37837837838
##$TD= 16384
##$TD0= 1
##$TE= 0
##$TE2= 300
##$TE3= 300
##$TEG= 300
##$TL= (0..7)
0 120 120 120 120 120 120 120 
##$TP= (0..7)
150 150 150 150 150 150 150 150 
##$TP07= 0
##$TPNAME0= <>
##$TPNAME1= <>
##$TPNAME2= <>
##$TPNAME3= <>
##$TPNAME4= <>
##$TPNAME5= <>
##$TPNAME6= <>
##$TPNAME7= <>
##$TPOAL= (0..7)
0.5 0.5 0.5 0.5 0.5 0.5 0.5 0.5 
##$TPOFFS= (0..7)
0 0 0 0 0 0 0 0 
##$TUNHIN= 0
##$TUNHOUT= 0
##$TUNXOUT= 0
##$USERA1= <user>
##$USERA2= <user>
##$USERA3= <user>
##$USERA4= <user>
##$USERA5= <user>
##$V9= 5
##$VALIST= <valist>
##$VCLIST= <CCCCCCCCCCCCCCC>
##$VD= 0
##$VDLIST= <DDDDDDDDDDDDDDD>
##$VPLIST= <PPPPPPPPPPPPPPP>
##$VTLIST= <TTTTTTTTTTTTTTT>
##$WBST= 1024
##$WBSW= 4
##$XGAIN= (0..3)
0 0 0 0 
##$XL= 0
##$YL= 0
##$YMAX_a= 38202
##$YMIN_a= -41472
##$ZGOPTNS= <>
##$ZL1= 120
##$ZL2= 120
##$ZL3= 120
##$ZL4= 120
##$ABSF1= 10
##$ABSF2= 0
##$ABSG= 5
##$ABSL= 3
##$ALPHA= 0
##$AQORDER= 0
##$ASSFAC= 0
##$ASSFACI= 0
##$ASSFACX= 0
##$ASSWID= 0
##$AUNMP= <proc_1d>
##$AZFE= 0.1
##$AZFW= 0.1
##$BCFW= 1
##$BC_mod= 2
##$BYTORDP= 1
##$COROFFS= 0
##$CY= 11.3945322036743
##$DATMOD= 1
##$DC= 2
##$DFILT= <>
##$DTYPP= 0
##$F1P= 16.9975609425685
##$F2P= -3.02152046262296
##$FCOR= 0.5
##$FTSIZE= 0
##$FT_mod= 4
##$GAMMA= 1
##$GB= 0.15
##$INTBC= 1
##$INTSCL= 1
##$ISEN= 128
##$LB= 0.24
##$LEV0= 0
##$LPBIN= 0
##$MAXI= 10000
##$MC2= 0
##$MEAN= 0
##$ME_mod= 0
##$MI= 1.114404
##$NCOEF= 0
##$NC_proc= 0
##$NLEV= 6
##$NOISF1= 3.799351
##$NOISF2= 2.8
##$NSP= 1
##$NTH_PI= 0
##$NZP= 0
##$OFFSET= 15.70392
##$PC= 1
##$PHC0= -10691.93
##$PHC1= 13.20088
##$PH_mod= 1
##$PKNL= yes
##$PPARMOD= 0
##$PSCAL= 0
##$PSIGN= 0
##$REVERSE= no
##$SF= 200.130013532006
##$SI= 16384
##$SIGF1= 3
##$SIGF2= 2
##$SINO= 400
##$SIOLD= 16384
##$SREGLST= <1H.CDCl3>
##$SSB= 0
##$STSI= 0
##$STSR= 0
##$SW_p= 3612.71676300578
##$SYMM= 0
##$S_DEV= 0
##$TDeff= 0
##$TDoff= 0
##$TI= <>
##$TILT= no
##$TM1= 0
##$TM2= 0
##$TOPLEV= 0
##$USERP1= <user>
##$USERP2= <user>
##$USERP3= <user>
##$USERP4= <user>
##$USERP5= <user>
##$WDW= 1
##$XDIM= 8192
##$YMAX_p= 0
##$YMIN_p= 0
$$ End of Bruker specific parameters
$$ ---------------------------------
##NTUPLES= NMR FID
##VAR_NAME=  TIME,          FID/REAL,        FID/IMAG
##SYMBOL=    X,             R,               I
##VAR_TYPE=  INDEPENDENT,   DEPENDENT,       DEPENDENT
##VAR_FORM=  AFFN,          ASDF,            ASDF
##VAR_DIM=   8192,          8192,            8192
##UNITS=     SECONDS,       ARBITRARY UNITS, ARBITRARY UNITS
##FACTOR=    0.000296,      1,               1
##FIRST=     0,             0,               0
##LAST=      2.424536,      0,               0
##MIN=       0,             -41472,          0
##MAX=       2.424536,      38202,           0
$$ Real data points
##PAGE= N=1
##DATA TABLE= (X++(R..R)), XYDATA
$$ [...]
1698a53O1M42q24J40j50M20K50k83n15k75P83J2l0m21l98P76K19K44r95M22q3
$$ -153 -92 350 -474 -334 -484 -64 186 -97 -612 -887 -104 -92 -122 -543 -941 -165 54 298 -697 -275 -358
1719c58L36K18m85l2o5O14k14Ro35L96N16O9J3o07L14l4R06p61j28j04L29L99
$$ -358 -22 196 -289 -321 -386 228 14 23 -612 -216 300 369 382 -225 89 55 961 200 72 -32 297 696
1741F96k64j1o91N68Q6K18k08m18K63K89L62q42J41l62N55K38l99r4m46O10m2
$$ 696 432 421 -270 298 384 602 394 -24 239 528 890 48 189 -173 382 620 221 127 -319 291 249
1762B49L08r61J74J79J87L81j050K20k60J015l63m02m69K74M37Q1o8p10M02J38
$$ 249 557 -404 -230 -51 136 517 -533 -313 -573 442 79 -323 -792 -518 -81 0 -68 -778 -376 -238
1782b38K69k60m50J43J03N81m67rm00O04J32R0j41o97O58J72L85n34j59J24J65
$$ -238 31 -229 -679 -536 -433 148 -319 -328 -728 -124 8 98 -43 -740 -82 90 475 -59 -218 -94 71
1803G1M37o14m3j59M35K99j34n64ON62L65j16n25J77j26N08o7m69n9%P29l20J2
$$ 71 508 -106 -149 -308 127 426 292 -272 -266 296 661 545 20 197 71 579 512 43 -16 -16 713 393 405
1826D05m78L0N53j09l13l55L45l5P00o14l18J45L9O06n22q4n89N73K79k59j15
$$ 405 -73 -43 510 401 88 -267 78 43 743 129 -189 -44 -5 601 79 -5 -594 -21 258 -1 -116
1847a16m00K73N8M09p70m1K07N35k09m39K5j66P97m17K2l05q8L17K88J18p20M00
$$ -116 -516 -243 -185 224 -546 -587 -380 155 -54 -493 -468 -634 163 -254 -232 -537 -625 -308 -20 98 -622 -222
1869b22o5K84N0k61j42l0P19l45M1k49J00L04J72k1o22M77k32P50l88l44k54P23
$$ -222 -287 -3 47 -214 -356 -386 333 -12 29 -220 -120 184 356 335 -287 190 -42 708 320 -24 -278 445
1891D45J78k60K6o49O52j37M23m76m08M13R0L69n49j48l00P92l7l66M4m80O38
$$ 445 623 363 389 -260 392 255 678 202 -206 207 297 666 117 -31 -331 461 424 58 102 -378 260
1912B60n5K60r71K39J77J96%m33q7P0R40n09l26j82j79P59k00q4o46N92j97K85
$$ 260 205 465 -506 -267 -90 106 106 -327 -414 -344 596 87 -239 -421 -600 159 -41 -125 -771 -179 -376 -91
1934i1R0o58K38L2N58m51M7m19N17J95j69k5m46O53j62M44o60j23L22J33M50o99
$$ -91 -1 -659 -421 -389 169 -282 -235 -654 -137 58 -111 -136 -582 71 -91 353 -307 -430 -108 25 475 -224
1956b24Q5k44Q12j38J3m29J0N38j62J55m76K33NK90j35l19J02k5N95m75j0k24
$$ -224 -139 -383 429 291 304 -125 -115 423 261 416 -60 173 178 468 333 14 116 91 686 211 201 -23
1978b3kM84k91J35o73N61j63M52n59k6J19j47O95n12p0n47O91K4j66j08m71M80
$$ -23 -25 459 168 303 -370 191 28 480 -79 -105 14 -133 562 50 -20 -567 124 148 -18 -126 -597 -117
2000a17K30Q4n36l6j85M74K34n30j38n5P76m10J13m77J02O76j10l5o05J80LO75
$$ -117 113 197 -339 -375 -560 -86 148 -382 -520 -575 201 -209 -96 -573 -471 205 95 60 -545 -365 -362 313
2022C13n81K48k64K9L90p9K35p27N24J58K23l11o71N34Q1N68m44j00l10O99J55
$$ 313 -268 -20 -284 -255 135 56 291 -436 88 246 469 158 -513 21 102 670 226 126 -184 515 670
2043F70m37mk98N77o3J47m28l94M99P6M95q78j19K29M76l17j29l34J3N69j91q
$$ 670 233 229 -69 508 445 592 164 -230 269 345 840 -38 -157 72 548 231 102 -232 -219 350 159 151
2065A51n39K26J69K6K20p29K21K34L37n75P8l51K60L02l34P1l18N73j61J19k69
$$ 151 -388 -162 7 33 253 -476 -255 -21 316 -259 -181 -532 -272 30 -304 -233 -551 22 -139 -20 -289
2086b89k61J07K98L28p01L02k04N52J82j62m82k21P90r6K08p98M26Q3L12j16n84
$$ -289 -550 -443 -145 183 -518 -216 -420 132 314 152 -330 -551 239 143 351 -447 -21 62 374 258 -326
2107c26J98j45P10%k11k86J66K31j03O1k93N7J58L80j99n82J84J57N47m85k98
$$ -326 -128 -273 437 437 226 -60 106 337 234 295 2 59 217 597 398 -184 0 157 704 219 -79
2128g9p5K77K02k37O6o02P10q2J83l35j27j87M71J91o16J35n72O20K49j49l27
$$ -79 -154 123 325 88 154 -448 262 180 363 28 -99 -286 185 376 -240 -105 -677 -57 192 43 -284
2149b84l04M89p2L57o54JP8L91j9l04N8j84M14l2J8m20oM03J70p5l53J87p6L58
$$ -284 -588 -99 -171 186 -468 -467 -389 2 -17 -321 -263 -447 -33 -65 -47 -467 -473 -70 100 25 -328 -141 -217 141
2173A41n2l67j2J76N44l67p9k44K64K12N1j27l19M37M3K43p26L87q9M11J27m51
$$ 141 89 -278 -290 -114 430 63 -16 -260 4 216 267 140 -179 258 301 544 -182 205 116 527 654 203
2195B03r8k49O24k01J56m76k7M41J2J60o49K24j04M04n8l91k47l6O05k46l8l15
$$ 203 105 -144 480 279 435 -41 -68 373 385 545 -104 120 16 420 362 -29 -276 -312 293 47 9 -306
2217c06J84K02J36l39k70K40o9L77l60J7k42J60L45l57J45n94M58J31K70l52j46
$$ -306 -122 80 216 -123 -393 -153 -222 155 -205 -188 -430 -270 75 -282 -137 -731 -273 -142 128 -224 -370
2238c70K75j63L52m37O9J16P6K36k38j12j30N25k66L82n18J31o0M00P3m05j72
$$ -370 -95 -258 94 -343 -274 -158 -82 154 -84 -196 -326 199 -67 315 -203 -72 -132 268 341 -64 -236
2259b36M4O87j52j51j59j89N48j52J39l26J33Q2J06j15l00n3K75M27n55Rl07L43
$$ -236 -192 495 343 192 33 -156 392 240 379 53 186 268 374 259 -41 -94 181 608 53 62 -245 98
2281I8L21j6k76m12M33j13K74l56j61J14K29J12o55M35n28O04R5j89n42K76K27
$$ 98 419 403 127 -285 148 35 309 -47 -208 -94 135 247 -408 27 -501 103 198 9 -533 -257 -30
2302c0j8q6m99L00l6L53J88o27J90j16N38j82K1m79K67L80k37J68n16K98j1N41
$$ -30 -48 -134 -633 -333 -369 -16 172 -455 -265 -381 157 -25 -4 -483 -216 164 -73 95 -421 -123 -134 407
2324D07l53j19l8KL72m12R4l88R33j34l44J21l40L33K16Q7n03J57Q0K49q7k85
$$ 407 54 -65 -103 -101 271 -141 -47 -435 498 364 20 141 -199 134 350 437 -66 91 171 420 333 48
2346D8l5J06K72j95l5k49J3L63K47j17q20M39j14M52k26k25PK56N1k14L20n80
$$ 48 13 119 391 196 161 -88 -75 288 535 418 -402 37 -77 375 149 -76 -69 187 238 24 344 -236
2368b36O9P8Q8j72l82P31j67J59k91l01J56J8M12j68j44n65M26J61K30o10Q8J00
$$ -236 -167 -89 -1 -173 -555 176 9 168 -123 -424 -268 -250 162 -6 -150 -715 -289 -128 102 -508 -420 -320
2390c20J73L48l87j63J29N01p2l54l4q8M88k55K68n31K46K21j4L05o74K29j6M37
$$ -320 -147 201 -186 -349 -220 281 209 -145 -179 -267 221 -34 234 -297 -51 170 156 461 -213 16 0 437
2412D37l45P7j27J8O35m20j33n12M65Q3K23k50k39J82o0M14m01Q8j80J65L33m01
$$ 437 92 169 42 60 695 275 142 -370 95 178 401 151 -88 94 34 448 47 135 -45 120 453 52
2434E2l49J2N35j00K32m88k4O8L19p9n88O8J40M06j79k06k9pK09j93J75m53P4
$$ 52 -297 -285 250 150 382 -106 -130 -62 257 178 -410 -342 -202 204 25 -181 -210 -217 -8 -201 -26 -479 -405
2457d05R9L11k25j84K27O7M9j62J55l42K00K74o2k99j93M21n0J98k36M3O6J10
$$ -405 -306 5 -220 -404 -177 -110 -61 -223 -68 -410 -210 64 2 -297 -490 -69 -119 79 -157 -114 -48 62
2479F2J81k36J92m66Q10l71L71n92k3L94l19K98k55L6J05J51J61l42k31P3M36
$$ 62 243 7 199 -267 543 172 543 -49 -72 322 3 301 46 82 187 338 499 157 -74 -1 435
2500D35l00J41m89L05P6K6J4m06K00J84P1k17m7j80oO20m42j05l50L97Q7J93n01
$$ 435 135 276 -213 92 168 194 208 -198 2 186 257 40 -7 -187 -193 427 -15 -120 -470 -73 14 207 -294
2523b94N3K33p5L63o35K6j28K87J21o9j43k13L49m6J97m79M03j5o3L51m95LJ58
$$ -294 -241 -8 -83 280 -355 -329 -457 -170 -49 -118 -261 -474 -125 -171 26 -453 -50 -65 -128 223 -272 -269 -111
2546a11K81j79p7j06m9L23j1O9l07K49J00K16o4l18K04m01O05l72N4j72K42Q3
$$ -111 170 -9 -86 -192 -241 82 71 140 -167 82 182 398 334 16 220 -181 424 52 106 -66 176 259
2568B59j55K34m94L92M4L1k77j5K24j01M83n22j18k06M18j4k24O4j64K02j33J92
$$ 259 104 338 -156 236 280 311 34 19 243 142 625 103 -15 -221 197 183 -41 23 -141 61 -72 120
2590A20l08k7K12J96K8o51J81k6L85k00L6l17K58K93k43j18k47K43N1Q1%l76J06
$$ 120 -188 -215 -3 193 221 -430 -249 -275 110 -90 -54 -371 -113 180 -63 -181 -428 -185 -134 -53 -53 -429 -323
2613c23L3L12r7k21pJ92J52rj09j86M57r8J29j09k43L1K57P5k36N6j13L07J2k16
$$ -323 -290 22 -75 -296 -303 -111 41 32 -77 -263 194 96 225 116 -127 -96 161 236 0 56 -57 250 262 46
2637D6Np0L30l6n1k13R8m5L97j67p3j32L9K88k39r6j48J03K22j52ll37K93j00
$$ 46 51 -19 311 275 224 11 109 64 461 294 221 89 128 416 177 81 -67 36 258 106 103 -234 59 -41
2661d1L01j23j43k13K77J49m02J74k24K43p3O1o2k36K04O0K13m71L33n57N61P9
$$ -41 260 137 -6 -219 58 207 -195 -21 -245 -2 -75 -14 -76 -312 -108 -48 165 -306 27 -530 31 110
2683A10l11k42P3J85j54M49n81J70K30K09j52k64R8K3O15m24ll28J94L33l98L23
$$ 110 -201 -443 -370 -185 -339 110 -471 -301 -71 138 -14 -278 -180 -157 458 34 31 -297 -103 230 -168 155
2705A55k70L03k0K8J10l41K71k19J12L3l7j67K15K31l86J63k72M72k23K36m19
$$ 155 -115 188 168 196 306 -35 236 17 129 162 125 -42 173 404 18 181 -91 381 158 394 -25
2726b5J36N6k15M44l08k54J05K49k61Q5l5j87K16O2r5j24p1L22j23J55n36L80
$$ -25 111 167 -48 396 88 -166 -61 188 -73 12 -23 -210 6 68 -27 -151 -222 100 -23 132 -404 -24
2748b4k82N34m78K2P1L2J75j12j27l42M35r6K77k67j87J83J35j0K7m1j73K40J31
$$ -24 -306 228 -250 -228 -157 -125 50 -62 -189 -531 -96 -192 85 -182 -369 -186 -51 -61 -34 -75 -248 -8 123
2771A23r3j02j20L13j08L11n72K5P6K68K72l90Q5k32M67j69lj10nN5n3K87l37
$$ 123 30 -72 -192 121 13 324 -248 -223 -147 121 393 3 88 -144 323 154 151 41 36 91 38 325 -12
2794a2p9K19J4O3j23j98K45K54o6jk77J56J15J4k25l76K04J82P0l24J77j75J53
$$ -12 -91 128 142 205 82 -116 129 383 317 316 39 195 310 324 99 -277 -73 109 179 -145 32 -143 10
2817A0M6k99K06k66M57l12J32j59L4L3q0J06j73q8K5K43J25l78J41k75O11j68
$$ 10 56 -243 -37 -303 154 -158 -26 -185 -151 -118 -198 -92 -265 -353 -328 -85 40 -338 -197 -472 139 -29
2839b9k7r6K3K33r6J71m82J80J26K50k94m1j03L6N15j76L4j45nJ41M9j83m21N78
$$ -29 -56 -152 -129 104 8 179 -303 -123 3 253 -41 -82 -185 -149 366 190 224 79 74 215 264 81 -340 238
2863B38j21K21m01j0J70Q3K05m10%p8L09J80p9j30j80J06J31m1j70kl54N94k50
$$ 238 117 338 -63 -73 97 180 385 -25 -25 -103 206 386 307 177 -3 103 234 193 23 21 -333 261 11
2886A1j64J34Q8J10r2m9l19L41j32K54k64j6K3OL34k91M5k42O7J11j20N6j70L34
$$ 11 -153 -19 69 179 87 38 -281 60 -72 182 -82 -98 -75 -69 265 -26 19 -223 -156 -45 -165 -109 -279 55
2910E5k80N00l09l45K43r5M04n17K43r6L27j42J07m00O8L93j3j21l68K81JL02
$$ 55 -225 275 -34 -379 -136 -231 173 -344 -101 -197 130 -12 95 -305 -237 156 143 22 -346 -65 -64 238
2932B38r6l79K72j77P35m07LQ6m96O17j81J70m42K35k38M39r4j97J00o0M28o33
$$ 238 142 -237 35 -142 593 186 189 275 -221 396 215 385 -57 178 -60 379 285 88 188 128 556 -77
2954g7k0jL61p9o5N0l24K30j40L07l30j06J02K42j47k35J60r5J75j00J44j81k02
$$ -77 -97 -98 263 184 119 169 -155 75 -65 242 -88 -194 -92 150 3 -232 -72 -167 8 -92 52 -129 -331
2977c31K39N7J13m44L26j8l5L0j17K14m40O47l05m8j62M3K35p0l4j40J23J79K32
$$ -331 -92 -35 78 -366 -40 -58 -93 -63 -180 34 -406 241 -64 -112 -274 -231 4 -66 -100 -240 -117 62 294
3000B94m66J2J80L2J01j87O0j47L58j97J68Jj69Q3o0L31k92qj20M06M0l51Qj76
$$ 294 -172 -160 20 52 153 -34 26 -121 237 40 208 209 40 123 63 394 102 94 -26 380 420 69 77 -99
3024i9M00k09R5j76j31J22K74P2m82K27p8K11L3l42j54K13L23k16q5j83Q3Q1R0
$$ -99 301 92 187 11 -120 2 276 348 -134 93 15 226 259 -83 -237 -24 299 83 -2 -185 -102 -21 69
3047F9j09k38Q0O0K67l64R1k10L98M0p8j69j35K63m6p2j3j13J27K21K75m85R8
$$ 69 -40 -278 -198 -138 129 -235 -144 -354 44 84 6 -163 -298 -35 -81 -153 -166 -279 -152 69 344 -141 -43
3070d3k30K56J44k40q4Q8K82k24K19l28J35J1Q7O6j00J19n0L61m88j6J77j65J51
$$ -43 -273 -17 127 -113 -197 -109 173 -51 168 -160 -25 -14 73 139 39 158 108 469 -19 -35 142 -23 128
3093A28R5r5l23L16RJ23r7m4p0N3N1k46LK58l4O8q8p0j19N64m09N8j75o5j91M11
$$ 128 223 128 -195 121 130 253 156 112 42 95 146 -100 -97 161 127 195 107 37 -82 482 73 131 -44 -109 -300 111
3119A11l7m61L37o2J32p0K9l11K43J39l07K23l08J16J51O1l5q4O1o8L35k86j55
$$ 111 74 -387 -50 -112 20 -50 -21 -332 -89 50 -257 -34 -342 -226 -75 -14 -49 -133 -72 -140 195 -91 -246
3142b46l3L66J53j26Pl00J39J05J16k35m9Q9q9J83k06M1j68M99N7j05k05j9J97
$$ -246 -279 87 240 114 121 -179 -40 65 181 -54 -103 -14 -103 80 -126 -85 -253 246 303 198 -7 -26 171
3165A71K4K12m19N4k4K99j20j47J92k51L41j84m2q2k04L10l1j53j15J66L2L08
$$ 171 195 407 -12 42 18 317 197 50 242 -9 332 148 106 24 -180 130 99 -54 -169 -3 29 337
3187C37l47j66J1J12K21m68K78k94L17rJ1L5k41P9k8K53j49j25KQ3K14j27j13
$$ 337 -10 -176 -165 -53 168 -300 -22 -316 1 -8 3 38 -203 -124 -152 101 -48 -173 -171 -88 126 -1 -114
3210a14j26J98j04J65l45K66M1J9J67j89J5n8J38N4p3j35JK33J9l7k0r6O1K85
$$ -114 -240 -42 -146 19 -326 -60 -19 0 167 -22 -7 -65 73 127 54 -81 -80 153 172 135 115 19 80 365
3234C65j05j73J73l06M08k34kk28J10J66j32k8k7K81k23K57j19l97K52M2K07k73
$$ 365 260 87 260 -46 362 128 126 -102 8 174 42 14 -13 268 45 302 183 -214 38 80 287 14
3256A4j94K44j8l8Q9j69O3K19k82M3j16J51j02QJ09m02L82l25L08k34J16k19K46
$$ 14 -180 64 46 8 97 -72 -9 210 -72 -29 -145 6 -96 -88 21 -381 1 -324 -16 -250 -134 -353 -107
3279a07J33l24L59j85Q5l8p9J38m7M7j28K83l20J08q8J46P2j8j19oJ40J1P9j62
$$ -107 26 -298 61 -124 -39 -77 -156 -18 -65 -18 -146 137 -183 -75 -163 -17 55 37 -82 -88 52 63 142 -20
3303b0O3J36Q5j3j62n4n4J24P1j94J04k11J34L31j36l70K47J77j11l5P8j19J03
$$ -20 43 179 264 251 89 35 -19 105 176 -18 86 -125 9 340 204 -166 81 258 147 112 190 71 174
3326A74k26Q7J35k44J40J67M8k65k56L54j50K14k39nj6l7L26l66L02l13J81l0
$$ 174 -52 35 170 -74 66 233 281 16 -240 114 -36 178 -61 -66 -82 -119 207 -159 143 -170 11 -19
3348a9rn9k43L18m4J0j59oP7K45l01m7J57J36Lj63K11k01j99L11M2K6l45L64j1
$$ -19 -28 -87 -330 -12 -56 -46 -205 -211 -134 111 -190 -237 -80 56 59 -104 107 -94 -293 18 60 86 -259 105 94
3373I4j05K8p0M4mK95r8k2j22J08k4J01k72j0J80j64J51j68K9R6J17P9J4j26j38
$$ 94 -11 17 -53 -9 -13 282 184 162 40 148 124 225 -47 -57 123 -41 110 -58 -29 67 184 263 277 151 13
3398A3J37j89M00l63j78L53j34l7J70m08K13J36K5p7n4l9K3J2J68m79M54l80K07
$$ 13 150 -39 361 -2 -180 173 39 2 172 -236 -23 113 138 61 7 -32 -9 3 171 -308 146 -234 -27
3421b7J45l93J65j41N04m44N1O7K6J65k35P5j95K82j16q0N1j73M8r7L48k14M3
$$ -27 118 -275 -110 -251 253 -191 -140 -73 -47 118 -117 -42 -237 45 -71 -151 -100 -273 -225 -322 26 -188 -145
3444a45p8J62K08j14j23J18q5N5Q1l40L42p1K20j75r0kR9K19j06Mk05J3J66j28
$$ -145 -223 -61 147 33 -90 28 -57 -2 79 -261 81 10 230 55 -35 -37 62 281 175 179 -26 -13 153 25
3468B5J07k35L88l05L60j65j56J97l16L37k54Q9n6K21j62K67l56j6l3n8K87p7
$$ 25 132 -103 285 -20 340 175 19 216 -100 237 -17 72 16 237 75 342 -14 -30 -63 -121 166 89
3490H9j44n7K8R5p4n6Q7J81k14J19j77J5R8m7J60k90Q3j69K92O5l43K23M2L0k17
$$ 89 -55 -112 -84 11 -63 -119 -32 149 -65 54 -123 -108 -10 -57 103 -187 -104 -273 19 84 -259 -36 6 36 -181
3515a81J79q7J9P5L2K0l74L17j00J55j10J55l7k85J43J78j37q5L42o3L0k14o8
$$ -181 -2 -89 -70 5 37 57 -317 0 -100 55 -55 100 63 -222 -79 99 -38 -123 219 156 186 -28 -96
3538i6l0J56L26l73J42j25J28J14k54N3Q4J66j02Q4k64o8J40P8j56j6o9K3J49
$$ -96 -126 30 356 -17 125 0 128 242 -12 41 125 291 189 273 9 -59 81 159 3 -13 -82 -59 90
3561I0J3p3k7p5J32o2J29n73L13K87j18J4j82M7j05K02k40K96q9j21jJ7k0q5L42
$$ 90 103 30 3 -72 60 -2 127 -446 -133 154 36 50 -132 -85 -190 12 -228 68 -21 -142 -143 -126 -146 -231 111
3586A11l42L41j82k02K08l3J19j09KLn6K04p1k77K29O5kJ60k67J75l6Q8Kj5L4
$$ 111 -231 110 -72 -274 -66 -99 20 -89 -87 -84 -140 64 -7 -284 -55 10 8 168 -99 76 40 128 130 115 149
3611A49o4P1k45K78j60J14M0k77M31l76L8K67q8k14J43M1j45J76l07K13k68L09
$$ 149 85 156 -89 189 29 143 183 -94 337 -39 -1 266 178 -36 107 148 3 179 -128 85 -183 126
3633A26J78k11j5k70K66q2J79l41M3j30R0J69j12J6j56L17k39L7j87L43J50k35
$$ 126 304 93 78 -192 74 -8 171 -170 -127 -257 -167 2 -110 -94 -250 67 -172 -135 -322 21 171 -64
3655f4q7M9K1j01K37J6k43K18k7Pj05J17j74J84j77J61K22k91j67Q9K73r6P1n3
$$ -64 -151 -102 -81 -182 55 71 -172 46 19 26 -79 38 -136 48 -129 32 254 -37 -204 -115 158 62 133 80
3679H0J93q1j52Q5l1J57j52J30k17O4J67j84J90l42K33l5J41p2j34N5o2R7j8Q
$$ 80 273 192 40 125 94 251 99 229 12 76 243 59 249 -93 140 105 246 174 40 95 33 130 112 120
3703A20R3j40n4j86M03k69j16K05J68m16R0K6n0L03l26J48l18J53L4K73j70k03
$$ 120 213 73 19 -167 236 -33 -149 56 224 -192 -102 -76 -126 177 -149 -1 -319 -166 -132 141 -29 -232
3725b32KoK95k34K23j43q3mK2L03l53J61O6j42N1j13J60L8J0l14J62M7J25l7P2
$$ -232 -230 -236 59 -175 48 -95 -178 -182 -160 143 -210 -49 17 -125 -74 -187 -27 11 21 -293 -131 -84 41 4 76
3750G6K8j25J51Po3m0j31J69P2n6p3K85l08J15J41k68N3M8M2k18L24l86K10mJ20
$$ 76 104 -21 130 137 74 34 -97 72 144 88 15 300 -8 107 248 -20 33 81 123 -95 229 -157 53 49 169
3775A69j88O7j83J40L22k97K0j73J92M3k56L9j99K07J4O9j12R1L6L5j35p2QJ45
$$ 169 -19 48 -135 5 327 30 50 -123 69 112 -144 -105 -304 -97 -83 -14 -126 -35 1 36 -99 -171 -163 -18
3799a8l9R1J23l42K8O5J06k0k24J72N8n2o4PJ36j04J29k72J42j6J88M7j66k7q5
$$ -18 -57 34 157 -185 -157 -92 14 -6 -230 -58 0 -52 -116 -109 27 -77 52 -220 -78 -94 94 141 -25 -52 -137
3824a37K71j20P5j06m6j5Q8J72j23K00k35J05p9J10k22pJ00L5R0j27N5j03K42
$$ -137 134 14 89 -17 -63 -78 10 182 59 259 24 129 50 160 -62 -69 31 66 156 29 84 -19 223
3847B23j95q8J37j52K47j30K01k81j02QJ40P9m9o8j00K46k30K7J06NJ55n62N26
$$ 223 28 -60 77 -75 172 42 243 -38 -140 -132 8 87 38 -30 -130 116 -114 -87 19 24 179 -383 143
3870A43j97p2Q4J43j26j37PN2M4j84O3r0K24M4K1j94j26L85k01N6KJ73j36%j8
$$ 143 -54 -126 -42 101 -25 -162 -155 -103 -59 -243 -180 -270 -46 -2 19 -175 -301 84 -117 -61 -59 114 -22 -22 -40
3895d0l9M9Q8J30k46K55k71j24J76R8l5q7J89l2J04m0l34R3J51K31j74nk44K75
$$ -40 -79 -30 58 188 -58 197 -74 -198 -22 76 41 -46 143 111 215 175 -159 -66 85 316 142 137 -107 168
3919A68l7j6j22j15L71j08J21n76L01rJ98J11k13J61k76J72J3j25q0m1N1J63j2
$$ 168 131 115 -7 -122 249 141 262 -314 -13 -22 176 287 74 235 -41 131 144 19 -61 -102 -51 112 100
3942A00j47j3j67L85l00qJ73p4J55j59kj52J76O7j7jk19J94k09Q8K07rQk37J93
$$ 100 -47 -60 -227 158 -142 -150 23 -51 104 -55 -57 -209 -33 34 17 16 -203 -9 -218 -130 77 68 76 -161 32
3967C2j58K56j96J76p7K23k78j44K32p3K36l23K55j64J36J00k83n8K53R2j54j10
$$ 32 -126 130 -66 110 33 256 -22 -166 66 -7 229 -94 161 -3 133 233 -50 -108 145 237 83 -27
3989b7J44R9n3K0J32l33K4P0N0j9k44R9Q0J79j63j11j95K46J51k57P9j40J03K01
$$ -27 117 216 163 183 315 -18 6 76 126 107 -137 -38 42 221 58 -53 -248 -2 149 -108 -29 -169 -66 135
4013A35J32k84K9o2J75j8j94J66o8j7Q3j69Lk6m8l4K99j72N2J86j67o0%m0q6J50
$$ 135 267 -17 12 -50 125 107 -87 79 11 -6 77 -92 -89 -115 -163 -197 102 -70 -18 168 1 -59 -59 -99 -185 -35
4039c5L7k0j31J25R6j05R9j38k07K59N3rk2k2r0L74k81J51K9Rj26j02J71k06K01
$$ -35 2 -18 -149 -24 72 -33 66 -72 -279 -20 33 24 2 -20 -110 264 -17 134 163 172 46 -56 115 -91 110
4064A10J60k7m15M14l27K39q3k76K18l00L79q5J05j29J56M4l99J80M7j15k7K90
$$ 110 270 243 -172 242 -85 154 71 -205 13 -287 92 7 112 -17 139 183 -216 -36 11 -104 -131 159
4086A59m1pj01q4L9J1N5j26P0J39k02K72j70j83m8L00J03k46pO9J8L5Qk19k9J00
$$ 159 118 111 10 -74 -35 -24 31 -95 -25 114 -88 184 14 -169 -217 83 186 -60 -67 2 20 55 63 -156 -185 -85
4112h5M6p3J55o1j90K14q1L52l95K46J22l72K87j87J70k92R9J55j6j82J90j22
$$ -85 -39 -112 43 -18 -208 6 -75 277 -118 128 250 -122 165 -22 148 -144 -45 110 94 -88 102 -20
4134b0P6r9L4J23j27K80m42K56J73k10K06m60J95J59j28l3O6K8k07M32l45K18
$$ -20 56 -43 -9 114 -13 267 -175 81 254 44 250 -210 -15 144 16 -17 49 77 -130 302 -43 175
4156A75j62O3j01OM1j92J00j2L14l79J9L5j09J79n9Q0o3j51K18M3j48J6O3m4J74
$$ 175 13 76 -25 -19 22 -170 -70 -82 232 -147 -128 -93 -202 -23 -82 -2 -65 -216 2 45 -103 -87 -24 -68 106
4181A06k97L70j37q5K79m05J28K8k2j3J68j70J85Q3k39N7j88J27L9J73j27J71
$$ 106 -191 179 42 -43 236 -169 -41 -13 -35 -48 120 -50 135 218 -21 36 -152 -25 14 187 60 231
4203B31j83P8j12n3J59k6p8J08n7Q1j40R0K6N4k88lLJ05J51p1j14j53L59l58L01
$$ 231 48 126 14 -39 120 94 16 124 67 148 8 98 124 178 -110 -113 -110 -5 146 75 -39 -192 167 -191 110
4228A10j11m6P9J2N7j44L9n4J14m9O5n4j69K79j08J28l84R9J06j38R6q8O5P5R3
$$ 110 -1 -47 32 44 101 -43 -4 -58 56 7 72 18 -151 128 20 148 -236 -137 -31 -169 -73 -161 -96 -21 72
4253G2m58J71n4K76P3m0q3k33K90L7p3k5N8J00k07KL5J82j02L20l38j48J37k08
$$ 72 -386 -215 -269 7 80 40 -43 -276 14 51 -22 -47 11 111 -96 -94 -59 123 21 341 3 -145 -8 -216
4277b16K43j37K23j61L30l97K92J8k26J33m2N4j3J81k67J26n3r4J00j09K6J9J80
$$ -216 27 -110 113 -48 282 -115 177 195 -31 102 60 114 101 282 15 141 88 -6 94 -15 11 30 210
4300B10j3j26j65J35L7j57K35j84J30J24j82j37Q1J8p8Q9q5J4m0m9J16j3j32Q4
$$ 210 197 71 -94 41 78 -79 156 -28 102 226 44 -93 -12 6 -72 17 -68 -54 -94 -143 -27 -40 -172 -88
4324h8J18m5J07m06K56J26k22J28r4J36p5J47k04r4Q4N7J01j15O2j76J70k1mJ42
$$ -88 30 -15 92 -314 -58 68 -154 -26 -120 16 -59 88 -116 -210 -126 -69 32 -83 -21 -197 -27 -48 -52 90
4348I0p5m4Q8k33J25M2m0Q2J52k61J80j00Q0k15L00k82J11j13J39R9J8j73K17
$$ 90 15 -29 59 -174 -49 -7 -47 35 187 -74 106 6 86 -129 171 -111 0 -113 26 125 143 -30 187
4371A87j65J09q7j3J52q3K4L0j92m3K11n0o2l9K0J43n2j24Q8j43k0R8nK32l14
$$ 187 22 131 44 31 183 100 124 154 -38 -81 130 80 18 -21 -1 142 90 -34 54 -89 -109 -11 -16 216 -98
4396i8m6J07J6L5j98J10q0J86j05j26J46K48l05Q6P4j3j00r0J36j82j3Q8K36P3
$$ -98 -144 -37 -21 14 -184 -74 -154 32 -73 -199 -53 195 -110 -24 50 37 -63 -153 -17 -199 -212 -124 112 185
4420A85l52M1J46J26k63l6O5J33K25k89L8r4R5j1J22j68p5J01k6M37l48j30J81
$$ 185 -167 -126 20 146 -117 -153 -88 45 270 -19 19 -75 20 9 131 -37 -112 -11 -37 400 52 -78 103
4443A03j31J78k0R2m77J77o7J64J11k3o6j8K60m79J59L3Pj17j09K50k7O6j85K06
$$ 103 -28 150 130 222 -255 -78 -145 19 130 107 41 23 283 -196 -37 -4 3 -114 -223 27 0 66 -119 87
4467H7l86L42j11nk6jj7rK11K0p6j91J4Q9J39q8j08K21j29R9r5k49K33j61L89
$$ 87 -299 43 -68 -73 -99 -100 -117 -126 85 105 29 -162 -148 -59 80 -8 -116 105 -24 75 -20 -269 -36 -197 192
4492A92j15n1j62K02j32J44q0P0J66l04J68j54K70j48K0J41j95l9o5J42n3R4N2
$$ 192 77 26 -136 66 -66 78 -2 68 234 -70 98 -56 214 66 86 227 32 -7 -72 70 17 111 163
4515A63L9j31j27K78j77j62K87M8j90l7P2k65L95k22p0n8K44O6r9m1j89mL2K01
$$ 163 202 71 -56 222 45 -117 170 218 28 -9 63 -202 193 -29 -99 -157 87 153 54 13 -176 -180 -148 53
4539E3j10N6j38KK78r8nk48J02Q7J18J1k64pJ70j50K88n7q3q3J52n2n4M2k4L5
$$ 53 -57 -1 -139 -137 141 43 38 -210 -108 -21 97 108 -156 -163 7 -143 145 88 5 -78 74 22 -32 10 -14 21
4565B1N4j21j37RP3R8o0J64k17l6J47l3J18j15J44j25J80j52P3l5J23o1j94K44
$$ 21 75 -46 -183 -174 -101 -3 -63 101 -116 -152 -5 -38 80 -35 109 -16 164 12 85 50 173 112 -82 162
4589A62p0R1J47k88K4j00J66j99K05k53L30j03J39k84l6K11j57K14j64K30l62
$$ 162 92 183 330 42 66 -34 132 -67 138 -115 215 112 251 -33 -69 142 -15 199 35 265 -97
4610i7j0N6J25ol3J18q4J31j76k44J10L4J0J18j96q9K55j06j9K32p0R7j83L8P2
$$ -97 -107 -51 74 68 35 153 69 200 24 -220 -110 -76 -66 52 -144 -233 22 -84 -103 129 59 156 -27 11 83
4635H3r6m3j4M5j49qRL80j62j74J04p3K04Nqj73J74j0p3j1o9Q9J45l4j25j3kk3
$$ 83 -13 -56 -70 -25 -174 -182 -173 207 45 -129 -25 -98 106 111 103 -70 104 94 21 10 -59 30 175 141 16 3 1 -22
4663b2K9J11j25o2L95j34L7k62k7L3N5L8j10O2j03J89j59J28k02J61Lk5M4o6J
$$ -22 7 118 -7 -69 326 192 229 -33 -60 -27 28 66 -44 18 -85 104 -55 73 -129 32 35 10 54 -12 -11
4688a1M8j08K55j48n7J69k49J92o4r6K15Mmm12J48J32k40K32j77J65q9R4J13k71
$$ -11 37 -71 184 36 -21 148 -101 91 27 -69 146 150 146 -266 -118 14 -226 6 -171 -6 -95 -1 112 -159
4712a59L25J7k69P0K07k24N6jMl4J44m5j05L4j03M2P9j2O9j55J55l73M66j22q4
$$ -159 166 183 -86 -16 191 -33 23 22 26 -8 136 91 -14 20 -83 -41 38 26 95 -60 95 -278 188 66 -18
4737a8J02k10J05l7K20n6p2llK75m01J61k0N1q9K35l79R1j20L18j98Jn2O1O9m6
$$ -18 84 -126 -21 -58 162 106 34 31 28 303 -98 63 43 94 5 240 -139 -48 -168 150 -48 -47 -99 -38 31 -15
4763a5p1L7m6n2Q0J17j25q2l8K15k3k37J06j4K27l83K85j19p3P0J36J7k18J67
$$ -15 -86 -49 -95 -147 -67 50 -75 -157 -195 20 -3 -240 -134 -148 79 -304 -19 -138 -211 -141 -5 12 -206 -39
4787c9n7L7J72j69J88l78M00k7k69J31J31M0m8K08l06L4j1J0J16j98p2PK17MN
$$ -39 -96 -59 113 -56 132 -246 154 127 -142 -11 120 160 112 320 14 48 37 47 163 -35 -107 -100 117 121 126
4812A26r0KJ8M4l25K52p9K01j76o9K49k87K39kj12j67J04K51k69O1J8L9j26J39
$$ 126 36 38 56 100 -225 27 -52 149 -27 -96 153 -134 105 103 -9 -176 -72 179 -90 -29 -11 28 -98 41
4836D1k31P4Q2O1L9j07J36r7J1p1k07L72l49K76q9J54l02R8J30QJ30k28M6q8J92
$$ 41 -190 -116 -34 27 66 -41 95 -2 9 -62 -269 103 -246 30 -59 95 -207 -109 21 29 159 -69 -23 -111 81
4861H1j66K2j58O6J92j63K70k08K24j40j54J18j88J79M6J1r6J06r2k5k0Q8K1j45
$$ 81 -85 -63 -221 -155 37 -126 144 -64 160 20 -134 -16 -204 -25 21 32 -64 42 -50 -75 -95 -7 14 -131
4885a31J1j9M43k56m1K2q9K92k31J54q8p7r9J01K2K58k0k43M0j45j41K93j59k7
$$ -131 -120 -139 304 48 7 29 -60 232 1 155 67 -10 -109 -8 14 272 252 9 49 -96 -237 56 -103 -130
4909a30N0O5J11j92O2l3N2k4j08J00L9q4N4M4j68J55j25j0J02J24J90l45L5N0
$$ -130 -80 -15 96 -96 -34 -67 -15 -39 -147 -47 -8 -92 -38 6 -162 -7 -132 -142 -40 84 274 -71 -36 14
4933A4N2j06mK8K23l80L34j9j91M0j4K00j43o5J53m9k7j76J52J86j6m29K93M4
$$ 14 66 -40 -44 -16 207 -173 161 142 -49 -9 -23 177 34 -31 122 73 46 -130 22 208 192 -237 56 100
4957A00j41oJ27n5l8R4j16J68j55K38l21J6L4O9q4J2j3M8L1O9j54k2J88np3P8
$$ 100 -41 -47 80 25 -13 81 -35 133 -22 216 -105 -89 -55 14 -70 -58 -71 -23 8 77 -77 -99 89 84 11 89
4983H9l40K79mn4J35j90J42j06R8j90L42k91K01j67N5J78k83J10j32J90j09j04
$$ 89 -251 28 24 -30 105 -85 57 -49 49 -141 201 -90 111 -56 -1 177 -106 4 -128 62 -47 -151
5005a51J16Q6k14J40j09o6Q9J12r1N4J32j99J67rj85l9K03j8j5j0K0l0P9j58j7
$$ -151 -35 51 -163 -23 -132 -198 -109 3 -88 -34 98 -101 66 57 -128 -167 36 18 3 -7 13 -17 62 -96 -113
5030a13J69J73k55J24L0L0l0o4M7k16J75M8NN9l24J79j33K94k57k2J28j77L36
$$ -113 56 229 -26 98 128 158 128 64 111 -105 70 118 123 182 -142 37 -96 198 -59 -81 47 -130 206
5053B06j42K3k80L53j5j86K5q7J78k08J60j33J9N2j61J90LO1j78K58k14k7L21
$$ 206 64 87 -193 160 145 -41 -16 -103 75 -133 27 -106 -87 -35 -196 -6 -3 58 -120 138 -76 -103 218
5076B18k27k33J80K37o3p5r4q5K00l1r0J4nL8J52l5j67R1r4N7j49J90L9M8j81
$$ 218 -9 -242 -62 175 112 37 -57 -142 58 27 -63 -49 -54 -16 136 101 -66 25 -69 -12 -161 29 68 116 -65
5101f5J35MM4q8j15K07q5J3O2j93K36k25L9r4J59J54q7M3r5k5q5K8J64j29j7k9
$$ -65 70 74 118 30 -85 122 37 50 112 -81 155 -70 -31 -125 34 188 101 144 49 24 -61 -33 131 2 -15 -44
5127d4O1J67l25J98j2p1K00l09J71j70J35J39k09k3j21L47l81K18l1J1J5m2n7
$$ -44 17 184 -141 57 45 -26 174 -135 36 -134 1 140 -69 -92 -213 134 -247 -29 -60 -49 -34 -76 -133
5150a33q0K45j02j20L4JJ91k2qj1N0R6p3j30J00Q8k57J59J65k84JJ56r5J75p8
$$ -133 -213 32 -70 -190 -156 -155 36 14 6 -5 45 141 68 -62 38 126 -131 28 193 -91 -90 66 -29 146 68
5175F8k83K00k1Q1J51l8k09j6NJ4jJ77P8r9q9J04j37K26k07r3J11J66or6M2Kn
$$ 68 -215 -15 -36 45 196 158 -51 -67 -62 -48 -49 128 206 107 18 122 -15 211 4 -89 22 188 182 86 128 130 125
5202A25k32L35k75N6N7j14Q1n1j26J63L6j10Q9l4m4J30r5m3J24m7Q5l38J32l7
$$ 125 -107 228 -47 9 66 -48 33 -18 -144 19 55 -55 34 0 -44 86 -9 -52 72 25 110 -228 -96 -133
5226a33o7J41O9k84K12m6Nm3J68r2J8P5K4kl1R0N6j84J15j47J20m9j08L42j47
$$ -133 -200 -59 10 -274 -62 -108 -103 -146 22 -70 -52 23 47 45 14 104 160 -24 91 -56 64 15 -93 249 102
5251A02j20o3J9J0R0o5M3j54K68j23lk3k60M38j85J92k47K14J3j54J79k6o7J2
$$ 102 -18 -81 -62 -52 38 -27 16 -138 130 7 4 -19 -279 159 -26 166 -81 133 146 -8 171 145 78 90
5275I0o3O5K16j54l0j87K24q2j41J22k36K09m2k2p9L0K17m31N37l29o5J03M8j05
$$ 90 27 92 308 154 124 -63 161 79 -62 60 -176 33 -9 -31 -110 -80 137 -294 243 -86 -151 -48 0 -105
5299a05J92n7p6J72j54j53L30j46J7pr8jJ8J52k0J46k73l1l7L08m13M79l33J95
$$ -105 87 30 -46 126 -28 -181 149 3 20 13 -85 -86 -68 84 64 210 -63 -94 -131 177 -236 243 -90 105
5323A05J96j93J4n2k3o0J68k14J42j64N4J79o4Pj15J14J3j75J39r1R7l3j2j06
$$ 105 301 108 122 70 47 -13 155 -59 83 -81 -27 152 88 95 -20 94 107 -68 71 -20 77 44 32 -74
5347g4K51j47L0o7j33L13j54Qj57L69k41K1J12j77J3L9k4J13j80l7J2QJ32P4m0
$$ -74 177 30 60 -7 -140 173 19 27 -130 239 -2 19 131 -46 -33 6 -18 95 -85 -122 -110 -102 30 104 64
5372F4j00qj3J24J6r4j08Q6R6j33Q5Q9j25p7J81j38m4l2J28p3m6LJ29jK6j37Q9
$$ 64 -36 -44 -57 67 83 -11 -119 -33 63 -70 15 104 -21 -98 83 -55 -99 -131 -3 -76 -122 -119 10 9 35 -102 -13
5399a3N0l4j08P6K58n1p8j53j55M06j58J14j46O0j09J68o1r4Q2M2j69o0L1J84
$$ -13 37 3 -105 -29 229 178 100 -53 -208 198 40 154 8 68 -41 127 66 -28 54 96 -73 -133 -102 82
5423H2j77J40k8J5LJ68j94j55K77l72M43m24K36J59n3j31J69l16j67M19k0k22
$$ 82 -95 45 17 32 35 203 9 -146 131 -241 202 -222 14 173 120 -11 158 -158 -325 94 74 -148
5445a48KJ37%k7N5j24n5J9K60k70O2O4K0J32j51J20k83J83m0LrL0j80M79j66j19
$$ -148 -146 -9 -9 -36 19 -105 -160 -141 119 -151 -89 -25 -5 127 -24 96 -187 -4 -44 -41 -50 -20 -200 279 113 -6
5471flK3K8o4K43l98J43J23q5K29j38k9j6KN1j32J68j78J18j10K25j69M8M4l9
$$ -6 -9 14 42 -22 221 -177 -34 89 4 233 95 66 50 52 103 -29 139 -39 79 -31 194 25 73 117 78
5496G8l9o9J65r9l9pj16K86q2k21L8R1M8j09m4J02j27Q9O2l8j6m8P8O0m6j74J20
$$ 78 39 -30 135 36 -3 -10 -126 160 78 -143 -105 -14 34 -75 -119 -17 -144 -55 7 -31 -47 -95 -17 43 -3 -177 -57
5523e7n7J14P0k67K44j80R6N5K1j45J09q9J73q4k07J27j1j57K36r1Q5j33L45l03
$$ -57 -114 0 70 -197 47 -133 -37 18 39 -106 3 -86 87 3 -204 -77 -88 -245 -9 -100 -15 -148 197 -106
5547a06J42p2j58J72K5O6p7o8LJ71M6r5K9J27j34l3k7j0m5JJ5Q5M1J13q4k18Q3
$$ -106 36 -36 -194 -22 3 69 -8 -76 -73 98 144 49 78 205 71 38 11 1 -44 -43 -28 57 98 211 127 -91 -8
5574ho9J64k54L40j79o0J32k02K22K03m40J26K38k11pj71R9P0j34L13k21K37k24
$$ -8 -77 87 -167 173 -6 -66 66 -136 86 289 -151 -25 213 2 -5 -176 -77 -7 -141 172 -49 188 -36
5597c6J08j0l5J02k57O3M3n5j4J7J64j69J99k51M2J17J18k06J52j44K5O2n8L9
$$ -36 72 62 27 129 -128 -65 -22 -77 -91 -74 90 -79 120 -131 -89 28 146 -60 92 -52 -27 35 -23 16
5621A6n3K12J0M8k38m1K04K6k23p1M8J76j70j01P0O5J10R4j42k2L4J11k04j25
$$ 16 -37 175 185 233 -5 -46 158 184 -39 -110 -62 114 -56 -157 -87 -22 88 182 40 18 52 163 -41 -166
5645a66J39KM1j01K13l2r3P1L1j27L7L6J80k38M6kp0J08j63j58J37l7K98k59L03
$$ -166 -27 -25 16 -85 128 96 3 74 105 -22 15 51 231 -7 39 37 -33 75 -88 -246 -109 -146 152 -107 196
5670A96k00PJ47j71q9JL3j45R6n4j83K70J80k33J80J43m7k24N6K0N7J56r6j36
$$ 196 -4 3 150 -21 -110 -109 -76 -221 -125 -179 -362 -92 88 -145 35 178 131 -93 -37 -17 40 196 100 -36
5694c6N7j5P7j74N6M3J58k79J29Nj79J62J17p0j86L20m06M73j49q3j52M9P0k7
$$ -36 21 6 83 -91 -35 8 166 -113 16 21 -158 4 121 51 -135 185 -221 252 103 20 -132 -83 -13 -40
5718d0J42M0n7m8k4RJ76p3j57JJ57r5J77l94J95j0K5J3k63K75j48L78k59j26R1
$$ -40 102 142 85 37 13 22 198 125 -32 -31 126 31 208 -186 9 -1 24 37 -226 49 -99 279 20 -106 -15
5743a5Ok5L8K5l9M2j74M4K0K1L9j35L09k44j7J75M5r6j12J24k08M39n02K05O3
$$ -15 -9 -34 4 29 -10 32 -142 -98 -78 -57 -18 -153 156 -88 -105 70 115 19 -93 31 -177 262 -240 -35 28
5768B8J40l63L65k08O5j09J20k8k5J8J1j3J94k05K07j88j21K21j17K39k30J87
$$ 28 168 -195 170 -38 27 -82 38 10 -15 3 14 1 195 -10 197 9 -112 109 -8 231 1 188
5790A88k40j0N5K53J1j95l8K9k87L59j32N4M0j76P1j02J56K34k04k53J14J02O
$$ 188 -52 -62 -7 246 257 62 24 53 -234 125 -7 47 87 -89 -18 -120 36 270 66 -187 -73 29 35
5813C5j21Q1j28Q4K04n9k69J09p3N1O3J49j07M4k36J76M2l16L52j44k1J34k44
$$ 35 -86 -5 -133 -49 155 96 -173 -64 -137 -86 -23 126 19 63 -173 3 45 -271 81 -63 -84 50 -194
5836a94K58k33J72o6j41K78o8L9j42R6J05p5n5M1P8j02Q8r9L2K2J7n1K51k53L1
$$ -194 64 -169 3 -63 -204 74 6 45 -97 -1 104 29 -26 15 93 -9 79 -20 12 34 51 0 251 -2 29
5861B9m6J70j40L3K42m46J96pj6p8J24k12J70%N9j04J06n4N8J4j59P5Jn5O9k28
$$ 29 -17 153 13 46 288 -158 38 31 15 -63 61 -151 19 19 78 -26 80 26 84 98 -61 14 15 -40 29 -199
5887a99K02RQ4n8J59k22j41K44M6j84P5j61J9N5N5N2k56J10K4P0j46J50nM0pp6
$$ -199 3 12 96 38 197 -25 -166 78 124 -60 15 -146 -127 -72 -17 35 -221 -111 -87 -17 -163 -13 -18 22 15 -61
5913f1n1J15J12j57L8K6M6j32L9K3Q4p6l0L3n0K74k37l3O7J08j74NK51j12L3M6
$$ -61 -112 3 115 -42 -4 22 68 -64 -25 -2 82 6 -24 9 -41 233 -4 -37 30 138 -36 -31 220 108 141 187
5939A87m9j37j7J64k63J85q6K6m1q4J32q7J73j07P0k75J67P9k15P3J39J37M1k58
$$ 187 138 1 -16 148 -115 70 -16 10 -31 -115 17 -70 103 -4 66 -209 -42 37 -178 -105 34 171 212 -46
5963d6K0J4p1J38P0k88R3q1K26j55K02j61n2M0j65J16J98j38K0J39j39J04K5j70
$$ -46 -26 -12 -83 55 125 -163 -70 -151 75 -80 122 -39 -91 -51 -216 -100 98 -40 -20 119 -20 84 109 -61
5987f1r2M59l99N3K25k47J47L1L3j4r6R3J04k08K2J10r8k80N19k36j00J36q7K0
$$ -61 -153 306 -93 -40 185 -62 85 116 149 135 39 132 236 28 50 160 62 -218 301 65 -35 101 14 34
6011C4L9o3J52j81Q6k1l7j74J01J86r1nN3o6J4j1j82J57MJ44k13J78l95J19JJ41
$$ 34 73 10 162 -19 67 46 9 -165 -64 122 31 26 79 13 27 16 -166 -9 -5 139 -74 104 -291 -172 -171 -30
6037c0j06M9L4l0L1Q5n5q4K43n8j06K07l78K66j75R7J34l13J75J48p6j28q2J85
$$ -30 -136 -87 -53 -83 -52 33 -22 -106 137 79 -27 180 -198 68 -107 -10 124 -189 -14 134 58 -70 -152 33
6061C3Nk5j51k2J60J35j05p8J36oqn0J32l26K61K2J8j80O2k12J55n7J40j22k7
$$ 33 38 13 -138 -160 0 135 30 -48 88 82 74 24 156 -170 91 113 131 -49 13 -199 -44 -101 39 -83 -110
6086a10J95k42M68k97k9J90l15J61P9n7j39J64k42L15j2r0k01Q3L08l40N6j52
$$ -110 85 -157 311 14 -15 175 -140 21 100 43 -96 68 -174 141 129 39 -162 -79 229 -111 -55 -207
6108b07L70j08p3J30k62J8J23j8n5K1K14m4n5k64K42k61J88O3j19N2r9P8j18K39
$$ -207 163 55 -18 112 -150 -132 -9 -27 -82 -61 153 109 54 -210 32 -229 -41 22 -97 -45 -144 -66 -184 55
6132E5k46J67K17l15L14j08q7R0j11O5J41k66K19r4j89K93m5j31M6J58j51O0k47
$$ 55 -191 -24 193 -122 192 84 -3 87 -24 41 182 -84 135 41 -148 145 100 -31 15 173 22 82 -165
6155a65M99k84n7j9Oj1J44r4K5J13m8m4r6K6J3J03n1l1J46j32j67J49pOk35Q1
$$ -165 334 50 -7 -26 -20 -31 113 19 44 157 109 65 -31 -5 8 111 60 29 175 43 -124 25 18 24 -211 -130
6181a30J60L9j20L7J86j47o8k4lJ2L2R2j24Lq7N5l9Q4m0J50l8p8J84k72K20qj35
$$ -130 30 69 -51 -14 172 25 -43 -67 -70 -58 -26 66 -58 -55 -142 -87 -126 -42 -82 68 30 -48 136 -136 84 76 -59
6208e9QP3r6q3K92J0p2m3M9j31kp8R8M8J31k51K88r1k39L08k21R7j07J32P1p9
$$ -59 -51 22 -74 -157 135 145 73 30 79 -52 -54 -132 -34 14 145 -106 182 91 -148 160 -61 36 -71 61 132 53
6234E3n0p6K17j19M7j8j0j14L13k39J16q4K40k30l9l3o4R8J06L2r1L3k02J65M0
$$ 53 3 -73 144 25 72 54 44 -70 243 4 120 36 276 46 7 -26 -90 8 114 146 55 88 -114 51 91
6259I1P9r0q4j57K47j33K8Q0j23l6L5%rM1M3j19l2N9K7K38m26K04Q0k03J87K7
$$ 91 170 80 -4 -161 86 -47 -19 61 -62 -98 -63 -63 -72 -31 12 -107 -139 -80 -53 185 -241 -37 43 -160 27 54
6285E4j43K31k70K17m4j51J89l36K96n0k02K02P4r3pJ5J81o1j58K58l50J83J1
$$ 54 -89 142 -128 89 45 -106 83 -253 43 -7 -209 -7 67 -26 -33 -18 163 102 -56 202 -148 35 46
6308D6P2o1Mq7j7j33K27J40j00q5N9j08J40qm0j96J38l4o3J96r7L3k3j34O0L3
$$ 46 118 57 61 -26 -43 -176 51 191 91 6 65 -43 97 89 49 -147 -9 -43 -106 90 -7 26 3 -131 -71 -38
6334c8k5n1p0J23J51j57J3N5j33K17j79qL2J4J46k62P5R0J30k08l3J95j02j6n1
$$ -38 -63 -114 -184 -61 90 -67 -54 1 -132 85 -94 -102 -70 -56 90 -172 -97 -7 123 -85 -118 77 -25 -41 -92
6359i2K33j97N0J6J02o5j94J48J7p3m3J72j17O8J52j35J16j08J19j34o1J77r3
$$ -92 141 -56 -6 10 112 47 -147 1 18 -55 -98 74 -43 25 177 42 158 50 169 35 -26 151 58
6382E8j74K19j01j72J69j5j3r0L57j54J4k94M16l17L2nnL9nO6%j04J52j9m5p1
$$ 58 -116 103 2 -170 -1 -16 -29 -119 238 84 98 -196 220 -97 -65 -70 -75 -36 -41 25 25 -79 73 54 9 -62
6408f2J12q0M2L5j63m8P9P8o5Q2o8Q4p7k8J33m8m2L6l4j14P1J39j16N8o1K03m69
$$ -62 50 -30 12 47 -116 -164 -85 -7 -72 10 -58 26 -51 -79 54 6 -36 0 -34 -148 -77 62 -54 4 -57 146 -323
6435c23J76K65j55K03j48j8k9R8j57Q9k3R4m6n9J23k11J91p9J74j53r4J31kJ85
$$ -323 -147 118 -37 166 18 0 -29 69 -88 1 -22 72 26 -33 90 -121 70 -9 165 12 -82 49 47 232
6459B32k39J76j30j29O1j17J48j78K40k14j8K90j68J21j84K7p1J24Q0k0o7O5l3
$$ 232 -7 169 39 -90 -29 -146 2 -176 64 -150 -168 122 -46 75 -109 -82 -153 -29 51 31 -36 29 -4
6482dj0r0J03J70K2q1k41K65k59j47L74k24P6J01r2j45Q2J60J35m39L01P2j11
$$ -4 -14 -104 -1 169 191 110 -131 134 -125 -272 102 -122 -46 55 -37 -182 -100 60 195 -244 57 129 18
6505A8l5J73j98j1N2n4K8j32J05K33j6k98J82rk69L17L2j22J07n6l2L9j24O8M5
$$ 18 -17 156 -42 -53 -1 -55 -27 -159 -54 179 163 -135 47 38 -231 86 118 -4 103 47 15 54 -70 -2 43
6530D3R1n3m9pL5k8p4K77j58o6j3J18j01M6k24J80k8L3k9j00N6K62k64k9M2j05
$$ 43 134 81 32 25 60 32 -42 235 77 11 -2 116 15 61 -163 17 -11 22 -7 -107 -51 211 -53 -82 -40 -145
6556a45P8r4J17J08j5j11QK21j38j34J15j36J7R4J15r8O6k00M8R0o4R9n1k33J50
$$ -145 -67 -161 -44 64 49 -62 -54 167 29 -105 10 -126 -109 -15 100 2 68 -132 -84 6 -58 41 -10 -243 -93
6581i3J2Mj3JO4jn0K0J77j53L7J06j71j19J46q3J69K5p1N1j73J53J9j38K30l06
$$ -93 -81 -77 -90 -89 -25 -26 -76 -56 121 -32 5 111 -60 -179 -33 -116 53 78 7 58 -115 38 57 -81 149 -157
6607a57O5J53J04j71qk02K53M0J29r1j02J84j26p7N2j25MJ70k04M3R6o3k8R7q1
$$ -157 -92 61 165 -6 -14 -216 37 77 206 115 13 197 71 -6 46 -79 -75 95 -109 -66 30 -33 -61 36 -45
6632d5KJ10j0j57R6j16L47l86J78j60J28j9N8k7j43J39o7k6K13k37O3J09j31N8
$$ -45 -43 67 57 -100 -4 -120 227 -159 19 -141 -13 -32 26 -1 -144 -5 -72 -98 115 -122 -59 50 -81 -23
6656b3m0J73j44J04M6J54k75J42M5K0k5k31n0J45n5J10r6j75L69j65m5J8P7k1
$$ -23 -63 110 -34 70 116 270 -5 137 182 202 177 -54 -104 41 -14 96 0 -175 194 29 -16 2 79 58
6680E8j4n3J01pj41J43o5R2j73O4%j02K42k38K35j75j55J57r7R9R8N1j68J40k38
$$ 58 44 -9 92 85 -56 87 22 114 -59 5 5 -97 145 -93 142 -33 -188 -31 -128 -29 69 120 -48 92 -146
6705a46J36nO4l71M57j61j67L25l01K06K7j34L9Jpj06J38k15N5J08j5O1J14r9
$$ -146 -10 -15 49 -322 135 -26 -193 132 -169 37 64 -70 -31 -30 -37 -143 -5 -220 -165 -57 -72 -11 103 4
6729DJ71j52l00M56j85p6N0K2o6L5O3k44K03J06j71N4M5O0j9K2j54m9J83m2L8
$$ 4 175 23 -277 179 -6 -82 -32 -10 -76 -41 22 -222 -19 87 -84 -30 15 75 56 78 -76 -125 58 16 54
6754E4j61J47l0J23j30l5L2n3j89K89R5m5j61J26l64L12l8N8l6J8N8J0M3j70k6
$$ 54 -107 40 10 133 3 -32 0 -53 -242 47 142 97 -64 62 -302 10 -28 30 -6 12 70 80 123 -47 -73
6779g3J64j14r1j21J35R5P5j5j3j65J34j00m4J01K3O2p8J03j03J64k03J51k3q7
$$ -73 91 -23 -114 -235 -100 -5 70 55 42 -123 11 -89 -133 -32 -9 53 -25 78 -25 139 -64 87 64 -23
6803b3J8l6J37j13Q1j77Q2R1j82P9J4kJ60r9l7J24j04qj22J70j8k2O9l38J78k1
$$ -23 -5 -41 96 -17 64 -113 -31 60 -122 -43 -29 -31 129 30 -7 117 13 5 -117 53 35 13 82 -256 -78 -99
6829i9r7P4J34J25l65J50K59k13L26l56K5L8O7j27k3N8K24j49k73J64J80p7q4
$$ -99 -196 -122 12 137 -228 -78 181 -32 294 -62 -37 1 68 -59 -82 -24 200 51 -222 -58 122 45 -39
6852c9J74k36K8J27k80n3L34K4o0N2j67O9j02J43m9j13J45kK03k90m1L9J14j41
$$ -39 135 -101 -73 54 -226 -279 55 79 19 71 -96 -27 -129 14 -35 -148 -3 -5 198 -92 -133 -94 20 -121
6876a21l1Q3L33l51J68j05J04j19J56k15n1L9J10P7r0j52j20K56J04j30O3r0J50
$$ -121 -152 -69 264 -87 81 -24 80 -39 117 -98 -149 -110 0 77 -13 -165 -285 -29 75 -55 8 -82 68
6899F8K01k10L1j23R7O9m2K0p3J66j42r3J89k0p2k50J37m6K63m3j57m7J08J73
$$ 68 269 59 90 -33 64 133 91 111 38 204 62 -31 158 138 66 -184 -47 -93 170 127 -30 -77 31 204
6923B04l31J82k69K65Qk91K15j05K35j59m5K03r0k5j55J86n3R2j66R4p9J1Q6r8
$$ 204 -127 55 -214 51 59 -232 -17 -122 113 -46 -91 112 22 -3 -158 28 -25 67 -99 -5 -84 -73 13 -85
6947h5J88k24J63j5j21K87l18J40J52j58j79K92j23j19J49j28J18L6k6p0NJ83
$$ -85 103 -121 42 27 -94 193 -125 15 167 9 -170 122 -1 -120 29 -99 19 55 29 -41 -36 147
6969A47j46l6K64k78J2J1k5J99Nl8j39P6N6n9K4r4m3q9J77j6K5n2K2L2%o4J39
$$ 147 1 -35 229 -49 -37 -26 -51 148 153 115 -24 52 108 49 73 -21 -64 -153 24 8 33 -19 3 35 35 -29 110
6996A10k25J44J96k08L0o7j01J65j12j34L7J51k3M9o9O1j36K20ok79K04k2j17
$$ 110 -115 29 225 17 47 -20 -121 44 -68 -202 -165 -14 -37 12 -57 4 -132 88 82 -197 7 -15 -132
7019a32K86k47n1J58r9J22j76J06j6N5k3J11j52J17J04j71J58o1k30J58K30l04
$$ -132 154 -93 -144 14 -85 37 -139 -33 -49 6 -17 94 -58 59 163 -8 150 89 -141 17 247 -57
7041e7m4J04k6L8j49J24P8k1j13P7J51k61K04j26L0O5j68K34j59j28K44J16r8
$$ -57 -101 3 -23 15 -134 -10 68 47 -66 11 162 -99 105 -21 9 74 -94 140 -19 -147 97 213 115
7064A15j71K0J25j02J34j97J76k05R7O1k36K49q8j08J40k2J67j69j27J58j40K1
$$ 115 -56 -36 89 -13 121 -76 100 -105 -8 53 -183 66 -22 -130 10 -12 155 -14 -141 17 -123 -102
7086a02O4L4o3p7K33r9J02j03k4o5J58m2m4j37J99J4P9l36L21j08J1K06m83L20
$$ -102 -38 -4 -67 -144 89 -10 92 -11 -35 -100 58 16 -28 -165 34 48 127 -209 112 4 15 221 -262 58
7110E8k6J06k78P3N6J19l6q1j21p5M34j81m7m0KJ53k6j15j5K22j68q2Q2K8rJ09
$$ 58 32 138 -140 -67 -11 108 72 -9 -130 -205 229 48 1 -39 -37 116 90 -25 -40 182 14 -68 14 42 33 142
7136A42j67j7J00j2m9jP9O8k70M1mN6J04J65k36q0J13k69J96N4j19J49KP8j17
$$ 142 -25 -42 58 46 -3 -4 75 143 -127 -86 -90 -34 70 235 -1 -81 32 -237 -41 13 -106 43 45 123 6
7161FjR2J07m14L10l9r7j6o3j28O6P7k40L15L4n4r7J38O0l29P9J23L9J0kR4o1
$$ 6 5 97 204 -210 100 61 -36 -52 -115 -243 -177 -100 -340 -25 9 -45 -142 -4 56 -273 -194 -71 -32 -22 -24 70 9
7188IJ1K23j75j58J84j93j39M20l0j4O6j48r5K43k42O2j31J04Pj38L10j29Q0j38
$$ 9 20 243 68 -90 94 -99 -238 182 152 138 204 56 -39 204 -38 24 -107 -3 4 -134 176 47 127 -11
7212a1J25n7q5P4N5l7l2L15l09k5j37L6P9K5J93l05R5J0k21K74k9j37j94M01j84
$$ -11 114 57 -28 46 101 64 32 347 38 13 -124 -88 -9 16 209 -96 -1 9 -212 62 33 -104 -298 103 -81
7237h1J5L5J7K55k20j06q2Q0m1K4J20j29J86j81K09mN6k02Q8j01M3K50l9o7j17
$$ -81 -66 -31 -14 241 21 -85 -167 -87 -128 -104 16 -113 73 -108 101 97 153 -49 39 -62 -19 231 192 125 8
7262HnJ15j10K8N9l1k5r5j07K58q8p0N6K04j34j57L22k62L4O4j45K06k31L0J30
$$ 8 3 118 8 36 95 64 39 -56 -163 95 7 -63 -7 197 63 -94 228 -34 0 64 -81 125 -106 -76 54
7287E4q9J4K9N9P4k98J31j87K28J48j09j69LK41j68M0J70j41k72M16k12R0j03
$$ 54 -35 -21 8 67 141 -157 -26 -213 15 163 54 -115 -112 129 -39 1 171 30 -242 174 -38 52 -51
7310e1o2M8O2p7n8J32p0K33p3j25j64Q5J7J91j44P6q5J08O4m19L96J5j43m5K3
$$ -51 -113 -65 -3 -80 -138 -6 -76 157 84 -41 -205 -120 -103 88 -56 20 -65 43 107 -312 84 99 -44 -89 -66
7335f6j6P3j13M9J99k2j55P4m0p6O4Q4nJ20k02M1l3J26k04L77k54j32J90j62O2
$$ -66 -82 -9 -122 -73 126 104 -51 23 -17 -93 -29 55 50 170 -32 9 -24 102 -102 275 21 -111 79 -83 -21
7360b1N0j7m6L47q9l36L76l06O7O9K7j50o9K69j36j51J20L0o8p3J29O8M4j34p5
$$ -21 29 12 -34 313 224 -112 264 -42 25 94 121 -29 -98 171 35 -116 4 34 -34 -107 22 90 134 0 -75
7385g5K01j73j00J1K37j20m4J50nj49OJ20j90K31m6m9L1R3o4j63K62j95J37q6
$$ -75 126 -47 -147 -136 101 -19 -63 87 82 -67 -61 59 -131 100 54 5 36 129 65 -98 164 -31 106 20
7409B0k40J51L9k4J91l8j89k2KJ40m7j22L05q6j89K13j97J2J58r1K02Lo8j13N0
$$ 20 -220 -69 -30 -54 137 99 -90 -112 -110 30 -17 -139 166 80 -109 104 -93 -81 77 -14 188 191 123 10 60
7434F0R3j27J96k84j73K02J43j36k0O9j35J71J9r1q3l0O4K11l9j12j9k34L87k05
$$ 60 153 26 222 -62 -235 -33 110 -26 -46 23 -112 59 78 -13 -96 -126 -62 149 110 -2 -21 -255 132 -73
7458g3J6n8Nm0J85J21j69L6j67J74l14L53q3Kj09j1J01q0j10J9J42R8j28LJ00
$$ -73 -57 -115 -110 -150 35 156 -13 23 -144 30 -284 69 -14 -12 -121 -132 -31 -111 -221 -202 -60 38 -90 -87 13
7483A3n6j54M08l08K07j09k24J16j20M53k62J3o0R9R9l4k52J9K51j04k37J10Q
$$ 13 -43 -197 211 -97 110 1 -223 -107 -227 226 -36 -23 -83 16 115 81 -171 -152 99 -5 -242 -132 -124
7506a24Kr0K73M3j01J4O6j17J8J79j96L5R7j89o7K47o9n3k0l0P6j17L2K21j35
$$ -124 -122 -212 61 104 3 17 83 -34 -16 163 -33 2 99 -90 -157 90 21 -32 -52 -82 -6 -123 -91 130 -5
7531ej57K9J61O7j01m5m6K52j75j04OR1k68L04r5J59j50j3K7J01r4R5O8k26J96
$$ -5 -162 -133 28 95 -6 -51 -97 155 -20 -124 -118 -27 -295 9 -86 73 -77 -90 -63 38 -56 39 107 -119 77
7556G7n3O3j3k10L53j07j01M6J46j37lq2R8j10O2o5J5J2j47M1K48j25K3JL5m6
$$ 77 24 87 74 -136 217 110 9 55 201 64 61 -21 77 -33 29 -36 -21 -9 -156 -115 133 8 31 32 67 21
7582B1N9J39j63j56J4Q1j85J89j36J75j0k03K02L5l7k2J0j92J81o0j35K43q4J13
$$ 21 80 219 56 -100 -86 -5 -190 -1 -137 38 28 -175 27 62 25 3 13 -179 2 -58 -193 50 -34 79
7606G9K3o9O0J14j58j72r4J27J22N0k43L21j02o1j54J92o3m3j17K56j50J54Q3
$$ 79 102 33 93 207 49 -123 -217 -90 32 82 -161 160 58 -3 -157 35 -28 -71 -188 68 -82 72 155
7629A55m06K31K77l38j2J29j44J15j9j25K6K75P6k90J3n7J57K19k89N8n9J01n9
$$ 155 -251 -20 257 -81 -93 36 -108 7 -12 -137 -111 164 240 -50 -37 -94 63 282 -7 51 -8 93 34
7652C4N0K1j31J09RJ4k8O9r6k06J02K16p9q0q8K12j62J22M4j96M5R6k27J30j10
$$ 34 84 105 -26 83 92 106 78 147 51 -155 -53 163 84 4 -84 128 -34 88 132 -64 -19 77 -150 -20 -130
7677a30L35j60j66J85M1q9j50P1J58k02J66m3k17L4J76ln4j58K38m3j47L1N1P
$$ -130 205 45 -121 64 105 16 -134 -63 95 -107 59 16 -201 -167 9 6 -48 -206 32 -11 -158 -127 -76 -69
7701f9k57K94k24K64qo1J08j02J9O0l0r0J77k77M29k29q8L42j22k91J53M7q7J30
$$ -69 -326 -32 -256 8 0 -61 47 -55 -36 24 -6 -96 81 -196 233 4 -84 258 136 -155 -2 45 -42 88
7725H8k48J4R0rJ42j0N1k64L38k43K20p0k07Q5J16n3k39QJ80k12L20j04Q2J9j26
$$ 88 -160 -146 -56 -65 77 67 118 -146 192 -51 169 99 -108 -23 93 40 -199 -191 -11 -223 97 -7 75 94 -32
7750c2M4j7M7op7m1M0p0J42o4L5q4NJ0k7Q1J33p5p7J41j14Q2j64J67k09J56j2
$$ -32 12 -5 42 36 -41 -82 -42 -112 30 -34 1 -83 -78 -68 -95 -14 119 44 -33 108 -6 76 -88 79 -130 26 14
7777A4j05q2J23R3j06P0J11j86L03k06J46j85mj03K12j6o5K0r9J35j07M4j16J08
$$ 14 -91 -173 -50 43 -63 7 118 -68 235 29 175 -10 -14 -117 95 79 14 34 -65 70 -37 7 -109 -1
7801aK29k18Mj8LP3M0J48k96J38m3L0r8J46l04J79jjQ4j42K02j35L1J10k32p4
$$ -1 228 10 14 -4 -1 72 112 260 -36 102 59 89 -9 137 -167 12 11 10 94 -48 154 19 50 160 -72 -146
7827a46J79L0j82j52L02j67K61j38k04l9O5J32K7O2j42P3j09K29M9j99J27P4l44
$$ -146 33 63 -119 -271 31 -136 125 -13 -217 -256 -191 -59 -32 30 -112 -39 -148 81 130 -69 58 132 -212
7850b12J17J1o3J5N7K5J38k80L77o9j87K25j02m0q4J48J02j20k03O8K85k18m9
$$ -212 -95 -84 -147 -132 -75 -50 88 -192 185 116 -71 154 52 12 -72 76 178 58 -145 -77 208 -10 -59
7873e9J00j77J83j28J1R1R2k12j29K40J05K4o4k5k33K43j21J37l0J20j24k04r0
$$ -59 41 -136 47 -81 -70 21 113 -99 -228 12 117 141 77 52 -181 62 -59 78 48 168 44 -160 -250
7896b50K52J24l41K94j19j1j19J87n3n9l1n4J92k00P1J4K76o3j07j64J07K7J09
$$ -250 2 126 -215 79 -40 -51 -170 17 -36 -95 -126 -180 12 -188 -117 -103 173 110 3 -161 -54 -27 82
7919H2j07q0j15L42j60J53j50R4p5J05p4O7o9j55J51j19J85Pj17P9J47k54q3J27
$$ 82 -25 -105 -220 122 -38 115 -35 59 -16 89 15 82 13 -142 9 -110 75 82 -35 44 191 -63 -146 -19
7943a9J81m9o7j04J10J26O9k32J07o2r4O5J9M4N4j16j16m8LM5L2J74q2j79M5j06
$$ -19 162 113 46 -58 52 178 247 15 122 60 -34 31 50 94 148 32 -84 -132 -129 -84 -52 122 40 -139 -94 -200
7969b00L15n0j00QOL2R0r6J07P5j00j19P8J52o8k30J8l2N5p1L5O7q0J06P7r7l9
$$ -200 115 65 -35 -27 -21 11 101 5 112 187 87 -32 46 198 130 -100 -82 -114 -59 -130 -95 -28 -108 -2 75 -22 -61
7996f1O5L8J04k59J41J31j91j47K70k43J33m7j6J78k15M5M7j22J96NN7j51k63
$$ -61 4 42 146 -113 28 159 -32 -179 91 -152 -19 -66 -82 96 -119 -74 -27 -149 47 52 109 -42 -305
8019c05L29p1Q3o4Q2j64R0K05k6o3k76L01%Rqj7LJ26l12J8K99k79L3j16j01J56
$$ -305 24 -47 36 -28 54 -110 -20 185 159 96 -180 121 121 130 122 105 108 234 -78 -60 239 -40 -7 -123 -224 -68
8045f8L08k67P3j41P9j01L88l16J4J06p3j91QJ97j03K44k18M4j17J12J1J17J1
$$ -68 240 -27 46 -95 -16 -117 271 -45 -31 75 2 -189 -181 16 -87 157 -61 -17 -134 -22 -11 106 117
8068A17k12K20p4n2q9K59k35K9j18J18L4j40Q4j15K29j50N9K23k65J67p6m2J29
$$ 117 -95 125 51 -1 -90 169 -66 -37 -155 -37 -3 -143 -59 -174 55 -95 -36 187 -78 89 13 -29 100
8091A00j65KJ13k26kK07n0j09K16p3J13k59J61J21K9l25L06j64J00j68K69k59
$$ 100 -65 -63 50 -176 -178 29 -21 -130 86 13 126 -133 28 149 178 -147 159 -5 95 -73 196 -63
8113f3N7pJ40L3j63J9j23J14m7J21oj27J7L26l23M4n8L0n4N9j38L87j00l83L23
$$ -63 -6 -13 127 160 -3 16 -107 7 -40 81 75 -52 -35 291 -32 12 -46 -16 -70 -11 -149 238 138 -245 78
8138G8j81m0K07j90R7RK6j64K32j07J97k15K73j41j1L9j90J36o7J45J41o9j72
$$ 78 -103 -143 64 -126 -29 -20 6 -158 74 -33 164 -51 222 81 70 109 -81 55 -12 133 274 205 33
8161C3R8j99J35j16O4J99k56N2q2J37j00R8n2J21j27R1k01N9O7p6M7q3Q8J21k5
$$ 33 131 -68 67 -49 15 214 -42 10 -72 65 -35 63 11 132 5 96 -105 -46 21 -55 -8 -91 -3 118 93
8186I3j80L1J26N4m3
$$ 93 -87 -56 70 124 81
8191H1
$$ Imaginary data points
##PAGE= N=2
##DATA TABLE= (X++(I..I)), XYDATA
0@%%%%%%%%%%%%%%%%%Qj6J6j6J6j6K4l2L2m0M8n1N9p0P9q9J03j14J26j42J60j82
$$ 0 0 0 0 0 0 0 0 0 0 0 0 0 0 0 0 0 0 8 -8 8 -8 8 -8 16 -16 16 -24 24 -27 32 -38 41 -48 55 -59 67 -75 85 -97
39i7K03k25K50k77L08l41L75m13M55n00N52o08O70p39Q15r01R96j104J230j374
$$ -97 106 -119 131 -146 162 -179 196 -217 238 -262 290 -318 352 -387 428 -473 523 -581 649 -725
59g25J542j744J990k297K692l224L982n149P200j1832M1365n962o9310N4602J1902
$$ -725 817 -927 1063 -1234 1458 -1766 2216 -2933 4267 -7565 33800 27838 -41472 13130 25032
74B5032l7062Q594K5028k8021K62N412J1224j022k3388K705K7636j0242k2781
$$ 25032 -12030 -3436 21592 -6429 -6167 -755 10469 9447 -13941 -11236 16400 6158 -16623
87a6623K3727l057j6215J8285K719j2503j348M826J296J3544k0340o691K2999
$$ -16623 7104 4047 -12168 6117 8836 -3667 -5015 -189 1107 14651 -5689 -12380 10619
100A0619n764j0232Q272L06j2680J0067L018l82q500q875J9212J797j7551J561
$$ 10619 4855 -5377 2895 3201 -9479 588 3606 3224 -5276 -14151 5061 6858 -10693 -9132
114i132J4976j6459M000J6208j8183l466J2828j104l033P555j6014O858J6214
$$ -9132 5844 -10615 -6615 9593 -8590 -12056 772 -332 -3365 4190 -11824 -4966 11248
127A1248j6704L036Q809j2765J794K1062j8525n217J6310j0499J739J0990j0983
$$ 11248 -5456 -2420 6389 -6376 -4582 16480 -2045 -7262 9048 -1451 288 11278 295
140B95j0090J8706k813q399N866m514k74M153J683m209M37p469R773R209j8663
$$ 295 -9795 8911 6098 -2301 3565 -949 -1223 2930 4613 404 841 -6628 3145 12354 -6309
155f309J909J0996o030l888J3678r886q661J2464K604m071o133L779J451J487
$$ -6309 -4400 6596 566 -3322 10356 470 -8191 4273 6877 2806 -3327 452 1903 3390
169C390k484J807l797n677J3160j250j0251P06O958o570L898M777j3775L437P723
$$ 3390 906 2713 -1084 -6761 6399 5149 -5102 -4396 2562 -4008 -110 4667 -9108 -5671 2052
184B052j602m558K396m952L761O222p201J624k209P93N094K004q770Q39N902k611
$$ 2052 450 -4108 -1712 -6664 -2903 3319 -3882 -2258 -4467 -3674 1420 3424 -5346 -4507 1395 -1216
200a216N080m181m345K914O793m880l42J944p650P306M847n212o051N438J541
$$ -1216 3864 -317 -4662 -1748 5045 165 -177 1767 -5883 1423 6270 1058 -4993 445 1986
215A986M95j46m929L486j787K607L223l714o983O734P126q118J44N53O89m58L995
$$ 1986 2481 2335 -2594 892 -895 1712 4935 1221 -5762 972 8098 -20 124 677 1366 908 4903
232D903j700m470Q20J716O523o946l871L644K939l387J650P08p811N516K669j361
$$ 4903 3203 -1267 -447 1269 7792 846 -3025 619 3558 171 1821 2529 -5282 234 2903 1542
248A542m063k19P44K916Q59n548J605j202K805J445j613l558Q72L782j283K249
$$ 1542 -2521 -2740 -1996 920 1779 -3769 -2164 -3366 -561 884 -729 -4287 -3415 367 -916 1333
264A333n441l09M313K022l666l53J075l251O709o52l245k266K912K725o85j475
$$ 1333 -4108 -4417 -104 1918 -1748 -2101 -1026 -4277 2432 1780 -1465 -3731 -819 1906 1221 -254
280b54l403L838m56K512q41l786m32M445K763n381J092j744J921K976m2l739j069
$$ -254 -3657 181 -275 2237 1396 -2390 -2822 1623 4386 -995 97 -1647 274 3250 3208 -531 -1600
297a600L767l67L230m792j727K434K802N0k882j008j274N589j397j090k429q37
$$ -1600 2167 1800 5030 238 -1489 945 3747 3797 915 -93 -1367 4222 2825 1735 -694 -1531
313a531L211J545p87n732K509Q89K381j452k571j136J411L739k531n11l499K166
$$ -1531 1680 3225 2438 -3294 -785 104 2485 1033 -1538 -2674 -1263 2476 -55 -566 -4065 -1899
329a899L539q42k205k261K145O44L189l954j435R00J509K223k260j238k455M686
$$ -1899 1640 798 -1407 -3668 -1523 -879 2310 -1644 -3079 -2179 -670 1553 -707 -1945 -4400 286
345B86P26r94k450n21K533O25J271l563L99n75L372J186l408j352J255L618j664
$$ 286 1012 18 -2432 -2953 -420 205 1476 -2087 -1688 -2263 1109 2295 -1113 -2465 -1210 2408 744
362G44N66k738O15J992J323J08m013J189J050K996k266j170o33P32K952j128j095
$$ 744 1310 -1428 -813 1179 2502 2610 -1403 -214 836 3832 1566 396 -237 495 3447 2319 1224
379A224k826K940N82N14j015k704J187J297K225l399q66p67L035P57k321Q1j479
$$ 1224 -1602 1338 1920 2434 1419 -1285 -98 1199 3424 25 -841 -1608 1427 2184 -137 -56 -1535
396a535J429L82K362m125j911K841K254n95l807J446o84K518l85o10j503j515
$$ -1535 -106 276 2638 -1487 -3398 -557 1697 1102 -2705 -1259 -1943 575 190 -420 -1923 -3438
412c438L216J689r48n692L183K859p62j454j19N59k580M775N27l158l013L842
$$ -3438 -222 1467 519 -5173 -1990 869 107 -1347 -1466 -907 -3487 1288 1815 -1343 -4356 -514
428e14L099k226j807j048L516j042R11L40j606k032K802M985n173k871K658L253
$$ -514 2585 359 -1448 -2496 1020 -22 889 1229 -377 -2409 393 5378 205 -2666 -8 3245
444C245k192K30j0k494K562J034O46l111n14O76L562n71m642J665R09R55o12Q96
$$ 3245 1053 1283 1273 -1221 1341 2375 3021 -90 -604 72 3634 3063 -1579 86 995 1950 1338 2234
462B234l814p5M633j433j028j601M19k40M562k973m225L010J408l49j339J654
$$ 2234 -1580 -1655 2978 1545 517 -1084 -665 -905 3657 684 -3541 -531 877 528 -811 843
478H43l678J269K793j82k406k044K217J746J031m985J003K455j678L59K219j793
$$ 843 -2835 -1566 1227 1045 -1361 -3405 -1188 558 1589 -3396 -2393 62 -1616 -1257 962 -831
494h31m756O144K339m223k138K599J290j304J817k484O48n31J549K348j733m097
$$ -831 -5587 557 2896 -1327 -3465 -866 424 -880 937 -1547 -899 -1430 119 2467 734 -3363
510c363J583O836m580k220K396Q68k650K642K573n657R3K911K266k599j556m5
$$ -3363 -1780 5056 476 -1744 652 1520 -1130 1512 4085 -1572 -1479 1432 3698 1099 -457 -502
526e02K646R57l413K153j193j746K045L961n048l433N469L53j505n53Q46l179
$$ -502 2144 3101 -312 1841 648 -1098 947 4908 -140 -3573 1896 2249 744 191 1037 -2142
542b142K698K427k943j300j85J795M63N66l716M17K286m60J044k202j331P49M000
$$ -2142 556 2983 40 -1260 -1445 350 813 1379 -2337 -1920 366 -94 950 -1252 -2583 -1834 2166
559B166k455j950J084p50R09K026N4n729L029K681q63j398m92N37k13K789j630
$$ 2166 -289 -2239 -1155 -1905 -996 1030 1084 -4645 -1616 1065 202 -1196 -1688 -1151 -1364 1425 -205
576b05m93j476J361K595n99k288j799M533o02p82k08m9r77J532K917l376j328
$$ -205 -698 -2174 -813 1782 1183 -1105 -2904 1629 1027 245 37 -12 -989 543 3460 84 -1244
593a244M43L274l74j632j122O58K146j623J197q00j710J74M176r37m708K268J248
$$ -1244 -801 2473 2099 467 -655 3 2149 526 1723 923 -787 -613 3563 2626 -2082 186 1434
610A434K46j271Q83j852k92K276J11m40l078J301J569R88k561l65P51q68K253
$$ 1434 1680 409 1292 -560 -852 1424 1535 1095 -1983 -682 887 1875 -686 -1051 -300 -1168 1085
627A085p63j126j779K393N71l07r26j736J891M08J079k598M7L35J296N40j246
$$ 1085 322 -804 -2583 -190 381 74 -852 -2588 -697 -289 790 -1808 -1761 -1426 -130 410 -836
644h36k01j457K682P10r79k107O31K115o44R76j993J80J23J989Oj613r93O52K993
$$ -836 -1037 -2494 188 898 -81 -2188 -1557 558 -86 890 -1103 -923 -800 1189 1195 -418 -1411 -759 2234
663B234j546m37p54K49J086J333q72k604J523O44J606j381j163m78J558J752j925
$$ 2234 688 251 -503 -254 832 2165 1293 -1311 212 856 2462 1081 -82 -560 998 2750 825
680H25l38j317J753P67L75k043r14J423P70J133l286K81M27J135O2o21j185j129
$$ 825 487 -830 923 1690 2065 22 -892 531 1301 2434 -852 -571 -144 991 1053 432 -753 -1882
698a882L050k23o79j963N97J188J63J24k034K30m7K347o01j753m10J039J527j251
$$ -1882 1168 945 266 -1697 -1100 88 251 375 -1659 -1429 -1476 871 270 -1483 -1893 -854 673 -578
716e78L35k147J443J117N45j450j451J181Q99J433k187rn03J422J014q55q64r85
$$ -578 -243 -2390 -947 170 715 -735 -2186 -1005 -106 1327 -860 -869 -1372 50 1064 209 -655 -1640
734a640K455j3L10j511n23J189R73O05k405P82m38J745R9q08q58m01K203k93M0
$$ -1640 815 802 1112 -399 -922 267 1240 1845 -560 222 -216 1529 1628 820 -38 -439 1764 1471 1511
753A511k090Q07P54N76m3j715M3q3K407j178q21q88P26J228k56n50j857J439O5
$$ 1511 -579 228 982 1558 1515 -200 -157 -240 2167 989 168 -720 6 1234 978 428 -1429 10 75
772G5J291j325j464N67P25J364j652k39j311J589R03m24j211q58J526L34P30k113
$$ 75 1366 41 -1423 -856 -131 1233 -419 -658 -1969 -380 523 99 -1112 -1970 -444 -110 620 -1493
790a493j13M11J379J99j557k22n79K374j51n07j243M4J694K06m4j865P89K47J689
$$ -1493 -1606 -1195 184 383 -1174 -1396 -1975 399 248 -259 -1502 -1458 236 442 398 -1467 -678 -431 1258
809A258l75j675Q0M74K207j318o28r70J254J204o4q02j383J234K47J491j722q42
$$ 1258 883 -792 -712 -238 1969 651 23 -947 307 1511 1447 645 -738 496 743 2234 512 -330
827c30L00J239O11j366l40p83K154P2m05j280m08J069N65M53k354J64N14J336
$$ -330 -30 1209 1820 454 114 -669 1485 1557 1152 -128 -536 533 1098 1551 -803 -639 -125 1211
845A211n60j060j36m65J676l29K5j990M23J319M35p49j970J462J63Q49p07l01
$$ 1211 651 -409 -545 -1010 666 337 362 -1628 -1205 114 549 -200 -2170 -708 -545 304 -403 -704
863g04j170O45K030p56j096j056J933L25k40n21o18Q69J1J232j293k38p59J602
$$ -704 -1874 -1229 801 45 -1051 -2107 -174 151 -89 -610 -1228 -359 -348 884 -409 -647 -1406 196
881A96J268j901k79J4J448q39J204j139r76J391R13P0j642L66m49K179l62j691
$$ 196 1464 -437 -716 -702 746 -93 1111 -28 -1004 387 1300 1370 -272 94 -355 1824 1462 -229
899b29L53J93N86O6Q55k813Q81J400j68k13p17l41RK578j946q65K79N08K69K79
$$ -229 124 317 903 969 1824 -989 -108 1292 1124 911 194 -147 -138 2440 494 -371 -92 416 685 964
919I64m17k353J798O09J43j213o77N21P64O62j834L17n84Q70O60K10j547j283
$$ 964 547 -1806 -8 601 744 -469 -1146 -625 139 801 -1033 -716 -1300 -430 230 440 -1107 -2390
937b390K676K3p70j256J101k78P53R55j956j77L41J639n11k27j713O42K411j140
$$ -2390 286 309 -461 -1717 -616 -894 -141 814 -1142 -1319 -978 661 150 -77 -1790 -1148 1263 123
955A23o89J64L25j000K687q64k651J750P11N19q31J01j390J799R07j383K24q48
$$ 123 -566 -402 -77 -1077 1610 746 -1905 -155 556 1075 244 345 -1045 754 1661 278 502 -346
973c46N48O47J545k909k5J397M4K92m68o42p99K178p67L0o55o83J312M45j02j934
$$ -346 202 849 2394 -515 -540 857 901 1193 725 83 -716 1462 695 725 70 -613 699 1144 1042 -892
993h92P67K61M74j05o82n37j72J815r19m9j289P04N46N02l96k004J457K99N19
$$ -892 -125 136 610 505 -177 -714 -886 929 10 -39 -1328 -624 -78 424 28 -1976 -519 -220 299
1012B99r60K24q80K58J934j410l52m43J062L5Q74j465j002K027l63N34k40p75
$$ 299 -661 -437 -1317 -1059 875 -535 -887 -1330 -268 -233 641 -824 -1826 201 -162 372 132 -643
1030f43o57K205K19j609K57m64J171K72K68j777P66N86P8R63j861k22O87J453
$$ -643 -1300 905 1124 -485 -228 -692 479 751 1019 -758 8 594 672 1635 -226 -448 239 1692
1048A692j144l61J9l69J767p93j3j523R97O19L97p67r92P51K61Q46j125n17n17
$$ 1692 548 187 206 -163 1604 811 798 -725 272 891 1288 521 -471 280 541 1387 262 -255 -772
1067g72J110O82o37m51j273J633K58j54j132k8L41M88J033k097R5j94J168R3n05
$$ -772 338 1020 383 -68 -1341 292 550 396 -736 -764 -423 65 1098 -999 -904 -1098 70 163 -342
1086c42r08j20J799o92K20j066mQ15P58m11j200O32l11J388l98p10n71Q07P04
$$ -342 -1250 -1370 429 -263 -43 -1109 -1113 -298 460 49 -1151 -519 -830 558 160 -550 -1121 -314 390
1105C90p8J16j857J469K54N93n67q49L33L65J271j411%k78P22K46J04n56q28J348
$$ 390 312 428 -1429 40 294 887 320 -529 -196 169 1440 29 29 -249 473 719 823 267 -561 787
1125G87o9O79j321j44K37R40j2r21J28p14J496j98k73q83K1Q09j40N39j814O92
$$ 787 718 1397 76 -68 169 1109 1097 176 304 -410 1086 888 615 -268 -247 562 422 961 -853 -161
1145a61J73O67m31p40j03p7J615j065k81o51N97P04k5n44j283J067k0R77j017
$$ -161 12 679 248 -492 -595 -672 943 -122 -403 -1054 -457 247 222 -322 -1605 -538 -558 419 -598
1164e98n05J54N67O61p00k14r47J395K36q1n93n43R00M40O96j676J17K41R05L58
$$ -598 -1103 -949 -382 279 -421 -635 -1582 -187 49 -32 -625 -1168 -268 172 868 -808 -691 -450 455 813
1184H13j012k88m5J500m01q8r49mR73O05n62q13M24k5J205m85q51j23M63J085
$$ 813 -199 -487 -532 968 567 479 -470 -474 499 1104 542 -271 153 128 1333 848 -3 -126 337 1422
1204A422o33j08j172J014M45K5p03n83L17N23N71j340O0l92R22N11p37m10o52
$$ 1422 789 681 -491 523 968 993 290 -293 24 547 1118 -222 -162 -554 368 879 142 -268 -920
1223i20J340j45M1j063j79Q54J12O20j540n4P9J214m33l48l75k65J024lj13j244
$$ -920 420 275 316 -747 -926 -72 40 660 -880 -934 -855 359 -74 -422 -797 -1062 -38 -41 -154 -1398
1243a398Q18L26L64nj134L41J66J014p76k7m97K81J243n18m47m19N68K49N70n10
$$ -1398 -580 -254 110 105 -1029 -688 -522 492 -284 -311 -808 -527 716 198 -249 -668 -100 149 719 209
1263B09p65N68M27O94j008j1m92J002M03n14k64o09R66L94J69j317K09J71P81
$$ 209 -556 12 439 1133 125 114 -378 624 1027 513 249 -360 606 1000 1169 -148 61 232 1013
1282A013J20j284K84k86J182m87j00q20o8J285k92k75q71M03L49N21o89p15K71
$$ 1013 1133 -151 133 -153 1029 542 442 -378 -446 839 547 272 -599 -196 153 674 -15 -730 -459
1301d59%J008p03k65p72R21N67k71m23r73J130M3M47p34m10Q8N52N82p46j83m69
$$ -459 -459 549 -154 -419 -1191 -270 297 26 -397 -1370 -240 -197 250 -484 -894 -806 -254 328 -418 -601 -1070
1322a070J184n4k78l41l62R58n6O73j360J76K33R25j69p54J77j75J484q87k6m99
$$ -1070 114 60 -218 -559 -921 37 -19 654 -706 -530 -297 628 459 -295 -118 -293 1191 304 278 -221
1342b21M12K84J83k9j302Q41K90N91p65j08m03O51P19o54m23l74Q51J92K6m18
$$ -221 191 475 658 629 -673 168 458 1049 284 176 -227 424 1143 489 66 -308 543 735 761 343
1362C43p43R08n9L40j060L78m10Q62K41r31j37m85R25l69O59j262l7R84pL1r85
$$ 343 -400 508 449 789 -271 107 -303 559 800 -131 -268 -753 172 -197 462 -800 -837 147 140 171 -814
1383h14K58m53J421m03n00k31J48O14k1j81j249R18K18K57j28n87m7M15J080j045
$$ -814 -556 -1009 412 9 -491 -722 -574 40 19 -162 -1411 -493 -275 -18 -146 -733 -780 -365 715 -330
1403c30k33j51N45N52j10m09o94J225lK13r01r6L58M50M45j095J97m2P59l3P5
$$ -330 -563 -714 -169 383 273 -136 -830 395 392 605 -296 -392 -34 416 861 -234 -37 -79 680 647 722
1424G22p52l41J329k34q4o44K74k08P28K64j245K13K18N91k33j53j178P37R31
$$ 722 -30 -371 958 724 640 -4 270 62 790 1054 -191 22 240 831 598 445 -733 4 935
1443I35p22l2n89J13K32Q37r05p28O79J15M72l79l31q73J417l6o37P7m71N16L75
$$ 935 213 181 -408 -295 -63 774 -131 -859 -180 -65 407 28 -303 -1176 241 205 -432 -355 -826 -310 65
1464F5L01j475M17PN71M83q00k60j81J232l40j85m04J4P78j60L48j070L23K49
$$ 65 366 -1109 -692 -685 -114 369 -431 -691 -872 360 20 -165 -569 -555 223 63 411 -659 -336 -87
1484h7P17m49n38J12m3J199l84j55o75O15L5K30j4j003P34K02M00l01l97k57L12
$$ -87 630 181 -357 -245 -288 911 527 372 -303 312 347 577 563 -440 294 496 896 595 198 -59 253
1505B53R41j175L75n55M92J61J36q15k70R10k89O43r33j69j05R87j76n06K7p45
$$ 253 1194 19 394 -161 331 492 628 -187 -457 453 164 807 -126 -295 -400 587 411 -95 -68 -813
1525h13J031J4k46o61J46L50K50jj075L08M06M82l25k87l44m2J180o93K48r60
$$ -813 218 232 -14 -675 -529 -179 71 70 -1005 -697 -291 191 -134 -421 -765 -807 373 -320 -72 -1032
1545a032O00L20N66o31m96M70j41Q15n60k91k21P46K58j69k32o23J129j86J21
$$ -1032 -432 -112 454 -177 -673 -203 -344 471 -89 -380 -601 145 403 234 2 -621 508 322 443
1564D43l47k84K97K70M31j010K70M4N77O0m22m40J31Q53n61M16q42L8O32L16m23
$$ 443 96 -188 109 379 810 -200 70 114 691 751 329 -111 20 873 312 728 -114 -76 556 872 449
1585D49n92K40q7Q85p62j94k42O99R6k58j33q10P18RJ97l65l66R7K31O21r18k4
$$ 449 -143 97 10 895 133 -61 -303 396 492 234 101 -709 9 18 215 -150 -516 -419 -188 433 -485 -509
1607e09k35N84K73k65l20m05P99j5J04o54j99M75M67o1l54k09l32R95m9k27n17
$$ -509 -744 -160 113 -152 -472 -877 -78 -93 11 -643 -842 -367 100 39 -315 -524 -856 139 90 -137 -654
1628f54K05N30J45m3q15M37J37N15N8o65K9J30N58k63l7n19N36M49j48l51m17
$$ -654 -449 81 226 183 -632 -195 -58 457 515 -150 -121 9 567 304 267 -252 284 733 585 234 -183
1649a83N12j54P48o86l31L65J36N82p28q0n64R95k68K32m48n83O32K00L52j122
$$ -183 329 175 923 237 -94 271 407 989 261 181 -383 612 344 576 128 -455 177 377 729 -393
1669c93K31k56O41J52n10k51k01P48j79L3p68J46N78O7j33n35J35K84P43p01m92
$$ -393 -162 -418 223 375 -135 -386 -587 161 -18 15 -753 -607 -29 38 -95 -630 -495 -211 532 -169 -661
1690f61j49M10O68k66n35m12Q83j4K66n21l42L45J70N90n81j66j16O89K59n39
$$ -661 -810 -400 268 2 -533 -945 -62 -76 190 -331 -673 -328 -158 432 -149 -315 -431 258 517 -22
1710b2k09p4Q04p3r3p66M51L57r0J71m67p8J67P39m67k70N9l08Q95j79q4n90L83
$$ -22 -231 -305 499 426 333 -433 18 375 285 456 -11 -89 78 817 350 80 139 -169 726 547 463 -127 256
1733B56K70J4n4p23K04O2O76n29j43k70L28M99n30j19n92Q11j01M30o74k44K63
$$ 256 526 540 486 -237 -33 29 705 176 33 -237 91 590 60 -59 -651 160 59 489 -185 -429 -166
1754a66J01L95n88p3l57N29J15k03l71k51Q42k55L14q59j5M04L38K99p87J66j82
$$ -166 -65 330 -258 -331 -688 -159 -44 -247 -618 -869 -27 -282 32 -827 -842 -438 -100 199 -588 -422 -604
1775f04Q69l75K49n52J73M77q0Qn90J55M31L02k41n89K47J04O80l62k04l51N08
$$ -604 265 -110 139 -413 -240 237 157 165 -425 -270 161 463 222 -367 -120 -16 664 302 98 -253 255
1796B55J50N7j24n07P03K01M9p09p5L25K75R2q03K10m01P99J47l90k62j34M91
$$ 255 405 462 338 -169 534 735 784 75 0 325 600 692 -111 99 -302 497 644 254 -8 -142 349
1817C49j18K63j038M93J43K10j84k92j28o2P47m89Jl99K95J52J95k34p96N58R8
$$ 349 231 494 -544 -51 92 302 118 -174 -302 -364 383 -106 -105 -504 -209 -57 138 -96 -892 -334 -236
1838b36M76n33j54M2L08L11o27m6k17N41q9L99k50p32R01q3J49k45j48j94P20
$$ -236 240 -293 -447 -405 -97 214 -413 -459 -676 -135 -224 175 -75 -807 94 11 160 -85 -233 -427 293
1859B93K04n94J29k46N96l1p4m37l1O62K1q3l42J02O1M54l20l03J25q5N92l05
$$ 293 497 -97 32 -214 382 351 277 -160 -191 471 492 409 67 169 230 684 364 61 186 101 693 388
1881C88m9o26N25j9K01j53l33Q3J86N22p56J04m11L40L70o3l43m29Q10k32J27
$$ 388 339 -287 238 219 420 267 -66 17 203 725 -31 73 -338 2 372 309 -34 -463 347 115 242
1902B42o47j24K42M13K13q17K65l87P12r2k66k18k29Q13k61P0n44J66J19M78j69
$$ 242 -405 -529 -287 126 339 -478 -213 -600 112 20 -246 -464 -693 120 -141 -71 -615 -449 -330 148 -21
1923b1n05J75j57P09l05j0l10L29L94l52J17p55N03J45N51n55r7P2J55L70m80
$$ -21 -526 -351 -508 201 -104 -114 -424 -95 299 -53 64 -691 -188 -43 508 -47 -144 -72 83 453 -27
1944b7K0l16Q20l8p7k51k13O61o0K21q17K47K5K60K62p22K99k99N41j74o4l05
$$ -27 -7 -323 497 459 382 131 -82 579 519 740 -77 170 195 455 717 -5 294 -5 536 362 298 -7
1966gk17N50R0j10p25M08J43J80k21m21J27j45P94n23j00l83J70L65l4L3n00K96
$$ -7 -224 326 416 306 -419 -11 132 312 91 -330 -203 -348 446 -77 -177 -560 -390 -25 -59 -26 -526 -230
1988b30m6K61k00j41j27J69N48o81K11k84M62RJ60n50rN57L4K33p28J3L33K28
$$ -230 -276 -15 -215 -356 -483 -314 234 -447 -236 -520 -58 -49 111 -439 -448 109 143 376 -352 -339 -6 222
2010B22O0r0j82m58J018k31j49l20K28K61l8Q5m96K99j60L43k34l22L20L7M65
$$ 222 282 192 10 -448 570 339 190 -130 98 359 321 406 -90 209 49 392 158 -164 156 193 658
2031F58j27J3r69N26N01j87l39k82K34P7M10o76J62j24K76J35l74pj00M04m85
$$ 658 531 544 -425 101 602 415 76 -206 28 105 515 -161 1 -123 153 288 -86 -93 -193 211 -274
2052b74K51l44rL62J57J01q41L65k62M00K44l88k40j49O82j27J22n44j4N30J76
$$ -274 -23 -367 -376 -14 143 244 -597 -232 -494 -94 150 -238 -478 -627 55 -72 50 -494 -508 22 198
2073A98l56k82J30J80M50m20n6k24M04M07m04o1m27Q38l91L69l13l91L81J41L27
$$ 198 -158 -440 -310 -130 320 -100 -156 -380 24 431 27 -34 -461 377 -14 355 42 -349 32 173 500
2094E00m62R6j94M00K82l76l8k99M72J84L3n25p4N53j52k9l88J13k38O92l70j99
$$ 500 38 134 -60 340 622 246 208 -91 381 565 598 73 -1 552 400 371 -17 96 -142 550 180 -19
2116a9j08j01M46j48J87m25J45j47M18l49m40K41L3L35l8l24k47M04J88j33q6
$$ -19 -127 -228 218 70 257 -168 -23 -170 248 -101 -541 -300 -267 68 30 -294 -541 -137 51 -82 -168
2137a68m38L50j0K32m04K64j76J25M31n26L6l4K88j41J30j95k46M39J32J57m98
$$ -168 -606 -256 -266 -34 -438 -174 -350 -225 206 -320 -284 -318 -30 -171 -41 -236 -482 -43 89 246 -252
2158b52K09j06N38j46k29J9j13O77m23J20m14K02L95J06k99l94K93n1O29m13k04
$$ -252 -43 -149 389 243 14 33 -80 597 174 294 -120 82 477 583 284 -110 183 132 761 348 144
2179A44j9j42O01m21m3k62M16J30K2m06k14M07O4K72p20N6r3M80K3n24M1k10O77
$$ 144 125 -17 584 163 120 -142 274 404 426 20 -194 213 277 549 -171 -115 -208 272 295 -229 -188 -398 279
2202B79k92J57n60J1K98K43o7m09K9mL71m02L4k34J62N52q9j29n85N24J21Pj01
$$ 279 -13 144 -416 -405 -107 136 69 -340 -311 -315 56 -346 -312 -546 -384 168 79 -50 -635 -111 10 17 -84
2225h4m20L54pN96n09o8j62M05L05l03O4m01N80j08K34n14j14K09L22J75m81J6
$$ -84 -504 -150 -157 439 -70 -138 -300 105 410 107 171 -230 350 242 476 -38 -152 57 379 554 73 89
2247H9j5L40j00K0l34j82O69m77M17m51J45p3M15r2m92L73m05N06k51L6m08M04
$$ 89 74 414 314 334 0 -182 487 10 427 -24 121 48 463 371 -121 252 -153 353 102 138 -270 134
2269A34J32j14R0o93M58j9J10k50L2m7l7N58o04Pk42O35j47l17K1j14M29l80N62
$$ 134 266 152 242 -451 7 -12 98 -152 -120 -167 -204 354 -250 -243 -485 150 3 -314 -293 -407 22 -358 204
2292B04q30K80P2K21L6l40j6J56L67k00K9j99j1K53K05m9o97L99J51O6L19l14
$$ 204 -626 -346 -274 -53 -17 -357 -373 -217 150 -50 -21 -220 -231 22 227 178 -519 -120 31 97 416 102
2314A02k42J85N17k73k08k55M60L9P2j55m58O28j68M23o13q9J95Q5L33n86jk45
$$ 102 -140 45 562 289 81 -174 286 325 397 242 -216 412 244 667 54 -35 160 245 578 -8 -9 -254
2336b54N57q9O4l96k29L74j11L50m19N0l9M88Q9n70J14j45J95p3R7n34K71K66
$$ -254 303 214 278 -118 -347 27 -84 266 -153 -103 -142 346 435 -135 -21 -166 29 -44 53 -481 -210 56
2358E6o3j43j40lp1N18J4l95j97P8M16j75n1l56M03J19J12p3l52L1J82M07m21
$$ 56 -7 -150 -290 -293 -364 154 168 -227 -424 -346 70 -105 -156 -512 -109 10 122 49 -303 -272 -90 317 -104
2381a04R7k22L44j37m3J39l82O41L4q9k81L5J34J23K25n23l4j30P11M1l83j22
$$ -104 -7 -229 115 -22 -65 74 -308 333 367 278 -3 32 166 289 514 -9 -43 -173 538 579 196 74
2403G4m6L55j24%j54N5j17M62k44o35K86J57K42j26k76j01Q1M56l03J4m78L71
$$ 74 28 383 259 259 105 160 43 505 261 -374 -88 69 311 185 -91 -192 -111 345 42 56 -422 -51
2425e1q2K37j89k57K64j45L86l50j08K8J59J89k24k13O8K66j99J01k44R9J57j8
$$ -51 -133 104 -85 -342 -78 -223 163 -187 -295 -267 -108 81 -143 -356 -288 -22 -221 -120 -364 -265 -108 -126
2447a26K21l07J6o9M37k41j32p9J17L18j38J06m08K33J35J2K04k35K6K77L38o19
$$ -126 95 -212 -196 -265 172 -69 -201 -280 -163 155 17 123 -285 -52 83 95 299 64 90 367 705 86
2469H6Rj83M60M8K3j61l33L53p6K08l19o4k7K21Q9k65K28l00K41j7j16l40K88
$$ 86 95 -88 372 420 443 282 -51 302 226 434 115 51 24 245 334 69 297 -3 238 221 105 -235 53
2492E3J78j49K45m37l0j11L83k59q4j77K63K78j42k1l16M67n6j25Rn20L66j02
$$ 53 231 82 327 -110 -140 -251 132 -127 -211 -388 -125 153 11 -10 -326 141 85 -40 -31 -551 -185 -287
2514b87M12l63k60J70L75Q1j64o1o06M79J83K2J4l47K88J85K94o75K42j4M8K52
$$ -287 125 -238 -498 -328 47 128 -36 -97 -703 -224 -41 -19 -5 -352 -64 121 415 -260 -18 -32 16 268
2536B68k54r2j14O77l08pk48l4K33q2L90l60PJ39P6J14o3k39n7M06k20P4m59K65
$$ 268 14 -78 -192 485 177 170 -78 -112 121 39 429 69 76 215 291 405 342 103 46 452 232 306 -153 112
2560A12J42q3J55l30j0J53K15m26R6k37L15K11k54k15m0J80N5K26m54l19K86L56
$$ 112 254 171 326 -4 -14 139 354 -72 24 -213 102 313 59 -156 -196 -16 39 265 -189 -508 -222 134
2582A34j99k12l0QL35p9j7k77q3M12m9K19o96L41N1K76N3n70L07j91O35l60m8
$$ 134 -65 -277 -307 -299 36 -43 -60 -337 -420 -8 -57 162 -534 -193 -142 134 187 -383 -76 -267 368 8 -40
2605d0j63J57L64j84l88J04J34K4M15k93l6jn4L21j29k06j19K59J36j91J15m01
$$ -40 -203 -46 318 134 -254 -150 -16 8 423 130 94 93 39 360 231 25 -94 165 301 110 225 -176
2627a76L28O8K21k38k32Q5P5N7k34K67j37L06m76K93k27%K37j67K14n61J40J62
$$ -176 152 220 441 203 -29 56 131 188 -46 221 84 390 -86 207 -20 -20 217 50 264 -297 -157 5
2649EK01m13M6p6j49M95j52j69k27L17K41k12n1j56J51O6P5j89k2j08J78K21l43
$$ 5 206 -207 -161 -237 -386 109 -43 -212 -439 -122 119 -93 -144 -300 -149 -83 -8 -197 -219 -327 -149 72 -271
2672b71L04l84L35K60o4k76j17L46j08L10n67P8J75J74k55J3K1l29O64l09J64
$$ -271 33 -351 -16 244 180 -96 -213 133 25 335 -232 -154 21 195 -60 -47 -26 -355 309 0 164
2693A64l21L44l4J63J30m16J97n9K36k85l7j9kK73j24j17k33L60k0m3k4j84J10
$$ 164 -157 187 153 316 446 30 227 168 404 119 82 63 61 334 210 93 -140 220 200 157 133 -51 59
2716E9NL95o33J82k07K55J05l35k2j86M16P1r7l43N9j40L76K4k64J56k28K53P8
$$ 59 64 459 -174 8 -199 56 161 -174 -196 -382 34 105 8 -335 -276 -416 -40 -16 -280 -124 -352 -99 -21
2739b1p7j03n1L38j47K1m48K66O1J39r0j31K12k16J90o3k2l6J40L07k99K42l71
$$ -21 -98 -201 -252 86 -61 -40 -488 -222 -161 -22 -112 -243 -31 -247 -57 -120 -142 -178 -38 269 -30 212 -159
2762a59L43j84L33j90j62O6R2J96l37J22Q1K1N4j76j5k76N34j97K60m26K24R8
$$ -159 184 0 333 143 -19 47 139 335 -2 120 201 222 276 100 85 -191 343 146 406 -20 204 302
2784C02n0p8j37L5j65N50m48n4n9N5J30j98K75l21K82l29L26k39o1j0J0M62m59
$$ 302 252 174 37 72 -93 457 9 -45 -104 -49 81 -117 158 -163 119 -210 116 -123 -184 -194 -184 278 -181
2807a81R4o5L1P6j46J04k10L32j89J31l0k58J07P5lj2j53KJ65J10Mk08J0K33J06
$$ -181 -87 -152 -121 -45 -191 -87 -297 35 -154 -23 -53 -311 -204 -129 -132 -144 -297 -295 -130 -20 -16 -224 -214 19 125
2832A25Ll30n8K90N1K13m23M8P5L74k79lj30n2M18k58K65l42J55j10N19o26J79
$$ 125 128 -202 -260 30 81 294 -129 -81 -6 368 89 86 -44 -96 322 64 329 -13 142 32 551 -75 104
2855A04J40k15N7M4J37o13M32o9J11j76j37J46O9K24k57LP7p8k4q2no1K07m9J04
$$ 104 244 29 86 130 267 -346 86 17 128 -48 -185 -39 30 254 -3 0 77 -1 -25 -107 -112 -173 34 -15 89
2880H9m47K33PJ45j6k70J91k40K57j67p9k0lM21j12P6m15K95j52L32j99k89K80
$$ 89 -358 -125 -118 27 11 -259 -68 -308 -51 -218 -297 -317 -320 101 -11 65 -350 -55 -207 125 -74 -363 -83
2903h3JJ09j68r2K18J97P1m7l39oL10J4J33k98k06M72j04K46l07rj79L50K8k7
$$ -83 -82 27 -141 -233 -15 182 253 206 -133 -139 171 185 318 20 -186 286 182 428 121 112 -67 283 311 284
2927B84l53P4K07m3J68m70K79j6K23k68j01n7J48K59j62j59k39J08J75j47O7l16
$$ 284 -69 5 212 169 337 -133 146 130 353 85 -16 -73 75 334 172 13 -226 -118 57 -90 -23 -339
2949c39M08j84J15m2j36j79J60K46q7p7k1J74r1L1j75j90L61o7K29m59J87j36
$$ -339 69 -115 0 -42 -178 -357 -197 49 -38 -115 -136 38 -53 -22 -197 -387 -26 -93 136 -323 -136 -272
2971b72l9L18Ol49J94K38j38J01j53j26M98j34P2k40l4J10Q6K4j39R4l5Q2j05
$$ -272 -311 7 13 -336 -142 96 -42 59 -94 -220 278 144 216 -24 -58 52 138 162 23 117 82 164 59
2994E9J14k29K04L39j93l90M4J09J33K26l30j91K27k23K43mj33J9K8Q5J11j62
$$ 59 173 -56 148 487 294 -96 -52 57 190 416 86 -105 122 -101 142 138 5 24 52 137 248 86
3016H6l40L0K66J75l31J27j67K1K47k06J3j02K61k4n4j68M8J72Q0k89k45K30N4
$$ 86 -254 -224 42 217 -114 13 -154 -133 114 -92 -79 -181 80 56 2 -166 -118 54 134 -155 -400 -170 -116
3039a16K47j36k06q8J91J69k02J60n12M38QK95m06n5K33Q1J06m08J61j06M82j20
$$ -116 131 -5 -211 -299 -108 61 -141 19 -493 -55 -47 248 -158 -213 20 101 207 -201 -40 -146 336 216
3061B16k23j04J14J91l9n0k20K12L1o8K72l66J47j01J71J93k32j20L4J29O9O5
$$ 216 -7 -111 3 194 155 105 -115 97 128 60 332 -34 113 12 183 376 144 24 58 187 256 321
3083C21l84K46l0j19J83l39K96j81J89m8j70j69J2K3K2K31l50J48J51M0k57n9
$$ 321 -63 183 153 34 217 -122 174 -7 182 134 -36 -205 -193 -170 -148 83 -267 -119 32 72 -185 -244
3105b44O0L7K08k68p3O3J84n3l1j68oN53k35Q4j75kL9J61l04J34k9j06K43l05
$$ -244 -184 -147 61 -207 -280 -217 -33 -86 -117 -285 -291 262 27 111 -64 -66 -27 134 -170 -36 -65 -171 72 -233
3129b33K94l02J79K4O2Q2k47J36L6O9J30k22J67j40J00n5k3j12J58M0N6k5k20
$$ -233 61 -241 -62 -38 24 106 -141 -5 31 100 230 8 175 35 135 80 57 -55 103 143 199 174 -46
3152d6J62j01J61j66J15l4l8K17k25K4m9J76j32J37l84L6J08J26J1j50j8K30j41
$$ -46 116 15 176 10 125 91 53 270 45 69 20 196 64 201 -183 -147 -39 87 98 -52 -70 160 19
3175A9k7N3Pl85L92m2Q3m21J84J76j97Kkk8M8J43k11L0k7R1O4k4ml8J61J41j33
$$ 19 -8 45 52 -333 59 17 100 -321 -137 39 -158 -156 -158 -186 -138 5 -206 -176 -203 -112 -48 -72 -76 -114 47 188 55
3202E5Mk83K84j49K42k21j21J08K30l1r6o4L2N1Q7l3k54L06K2R9k07k13K55j66
$$ 55 59 -224 60 -89 153 -68 -189 -81 149 118 22 -42 -10 41 128 95 -159 147 169 268 61 -152 103 -63
3226f3K75j02j18K56k5o9k52L05l92K93K6k6N1k82P2l1L93l29Q7r0L8O1j66J25
$$ -63 212 110 -8 248 223 154 -98 207 -185 108 134 108 159 -123 -51 -82 311 -18 69 -21 17 78 -88 37
3250C7k67M96k91J49k53J4J19J08k43L8k2k51M11j58j99R8o4R7J86k05J08kj22
$$ 37 -230 266 -25 124 -129 -115 4 112 -131 -93 -115 -366 45 -113 -312 -214 -278 -181 5 -200 -92 -94 -216
3273b16J05J21j51O1KP5O8m8k84L96k4KJ08k09Q8p2K13K2j77l2LK26k45l4k09
$$ -216 -111 10 -141 -80 -78 -3 65 17 -267 129 105 107 215 6 94 22 235 257 80 48 51 277 32 -2 -211
3298b11M40o5R9j29j16J32p7J37j73j59J27J26K3m46K79Q7k9J03j21k64J25J27
$$ -211 229 164 263 134 18 150 73 210 37 -122 5 131 154 -292 -13 74 45 148 27 -237 -112 15
3320A5K8J42j82p1L8n7K40j53k36P4J66j4j09r3K89k30N5OO1ml7J17j10k93L61
$$ 15 43 185 3 -68 -30 -87 153 0 -236 -162 4 -10 -119 -212 77 -153 -98 -92 -31 -35 -72 45 -65 -358 3
3345Ck13K52k91K97k26K05K31m42J85j91L25q3K10l50l6N9J99Ro3J5j45L70l70
$$ 3 -210 42 -249 48 -178 27 258 -184 1 -190 135 52 262 -88 -124 -65 134 143 80 95 -50 320 -50
3368e0K68j69J05M5k80L92n05J99K5J99P1l43Q6m6J05r0n1n0K69k4P7j86j43J80
$$ -50 218 49 154 199 -81 311 -194 5 30 229 300 -43 43 -3 102 12 -39 -89 180 156 233 47 -96 84
3392H4k0J22n4k06j62K81j51J97j26k54L99j4l7j74j65L82l60J69j29J9LK79j41
$$ 84 64 186 132 -74 -236 45 -106 91 -35 -289 110 96 59 -115 -280 102 -258 -89 -218 -199 -196 83 -58
3415e8j5k26J55R9j33L09j46k32P4L33k50k12K31q1L99l8j58J21j01Jn4O8j51
$$ -58 -73 -299 -144 -45 -178 131 -15 -247 -173 160 -90 -302 -71 -152 247 209 51 172 71 72 18 86 -65
3438f5O3m9R1J36k09J52j01O9j15J19k10K89J01j21q5m8P5n0K45m13J66P3l0K15
$$ -65 -2 -51 40 176 -33 119 18 87 -28 91 -119 170 271 150 65 17 92 42 287 -126 40 113 83 298
3462B98m06p5K15Q7k03K07o2n1K50j75m6k94M48k47J92k18k94J79K13j41j50J95
$$ 298 -108 -183 32 119 -84 123 61 10 260 85 39 -255 193 -54 138 -80 -374 -195 18 -123 -273 -78
3484g8k01J11J21J8j80l4J99J98j85k11J11q0J62J96l04K06k76K41j60J38o0r8
$$ -78 -279 -168 -47 -29 -209 -243 -44 154 -31 -242 -131 -211 -49 147 -157 49 -227 14 -146 -8 -68 -166
3506a66J96k1O8l50L25j69J81j00J11j04%J00L1L1j43J82J10Jj30j06R8M2M3j70
$$ -166 30 9 77 -273 52 -117 64 -36 75 -29 -29 71 102 133 -10 172 282 283 153 47 145 187 230 60
3530F0N3p6j63M05k11J3l66M14j74J05q5m9o9K34J83n70L57j68J76N7n6p9k23
$$ 60 113 37 -126 279 68 81 -285 129 -45 60 -25 -74 -143 91 274 -296 61 -107 69 126 70 -9 -232
3553b32K76M6Kk01J13L5n2k21n8K88k28K90j36n2N3j37K32l9K69m04L23j59J30
$$ -232 44 90 92 -109 4 39 -13 -234 -292 -4 -232 58 -78 -130 -77 -214 18 -21 248 -156 167 8 138
3576A38l58N6K04P4j25j16J37j15Q8l9K67k72K2J41j58K06j08Rm1m0K33o9j76
$$ 138 -220 -164 40 114 -11 -127 10 -105 -17 -56 211 -61 -39 102 -56 150 42 51 10 -30 203 134 -42
3599d2J24r1P1j57K69m37K47J22O9k45L11l16l0R4m2J25k25M13l08P6j08J39J49
$$ -42 82 -9 62 -95 174 -263 -16 106 175 -70 241 -75 -105 -11 -53 72 -153 260 -48 28 -80 59 208
3622B08j06l16J14J73k3M8j80j06J38J23Qo5j35o2k1J15J98l18J4J62P8j48k04
$$ 208 102 -214 -100 73 50 98 -82 -188 -50 73 81 16 -119 -181 -202 -87 111 -207 -193 -31 47 -101 -305
3645c05K48q7n1L40j86K9j73K49L0j93j7M1O1K38K0l65j6K49L7j01J13%j08J7
$$ -305 -57 -144 -195 145 -41 -12 -185 64 94 -99 -116 -75 -14 224 244 -121 -137 112 149 48 161 161 53 70
3669G0j04K14j62K5n1R0O8l26L65r3NN9k68J55J11nj11N5j94M08j24l8l30K4K91
$$ 70 -34 180 18 43 -8 82 150 -176 189 96 101 160 -108 47 158 153 42 97 -97 311 187 149 -181 -157 134
3694A34j27K18k77q3R4J69O5l42N2j07K13q4n8l25L29J40k04J72j43K5p4M48l05
$$ 134 7 225 -52 -135 -41 128 193 -149 -97 -204 9 -75 -133 -458 -129 11 -193 -21 -164 -139 -213 235 -70
3717g0l1R6k66K19q9J97l47L12J58k42O5j83K29m3Q5R4Nk48J22k2P3o9k57L97
$$ -70 -101 -5 -271 -52 -141 56 -291 21 179 -63 2 -181 48 5 90 184 189 -59 63 41 114 45 -212 185
3741A85mk0j4k02L55k11j1k05K57p5N0l1j60n4J62J24K4n8j7nl78N25j23pp7j71
$$ 185 181 161 147 -55 300 89 78 -127 130 55 105 74 -86 -140 22 146 170 112 95 90 -288 237 114 107 30 -141
3767a41L39l1j02l0r9m1%K49m17M01j26J20j72j62K24R7p0p2r2j04K25K2j67r7
$$ -141 198 167 65 35 -64 -105 -105 144 -273 128 2 122 -50 -212 12 109 39 -33 -125 -229 -4 18 -149 -246
3791b46K25j23K39p8K11k43q9R1Q8j29J95L5l4k45K32j29j3Q9j30K21j81K8L7
$$ -246 -21 -144 95 17 228 -15 -104 -13 75 -54 141 176 142 -103 129 0 -13 76 -54 167 -14 14 51
3814E1J48k09j03J77q3L29l72J61k95L53J02k83j46Q7pJ16J06k49L82l26J57m4
$$ 51 199 -10 -113 64 -19 310 -62 99 -196 157 259 -24 -170 -83 -90 26 132 -117 265 -61 96 52
3836E2j40K00k50M20k11P3j17k2K4O2J19k49M5j55J83m2j55j74P4K20Q8k13r1
$$ 52 -88 112 -138 282 71 144 27 5 29 91 210 -39 6 -149 34 -8 -163 -337 -263 -43 45 -168 -259
3859b59J45kJ54k6l61K00l4K23j63P6o1P8K73l69K65l13K4J86Lk81J57L2j4J72
$$ -259 -114 -116 38 12 -349 -149 -183 40 -123 -47 -108 -30 243 -126 139 -174 -150 36 39 -242 -85 -53 -67 105
3883A05k3q1r3L6K10j21J18J3K4q8N0p6j53l7K66N6k41MLK06p1j7m9o0J49J1l04
$$ 105 82 1 -92 -56 154 33 151 164 188 100 150 74 -79 -116 150 206 -35 -31 -28 178 107 90 41 -19 130 141 -163
3910a63J35J69k92J38Ro4m4J44l4j18P0l07J76J92k05J2L7J69r9L95l70l8P5k40
$$ -163 -28 141 -151 -13 -4 -68 -112 32 -2 -120 -50 -357 -181 11 -194 -182 -145 24 -75 320 -50 -88 -13 -253
3934b53K82k38K72k67L94k02k31j8R0L23k79J40k54M2K15O2l47K1L46l17J07P
$$ -253 29 -209 63 -204 190 -12 -243 -261 -171 152 -127 13 -241 -199 16 78 -269 -248 98 -219 -112 -105
3956a05K84k67rK56l12J96j81N4P1J59q8j50J49o2J69Rq9j37J40R8k46K10k99
$$ -105 179 -88 -97 159 -153 43 -138 -84 -13 146 58 -92 57 -5 164 173 84 -53 87 185 -61 149 -150
3979a50K28nJ70j92q8K09j08M7j2k74n9N83l44n2J21m9O3j20J37l09K47j60J28
$$ -150 78 73 243 51 -37 172 64 111 99 -175 -234 349 5 -47 74 25 88 -32 105 -204 43 -117 11
4002A1mn1J18l9o2j83K79j60N9j56Q9O0k92K74K30j8j38n3P9n2J33l36J80j05
$$ 11 7 -44 74 35 -27 -210 69 -91 -32 -188 -99 -39 -331 -57 173 155 17 -36 43 -9 124 -212 -32 -137
4026a37K35j41J94j29N6qK1N2M0j21o8J46Q3l10J63j28j5J48PKJ48k08m6J91k11
$$ -137 98 -43 151 22 78 70 91 143 183 62 -6 140 223 -87 76 -52 -67 81 88 90 238 30 -16 175 -36
4051c6J23j56K52j07j50k0J78K73m19J51j71p0K78q9j73q4M21j04o7k3k1j94K33
$$ -36 87 -69 183 76 -74 -94 84 357 -62 89 -82 -152 126 37 -136 -220 201 97 30 7 -14 -208 25
4074B5O0k16N5r1J68M3j64k08L31k5l4P1m6P6j21Q2K07k16k21J81O4J39L7l63
$$ 25 85 -131 -76 -167 1 44 -120 -328 3 -22 -56 15 -31 45 -76 6 213 -3 -224 -43 21 160 197 -166
4098a66n7j5J98L02m49L87j93J74j4j0Pk38J04n1O4j31J57j66J93L8j59Q3K32
$$ -166 -223 -238 -40 262 -187 200 7 181 167 157 164 -74 30 -21 43 -88 69 -97 96 134 -25 58 290
4121B90j29j62J63m7m5p6J12K4k28J22j16J84q3q2P0qM8L2k34J30K25k26L7l0
$$ 290 161 -1 162 115 70 -6 106 130 -98 24 -92 92 9 -73 -3 -11 37 69 -165 -35 190 -36 1 -29
4145b9J7o4N7O1p6j02L3rK96j57l7l20M02k47R6j46J57P0j19J66j17R5j14m3m
$$ -29 -12 -76 -19 42 -34 -136 -103 -112 184 27 -10 -330 72 -175 -79 -225 -68 2 -117 49 -68 27 -87 -130 -134
4170a34q0K35N3p9r6o9l2J46O7K70l87J45N6O3K5j43m1k3J99k7j19r8N9n8J34
$$ -134 -214 21 74 -5 -101 -170 -202 -56 11 281 -106 39 95 158 183 40 -1 -24 175 148 29 -69 -10 -68 66
4195F6m3p5J57J20m4l51k9K59rj0p7j58K5J38J65L0k20J58j19p9K44k23lK14k17
$$ 66 23 -52 105 225 181 -170 -199 60 51 41 -36 -194 -169 -31 134 164 -56 102 -17 -96 148 -75 -78 136 -81
4220h1J53j50Q0n1M0M6j88K04k55K13M6o7k29L4J20m7K42j86j5r2L15k09L21m00
$$ -81 72 -78 2 -49 -9 37 -151 53 -202 11 57 -10 -239 -205 -85 -132 110 -76 -91 -183 132 -77 244 -156
4244a56l4K18j25Q1q7M1l3M9P1j01J01m9Q5j18N0j02O1J08r1K27k32J87n6M2m1
$$ -156 -190 28 -97 -16 -103 -62 -95 -46 25 -76 25 -24 61 -57 -7 -109 -48 60 -31 196 -36 151 95 137 96
4269I6p5N0J77j67Oj5OJ62j41j43J79j71J97k20K41k85J15L4p9J05o6P1j88K81
$$ 96 21 71 248 81 87 72 78 240 99 -44 135 -36 161 -59 182 -103 12 46 -33 72 6 77 -111 170
4293A70k24K32l79K63RP6j32J2m3j16K64k30l4K44Q6j02j46Jp5jK68p9k06j3J64
$$ 170 -54 178 -201 62 71 147 15 27 -16 -132 132 -98 -132 112 198 96 -50 -49 -124 -125 143 64 -142 -155 9
4318IL4j4m7j45K63p8M1p2j26O4m2J10q5N9J31l6J15j77j05N7K24n0p3j06L1q7
$$ 9 43 29 -18 -163 100 22 63 -9 -135 -71 -113 -3 -88 -29 102 66 181 4 -101 -44 180 130 57 -49 -18 -105
4344a05L41j76J96j69r1J25p5J29j81O5J03Q0j30m7j93M4K96l73J58j07K24r2
$$ -105 236 60 256 87 -4 121 46 175 -6 59 162 242 112 65 -128 -84 212 -161 -3 -110 114 22
4366B2p0Rk8Q9k28K87j01N3k64K43n0J75j59j00J81m1K28j81n3j5m7o9J7J57j58
$$ 22 -48 -39 -67 22 -206 81 -20 33 -231 12 -38 137 -22 -122 59 18 246 65 12 -3 -50 -119 -102 55 -103
4391a03J26j56J27J03k7r2J2k8k34K38j01P6j9J10o7Q7L8k9L2k61J72Q1O5j14
$$ -103 23 -133 -6 97 70 -22 -10 -38 -272 -34 -135 -59 -78 32 -35 52 90 61 93 -168 4 85 150 36
4415C6j06J39p0J69n4j91q2K27J81j87j25K8K97l84P6j9J87m2p3l9K2JN2J69k43
$$ 36 -70 69 -1 168 114 -77 -159 68 249 62 -63 -35 262 -122 -46 -65 122 80 7 -32 -10 -9 43 212 -31
4440c1J58j97J92J0k35M0m3P0J38k14L57l05N7n9R0Q5j87J32k91J32l9J63j66
$$ -31 127 -70 122 132 -103 -63 -106 -36 102 -112 245 -60 -3 -62 28 113 -74 58 -233 -101 -140 23 -143
4463a43J59p8R9j86J05J76j01R2l51J94p3r3L20k35J77l2Q8j36Nk5o7J62o7N7
$$ -143 16 -62 37 -149 -44 132 31 123 -228 -34 -107 -200 120 -115 62 30 118 -18 -13 -38 -105 57 -10 47
4487D7j36O2MR7q5o4K36j57j4L15j00n8K9l7j77J26k13J09j2kJ94j76L7K3j5o6
$$ 47 -89 -27 -23 74 -11 -75 161 4 -10 305 205 147 176 139 -38 88 -125 -16 -28 -30 164 -12 25 48 33 -33
4513c3nj96J27J42k07K71k03L2O6K07j86q0m6l8J30m0K3m1J09j81J11n1M7Q8k42
$$ -33 -38 -234 -107 35 -172 99 -104 -72 -6 201 15 -65 -111 -149 -19 -59 -36 -77 32 -149 -38 -89 -42 46 -196
4538a96L06k25J33j69Q7O2j58K17j49K35r0J36k74J26J76j77p2l0J3J60P2l81
$$ -196 110 -115 18 -151 -64 -2 -160 57 -92 143 53 189 -85 41 217 40 -32 -62 -49 111 183 -198
4560a98K26J96q2j24j59K71r0mO1j88J50k8n0k7J81k20J82N3j90K6L5N5r1R1O2
$$ -198 28 224 142 18 -141 130 40 36 97 -91 59 31 -19 -46 135 -85 97 150 -40 -14 21 76 -15 76 138
4585A38q6M7p8j60K53q8r1NK8J61k64J39k6m1K71k19k06J29J22k5K1J49l33qM2
$$ 138 52 99 21 -139 114 26 -65 -60 -32 129 -135 4 -22 -63 208 -11 -217 -88 34 9 30 179 -154 -162 -120
4610a20Q3j66P6J06j33J09L7P4j89J65j44K46j80j35K29N7j45K21j3j76K6q2K23
$$ -120 -37 -203 -127 -21 -154 -45 -8 66 -123 42 -102 144 -36 -171 58 115 -30 191 178 2 28 -54 169
4633A69k02Q5j5K2P8l52L41K2m9k9r2R6j69J90k74L48j52Q4jr4J70j27m6P1j2
$$ 169 -33 52 37 59 137 -215 126 148 99 70 -22 74 -95 95 -179 169 17 101 100 6 176 49 3 74 62
4658F2J7j89J85k73J96L7J11k91L42k03l9N5m8q8n0K62k11J51pj09J86n6j05R6
$$ 62 79 -110 75 -198 -2 35 146 -145 197 -6 -45 10 -38 -126 -176 86 -125 26 19 -90 96 40 -65 31
4682C1j41J56nq2L4l8k24K69j01J81l9O5j92J53j02j55J16J43k5OL9R9l15K2K63
$$ 31 -110 46 41 -41 -7 -45 -269 0 -101 80 41 106 -86 67 -35 -190 -74 69 44 50 89 188 -127 -105 158
4707A58j51N6M6j39O5j2k9J87q2J99l39L9M9J09j83K42r7j30K01k48J49L7J37
$$ 158 7 63 109 -30 35 23 -6 181 99 298 -41 -2 47 156 -27 215 118 -12 189 -59 90 127 264
4730B64j90j67L09m9k26J37k6K4k6o4pj7nj91K29K8n4M0j49K87J9l83Q1J90j5
$$ 264 74 -93 216 167 -59 78 52 76 50 -14 -21 -38 -43 -234 -5 23 -31 9 -140 147 166 -217 -136 54 39
4755C9l4Kk93J50K9J62r7q5L6J33P6j65o8J37P9k19N4N6j81J64J96j11J63l36
$$ 39 5 7 -286 -136 -107 55 -42 -127 -91 42 118 -47 -115 22 101 -118 -64 -8 -189 -25 171 60 223 -113
4779a13J08o3R7j11J70QQ6r0j6J67k54P5j17J15j88J08J19p5R0q9j82k1K97l2
$$ -113 -5 -68 29 -82 88 96 182 92 76 243 -11 64 -53 62 -126 -18 101 26 116 27 -155 -176 121 89
4803H9%J24j76j16L7J36N5j79M7Jp0J24p1j91K35p4m0o4k0J81pq0N8j83J75j0
$$ 89 89 213 37 -79 -42 94 149 -30 17 18 -52 72 1 -190 45 -29 -69 -133 -153 28 21 -59 -1 -184 -9 -19
4829a9j01K6K7j34K21k60K14J50j57J36l07L01j67%k01J42l4L13j65q4L20l72
$$ -19 -120 -94 -67 -201 20 -240 -26 124 -33 103 -204 97 -70 -70 -271 -129 -163 150 -15 -99 221 -151
4851a51L8RJ46O0j15j46L94l36J93J03l02R6J39j1mj9JO3j77k8J20l5J07j21K
$$ -151 -113 -104 42 102 -13 -159 235 -101 92 195 -107 -11 128 117 113 94 95 158 -19 -47 73 38 145 24 26
4876B6P1k6k47J89j26J70N0k07q4M07l14qK00k40J71k44K04L1J23l81K91p7n6
$$ 26 97 71 -176 13 -113 57 107 -100 -184 223 -91 -99 101 -139 32 -212 -8 23 146 -235 56 -21 -77
4899g7J08p1L3j3Lm3N8%l9j66J39o2L18k49J4J94k43J13j33j8j0K10q3rJ7o4K31
$$ -77 31 -40 -7 -20 -17 -60 -2 -2 -41 -207 -68 -130 188 -61 -47 147 -96 17 -116 -134 -144 66 -17 -26 -9 -73 158
4926A58l30J92O6m3L7j51K07l9r7M6L9j13K5J31k1KJ0O6N1k46K85j88j82M8L3
$$ 158 -172 20 86 43 80 -71 136 97 0 46 85 -28 -3 128 107 109 119 185 236 -10 275 87 -95 -47 -14
4951a4q1Q6R0j41J87l8q5j11kNK66j47P6K0k13r9J67J47k56K24j80k4K18K4k21
$$ -14 -95 -9 81 -60 127 89 4 -107 -109 -104 162 15 91 111 -102 -201 -34 113 -143 81 -99 -123 95 119 -102
4976a02L4J36j11n6k1J72j6j14J6n8K1J12k2j0K4o7NJ80j66J77q2k5l0P9k23J74
$$ -102 -68 68 -43 -99 -120 52 36 -78 -62 -120 -99 13 -9 -19 5 -62 -57 123 -43 134 52 27 -3 76 -147 27
5002B7M4K8N1m2L0j22j3m6K17j64L7Q1o8j1q4j36R3r1K75K6k43L02r8kJ0l2M4
$$ 27 71 99 150 108 138 16 3 -43 174 10 47 128 60 49 -35 -171 -78 -169 106 132 -111 191 93 91 101 69 113
5029A13j38m4J38M6j86Q2j12J55J38j63j41J13P8j34K9j03J03M3l8j51J67Oro1
$$ 113 -25 -69 69 115 -71 11 -101 54 192 29 -112 1 79 -55 -26 -129 -26 17 -21 -172 -5 1 -8 -69
5053f9K07j18n8R1r7P9k17J80K2l5QjQO8N4m9j46K8K26j35j64K78k14J95j15n6
$$ -69 138 20 -38 53 -44 35 -182 -2 20 -15 -7 -8 0 68 122 73 -73 -45 181 46 -118 160 -54 141 26 -30
5079c0j2J71o5p6K29k66R7l6O8j03j85K37J47p3qL9k42J23rK16l0j61j5j57K18
$$ -30 -42 129 64 -12 217 -49 48 12 80 -23 -208 29 176 103 95 134 -108 15 6 222 192 31 16 -141 77
5104G7j68j0L1J12KO6L0n8n2K4k02K16j49k7J00J64k35J78Lk07J64k13J32j14
$$ 77 -91 -101 -70 42 44 110 140 82 30 54 -148 68 -81 -108 -8 156 -79 99 102 -105 59 -154 -22 -136
5128a36P6k27K80j28O4j49K42j66J41k20K50Oj89K30o3r4j34K43L0j09K46l45
$$ -136 -60 -287 -7 -135 -71 -220 22 -144 -3 -223 27 33 -156 74 11 -83 -217 26 56 -53 193 -152
5150a52M9K30k16J01qk61L53j22M5J12j19p1Q0N1j41K23j29j2J90n3m9K4r8J67
$$ -152 -103 127 -89 12 4 -257 96 -26 19 131 12 -59 21 72 -69 154 25 13 203 150 101 125 27 194
5174A94k74J84p9K05r6j90j9J2n2J89k1p3k0K47k25K24j87k20K46j49J65k4J25
$$ 194 -80 104 25 230 134 -56 -75 -63 -115 74 53 -20 -40 207 -18 206 19 -201 45 -104 61 37 162
5197A62k68J07n2Q9j88K15j54J31J34m86J95J94j22j41K51j33K34k03q3P3QQ9
$$ 162 -106 1 -51 38 -150 65 -89 42 176 -310 -115 79 -43 -184 67 -66 168 -35 -118 -45 -37 52
5219E2j72O1J16j33J16l4OL3J9p2j3L2j20K63j53L3K33j55k56L28p2k45J09Q6
$$ 52 -120 -59 57 -76 40 6 12 45 64 -8 -21 11 -109 154 1 34 267 112 -144 184 112 -133 -24 62
5243F2o1J12q7J6j33P8j61K91q1J4j3M3j04N4j34J43K0k9pj38J46J8J0p0K7j60
$$ 62 1 113 26 42 -91 -13 -174 117 36 50 37 80 -24 30 -104 39 59 30 23 -115 31 49 59 -11 16 -144
5269a44R3q0n2J63O4j91J66P9l05J37K29l28J22n1L27k99J99j19KR4j44P6j06
$$ -144 -51 -131 -183 -20 44 -147 19 98 -207 -70 159 -169 -47 -98 229 -70 129 10 12 106 -38 38 -68
5292f8J95k41J35k16J62L6k03J32O3J72j9o4k98K08O8j42N2J47j49L13j09o1j92
$$ -68 127 -114 21 -195 -33 3 -200 -68 -5 167 148 84 -214 -6 62 -80 -28 119 -30 283 174 113 -79
5315g9K18j31J18k42P3J61q3K29l62O1K1J34j70K01J56l20J64j03m0k17K48O5
$$ -79 139 8 126 -116 -43 118 35 264 -98 -37 -16 118 -52 149 305 -15 149 46 6 -211 37 102
5337A02j01J83l57M0k2J97j21L9J31K4r9j26K36p4j40j01K40K9r9L5p0K6J85j79
$$ 102 1 184 -173 -133 -155 42 -79 -40 91 115 16 -110 126 52 -88 -189 51 80 -19 16 -54 -28 157 -22
5361b2k48K23O8L3j00j89l4Q0J25q5l5o6M13j64L8R8j09j6L3Q1k23J80k16J06
$$ -22 -270 -47 21 54 -46 -235 -269 -189 -64 -149 -184 -250 163 -1 37 135 26 10 43 124 -99 81 -135 -29
5385b9p6K39j64J69J60j06j38J60k23J38j70K54k96N3J94j76n9M8j0j7J37%j65
$$ -29 -105 134 -30 139 299 193 55 215 -8 130 -40 214 -82 -29 165 -11 -70 -22 -32 -49 88 88 -77
5408g7J04J9l9J29j88j42J90K7p1J01j55Q3J3o5r5J52j6R1j00L8J59k56J34M0
$$ -77 27 46 7 136 -52 -194 -4 23 -48 53 -102 -19 -6 -71 -166 -14 -30 61 -39 -1 158 -98 36 76
5432G6j72K6J55j96J11Kq4j38J48J22j01j85R9J39L6k3K78m74J88pj20J85j11
$$ 76 -96 -70 85 -111 0 2 -82 -220 -72 50 -51 -236 -137 2 38 15 293 -181 7 0 -120 65 -46
5455d6J01o7N2Q5k60o5K94j3R1j52k5O5j67K99j45j2K1j07Q5KP6m1l3k07M8N1
$$ -46 55 -12 40 125 -135 -200 94 81 172 20 -5 60 -107 192 47 35 56 -51 34 36 112 71 38 -169 -121 -70
5481g0O8J20r3k41K90J9j42L4o0q2K74k40J39JJn1j68L72k31J22k53N0L56m02
$$ -70 -2 118 25 -216 74 93 -49 -15 -75 -157 117 -123 16 17 18 -33 -201 171 -60 62 -191 -141 215 -187
5505a87J04J59j32L1J58j06j37O7J2j60K50j26p4q0L85K0j16j17K3pJ3k35K44
$$ -187 -83 76 -56 -25 133 27 -110 -43 -31 -191 59 -67 -141 -221 164 184 68 -49 -26 -33 -20 -255 -11
5528a1N6N5j01J70k27O5k2L9J24k59O5n2J85j68J10j10J48r3l1K17l27K10L0R9
$$ -11 45 100 -1 169 -58 7 -15 24 148 -111 -46 -98 87 -81 29 -81 67 -26 -57 160 -167 43 73 172
5552A72q7p1M1j55K67j43j86L42j99K27p7r1ll6m6r1q2J02P4k10J98o4K12J4j40
$$ 172 85 14 55 -100 167 24 -162 180 -19 208 131 40 37 1 -45 -136 -218 -116 -42 -252 -54 -118 94 108 -32
5577c2M7j3O7j71J38pp2o3K3r8P4J31j55K39j27q2J80K3j38J53j98N9Q1k3m2o0
$$ -32 15 2 69 -102 36 29 -43 -106 -83 -181 -107 24 -131 108 -19 -101 79 102 -36 117 -81 -22 59 36 -6 -66
5603f6P9o1N8r7K32p7Po8M0M0n2R6l50J14K22n4L8k23K33k66J24K8J7K01j90L2
$$ -66 13 -48 10 -87 145 68 75 7 47 87 35 131 -219 -105 117 63 101 -122 111 -155 -31 -3 14 215 25 57
5629E7L7O3o9k23K27r0j40J8n4Q7J23j28j9J46j99J04q5M7J86J34j22k41oN1K55
$$ 57 94 157 88 -135 92 2 -138 -120 -174 -87 36 -92 -111 35 -164 -60 -145 -98 88 222 100 -141 -147 -96 159
5654A59m12J70PM5Q5k53L50J7j65o3J8lJ50L3j49P5J6m3j60J35J67l7l97M14k81
$$ 159 -253 -83 -76 -31 54 -199 151 168 3 -60 -42 -45 105 138 -11 64 80 37 -123 12 179 142 -255 159 -122
5679a22k7K30j88J39L9j61J82nj8K28j01l51J50r3J79j06J42K2N1l9p3J66l39
$$ -122 -149 81 -107 32 71 -90 92 87 69 297 196 -155 -5 -98 81 -25 117 139 190 151 78 244 -95
5702i5LQ6N2J54k08L84l07k86K37L5Rl0K4m8J5q0J11P1L0l29J28L6P0l0m4L12
$$ -95 -92 -6 46 200 -8 376 69 -217 20 55 64 34 58 10 25 -55 56 127 157 -172 -44 -8 62 32 -12 300
5728C00k71J50j57p8r9K80k22Q0o4o4J6J08K7J79l47Q8J05j29O2l9K20j40N4q5
$$ 300 29 179 22 -56 -155 125 -97 -17 -81 -145 -129 -21 6 185 -162 -74 31 -98 -36 -75 145 5 59 -26
5752b6L4K5j41M5J39j94K38j3L4k16m7Q4J12l0j28j58L35m7K4j90K09k31Q9K25
$$ -26 8 33 -108 -63 76 -118 120 107 141 -75 -122 -38 74 44 -84 -242 93 46 70 -120 89 -142 -53 172
5776A72l24R7j04K57k08K28k27L45k57K8l9j3K9J63oj76J29n1m1L1j00Pn5K64
$$ 172 -152 -55 -159 98 -110 118 -109 236 -21 7 -32 -45 -16 147 141 -35 94 43 2 33 -67 -60 -115 149
5800A49k44R1l4m6J97k28J74l92K83L7L7L8j77N7j49K58k20rJ00q9J41k5J90l09
$$ 149 -95 -4 -38 -84 113 -115 59 -333 -50 -13 24 62 -115 -58 -207 51 -169 -178 -78 -167 -26 -51 139 -170
5824a70K39P0j81N7k57K56J9K3k5J02o2L3L5M5r6j28K36k29K87k99j4j14J29J56
$$ -170 69 139 -42 15 -242 14 33 56 31 133 71 104 139 184 88 -40 196 -33 254 -45 -59 -173 -44 112
5848A12jn6NR9q9j8K9j67QJ66Mj36p0K01k8j46j9KJ58j77R9o4j11J91k3j90K45
$$ 112 111 55 60 159 70 52 81 -86 -78 88 92 -44 -114 87 59 -87 -106 -104 54 -123 -24 -88 -199 -8 -31 -221 24
5875B4j50J91j98K61j06j01O1j14J95o6n0j09K04j27L5K16j15j04q4L87j67j17
$$ 24 -126 65 -133 128 22 -79 -18 -132 63 -3 -53 -162 42 -85 -50 166 51 -53 -137 250 83 -34
5897c4P0r3jJ17m9o3K46j71J39j88R3J47j83qk4l4J08o7L2j26K21L1j30P7j05
$$ -34 36 -57 -58 59 10 -53 193 22 161 -27 66 213 30 22 -2 -36 72 5 37 -89 132 163 33 110 5
5922EM5J73Nj0j26k14J96j94K11l3q1j60J95M1j03J39m22K82p9J33j28J03k0Q8
$$ 5 50 223 228 218 92 -122 74 -120 91 58 -23 -183 12 53 -50 89 -333 -51 -130 3 -125 -22 -42 46
5946D6J69l99K20j50n5J30O5J0k37K29j00J02J32k26J01j05J54j83J93k06N8K25
$$ 46 215 -184 36 -114 -169 -39 26 36 -201 28 -72 30 162 -64 37 -68 86 -97 96 -110 -52 173
5968A73k30o5J88P0r5j33J36O6n6o3p5K76l35J32M0L2j65J13Q3j68M0N9r4K79
$$ 173 -57 -122 66 136 41 -92 44 110 54 -9 -84 192 -143 -11 29 61 -104 9 92 -76 -36 23 -71 208
5992B08j23K3J3j16p4N4J23k44J53K1o1J03j41k3P4Q5j57K51j97P3j24j38K01
$$ 208 85 108 121 5 -69 -15 108 -136 17 38 -23 80 -61 -84 -10 75 -82 169 -28 45 -79 -217 -16
6015a6K00j2l8k9q3O9k01P4J0k7J71l53K35o5P3M3j35p5J4J95q9K61k93R4j11
$$ -16 184 172 134 105 22 91 -110 -36 -26 -53 118 -235 0 -65 8 51 -84 -159 -145 50 -39 222 -71 23 -88
6040h8K3j36M3J63j9J04j5J7q1J24l47N9M5J54J93m07K06P6k31O9n9J09Q1j53
$$ -88 -65 -201 -158 5 -14 90 75 92 11 135 -212 -153 -108 46 239 -168 38 114 -117 -48 -107 2 83 -70
6064g0n4K03o2K9j51J19M4r3J26m4M1j59J08J4k75L80j25j27O6j94K42j32K49
$$ -70 -124 79 17 46 -105 14 58 -35 91 47 88 -71 37 51 -224 156 31 -96 -30 -224 18 -114 135
6087A35p3q7QM0M6j02J24k16k7P4P0J61j56j03l7p3J24O8r8J42o2Q5j33J25o2
$$ 135 62 -25 -17 23 69 -33 91 -125 -152 -78 -8 153 -3 -106 -143 -216 -92 -24 -122 20 -42 43 -90 35 -27
6112b7R7N7j04R7j35J02n2P3j18m4P7P9n2J8j85J62J25l27J24j0K48j33p7K9N4
$$ -27 70 127 23 120 -15 87 35 108 -10 -54 23 102 50 68 -117 45 170 -157 -33 -43 205 72 -5 24 78
6137G8j55J85k09MR3l4L0j05P5n5J10n9M6N7K0j50K03q1%j37j9K12k79J62J39
$$ 78 -77 108 -101 -97 -4 -38 -8 -113 -38 -93 17 -42 4 61 81 -69 134 53 53 -84 -103 109 -170 -8 131
6162A31j72J21j05Pj53J61j6J00q7j9k8qJ05P5k61j7K59j12j29J68j84K35n6r
$$ 131 -41 80 -25 -18 -171 -10 -26 74 -13 -32 -60 -68 37 112 -149 -166 93 -19 -148 20 -164 71 15 6
6186FL8j1j52mn0L12m9j75P6k8J50k72J73l8kOj2J15j23K22q8q2l7J15J28j89
$$ 6 44 33 -119 -123 -173 139 90 -85 -9 -37 113 -159 14 -24 -26 -20 -32 83 -40 182 94 12 -25 90 218 29
$$ [...]
8191c7
##END NTUPLES=NMR FID
##END=
