##TITLE=1H_Pr 4687-st
 CDCl3
 8 sc, 
 14.12.2021
##JCAMPDX= 6.0         $$ Bruker NMR JCAMP-DX V2.0
##DATA TYPE= NMR FID
##DATA CLASS= NTUPLES
##ORIGIN= UXNMR, Bruker Analytische Messtechnik GmbH
##OWNER= root
$$ XWIN-NMR		Version 3.5
$$ Tue Dec 14 11:13:33 2021 Russian Standard Time (UT+4h)  she@DPX200
##.OBSERVE FREQUENCY= 200.131346
##.OBSERVE NUCLEUS= ^1H
##.DELAY= (6, 6)
##.ACQUISITION MODE= SIMULTANEOUS
##.ACQUISITION SCHEME= undefined
##.AVERAGES= 8
##.DIGITISER RES= 18
##SPECTROMETER/DATA SYSTEM= spect
##.PULSE SEQUENCE= zg30
##.SOLVENT NAME= CDCl3
##.SHIFT REFERENCE= (INTERNAL, CDCl3, 0, 15.7039)
##AUDIT TRAIL= $$ (NUMBER, WHEN, WHO, WHERE, WHAT)
$$ ##TITLE= Audit trail, XWIN-NMR		Version 3.5
$$ ##JCAMPDX= 5.01
$$ ##ORIGIN= Bruker BioSpin GmbH
$$ ##OWNER= she
$$ F:/spectra/data/she/nmr/H-F/1/audita.txt
$$ ##AUDIT TRAIL=  $$ (NUMBER, WHEN, WHO, WHERE, WHAT)
(   1,<2021-12-14 11:12:34.87 +0400>,<she>,<DPX200>,
      <created by zg, POWCHK disabled, PULCHK disabled
       configuration hash MD5:
       00 E9 B6 7A A2 85 ED C7 34 08 36 98 17 FE 4E 26
       data hash MD5: 16K
       A1 6D 00 9E 71 CE 50 7C AC CB 76 ED BC 5D 79 4D>)
$$ ##END=
$$ 
$$ hash MD5
$$ D0 33 61 12 95 2F 45 59 F6 F1 56 43 89 C1 9D AA
##$RELAX= 
##$RELAX= 
##$RELAX= 
##$RELAX= 
##$RELAX= 
##$RELAX= 
$$ Bruker specific parameters
$$ --------------------------
##$DU= <F:/spectra>
##$EXPNO= 1
##$NAME= <H-F>
##$PROCNO= 1
##$TYPE= <nmr>
##$USER= <she>
##$AMP= (0..31)
100 100 100 100 100 100 100 100 100 100 100 100 100 100 100 100 100 100 
100 100 100 100 100 100 100 100 100 100 100 100 100 100 
##$AQSEQ= 0
##$AQ_mod= 1
##$AUNM= <au_zg>
##$AUTOPOS= <>
##$BF1= 200.13
##$BF2= 200.13
##$BF3= 200.13
##$BF4= 200.13
##$BF5= 200.13
##$BF6= 200.13
##$BF7= 200.13
##$BF8= 200.13
##$BYTORDA= 1
##$CFDGTYP= 0
##$CFRGTYP= 5
##$CHEMSTR= <none>
##$CNST= (0..31)
1 1 145 1 1 1 1 1 1 1 1 1 1 1 1 1 1 1 1 1 1 1 1 1 1 1 1 1 1 1 1 1 
##$CPDPRG= <>
##$CPDPRG1= <>
##$CPDPRG2= <>
##$CPDPRG3= <>
##$CPDPRG4= <mlev>
##$CPDPRG5= <mlev>
##$CPDPRG6= <mlev>
##$CPDPRG7= <mlev>
##$CPDPRG8= <mlev>
##$CPDPRGB= <>
##$CPDPRGT= <>
##$D= (0..31)
0 1.2 0 0 0 0 0 0 0 0.06 0 0.03 0 0 0 0 0.0002 0 0 0 0 0 0 0 0 0 0 0 0 
0 0 0 
##$DATE= 1639465954
##$DBL= (0..7)
120 120 120 120 120 120 120 120 
##$DBP= (0..7)
150 150 150 150 150 150 150 150 
##$DBP07= 0
##$DBPNAM0= <>
##$DBPNAM1= <>
##$DBPNAM2= <>
##$DBPNAM3= <>
##$DBPNAM4= <>
##$DBPNAM5= <>
##$DBPNAM6= <>
##$DBPNAM7= <>
##$DBPOAL= (0..7)
0.5 0.5 0.5 0.5 0.5 0.5 0.5 0.5 
##$DBPOFFS= (0..7)
0 0 0 0 0 0 0 0 
##$DE= 6
##$DECBNUC= <off>
##$DECIM= 32
##$DECNUC= <off>
##$DECSTAT= 4
##$DIGMOD= 1
##$DIGTYP= 9
##$DL= (0..7)
0 120 120 120 120 120 120 120 
##$DP= (0..7)
150 150 150 150 150 150 150 150 
##$DP07= 0
##$DPNAME0= <>
##$DPNAME1= <>
##$DPNAME2= <>
##$DPNAME3= <>
##$DPNAME4= <>
##$DPNAME5= <>
##$DPNAME6= <>
##$DPNAME7= <>
##$DPOAL= (0..7)
0.5 0.5 0.5 0.5 0.5 0.5 0.5 0.5 
##$DPOFFS= (0..7)
0 0 0 0 0 0 0 0 
##$DQDMODE= 0
##$DR= 18
##$DS= 0
##$DSLIST= <SSSSSSSSSSSSSSS>
$$ [...]
##$SUBNAM2= <"">
##$SUBNAM3= <"">
##$SUBNAM4= <"">
##$SUBNAM5= <"">
##$SUBNAM6= <"">
##$SUBNAM7= <"">
##$SUBNAM8= <"">
##$SUBNAM9= <"">
##$SW= 18.0517287032376
##$SWIBOX= (0..15)
0 0 2 0 0 0 0 0 0 0 0 0 0 0 0 0 
##$SW_h= 3612.71676300578
##$TD= 16384
##$TD0= 1
##$TE= 0
##$TE2= 300
##$TE3= 300
##$TEG= 300
##$TL= (0..7)
0 120 120 120 120 120 120 120 
##$TP= (0..7)
150 150 150 150 150 150 150 150 
##$TP07= 0
##$TPNAME0= <>
##$TPNAME1= <>
##$TPNAME2= <>
##$TPNAME3= <>
##$TPNAME4= <>
##$TPNAME5= <>
##$TPNAME6= <>
##$TPNAME7= <>
##$TPOAL= (0..7)
0.5 0.5 0.5 0.5 0.5 0.5 0.5 0.5 
##$TPOFFS= (0..7)
0 0 0 0 0 0 0 0 
##$TUNHIN= 0
##$TUNHOUT= 0
##$TUNXOUT= 0
##$USERA1= <user>
##$USERA2= <user>
##$USERA3= <user>
##$USERA4= <user>
##$USERA5= <user>
##$V9= 5
##$VALIST= <valist>
##$VCLIST= <CCCCCCCCCCCCCCC>
##$VD= 0
##$VDLIST= <DDDDDDDDDDDDDDD>
##$VPLIST= <PPPPPPPPPPPPPPP>
##$VTLIST= <TTTTTTTTTTTTTTT>
##$WBST= 1024
##$WBSW= 4
##$XGAIN= (0..3)
0 0 0 0 
##$XL= 0
##$YL= 0
##$YMAX_a= 142047
##$YMIN_a= -191689
##$ZGOPTNS= <>
##$ZL1= 120
##$ZL2= 120
##$ZL3= 120
##$ZL4= 120
##$ABSF1= 10
##$ABSF2= 0
##$ABSG= 5
##$ABSL= 3
##$ALPHA= 0
##$AQORDER= 0
##$ASSFAC= 0
##$ASSFACI= 0
##$ASSFACX= 0
##$ASSWID= 0
##$AUNMP= <proc_1d>
##$AZFE= 0.1
##$AZFW= 0.1
##$BCFW= 1
##$BC_mod= 2
##$BYTORDP= 1
##$COROFFS= 0
##$CY= 11.3945322036743
##$DATMOD= 1
##$DC= 2
##$DFILT= <>
##$DTYPP= 0
##$F1P= 2.36226072786647
##$F2P= -0.459571619588291
##$FCOR= 0.5
##$FTSIZE= 0
##$FT_mod= 4
##$GAMMA= 1
##$GB= 0.15
##$INTBC= 1
##$INTSCL= 1
##$ISEN= 128
##$LB= 0.24
##$LEV0= 0
##$LPBIN= 0
##$MAXI= 10000
##$MC2= 0
##$MEAN= 0
##$ME_mod= 0
##$MI= 1.114404
##$NCOEF= 0
##$NC_proc= 0
##$NLEV= 6
##$NOISF1= 3.799351
##$NOISF2= 2.8
##$NSP= 1
##$NTH_PI= 0
##$NZP= 0
##$OFFSET= 15.70392
##$PC= 1
##$PHC0= -15868.4
##$PHC1= 6.400801
##$PH_mod= 1
##$PKNL= yes
##$PPARMOD= 0
##$PSCAL= 0
##$PSIGN= 0
##$REVERSE= no
##$SF= 200.130013532006
##$SI= 16384
##$SIGF1= 3
##$SIGF2= 2
##$SINO= 400
##$SIOLD= 16384
##$SREGLST= <1H.CDCl3>
##$SSB= 0
##$STSI= 0
##$STSR= 0
##$SW_p= 3612.71676300578
##$SYMM= 0
##$S_DEV= 0
##$TDeff= 0
##$TDoff= 0
##$TI= <>
##$TILT= no
##$TM1= 0
##$TM2= 0
##$TOPLEV= 0
##$USERP1= <user>
##$USERP2= <user>
##$USERP3= <user>
##$USERP4= <user>
##$USERP5= <user>
##$WDW= 1
##$XDIM= 8192
##$YMAX_p= 0
##$YMIN_p= 0
$$ End of Bruker specific parameters
$$ ---------------------------------
##NTUPLES= NMR FID
##VAR_NAME=  TIME,          FID/REAL,        FID/IMAG
##SYMBOL=    X,             R,               I
##VAR_TYPE=  INDEPENDENT,   DEPENDENT,       DEPENDENT
##VAR_FORM=  AFFN,          ASDF,            ASDF
##VAR_DIM=   8192,          8192,            8192
##UNITS=     SECONDS,       ARBITRARY UNITS, ARBITRARY UNITS
##FACTOR=    0.0002768,     1,               1
##FIRST=     0,             0,               0
##LAST=      2.2672688,     0,               0
##MIN=       0,             -191689,         0
##MAX=       2.2672688,     142047,          0
$$ Real data points
##PAGE= N=1
##DATA TABLE= (X++(R..R)), XYDATA
0 0 0 0 0 0 0 0 0 0 0 0 0 0 0 8 -8 8 -8 16 -16 16 -24 24 -32 40 -47 50 -59 72 -80 92 -104 120 -136 153 -175
35 -175 197 -221 247 -277 309 -344 383 -424 470 -520 573 -634 700 -771 847 -934 1029 -1134
53 -1134 1251 -1384 1530 -1698 1891 -2114 2376 -2692 3076 -3557 4185 -5035 6261 -8187 11680
68 11680 -20039 86967 -3501 -166003 13111 105047 20786 -86397 -11699 49676 7328
79 7328 -18997 -18744 -57493 1029 90500 66121 -58656 -83500 35994 62876 -57416 -60554
91 -60554 32547 47267 -14212 -47284 -13956 12787 16392 51885 26637 -40503 -24628 16021
103 16021 4789 -20396 -10382 31655 19317 -14999 -5788 -17138 -14597 46299 51970 -17185 -58812
116 -58812 -11754 36811 -23482 -56669 26620 55216 -5601 -37950 -10952 16549 1113 11115
128 11115 36546 -14794 -42209 8558 13208 -27726 -17537 47451 52955 -34345 -42965 33432 22004
141 22004 -27399 -4799 37286 12431 -52183 -35997 24979 9699 -10074 14910 17413 -2764
153 -2764 -18404 -10722 428 -5509 18542 26300 -26936 -37850 6867 22706 1711 -9828 25450
166 25450 35936 -17898 -32944 -3174 9909 14675 5224 -6034 -8076 -11358 1155 346 -8679
179 -8679 21683 27539 -12903 -30034 -13304 9689 1029 -12577 15734 16703 -19053 -17233 3063
192 3063 13325 12030 6634 13465 -4256 -24161 -3156 3179 -3715 11787 17382 3417 -19249
205 -19249 -17272 15063 10652 -5912 9820 8390 -13249 -24303 -13152 11279 5526 -644 15376
218 15376 1781 -17680 -9234 3773 14143 8145 601 3283 -11741 -13412 4715 2018 5500
231 5500 17740 12114 -4651 -23704 -8168 20355 6035 -7514 828 216 -5796 -17094 -11155
244 -11155 12496 14172 10065 475 -20175 -10952 6233 4526 1094 -1115 9279 6669 -20524 -13375
258 -13375 12379 16166 13218 2088 -3700 -4170 -12149 -1577 7597 1463 7736 3793 -11108 -12048
272 -12048 -6897 8572 12674 149 3056 -2830 -17606 -9390 1188 7784 7344 -446 4355 -2707
286 -2707 -15049 231 12089 11455 8294 -3540 -5799 -7297 -8616 6264 7936 4139 8471 -2557
300 -2557 -12057 -8950 -1336 13099 6454 -5180 -815 -8339 -12821 -3949 2743 12043 8135 -2465
314 -2465 -1758 -9235 -7127 8167 7731 6497 3530 -5056 -4433 -8581 -1677 13891 8349 4190 2080
329 2080 -8570 -7945 -5374 2121 11568 1515 -4065 -3766 -11135 -6182 1965 5970 11363 1491 -5008
344 -5008 -5436 -11204 -648 9674 6031 5376 -1573 -5095 -2582 -5711 5417 13587 5465 2360 -5255
359 -5255 -10604 -3957 -1427 6765 9694 -1684 -3204 -5973 -8898 443 2761 6157 7212 -4086 -6761
374 -6761 -8669 -8108 6903 9760 4249 1809 -5067 -2289 -1271 -3740 7801 10551 4378 -507 -11439
389 -11439 -8484 2635 4896 8373 2992 -3530 -840 -7725 -7943 1481 4586 8956 1396 -10526 -7240
404 -7240 -5484 520 8874 4429 3060 1114 -5837 -4242 -3733 2772 13116 4824 -1760 -3720 -7110
419 -7110 -1068 2293 5619 10634 153 -5979 -4459 -6981 -812 2919 3627 6210 -4079 -9630 -4793
434 -4793 -4352 3984 8988 3922 1111 -7602 -7071 2334 -306 2801 7873 5032 1614 -9049 -10085
449 -10085 5316 9056 7248 1971 -6016 -2952 -3502 -5122 1533 2211 5397 6470 -6456 -12380 -7787
464 -7787 3463 14307 2445 -8833 -1821 883 -1396 -6857 -3570 14331 12460 -3177 -8347 -8453
478 -8453 1929 9653 5217 2429 -3377 -3002 3813 -5302 -9714 3503 13445 10698 -10190 -18893 219
493 219 7588 716 -1856 -509 5237 -810 -11430 -3839 2328 6510 10915 1965 -7085 -8016 -2109
508 -2109 9555 4292 -3198 4902 4990 -3167 -9584 -5979 9953 9912 -1393 -1156 -3776 -7023 -4072 289
524 289 8127 2956 -5709 -14 -1626 -7716 -3530 4324 11814 4247 -8598 -3831 -1025 -2310 3877
539 3877 6547 6147 -328 -6821 884 334 -4669 4209 9507 5285 -6516 -13458 -751 5679 474
554 474 2192 1716 -922 -3527 -7268 -1098 1796 548 8188 4650 -8476 -10868 -2478 11385 7853
569 7853 -5805 -54 6834 -219 -7821 -7403 7401 13474 857 -5136 -6206 -5368 2524 3500 2029
584 2029 532 -2111 2682 -2601 -13156 -3101 10554 10219 -2073 -12470 -2112 5103 -2786 -1142
598 -1142 5221 6819 2585 -7374 -5168 863 825 6684 6485 -1865 -3812 -4347 -425 1724 -770 4836
614 4836 4997 -4353 -6530 -5582 -104 4282 985 2974 1660 -6400 -5238 -2091 2843 6968 1129 285
630 285 268 -5047 -2808 607 4478 7819 643 -2455 -1528 -5373 -1426 4112 5244 3429 -4540 -4680
646 -4680 79 -4254 -2098 3987 5178 2841 -5714 -7464 -1083 475 4188 5022 -765 -1406 -1360 -2163
662 -2163 -838 -1437 6412 9840 -1553 -7140 -4558 1560 5522 168 494 4071 -1705 -4016 -4770 -3498
678 -3498 5124 5936 1179 -3421 -7868 -1811 2084 -852 2637 3621 1167 -1208 -6433 -2773 3909 4072
694 4072 5727 1247 -3738 -1788 -2145 277 3723 2611 3858 -397 -5609 -2565 -1846 346 5112 2292
710 2292 -491 -4348 -5903 284 486 297 4514 1584 -1298 -3838 -5278 1735 4168 3748 3932 -2002
726 -2002 -3689 -974 -1275 2074 3367 3373 3292 -4027 -5965 -351 895 3177 2724 -262 -476 -4957 -4855
743 -4855 789 977 3334 3114 -2049 -3118 -4158 -1530 3437 2163 2903 2809 -3416 -2811 -1454 641 4954
760 4954 2589 2055 670 -5178 -2852 775 1608 4193 1137 -1393 -1949 -5254 -1823 1587 968 3961
776 3961 796 -4026 -3564 -3345 1394 3749 1062 2450 129 -3863 -2141 -1324 3308 5677 1437 449
792 449 -2009 -3893 124 1082 2476 4238 -79 -1738 -3482 -4394 1499 2514 1620 2061 -2565 -3206 -2864
809 -2864 -2413 2617 3301 1519 1053 -3018 -3277 -352 406 4228 3968 278 -61 -3505 -2532 1751 2112
826 2112 3741 2354 -1910 -1866 -3766 -2099 2963 1969 1815 0 -4082 -2692 -2418 -726 3756 2014
842 2014 673 -916 -4357 -1387 565 1642 4259 1417 -368 -672 -3681 -292 2356 2986 4181 -768
858 -768 -3073 -1337 -2360 651 2608 1224 2017 -2058 -4354 -2215 -1348 2084 3774 189 -665 -2828
874 -2828 -3346 442 371 2485 3889 46 -1022 -2501 -2852 2175 3335 3071 1948 -2797 -1575 -581 -1562
891 -1562 1866 2089 1951 495 -4449 -3732 -437 34 3118 1455 -1307 -1140 -3793 -1388 932 110 3781
908 3781 2773 -1689 -2470 -2876 906 3937 1634 2116 1097 -2717 -1504 -1492 877 3692 1173 942 -1202
925 -1202 -4404 -1556 407 1548 2921 -1154 -1198 -1343 -3618 -492 1180 1857 3004 -1038 -2088 -1236
941 -1236 -2079 1492 3377 2321 1465 -2548 -2079 799 -721 1243 3363 1691 238 -3990 -3074 1048
957 1048 196 1690 2598 -1366 -2606 -3047 -1096 1957 -616 894 3562 -1399 -4206 -3034 1510 5101
973 5101 811 -146 1808 -1805 -2144 -285 1349 3496 1139 646 -26 -4707 -2655 2843 2775 1268 -2145
990 -2145 -1417 882 -3436 -2470 2228 2553 2073 -1899 -3703 -895 -853 1327 3342 768 255 -1036 -1992
1007 -1992 -146 -700 1622 4873 1268 -1937 -3242 -1665 2472 1198 123 2506 -136 -2380 -2685
1022 -2685 -1595 2072 1173 46 1631 -1784 -4136 -1394 1259 2830 427 -613 2210 -1627 -4035
1037 -4035 816 2715 2893 577 -810 1211 -2613 -2770 2848 2987 1131 -837 -1613 144 -2743 -1779
1053 -1779 3266 2079 -230 -1182 -2150 -1265 -1293 415 4022 499 -1708 -536 -1407 -92 428 1268 4177
1070 4177 1142 -2079 -1697 -1474 1304 2325 793 1363 -665 -2486 -1138 -1583 740 2327 283 502
1086 502 -2008 -3865 -699 881 1783 894 -1147 504 -1321 -3417 272 2418 2403 1283 -1482 -494
1102 -494 -718 -1475 2634 2784 640 102 -1312 -1222 -1514 -1347 3227 2200 -1369 -1430 -2124 -1310 -352 -158 2709
1121 2709 1062 -2217 -724 -1469 -1089 1161 1833 2351 46 -2294 -393 -588 137 2522 1613 1088 -596
1138 -596 -2464 -275 -334 473 2845 389 -951 -1598 -2507 -404 481 787 2113 -636 -1514 -1006 -2137
1155 -2137 626 1574 1270 1328 -1069 -1704 -230 -694 1705 2689 520 251 -1079 -1367 -77 -223 2008
1172 2008 2578 -869 -972 -1786 -1771 632 356 1609 1030 -2245 -1390 -842 -1246 1370 1505 1117 46 -2456
1190 -2456 -1060 4 -217 2211 1808 281 -374 -1934 -311 709 542 2278 823 -1437 -950 -1789
1206 -1789 -380 876 692 1721 -223 -2531 -1110 -1067 116 1635 624 754 -1103 -2348 -203 -44
1222 -44 1108 2362 563 -172 -1064 -1847 817 727 1512 2228 -532 -1307 -1020 -1291 918 1196 965 1061 -1825
1241 -1825 -2228 -640 -610 1072 1457 322 45 -2098 -1559 537 78 1558 1780 -141 -560 -1362 -495 1048
1259 1048 781 1679 1526 -1356 -1030 -869 -420 1516 734 841 -42 -2500 -928 -393 -258 1323 714 -110
1277 -110 -717 -2584 -284 634 334 1924 645 -750 -876 -1460 743 1579 811 1862 93 -1399 -847
1294 -847 -773 1039 1627 242 503 -998 -2229 -513 64 882 1373 -358 -315 -1718 -1946 837 673 849
1312 849 1312 -593 -835 -1203 -949 1320 1246 912 1169 -1072 -1242 -243 137 1637 844 450 471 -1807 -1511
1331 -1511 373 205 1114 656 -825 -707 -2212 -877 1165 530 862 425 -966 -789 -1252 215 2018
1348 2018 523 1022 162 -1509 -814 14 860 1781 225 -121 -319 -1987 -305 590 859 1342 -161 -997
1366 -997 -948 -1878 198 1115 331 777 -643 -1403 -668 -824 1217 1565 252 828 -904 -1497 -20 446
1384 446 1520 1401 -281 -151 -1070 -1483 721 593 927 800 -926 -818 -1412 -1343 890 760 222 171 -1176
1403 -1176 -1069 -857 -229 1788 839 18 63 -989 -461 287 518 1736 879 -622 -388 -1400 -62 1152
1421 1152 563 1375 -102 -1300 -744 -840 160 919 545 598 -366 -2225 -785 -21 388 1177 231 251 -846
1440 -846 -1798 219 847 701 1366 -77 -255 -590 -1161 863 1454 589 984 -742 -872 -729 -976 1125
1458 1125 1073 -151 -117 -1113 -1162 -380 -408 1376 1299 -699 -640 -980 -629 465 333 1534 1237 -1035 -639 -500
1478 -500 92 1100 619 920 500 -1758 -854 154 390 862 272 276 -404 -2167 -713 830 321 728 69
1497 69 -372 -765 -1627 260 1435 138 823 180 -497 -763 -1101 1389 1667 174 293 -232 -981 -496 -249
1516 -249 1001 1594 -334 -466 -821 -1223 -171 422 845 918 -903 -837 -815 -873 470 514 1001 716 -1154 -994
1536 -994 -235 142 1156 773 608 319 -1495 -921 432 387 912 629 35 -341 -1804 -937 1125 364 524
1555 524 441 -708 -904 -1413 94 1242 331 299 12 -918 -862 -445 524 1710 296 23 117 -1022 -307
1574 -307 518 1245 1488 -258 -589 -187 -1113 -130 765 573 652 -824 -847 -354 -997 275 1156 222 249 -930
1594 -930 -1145 -156 -106 982 977 149 -106 -621 -805 389 391 1043 642 -340 -225 -779 -723 634 728 282 249 -790
1616 -790 -844 -772 -321 1220 645 -218 -52 -878 -951 -110 385 1510 63 -538 112 -897 -398 664 884
1635 884 1176 12 -756 -121 -1007 -25 1066 526 283 -789 -1042 -421 -585 -107 1493 81 -403 -754
1653 -754 -957 115 -154 620 1325 -431 -624 -329 -1033 412 635 807 844 -607 -539 -153 -253 683 991
1672 991 225 335 -857 -959 296 -427 903 791 -548 -404 -817 -706 389 183 877 417 -684 -544
1690 -544 -456 -370 756 543 1056 188 -1196 -426 -278 60 1060 648 238 -432 -952 -410 -103 -136 1103 358
1710 358 -952 -631 -1128 -215 130 396 829 -166 -846 -421 -629 249 929 465 759 -252 -616 93 -272
1729 -272 506 1067 452 42 -534 -1172 104 48 490 920 -463 -231 -706 -781 421 263 512 455 -928 -653
1749 -653 -231 -462 645 516 365 355 -689 -527 145 277 1006 691 -107 17 -721 -263 384 153 943 413
1769 413 -534 -469 -864 -425 754 388 394 -100 -1114 -451 -566 -186 1053 352 91 -428 -897 115 224 568
1789 568 1277 218 -216 -351 -665 380 531 541 862 -261 -732 -307 -795 194 567 217 293 -693 -968 -235
1809 -235 -56 523 892 -34 -9 -504 -916 411 157 782 726 -169 -308 -426 -621 624 503 538 374 -569
1829 -569 -369 -461 -223 592 635 226 149 -886 -473 -255 -258 863 138 -490 -62 -1009 -192 299 276 709 307
1850 307 -479 -383 -478 25 769 350 756 149 -834 -443 -153 323 967 -70 151 -262 -1145 -276 -41 473
1870 473 584 -154 -196 -596 -774 359 424 507 678 -232 -376 -225 -84 745 721 420 473 -398 -538 -179 -118 503
1892 503 710 -211 -75 -690 -585 -52 -6 547 113 -383 -430 -693 -439 604 75 517 516 -818 -389 -340 61
1913 61 952 380 152 114 -727 -576 -127 370 953 175 -63 -5 -844 -130 315 237 751 38 -478 -177 -565
1934 -565 -133 611 76 172 -365 -590 49 -5 519 1015 181 176 -522 -760 172 107 477 788 19 -282 -660 -570
1956 -570 458 186 336 522 -469 -415 -559 -247 507 177 241 166 -626 -484 -323 -144 905 363 24 307
1976 307 -404 -503 212 223 757 497 -377 40 -545 -219 838 273 364 22 -723 -310 -513 -631 501 185
1996 185 48 -489 -902 -33 87 -81 886 164 -109 -222 -614 155 216 395 653 57 -240 -102 -549 394
2016 394 277 -290 594 -347 -870 -436 -382 556 250 -136 95 -676 -1012 282 115 419 378 -294 -134 -152 -494
2037 -494 659 648 543 535 -389 -320 -176 -464 505 594 149 -64 -581 -457 -529 -173 622 357 -167 -261 -784 -130
2059 -130 142 164 773 307 -326 -429 -228 110 541 125 450 222 -744 -57 -28 280 603 166 170 142 -651 -77
2081 -77 -41 132 509 -398 7 -194 -695 -118 284 224 500 -187 -379 -363 -691 454 577 211 170 -64 -355
2102 -355 25 -232 580 580 -279 101 -487 -641 -4 -3 597 404 -352 -246 -463 -386 118 164 185 242 -701 -169 -122
2125 -122 -257 712 447 574 71 -643 -279 167 237 713 432 75 142 -686 -261 177 131 536 78 -309 -146
2146 -146 -692 -231 405 -133 247 -208 -495 -425 -666 303 692 -21 140 9 -574 82 -3 350 662 45 89
2167 89 -316 -423 221 366 362 334 -268 -431 -169 -420 371 458 275 70 -643 -456 11 -155 243 455 199 294
2189 294 -329 -348 181 267 504 493 46 -522 -588 -301 423 199 494 353 -379 -83 -390 -97 682 325 119
2210 119 -355 -476 -325 -254 -46 1018 299 32 -35 -694 198 58 252 583 183 -153 48 -503 345 610
2230 610 364 582 28 -345 -85 -263 232 372 98 -35 -323 -335 -65 -481 0 505 -315 -274 -382 -340 245
2251 245 394 486 345 -378 -206 -91 -36 628 268 134 315 -427 -226 -24 115 369 395 -223 44 -568 -61
2272 -61 154 -35 194 214 -210 -134 -474 -147 242 210 438 82 -370 -51 -425 157 615 450 257 -192 -399
2293 -399 -149 233 217 418 73 -20 -247 -561 -56 240 173 237 -277 -322 -152 -440 3 342 4 516 -285 -168
2315 -168 1 -115 306 521 411 457 -234 -289 303 143 552 526 -333 -111 -438 -543 247 -67 272 120 -522
2336 -522 -265 -263 -443 485 179 292 211 -517 -101 -28 -169 588 523 -72 -118 -242 -373 237 227 586 397 -265
2358 -265 -15 -350 -147 314 124 308 -223 -487 -141 -424 5 433 -268 268 -61 -536 -168 -345 243 650
2378 650 146 40 -170 -496 153 15 208 589 -55 -362 -210 -491 163 17 295 330 -395 -274 -91 -283
2398 -283 256 408 16 55 -319 -243 -37 -315 490 508 -107 29 -269 -227 -77 325 669 524 -398 -154 -73 -257
2420 -257 219 78 264 27 -419 -223 -279 -373 391 140 91 -341 -525 -137 133 -33 589 208 -158 -242 -729
2441 -729 156 291 102 625 -142 -179 -113 -262 512 578 17 98 -288 -529 76 -222 60 295 -206 30 -325
2462 -325 -432 -38 -21 101 300 -274 -337 -318 -302 404 208 287 361 -344 -267 173 -108 608 373 -47 340 -491
2484 -491 -69 25 -138 214 240 -152 -102 -756 -253 178 82 184 -18 -13 -387 -208 -289 489 185 55 -21 -400 -55
2507 -55 -133 179 770 164 -44 -122 -378 167 -20 208 461 -50 -346 -252 -625 31 0 -129 289 -436 -665 -135
2529 -135 -193 305 324 42 247 -404 -353 305 -120 212 398 -29 111 -275 -356 524 273 208 396 -38 -157 -427
2551 -427 -525 370 172 -29 306 -384 -189 -472 -127 455 -24 73 381 -396 -298 95 62 770 311 10 113
2572 113 -339 -206 509 35 316 94 -441 -157 -418 -138 359 -86 123 -113 -604 -196 69 -58 228 -258
2592 -258 22 -139 -496 109 150 223 476 67 19 -156 -97 238 284 295 -18 -140 -157 -348 -441 370 190 -51 131
2615 131 -173 -266 -37 -164 419 281 -506 -7 -16 -224 30 -68 362 402 -151 105 -219 -183 403 135 312 494
2637 494 -110 -319 -152 -95 308 -22 75 -158 -515 -360 191 160 496 114 -63 280 5 -58 70 61 228 -124
2659 -124 -216 56 -245 12 381 180 57 121 -146 -149 -273 126 250 -79 60 -378 -584 -173 -90 144 319 -180
2681 -180 102 -229 -287 202 211 186 157 -251 -266 99 -113 377 -35 316 121 -149 -184 246 -50 425 187 -45
2703 -45 -8 -281 -216 246 119 121 172 -105 25 -268 -353 422 176 113 -158 -235 18 -97 -7 396 413 -12 -41 -200
2727 -200 39 35 208 460 28 -184 -42 -165 -114 -129 -47 345 -149 -210 -181 -482 -49 71 170 134 -412 -421 -24 -74
2751 -74 146 478 -26 402 -137 -44 29 47 217 450 70 136 63 -92 184 165 286 174 -621 -282 -66 -230
2773 -230 229 -56 -78 18 -334 -53 -36 -137 205 150 -79 100 -344 12 112 -113 412 133 -226 49 -153
2794 -153 -215 469 144 405 -125 -737 -200 -112 -94 190 78 -12 -206 -401 -240 -91 186 302 68 -49 60
2815 60 -411 222 52 -10 417 -162 26 -27 -477 237 56 88 354 -426 -396 18 -160 174 222 87 -133 -414
2837 -414 -360 -45 23 12 66 -180 -169 -154 -66 297 250 155 449 -186 0 -125 37 122 26 171 8 -67 -85 -55 -181
2862 -181 312 37 19 41 -750 -254 18 -31 184 8 -93 -60 -237 171 196 73 178 23 -380 -86 -128 80
2884 80 395 321 110 -3 -35 -314 184 216 329 -159 145 -77 -625 505 226 210 170 38 -237 10 46 375
2906 375 46 -65 402 -179 -133 108 124 385 420 76 52 -110 -260 298 246 408 -151 -269 -1 -466 -51 325
2928 325 179 11 1 -555 -201 -35 -51 250 -16 210 93 -357 -17 171 161 491 59 161 -132 -309 -25
2949 -25 -4 222 341 -244 33 83 -409 -135 274 -314 266 -61 -524 -237 -297 198 174 -71 31 141 -301 319
2971 319 95 353 264 -254 193 87 -273 295 314 6 152 13 -80 49 -432 123 227 -64 163 -450 -25
2992 -25 -176 -192 221 198 -332 143 -64 -268 -84 9 386 245 34 9 -203 -2 279 128 285 326 -166 -108
3014 -108 -135 -142 216 124 95 -39 -499 -55 -154 -159 220 -250 -262 -118 -279 -66 231 247 511 -94 9 110 -204
3037 -204 102 42 191 170 -27 -224 -81 -63 99 451 -218 140 -416 -244 159 10 260 217 -174 193 -262
3058 -262 -237 109 13 78 363 36 -131 26 -205 424 132 196 246 -83 -163 60 -155 384 4 99 141 -331 -28
3081 -28 -87 49 390 117 -382 127 -150 -288 116 -177 369 75 -76 -199 -24 32 468 389 150 213 -126 32
3103 32 16 140 342 -42 -173 -110 -486 -39 -47 59 87 -129 -150 -230 -188 68 316 -142 231 -198 -303 -47 -275
3126 -275 -26 150 -39 208 -98 -88 229 -39 249 49 88 216 -446 -21 339 5 108 136 -136 -197 -166 43
3148 43 219 -129 48 -145 -359 -40 -120 26 206 17 -122 93 -25 29 45 52 515 -238 -209 214 -311 152
3170 152 114 50 254 28 -337 -126 -242 35 351 -374 -115 134 -112 125 -6 106 308 140 42 -231 -392
3191 -392 396 377 21 262 -177 87 -35 -275 101 384 -106 251 -230 -182 -114 -354 258 1 -254 93 -376
3212 -376 -238 159 -66 376 203 -111 -33 -403 75 233 104 246 26 -164 93 -288 169 388 89 -130
3232 -130 91 -145 -215 22 -155 165 -96 250 -38 -485 -49 185 -90 156 -73 -256 47 -430 194 195 98
3253 98 145 157 -66 -105 156 8 418 -32 188 -148 -82 117 -356 197 29 -241 -77 -230 -134 -34 74 115
3275 115 255 -156 -103 -50 -301 185 180 134 113 -117 -166 -106 65 486 60 -143 489 -345 -197 -201 -34 187 130 -183
3299 -183 -100 -248 -150 171 81 -226 29 -56 36 -177 162 340 16 262 68 -382 -15 -35 160 295 308 123
3321 123 -59 -418 -32 46 77 403 -159 -268 -108 -254 277 -41 70 146 11 -344 -5 -6 160 42 106 252
3343 252 -317 -105 -94 103 256 223 123 240 -234 -61 -74 179 187 192 -248 -93 -79 -35 189 -54 399 26 -245
3366 -245 -19 -128 -128 79 1 232 -62 -122 17 0 325 447 3 -292 286 -359 -125 163 -112 254 -11 -323
3388 -323 160 -104 39 269 -136 32 193 -260 -148 -135 -24 105 -25 -52 -135 -440 80 -1 43 378 -40 -196
3410 -196 -210 -271 160 163 299 275 -73 -215 -88 -218 -207 93 -65 67 -196 -115 327 -8 -67 120 -79 -56 -336
3433 -336 -117 157 117 22 47 -7 -65 -150 -221 163 0 6 -42 -363 -149 -87 -117 336 -13 164 39 -207 -84 115
3457 115 -90 367 -63 -72 72 -268 -42 202 93 194 -118 -341 246 -129 218 92 250 -166 -199 -121 174
3478 174 44 130 206 -51 259 -210 -300 -133 262 224 197 98 -14 59 -273 140 -351 103 292 -103 -303 -27
3500 -27 -67 104 163 136 327 -137 -203 146 -206 172 60 159 70 -278 66 71 -111 -29 163 -332 -38 28 -57 323
3524 323 -40 171 -144 -216 -77 -225 -72 82 -69 211 -118 -148 17 116 190 264 -186 24 -170 -249 -15 -20 -129
3547 -129 214 14 -173 183 -272 -29 177 -39 129 -170 -99 14 -283 -8 -132 80 -88 -290 -300 83 -94
3568 -94 360 215 -309 79 -85 -273 277 152 -52 45 -187 -162 -82 -86 181 -207 47 -144 -360 -67 118 -163
3590 -163 258 139 -28 -90 -6 -127 -50 252 263 -106 -106 -98 -100 -62 116 -115 21 56 -397 127 -82 -130 178 -85
3614 -85 -5 -97 -190 2 -211 24 210 -341 -17 -161 -189 -156 16 34 157 126 29 80 -86 106 183 -10 88 -98
3638 -98 -235 -41 92 103 212 154 17 -128 -494 106 -152 113 -79 -440 -59 -361 -55 197 356 210 12
3659 12 -173 110 -19 39 494 149 66 60 -313 -232 -150 -122 162 121 -102 -303 -199 -84 10 -33 175 -217 -265 11
3683 11 -170 227 148 -152 88 -143 -103 36 -212 87 186 -74 117 -97 -198 225 -23 261 165 -30 -102 -23
3705 -23 -54 163 -101 139 106 -255 126 -207 -252 27 -26 -98 -68 -273 163 3 -156 52 -122 14 62 -86 -71
3728 -71 208 -140 144 47 -54 -110 -264 56 30 -124 231 -86 -195 -147 29 -73 151 -138 -86 -167 -184 -210 92
3751 92 143 293 83 -12 160 -56 117 175 233 33 0 1 35 -302 -159 307 101 44 -164 -78 -156 -201 -10 -126
3775 -126 -160 141 -250 -292 278 -316 224 -140 -244 131 23 13 120 70 146 198 -152 83 39 36 205 53 68
3798 68 97 -455 -25 82 -110 170 53 103 175 -111 -11 166 -226 357 143 -341 158 0 102 203 141 250
3820 250 -117 -89 -16 -39 -112 300 -129 45 -87 -406 -42 -188 -13 83 -193 -46 -200 -168 -20 122 325 319 -15
3843 -15 -290 81 -167 -32 100 136 79 -218 -130 117 -26 209 210 -11 70 -24 -191 -133 -87 331 212 89 -81
3866 -81 -319 -227 -135 -34 214 110 -111 -381 -126 60 152 68 114 123 -285 103 24 -229 93 62 13 -10 -161 208
3890 208 -40 -216 235 -166 -131 -229 -306 -25 36 56 47 35 -282 -154 12 171 22 37 294 -75 227 142 30
3913 30 59 201 -115 -80 -14 -274 267 -37 51 211 -9 62 -114 -135 229 -51 109 43 -341 -32 -4 -142 -175
3936 -175 331 -117 175 -232 -37 14 -130 167 15 -160 119 155 -6 91 -244 222 147 -299 -3 -114 -178 136
3958 136 -160 36 -94 -362 -196 -38 -10 233 -23 115 -73 -227 189 203 66 151 -21 66 -31 -35 111 121 -117
3981 -117 355 40 -117 -11 26 92 134 -234 -54 -454 -90 180 43 91 -37 -130 -185 -80 -34 212 -195 216
4003 216 161 -242 -299 -138 -336 308 342 31 194 -276 265 9 -89 47 136 50 -147 -284 86 62 -61 367
4025 367 -77 -261 19 -279 -252 -6 44 282 53 -299 -59 -106 35 335 -398 244 20 -370 -27 -54 60
4046 60 84 -98 11 -83 -379 40 57 113 221 -115 -101 -9 -51 123 -17 -3 311 -247 -346 -247 -324 255 178 143 384
4071 384 129 -257 91 112 -22 65 -89 156 -114 -273 -11 -111 9 37 -305 -1 -451 -98 61 14 157
4092 157 95 -54 -123 48 98 38 86 88 45 -139 229 24 127 263 51 -39 -172 42 33 11 148 24 120 -360
4116 -360 -95 -247 -39 7 3 86 68 -132 22 12 108 105 44 3 83 193 235 43 140 293 -313 -52 -49 77 213
4141 213 70 -140 -59 -390 -402 87 -52 20 -51 -3 1 -185 -74 19 -113 91 251 -81 -20 -94 -154 76 81 30 -33
4166 -33 98 41 -88 30 103 -50 -77 -44 -403 -64 -505 149 30 49 -134 33 -271 4 -128 52 -79 72
4188 72 -235 -6 -182 244 201 70 363 -109 3 45 58 110 135 112 123 -112 -274 -199 188 -181 157 -94 -39
4211 -39 -94 -295 32 -113 22 103 -153 116 -272 81 236 -68 162 68 -119 110 -111 -183 -81 16 114 -127
4233 -127 -305 105 30 31 372 -23 -270 79 -45 -18 138 -103 29 -292 -75 20 -69 -41 150 79 243 1 -110
4256 -110 30 -7 208 248 -93 68 64 -234 59 47 -27 374 -232 57 -153 -346 -107 236 -129 -57 -384 -153
4278 -153 214 -170 9 -37 -10 158 -160 -95 266 -49 216 167 -94 -79 -116 -117 109 -268 144 -44 -22 134 -327
4301 -327 -246 111 49 136 -149 -210 -30 103 -26 346 -120 25 59 -273 47 41 -3 142 -16 4 104 24 58 139
4325 139 -12 187 -58 -195 159 -160 24 218 87 216 75 -201 -220 -52 6 290 -81 -46 -59 -74 58 -83
4347 -83 129 114 69 -12 178 -87 -17 211 281 129 -32 -118 173 -158 321 -167 24 -93 -86 159 -76 -133 243
4370 243 -120 -289 -90 81 88 -115 66 27 162 -202 168 -69 -59 204 129 51 104 -301 -65 73 6 263 -213
4393 -213 -78 -203 31 -34 40 -11 193 176 -10 -143 -223 155 -19 48 217 -143 23 153 -30 43 64 287 251
4416 251 158 261 185 -152 54 -78 92 134 -175 120 26 -127 -47 20 -271 -181 -24 -204 152 99 46 -18 49 -99
4440 -99 0 314 269 104 168 182 -90 120 90 -208 252 82 -144 124 -243 -24 -3 -122 -68 -61 -123 -5 -273 61
4464 61 -41 -20 292 -10 -364 -230 -52 95 -65 -120 124 131 15 257 -212 100 -83 -283 -100 128 20 7
4486 7 206 -31 139 -205 -47 -55 149 106 156 -117 1 -461 -19 -11 -92 52 166 153 -71 -21 -50 125 48 87 259
4511 259 92 8 131 -46 -39 -67 96 -129 -209 316 -269 34 118 61 -309 -157 -205 -178 72 -109 118 -121 243
4534 243 70 -10 41 36 -35 48 86 -44 108 21 369 313 41 328 -378 -293 222 -258 62 -42 -85 37 5 -108
4558 -108 151 103 211 110 -89 138 -75 143 -163 -219 -220 128 72 -76 -75 -48 93 -160 -25 143 64 -80 -32
4581 -32 -296 93 -71 132 -18 -217 -219 21 221 161 -17 -145 -41 48 124 23 98 227 54 -185 116 -338
4603 -338 122 56 47 215 188 -206 137 -73 -71 170 -317 -104 -313 -176 244 58 102 98 -46 -49 -124 -157 32 433
4627 433 75 59 -126 -99 136 45 34 175 -245 -268 -65 -186 -41 26 -126 155 -93 -155 -184 -111 237 -20 51
4650 51 7 -404 39 -9 -81 148 32 153 110 -109 -94 310 64 324 -70 -18 18 -251 56 211 -6 -38 -29 -132
4674 -132 99 -200 33 -102 -21 -126 105 -218 86 -260 62 49 -141 251 -229 137 -101 -129 -60 -25 178 38
4696 38 86 -111 0 65 -119 281 -203 72 -32 -119 97 -111 -82 244 -9 -194 175 -193 138 174 -171 -208
4718 -208 -122 -240 77 -5 -13 178 -17 91 -38 -40 105 -30 -13 146 -173 111 -189 -55 225 -277 -37 -72 -338
4741 -338 -35 214 19 -36 -157 112 -149 -256 -134 178 -95 173 44 -236 -75 -1 21 244 -98 -284 -174
4762 -174 -378 105 129 77 225 -67 -197 19 -109 195 9 -172 37 -81 -67 -161 -307 -4 -93 110 -66 -115
4784 -115 -160 -118 32 -4 253 54 280 119 78 -80 -54 61 -39 -280 163 -37 61 173 -38 -96 -182 -135 -56
4807 -56 -22 -96 73 25 154 163 -296 -35 -15 -132 40 -123 -13 307 -64 -5 150 153 326 58 87 -130 -139 147
4831 147 -210 -27 88 46 291 21 -133 345 252 103 11 34 -126 8 51 150 -135 -92 143 -93 172 18
4853 18 -217 -107 121 50 -77 -17 -32 62 -31 31 -94 -226 103 -28 -89 199 168 48 -135 -200 -11 -117 -31 241
4877 241 78 128 1 -25 214 9 -23 225 -123 180 159 -66 -10 190 235 82 -247 -88 72 -334 -126 -24
4899 -24 -38 53 15 -113 189 199 -1 221 -38 -25 -74 14 149 -6 93 219 -207 84 -85 -114 46 105 10 221
4923 221 -156 -116 5 158 60 31 -121 1 73 -124 252 107 128 88 -132 -20 -62 55 20 -30 22 183 97 109
4947 109 -98 21 394 -75 -13 123 -148 62 69 89 172 -34 34 -1 -11 -205 -214 64 31 -184 47 2 -100 32
4971 32 41 -155 57 125 -54 -103 -215 29 131 121 165 420 -297 228 4 81 247 -167 -195 -318 -125 20 135
4994 135 58 31 56 -150 -120 -135 123 96 50 128 -240 -122 -253 25 36 103 92 18 -153 -170 -24 77 119 -189 110
5019 110 -84 -143 -195 -48 -36 -208 -59 -139 -82 -188 216 33 -89 137 33 -40 255 74 166 101 -194 -258 81
5042 81 -156 92 163 187 379 -25 127 -157 -243 186 89 133 171 -148 -90 -87 -45 -43 112 -178 -29 -228 -204 -12 50
5067 50 146 32 25 -105 117 105 104 38 198 124 -39 69 -137 57 238 -148 14 -198 -16 -71 -235 -71 291
5090 291 -69 39 -172 -40 -47 -140 188 276 114 31 -102 -116 -70 148 18 22 -2 -243 326 103 315 282 90 -33
5114 -33 184 -55 272 137 -21 68 -225 -109 68 -70 316 170 193 238 95 -149 -132 70 215 141 -122 -14
5136 -14 79 82 73 -156 265 65 -54 58 125 -55 132 94 -86 144 -51 94 -174 26 234 -197 -14 131 -115
5159 -115 76 15 162 90 0 238 77 -222 77 210 126 114 68 -36 94 -245 6 21 24 108 -63 -85 -161 -181
5183 -181 106 48 2 -78 99 -136 -145 3 10 165 20 141 -269 88 -56 -33 185 292 -43 -75 -120 -162 52 -41
5207 -41 71 115 45 200 107 -141 327 60 117 -87 -254 79 131 -117 77 105 -65 29 -87 9 95 -66 -156 -34
5231 -34 106 -39 -112 -54 209 -35 -17 86 20 52 -246 -164 61 -144 55 174 57 -49 -140 44 67 -26 159
5254 159 -155 -154 -83 -264 171 139 -236 39 89 162 260 117 52 120 10 139 -60 187 39 -3 131 41 -169 46
5278 46 -6 -35 347 84 17 66 93 18 171 109 58 58 -115 -94 -226 2 29 -31 -16 -60 99 208 29 -152 36
5303 36 -10 -126 314 -246 -146 64 -88 -117 67 -284 -346 60 -49 64 -147 233 147 37 345 -210 49 -67
5325 -67 -146 212 -101 -62 -58 218 139 -82 -154 -47 36 -272 266 -143 67 53 -122 2 -181 -1 105 87 -53
5348 -53 66 -144 163 -40 -42 342 129 -210 31 -4 -16 -1 27 -27 -15 -243 5 -278 -162 117 -248 84 8
5371 8 -153 12 -97 71 204 142 220 -23 -121 -7 -34 123 271 -122 -57 -29 26 -69 -78 138 -110 -203 127 7
5395 7 -157 113 11 -116 -71 101 -168 61 -41 121 59 10 103 -437 -35 61 -49 -2 321 -172 18 -176 -92
5418 -92 215 4 156 132 -260 -13 -70 -93 15 -131 -96 117 -60 -239 194 53 -240 -113 -279 227 -11 -3
5440 -3 35 -270 27 -22 -193 -26 6 -85 139 -107 262 97 155 88 -91 -81 73 -200 -191 -5 -331 221 -289 65
5464 65 186 -29 224 57 -14 177 -103 -59 123 45 30 -199 137 155 131 113 -53 -213 -197 106 48 132 -21 -241
5488 -241 -120 -67 74 22 -205 301 -280 -166 121 -213 54 96 48 -356 -34 -57 75 -32 57 182 138 -100
5510 -100 -57 -244 97 -155 -398 363 17 2 -116 166 -62 251 -78 116 187 26 -35 -115 -51 176 -65 88
5532 88 -347 96 261 178 208 22 200 -92 -18 181 39 46 78 141 34 297 -190 158 32 -215 -170 224 -82
5555 -82 -27 0 66 -166 -29 -59 65 -131 -11 67 -103 186 -23 40 54 -188 61 82 -37 203 -45 -106 -322
5578 -322 -30 274 137 -339 173 -212 22 34 18 56 -48 -67 30 1 -199 -287 65 176 163 23 -14 -23 -30 175
5602 175 219 -182 151 -154 159 130 -108 120 294 -92 294 -18 -60 81 -85 -268 111 -181 107 4 -173
5623 -173 180 -190 9 243 8 24 230 -124 36 -207 -5 -210 81 -88 305 53 316 95 -151 81
5643 81 -66 -19 -309 -103 61 128 -174 95 -164 93 -281 151 70 -72 23 -34 -125 -144 -81 18 -268 -12 -63 127
5667 127 -37 212 33 324 35 -185 -189 -258 29 26 -2 33 -145 -198 28 27 -11 6 -61 -74 133 -237 -107 72 75
5692 75 16 68 213 27 111 -176 71 4 31 39 159 -60 -191 -250 -36 35 -154 139 -170 -67 -76 42 194 173
5716 173 -4 -18 -141 119 161 -5 -75 -16 -39 213 3 48 -50 -190 0 -14 -98 21 114 156 247 -75 38 -172
5740 -172 -81 179 26 66 65 3 60 247 -104 -156 231 -11 -123 1 -91 59 -155 -47 68 -87 326 15 151
5763 151 23 -95 5 184 -184 92 42 -99 150 -130 104 -228 -110 -266 223 -108 251 123 2 402
5783 402 9 -13 67 -145 172 184 119 147 43 0 50 -49 181 232 56 -44 -107 203 -81 -158 -75 -77 -62 204 28
5808 28 119 26 42 144 -98 -149 -85 -179 169 169 -277 -236 157 -67 88 -2 -14 17 -115 200 -67 141 -52 67
5832 67 -137 109 -61 -237 73 -275 115 231 -167 -120 78 22 -75 -274 88 -41 -339 43 -54 -83 198 79
5854 79 91 -21 -225 -34 5 80 -228 -150 -111 -82 114 -207 -54 -7 -4 63 -100 -27 -32 100 -143 25 87 40 125 152
5880 152 50 -65 262 94 48 9 54 137 -70 -149 143 272 48 -219 -33 104 40 102 45 -88 -92 60 -39 59
5904 59 -22 -24 51 -244 155 -158 -7 212 -77 -123 -24 -272 72 -144 0 211 20 -231 298 -18 -256 14
5926 14 72 136 89 103 158 42 -98 39 143 30 -140 -54 -200 -49 -14 24 -64 127 -170 82 -75 94 -1 26
5950 26 164 21 184 -8 -98 123 -36 128 13 -85 -80 120 -81 56 -87 -8 -158 -163 108 42 257 -126 -189
5973 -189 134 35 24 186 -66 143 263 -47 177 70 -46 167 -162 233 78 -76 54 -28 -30 -27 -55 -65 -63 -49
5997 -49 -122 41 -68 26 140 -7 -37 71 -129 45 -103 232 58 236 17 -339 4 287 24 20 -84 153
6019 153 -6 125 -127 91 -106 -83 3 11 -49 -59 149 -81 -47 -36 -148 -72 129 -50 -74 -78 -191 26 -15 135
6043 135 -116 -99 70 -186 -209 103 -44 112 -239 -224 -38 -15 106 65 17 -41 197 -97 70 78 129 -64 -72 88
6067 88 38 22 -9 142 -12 -155 -395 104 171 128 -227 201 -207 222 149 45 43 -32 78 -97 -22 -11 -106 -218
6091 -218 193 -229 43 66 207 -119 -100 -3 55 89 -112 70 162 21 148 -180 40 95 -105 -8 114 -41 141
6114 141 -58 234 311 -19 -6 45 46 -42 -74 -169 4 43 -241 67 50 -11 130 -24 18 116 265 194 -25 49 46 -84
6140 -84 121 -99 -102 26 67 27 36 22 139 -5 48 70 -272 -372 151 -142 99 225 -192 82 -71 128 201 -49
6164 -49 167 -41 -25 75 -100 130 -37 -22 -86 5 -145 139 -205 -19 35 -174 -119 107 -199 191 255 -404 -159
6187 -159 79 63 84 109 -60 -35 -124 162 -173 70 255 -93 -154 74 -59 54 -54 43 21 -38 121 9 -234
6210 -234 -5 45 78 118 -251 -110 -110 -19 136 118 88 165 -110 -31 19 -174 51 162 -112 97 -111 128 -166 14
6234 14 52 289 206 5 -274 -333 22 -102 168 59 -54 33 14 24 150 -40 -178 66 -139 6 -198 6
6256 6 -109 -150 -142 126 23 60 -59 -241 100 256 -35 80 -179 -242 438 -115 0 -8 26 172 119 -9 29 176
6280 176 82 29 -219 113 -217 42 -55 234 -2 -114 65 9 -67 157 90 -75 220 49 -39 318 -10 145
6302 145 75 -198 -149 -9 59 133 -73 -90 223 124 139 -147 -88 -153 -89 2 131 -140 122 220 -121 -43 91 92 24
6327 24 40 220 82 43 14 7 -49 -264 71 -129 44 -97 -122 96 179 53 43 -249 110 172 -30 5 -499 356
6351 356 288 88 246 -299 -310 129 36 72 -79 11 145 126 -119 231 18 -50 100 -108 -215 -71 59 -86
6373 -86 -259 101 86 -33 -153 -46 -73 -119 39 206 5 214 99 114 246 38 -34 -192 88 -265 172 -52
6395 -52 123 87 69 -32 166 -73 83 76 30 72 -6 -161 157 -53 -212 -103 -132 122 90 -89 41 -84 -37 -24
6419 -24 -31 -304 73 131 -8 84 -233 42 -36 118 -165 -5 -147 -18 -23 69 -77 -71 58 -87 -17 89 160 31
6443 31 -28 -59 -203 -13 46 -135 346 39 -299 123 54 266 -15 -17 125 -20 -145 -53 -70 -209 -53 164 -40
6466 -40 200 55 6 117 73 -34 23 170 -54 -14 165 -65 -29 -88 19 81 94 240 -30 -74 -137 147 149 -50
6490 -50 -101 47 -282 235 -56 -141 126 -152 92 124 -1 -77 46 -117 225 -71 -143 -124 -114 -102 19 145 157
6513 157 172 77 167 -87 -61 -140 -125 58 74 -159 -137 -306 -169 -6 -311 -13 79 54 89 122 -108 62 147 177 388
6538 388 -142 69 -15 257 49 164 41 3 158 151 62 -77 105 24 65 156 -120 110 -40 128 97 -177 43
6561 43 -178 -104 -65 -10 -301 140 62 33 -125 18 72 -5 42 10 -15 240 299 45 -5 -14 35 367 -87 -5 32 249
6587 249 -146 61 -377 89 253 -242 54 -144 -227 -186 -70 46 282 54 71 -162 151 6 -186 -323 19
6608 19 -10 113 52 -7 297 118 197 173 -150 -12 69 -99 -71 187 -45 189 24 109 -141 46 -254 -177 -25
6631 -25 101 58 120 -7 -192 66 216 -94 260 1 73 -60 80 -129 73 -43 -180 -97 93 188 11 129
6653 129 -116 110 -31 -48 230 59 -78 -244 -12 126 151 45 -176 8 -159 34 218 -273 -163 69 -62
6674 -62 48 -162 117 205 -165 51 23 -69 -151 98 18 35 -86 -39 -52 38 -174 -147 -10 41 -88 27 154 -156
6698 -156 280 70 -135 -166 27 -92 130 -70 84 48 -82 164 14 91 263 -68 -232 -83 22 -148 -191
6719 -191 -93 -210 -75 162 -31 -112 -45 99 73 143 27 309 10 -40 -103 -267 -53 192 203 155 -252 -354 -174
6742 -174 64 85 216 57 -64 176 23 -105 7 -204 29 -265 -93 137 61 -134 -91 61 -226 -41 17
6763 17 59 -12 18 43 -42 253 226 -71 159 -57 18 136 -53 126 227 93 -9 178 -56 116 -76 -87 64
6786 64 19 75 30 152 2 -14 45 15 -148 92 122 -135 137 295 -28 108 119 52 179 -75 101 109 187 -6
6810 -6 -31 -269 90 -80 201 54 -5 7 -488 100 97 -433 35 1 29 -208 7 167 -31 -367 -33 -54 109
6833 109 277 -143 163 -165 -70 146 147 -15 -98 89 -110 34 -142 45 -210 -32 -15 -169 -19 36 190 15
6855 15 30 -264 70 -190 119 62 12 -180 -74 -81 57 64 -135 183 189 -98 18 15 185 100 -284 125 36 193 122
6880 122 239 18 -49 -205 125 -70 -240 116 -127 173 -203 -31 131 -108 -131 33 170 13 158 -97 40
6901 40 114 -3 26 -290 -140 -68 3 196 -91 -205 175 51 43 -164 -15 -78 -3 -65 14 -62 -197 99 117 107 -17
6926 -17 -189 105 86 80 -165 154 -44 251 -183 -18 30 -177 243 40 111 -52 79 -178 69 6 -6 -25 -137
6949 -137 16 127 -30 -108 -55 135 6 -104 -39 0 67 193 16 83 -87 -63 -125 20 82 -141 -194 -81 24
6972 24 -121 -76 199 -261 -1 223 210 -140 -54 174 316 -159 -23 196 -3 248 -106 -122 170 6 -13 -112
6994 -112 -89 247 60 -157 -325 17 258 -67 249 85 -246 20 115 -165 -28 -56 -43 100 174 62 -102 104
7016 104 -169 -51 -140 -101 78 26 92 -119 -126 10 144 -15 -84 -50 -123 -180 -60 -142 -4 -131 -391 89 74 -213
7040 -213 3 200 -71 -200 47 -47 162 -114 60 -30 21 -145 41 62 -66 17 22 -189 283 268 68 79 158
7063 158 94 -7 23 -78 -25 46 -118 27 106 90 311 -76 -128 78 -165 242 81 -167 8 -108 30 -60 48
7086 48 184 1 -85 199 -19 61 -14 34 -168 -128 -139 -166 139 175 -19 9 124 -19 -44 107 68 8 84 237 -176
7111 -176 -14 4 96 221 -75 112 69 83 0 167 137 -41 -216 75 6 -54 -2 -126 -5 69 317 -72 -75 -48
7135 -48 19 -59 17 -134 -261 62 -1 -117 -69 -93 47 -215 -251 -100 184 131 66 -78 75 55 255 29 34 -13 -210
7160 -210 86 234 9 -24 -161 -36 -56 117 67 -24 25 0 143 92 -135 173 147 -110 -155 -237 -158 -2 165 81
7184 81 -155 44 113 272 -62 16 -131 157 105 12 301 157 159 -72 49 13 -65 100 159 -111 115 -102 -5 31
7208 31 156 26 -66 129 -172 6 171 148 -87 212 29 -100 2 -91 153 -168 124 26 55 136 176 153 34
7231 34 213 73 14 25 -8 -101 -40 17 -227 -60 -64 58 -187 -2 -148 139 -274 8 24 21 -120 -247 224 -30
7255 -30 23 -95 -14 154 42 1 -137 110 -101 23 55 -72 158 -112 -38 -66 145 104 -1 -98 -108 -77 -73 166
7279 166 -236 271 70 99 -11 161 -67 135 -44 -29 96 50 133 246 -144 149 152 -35 37 -118 113 -44
7301 -44 -24 118 132 -58 125 80 197 -44 4 50 -68 -183 47 203 -94 11 85 -258 -172 116 27 -158 69
7324 69 -154 90 -210 147 145 -62 -111 221 21 -77 -141 -214 -69 -80 -314 -2 -141 -68 -47 -106 -219 -29 -60 60
7348 60 -100 -57 -54 -116 -127 -134 276 54 213 298 98 -88 138 145 109 -162 119 39 -257 4 -172 84 107 92 159
7373 159 116 46 -11 -21 -80 -191 80 114 30 -3 17 -19 47 -91 -9 75 -34 -263 -15 -163 301 -62 -6 210 -28
7398 -28 96 -55 315 -320 -139 82 -68 -4 -47 294 2 -51 227 404 81 -96 -76 -22 162 -164 -1 -188
7420 -188 113 172 -104 102 111 -37 125 -106 -26 -204 -317 186 172 -160 60 52 -94 -189 35 38 141 55 221 77
7444 77 -65 -23 136 3 -54 -61 69 -28 -138 -98 -138 218 147 -283 -171 -23 -70 56 243 -252 236 105 159 152
7468 152 -39 -254 -118 -108 40 -109 -90 -52 185 -304 95 -19 173 166 -165 100 -48 25 189 61 -44 29
7490 29 89 -244 -77 263 68 13 9 178 -166 -119 -71 -38 -92 34 -65 87 -237 157 -56 106 188 -349 -68 -141
7514 -141 -68 97 -280 130 -32 43 -24 -75 -81 -94 -3 -122 -163 -168 -144 133 71 42 -135 -40 -155 36 -175 -51 82
7539 82 -28 152 29 -63 -54 -109 111 -10 -77 -134 22 14 -44 -99 84 -128 64 82 -81 309 -197 -120 217 101
7563 101 24 -90 -141 25 170 142 -196 -173 -56 173 229 83 272 69 79 16 242 58 -97 -27 -50 -128 -51 180
7587 180 -165 30 -175 -45 -220 -178 76 32 13 -108 -294 5 184 -43 -4 10 -115 239 28 82 116 146 73
7610 73 127 99 32 155 16 94 90 52 -178 -21 77 73 -54 0 3 89 107 0 122 -178 -133 -103 64 0 -34 -121 41
7637 41 -31 6 -42 -223 -52 26 106 65 -40 129 -105 61 93 -49 143 -324 -73 -25 131 19 183 177 -111 -147
7661 -147 139 136 37 -79 -72 126 -60 -161 -124 -37 -53 132 110 -142 209 -17 -1 193 59 79 -26 203 61 -123
7685 -123 124 21 -138 -217 -63 30 -19 59 195 102 -35 179 2 188 267 18 -38 152 264 -8 -94 32 59
7708 59 174 25 -7 89 -85 47 57 14 79 179 216 -101 118 305 -266 67 -18 70 16 134 -20 -231 37
7731 37 -209 200 52 65 82 -37 -199 -95 -232 -46 24 354 -6 -188 351 104 29 186 118 141 21 -83
7753 -83 29 5 200 88 201 -17 -342 13 -31 189 -103 -39 119 41 54 254 -15 168 43 -319 121 62
7775 62 157 -221 105 151 -13 20 -309 -32 205 44 227 -104 20 -16 -86 60 -7 72 233 -18 145 227 93
7798 93 138 -36 -7 38 -96 -86 6 -112 25 -447 -71 -285 -30 -22 -46 -69 10 93 75 13 120 147 110 126 113 -51
7824 -51 -157 -60 120 -238 -144 18 184 89 -27 52 -140 227 25 -191 55 -43 171 -139 -117 136 -15 -37 -50
7847 -50 178 78 122 -30 78 -79 132 22 63 81 -20 40 -24 48 62 64 -32 1 5 192 102 9 -135 -8 83 194
7873 194 -61 -46 101 86 -139 232 -63 -94 -10 10 139 1 39 88 190 -253 33 -156 35 271 -61 -11 117
7896 117 109 -67 304 88 -41 92 -14 262 -138 167 109 -191 54 -20 208 -26 -31 206 26 -75 -150 -59 -123
7919 -123 -98 277 200 -36 244 179 -113 -44 114 153 -77 -192 274 -125 -154 -38 133 151 19 -224 -70 -17 10
7942 10 -32 115 17 -232 247 -11 80 -73 -109 12 51 146 5 128 115 8 166 -160 16 18 49 -72 110 44
7966 44 -164 -63 157 -1 -9 -2 -26 66 -98 -75 36 52 101 173 -36 -28 -75 -134 -81 158 194 -116 105 42 2 2 61
7993 61 -86 -1 100 196 191 39 124 96 161 -8 -167 127 14 130 90 27 25 -64 -5 80 72 37 3 196 -83 25
8019 25 -5 -12 136 -165 -31 -43 175 -54 -120 92 156 117 77 208 -19 -45 61 -33 102 -103 -56 263 -54 227
8043 227 -141 -24 -172 32 162 -84 82 23 28 55 -223 60 -68 -194 -93 -128 53 186 -154 -78 -12 45 81
8066 81 61 65 319 178 99 -103 232 -53 145 46 23 -6 -18 -59 129 -13 5 -106 20 -87 85 269 77 267
8090 267 85 -157 -22 -13 -224 -194 -162 143 260 -177 106 -58 -65 -18 -109 172 86 -102 -86 -98 83 62 -72 -58
8114 -58 18 51 -38 -24 87 232 -129 -73 309 208 45 29 3 -134 296 -75 41 -93 171 -5 -78 -67 -51 296
8138 296 181 164 -86 -16 75 218 250 40 9 188 116 -19 50 334 -91 3 -119 -238 344 4 147 -15 -39
8161 -39 201 -114 -159 90 82 39 -113 -21 175 74 54 -142 181 -119 -82 -388 121 6 -122 158 179 508 -122
8184 -122 -1 -212 119 84 -67 51 51
8191E1
$$ Imaginary data points
##PAGE= N=2
##DATA TABLE= (X++(I..I)), XYDATA
0 0 0 0 0 0 0 0 0 0 0 0 0 0 0 0 0 0 8 -8 8 -8 8 -12 16 -16 20 -24 24 -32 35 -40 48 -54 59 -67 75 -86 94 -107
38 -107 118 -131 146 -161 178 -200 218 -242 266 -296 324 -358 393 -434 479 -529 585 -650 721
57 721 -807 909 -1027 1172 -1353 1589 -1902 2347 -3021 4158 -6434 12670 -64761 -191689
71 -191689 22782 142047 28571 -77293 -785 75505 10001 -45358 -22689 -32205 7281
82 7281 76387 33179 -73177 -69898 56516 90223 -35428 -53702 47728 45138 -38686 -66601
94 -66601 -18835 21533 10908 20100 8741 -45654 -20217 38216 22584 -9544 -5460 22505 7488
107 7488 -37326 -23390 -3886 -1871 44016 45414 -22976 -46293 8198 53618 -568 -48185 21744
120 21744 47635 -30400 -58922 -12651 25140 13177 4235 25446 -8862 -41267 11028 24776
132 24776 -22042 -17890 30734 28350 -47648 -53284 37663 41314 -18556 728 40508 12256 -44201
145 -44201 -28442 37012 20677 -21588 15 8039 -13536 -17761 -1831 17306 11126 13049 16663
158 16663 -29784 -41935 9938 22998 -6163 -17717 9625 23556 -21476 -31540 16401 30140
170 30140 16954 2477 -12803 -11180 -8804 -142 6970 -3883 13643 21909 -16885 -26663 2952
183 2952 22856 12291 -11244 2903 7925 -28434 -25267 7088 13966 7977 -743 2451 -3136 -18710
197 -18710 2920 17975 1483 5749 7988 -9532 -21480 -12646 20383 21063 -4239 6005 10196
210 10196 -11760 -15518 -713 17134 9065 -10267 -609 -5264 -23015 -6542 12498 15540 7222
223 7222 -6221 -3265 -8680 -12332 7362 7063 -476 7991 824 -12943 -16743 1876 30326 15005
237 15005 -9236 547 1974 -6200 -10270 -5016 15221 12478 -3414 -8627 -18148 -6718 15791 10027
251 10027 -222 -3142 -482 -1034 -21146 -14312 16575 15115 2187 -5659 -9042 -1197 -1157 5213 15825
266 15825 4367 731 -155 -13851 -9834 2061 11739 13932 -2465 -4324 -1146 -12055 -3046 10440
280 10440 7774 1990 -8610 -7741 -5706 -14109 1564 16392 7500 737 -7467 -7746 -821 -830 9033
295 9033 10828 -1673 -352 -4871 -11794 -892 8783 15783 8519 -8595 -3598 -3238 -8686 1911
309 1911 6806 6601 1136 -12001 -8802 -5496 -3580 12142 10026 123 -1845 -8874 -6780 -2558 947
324 947 13490 6497 -4789 -2497 -6378 -3283 5927 8797 12806 1368 -9821 -4303 -6538 -2700
338 -2700 7289 5892 5251 -3421 -11631 -4684 -3861 2747 12534 2909 -3726 -6973 -9964 -2461 -503 5511
354 5511 12934 1582 -4821 -4507 -6474 3476 7792 7776 8198 -5002 -8637 -3611 -4257 4662 8482 4089
370 4089 3256 -6517 -9346 -3309 -2098 8210 9049 -3656 -6475 -8668 -5106 1943 340 7186 9737
385 9737 -1710 -5644 -8488 -4124 9494 8387 4321 119 -7163 -2270 -1846 -2308 8052 9013 4898
400 4898 -1998 -12725 -6716 878 2659 7965 983 -5203 -3339 -7594 -3595 2207 4699 10777 1224
415 1224 -8964 -5567 -4283 1815 7044 4842 6054 -1917 -8904 -1413 703 4097 8213 3220 1924
430 1924 -5461 -11177 -1470 2037 4656 7667 -1443 -5497 -7738 -6191 5045 3940 749 4881 -763
445 -763 -5686 -8676 -6578 9097 12454 2932 -1558 -6429 -2440 2829 47 4964 5621 2031 1907 -7805
461 -7805 -10967 40 8785 12820 3 -13370 -3802 2658 -1540 -4264 -1689 10476 7540 -11181
475 -11181 -12353 -3441 5668 11936 3424 -2673 -3531 -3560 4106 -461 -5729 7085 13213 3938 -12143
490 -12143 -15925 5882 15170 1711 -3617 -1607 1301 -2308 -11393 -2786 7107 5100 4184 -4069 -11853
505 -11853 -5803 1924 9867 5155 -5904 684 3297 -5464 -6728 -445 11969 10779 -5013 -4999 -1283
520 -1283 -3247 1633 5400 7092 2124 -8251 -3078 542 -5516 -722 6240 7391 -551 -12892 -6179
535 -6179 2857 180 3712 4939 419 -4153 -8269 114 4777 -1149 4630 8944 536 -7677 -9872
550 -9872 3307 11733 1985 -675 513 -3252 -3533 -4250 846 5886 1345 3158 587 -11267 -9283
565 -9283 2259 10965 6041 -9229 -4998 5613 -1532 -6901 -2285 9139 12799 -2642 -9805 -3367
579 -3367 -416 5833 6714 1002 -215 -2290 357 -486 -8243 634 13357 6319 -6999 -13691 -2491
594 -2491 7869 -634 -2872 4354 2653 -2253 -8343 -4956 4878 3821 4418 3629 -5250 -5714 -1129 2107
610 2107 5404 1464 2910 3965 -5732 -6263 -293 3461 6545 933 -1651 -908 -6747 -4608 2026 3841
626 3841 5145 -1081 -5000 -1624 -4446 -1762 3929 4105 4530 -1805 -6194 -1249 -1433 1381 7358 4567
642 4567 630 -4769 -4703 2812 480 -315 5331 3370 -1279 -6670 -6882 2341 4062 2538 2666 -4062
658 -4062 -5034 -1622 -2015 384 1019 3895 6127 -5081 -9736 -1093 4745 7024 1445 -1471 2514 -1585
674 -1585 -3969 -882 1072 6812 5944 -2572 -5397 -5599 -189 5328 184 677 1915 -2666 -3823 -5214
690 -5214 -1556 5872 3684 1035 -1598 -6086 -1868 1235 1851 4746 2269 730 -876 -5346 -636
705 -636 3379 2919 5479 1534 -3411 -3579 -3660 2531 4151 -164 1882 -456 -4844 -4066 -3158 2699 5209
722 5209 695 -322 -3970 -5219 562 1512 2413 3836 869 203 -3803 -5156 3216 5090 3378 2513
738 2513 -1847 -1976 -2631 -2501 3523 3521 1525 1260 -4203 -4860 -1822 88 4226 2332 -1036 -551 -4688
755 -4688 -4100 1130 1927 4159 1909 -1424 -860 -4125 -1653 4192 3612 3400 641 -3320 -1562 -1809 375
772 375 4830 2113 1401 -499 -5628 -3103 -190 2593 3895 -752 -1512 -1314 -4862 -1894 1568 2898
788 2898 4336 -1192 -3405 -1957 -2465 1785 3816 2150 2700 -1137 -3206 -1591 -1110 3634 4917 513
804 513 70 -2707 -3955 -366 -49 3053 3513 -1657 -2138 -3691 -3635 1553 1700 2592 2124 -3231 -2685 -2474
822 -2474 -1352 3821 3296 1961 1088 -3353 -1872 -393 386 4938 2887 -129 -825 -3855 -1707 934
838 934 1230 3729 1179 -2584 -2461 -3943 -961 2518 1507 2222 -645 -3785 -1690 -2460 237 4284
854 4284 2145 1306 -1361 -4011 5 1075 2079 4232 857 -99 -1714 -3992 133 2058 2681 3176
870 3176 -1651 -3197 -2241 -2591 1596 2014 757 1541 -2590 -3720 -1915 -1455 2981 3572 458 -266 -3545
887 -3545 -2023 2037 865 2484 3326 450 -609 -3551 -2247 3102 2434 2567 881 -2995 -2267 -2028
903 -2028 -781 2471 960 1123 979 -4203 -3793 -1305 1695 4194 511 -1031 -232 -2971 -955 1207
919 1207 1913 4018 937 -1412 -1064 -2900 226 3694 2456 1959 -1288 -3086 -466 -1727 288 2898
935 2898 1099 710 -2395 -3879 -672 -623 1389 3544 -68 -1187 -3050 -2756 2124 1052 1250 3102
951 3102 267 -1335 -2672 -1643 3668 2916 1099 1721 -1953 -3077 -1223 518 3097 679 -878 1322
967 1322 -2591 -4818 -1182 2431 4308 -226 -3306 -191 -1598 -2043 1427 1889 2737 746 -1556 -497
983 -497 -2766 -1045 4931 3342 -250 -2224 -1775 1365 -1150 -1458 3764 2598 -471 -2586 -3925 -174
999 -174 1075 899 2560 -715 -2644 -1179 -2152 385 1090 866 3305 -509 -3766 -1917 315 3562
1015 3562 2415 -788 1334 -365 -2974 -1246 777 3364 2162 -1329 -66 -1709 -3817 260 2715
1030 2715 2325 -384 -2649 339 -1448 -3769 1427 3520 1223 -1056 -2581 23 -849 -1684 3714 3795
1046 3795 -569 -1689 -1528 338 -86 -370 3794 2434 -2160 -1927 -1840 -148 481 794 2942 -287 -4010
1063 -4010 -1376 -620 -77 1070 692 1792 -543 -3618 -1383 160 1990 3082 -44 -133 -366 -2090
1079 -2090 146 990 1618 2662 -11 -826 -1428 -2697 1046 2777 1307 128 -2058 -1228 -667 -2625
1095 -2625 743 3119 650 -794 -2924 -1683 297 -496 2520 3039 -1112 -791 -1004 -712 772 403
1111 403 3344 2429 -2393 -2051 -516 -60 1331 962 1830 569 -3475 -1682 -203 -444 1861 1236 319
1128 319 -1245 -3288 -529 1135 213 2521 1179 -995 -1241 -1953 487 1741 1117 2350 40 -2046
1144 -2046 -777 -775 820 2081 864 971 -1221 -2823 -391 -773 769 2230 293 -613 -1818 -2529 195
1161 195 210 1315 2285 -1012 -1246 -817 -812 1477 1414 1375 1927 -1514 -1759 -244 -89 1699 1733 659 398 -2562
1181 -2562 -1725 558 -328 1349 1277 -633 -1304 -2784 -1085 1276 111 1422 1032 -1599 -1576 -1408 135
1198 135 2061 1021 1391 641 -2258 -958 -103 742 2372 988 457 -662 -2768 -343 599 892 1974
1215 1974 109 -1012 -1440 -2343 298 1203 463 1331 -378 -1995 -1116 -1126 1189 1804 291 1118 -773
1232 -773 -2052 59 486 1556 1836 174 280 -1647 -1897 825 846 1053 1468 -952 -1268 -1678 -1314 1332
1250 1332 709 396 752 -1564 -1713 -1024 -343 1959 887 143 333 -1826 -1163 291 696 2246 1306 -51
1268 -51 -238 -1749 -628 1496 692 1256 430 -1286 -1195 -1832 13 1927 446 430 -281 -2293 -1104 -727
1286 -727 987 1910 181 116 -341 -1783 -38 914 1374 1977 -277 -431 -567 -1720 797 1489 901 1165
1304 1165 -647 -1041 -957 -1305 1141 1425 22 55 -1485 -1760 -653 -189 1446 1195 -457 -163 -1315 -1660
1322 -1660 466 755 1411 826 -742 -329 -1205 -712 1645 1407 814 470 -1063 -900 -797 -68 1901 675
1340 675 -92 -517 -1810 -1349 -371 475 1712 12 -1034 -342 -1651 -713 984 1150 1736 -414 -1161 -317
1358 -317 -1205 384 1918 977 789 -426 -1363 -246 -569 749 1730 -50 -387 -792 -1605 -256 72 1056
1376 1056 1220 -843 -717 -1179 -1484 662 1013 820 902 -969 -835 -534 -658 1589 1764 596 227 -1160
1394 -1160 -688 -60 -237 1419 1117 -563 -392 -1186 -897 152 228 1424 432 -1598 -854 -765 -516 859
1412 859 505 910 77 -1479 -650 -234 264 1798 862 465 -183 -1550 -261 554 559 1439 363 -360 -627
1431 -627 -1787 -335 1157 532 627 -736 -1258 -999 -1376 340 1482 293 236 -681 -1249 -426 -514 1053
1449 1053 1747 -66 -210 -592 -818 328 121 1241 1666 -545 -815 -648 -996 572 452 850 863 -1477
1467 -1477 -1163 -815 -515 661 300 397 298 -1694 -1142 193 444 1178 465 -68 -136 -1503 -473 1345 869
1486 869 1122 270 -99 -133 -1423 -416 1937 680 88 -199 -1102 -376 -1068 252 1807 -86 -428 -211
1504 -211 -1244 -599 -249 864 1822 -514 -752 -243 -783 -52 665 1387 1374 -609 -1107 -116 -585 749 1322
1523 1322 642 344 -1233 -1115 -185 -430 574 861 -142 3 -1247 -1008 315 427 811 486 -457 -250
1541 -250 -1126 -893 1244 852 781 402 -539 -332 -707 -147 1906 859 -143 139 -848 -532 -299 284 1580
1560 1580 319 -683 -335 -853 -579 -50 657 1216 -490 -1108 186 -698 -281 1092 1264 903 -427 -821
1578 -821 282 -238 493 1656 844 -48 -710 -959 182 -131 602 942 -51 -699 -973 -1255 181 345 430
1597 430 863 -825 -967 -639 -833 574 1145 389 349 -744 -776 99 77 1452 1086 32 12 -791 -609 564
1617 564 206 1375 721 -977 -772 -497 -515 379 690 545 -202 -1342 -369 -359 -503 1087 688 273 -367
1636 -367 -1231 148 152 122 1436 796 -290 -549 -775 239 463 377 1369 -61 -1232 -540 -646 214 616
1655 616 -21 763 -919 -1415 -532 -204 565 1021 504 -205 -654 -825 248 432 460 1189 34 -250 -491
1674 -491 -438 816 617 763 661 -872 -633 -511 -384 550 476 359 -135 -1305 -581 -92 -111 956 733 -100
1694 -100 -422 -940 -351 331 61 1216 898 -413 -449 -493 -63 1028 400 976 169 -919 -236 -287 186 965
1714 965 125 222 -473 -1408 -110 -46 71 903 -46 -462 -816 -1261 350 475 522 735 -59 -629 -210 -555
1734 -555 742 672 579 790 -420 -762 -16 -131 646 593 203 -25 -1008 -724 240 212 709 696 -524 -530 -706
1755 -706 -634 562 317 552 751 -459 -332 -449 18 1099 679 516 298 -677 -289 -143 288 851 491
1774 491 -161 -395 -1018 -307 418 114 801 -151 -643 -387 -834 40 758 204 723 -170 -801 -340 -295 548
1794 548 1039 511 406 -316 -1038 -6 102 760 926 -54 -200 -555 -888 222 591 205 569 -534 -734
1813 -734 -587 -870 426 572 179 187 -704 -505 -302 -189 873 750 146 -87 -606 -504 620 158 913 597
1833 597 -336 2 -897 -5 314 177 500 60 -851 -499 -702 -132 753 -38 217 -10 -937 -465 -160 116
1853 116 927 165 19 -145 -819 -216 559 513 1028 63 -79 -425 -748 310 618 464 557 -447 -637 -248
1873 -248 -394 217 435 -48 21 -599 -494 -258 -60 515 753 -333 -83 -289 -647 436 246 607 852 -362
1893 -362 -349 -433 -312 761 659 229 -26 -695 -726 -308 -118 787 617 -225 -174 -625 -542 -11 56 928 210 -526
1915 -526 -116 -546 -104 563 289 602 47 -567 87 -441 225 909 306 395 -213 -762 -118 -124 -9 972 89
1936 89 -292 -671 -876 72 66 -70 696 -2 -585 -395 -520 319 432 149 669 -258 -631 -90 95 657 526
1957 526 -40 188 -448 -715 197 123 689 603 -355 -303 -618 -680 374 -2 248 63 -534 -122 -564 -566 753
1978 753 238 407 118 -427 -198 179 93 647 464 -82 -375 -648 6 286 123 960 314 -360 -499 -853
1998 -853 52 429 135 544 -172 -709 -358 -374 29 307 127 249 -144 -356 -91 86 319 801 -25 139
2018 139 -250 -554 86 341 479 504 -225 -158 -358 -599 97 717 226 147 -786 -440 -246 -280 727 475 40
2039 40 92 -431 -301 268 118 598 473 -276 -223 -292 -211 470 310 330 518 -474 -458 -459 -14 583 111 213 -181
2062 -181 -816 -246 -239 32 776 -88 39 10 -875 -258 246 279 816 47 -91 -321 -533 109 601 281 651
2083 651 -73 -323 -63 -557 171 738 -20 -21 -321 -615 -117 -133 103 585 -279 -456 -284 -349 -17 107 276
2104 276 633 -102 -144 -8 -19 461 253 366 581 -716 -359 357 49 466 264 112 105 -735 -453 99 32
2125 32 310 268 -436 -222 -556 -264 372 147 402 204 -603 -385 -405 -126 631 191 401 78 -696 -7 -179
2146 -179 282 854 -45 236 -163 -905 -91 102 268 793 -160 -366 -291 -720 131 287 194 604 -364 -595 -45
2167 -45 -174 279 629 97 383 -441 -507 178 65 359 545 -386 -95 -407 -779 216 7 273 331 -567 -438
2188 -438 -332 -290 569 377 137 323 -633 -131 6 -80 715 292 359 72 -585 -112 186 48 580 259 -152
2209 -152 -200 -377 -245 317 168 317 -17 -484 -317 -464 209 310 213 172 -393 -760 -69 -119 249 622 26
2230 26 386 -304 -469 104 114 366 745 94 -274 -360 -596 304 450 212 251 -300 -416 -35 -366 314 291 36
2252 36 58 -421 -574 -91 19 268 483 43 92 -696 -298 139 175 567 438 -158 56 -308 -321 446 265 327
2274 327 308 -628 -390 -256 -27 397 178 37 -138 -509 -359 9 -92 660 -202 71 -85 -379 189 158 167
2295 167 548 -116 -320 14 131 206 311 430 461 -203 -599 -111 -77 155 473 -26 -12 -456 -623 29 158
2316 158 -10 263 -346 -340 -182 -518 209 60 273 403 -327 -271 41 -97 560 394 136 262 -385 -214 -108
2337 -108 -95 260 400 -114 -193 -406 -115 332 9 485 52 -230 -160 -419 -169 363 13 89 75 -445 -187 -200
2359 -200 60 523 267 316 -88 -487 -11 231 -17 480 -7 -250 -208 -740 -80 15 107 186 -396 -441 -24 -407
2381 -407 210 534 -58 235 -263 -250 154 0 550 577 62 12 -182 31 110 6 291 316 -225 -131 -438 -660
2403 -660 209 -92 124 311 -392 -318 -109 -293 370 147 -67 20 -417 -430 87 195 402 239 68 141 -441
2424 -441 54 465 136 429 230 -301 -79 -242 85 179 10 40 -80 -453 -39 -179 67 556 79 19 72
2445 72 -455 -33 112 102 595 129 -160 8 -63 162 260 200 510 -246 -346 93 -365 293 133 -41 338 -106
2467 -106 -440 -125 -81 -46 244 -44 133 -482 -507 32 26 173 475 -168 142 -85 -167 581 308 192 590 -404
2489 -404 -42 -245 -35 476 358 13 -74 -353 -346 26 27 316 150 -179 -309 -507 -210 47 146 535 68 -320
2511 -320 55 -143 -49 329 58 278 -160 -416 -2 -144 387 290 60 55 -141 -572 -334 207 138 530 -141 -170
2533 -170 -365 -490 257 258 -63 61 62 -355 70 -221 495 484 141 98 -370 -258 -188 -209 453 353 126 56 -385
2556 -385 -179 70 -65 394 33 -553 -124 -576 -180 145 99 -11 43 -455 -280 -52 -11 519 59 229 52
2577 52 -393 65 26 121 744 69 56 -106 -448 45 -46 41 394 -161 -439 -221 -669 -47 381 96 14 -276
2599 -276 -482 9 -209 294 314 271 80 -92 -250 327 -61 347 483 -190 142 -129 29 154 27 103 200
2620 200 -477 -282 -42 -474 264 281 139 -38 -399 -180 5 90 271 263 -206 68 -361 19 43 307 201 138
2642 138 -301 -157 -407 -73 753 -158 377 -31 -452 -130 -502 -91 504 -118 94 -28 -511 88 -36 46
2662 46 404 107 -198 -197 -300 198 294 138 230 -66 -197 0 -227 61 187 130 264 -222 -197 -12 -349 82
2684 82 417 135 -193 -380 -402 36 -10 406 243 -287 -256 89 -72 -55 183 84 303 -267 -84 89 -287 315
2706 315 308 61 38 -228 -56 -20 -283 36 59 17 -168 -443 -55 -48 -37 280 -51 -162 -173 -297 44 312 44
2729 44 403 -97 -232 -223 -136 182 307 145 129 -269 -317 129 215 -75 425 111 -27 121 -694 65 136 -1 342
2752 342 -25 36 -8 -282 256 342 -101 417 -268 -367 29 -8 373 310 355 203 -392 -5 46 62 297 286 -87
2775 -87 1 -274 -137 231 75 348 368 -337 -301 52 -98 427 61 43 88 -428 -178 -32 -33 420 38 280 -110
2798 -110 -328 -59 342 96 300 27 -216 -203 -321 203 387 69 25 51 -440 -126 -365 178 185 -180 156 -193
2820 -193 -225 31 65 -82 221 183 324 -4 -117 314 120 51 491 9 16 -80 -306 164 315 297 45 -162 -261
2843 -261 -217 -52 395 160 -44 -72 -493 -219 -280 -19 336 -21 -189 -47 -509 12 539 254 340 302 -330 -163
2865 -163 -184 -276 381 94 66 -86 -434 -85 -158 20 269 -125 -155 -122 -463 53 112 90 316 -73 -160 53 -264
2888 -264 333 387 -128 230 4 -173 -5 -289 177 184 124 151 -135 -499 105 -203 308 33 -201 60 -209 -418
2910 -418 -75 256 218 162 -247 92 -149 -9 162 227 197 -7 -314 73 32 56 134 114 75 122 -385 209 3
2933 3 -187 288 257 -111 -100 -345 58 252 -83 309 150 -390 -180 -9 25 229 159 206 -125 -290 -3 -214
2955 -214 76 342 41 72 -17 -392 -47 38 365 408 -209 -71 -50 -171 68 42 124 110 -216 -207 -15 -223 -8
2978 -8 207 -66 171 -224 -106 21 -246 -43 367 118 -128 -177 -68 184 -38 215 20 -293 -127 -305 -89
2999 -89 119 14 -52 35 -488 7 -87 173 247 -13 -88 143 -99 45 174 50 267 3 82 129 -118 -201 -35
3022 -35 205 -3 -155 -272 -63 25 24 473 152 217 -390 -397 215 -131 131 186 -7 -19 -111 -252 -58 88 122 436
3046 436 -140 -68 -141 -90 457 -139 -132 112 -283 -351 -166 -106 159 -129 -124 211 -239 -347 -35 46 234 131 -170
3069 -170 31 -337 -66 294 -57 346 100 -501 19 -38 -197 286 36 244 102 -302 -202 -35 -130 347 112
3090 112 10 32 -392 -174 -196 56 443 -42 -112 -154 -369 100 81 330 312 -23 -116 36 -386 40 315 105
3112 105 -70 -181 -245 202 128 371 48 -94 32 -96 -220 -137 -153 186 238 -134 49 -167 -80 49 -49 83
3134 83 239 -205 -80 -37 24 220 368 236 43 -328 54 -54 194 16 49 -110 -152 -287 -266 268 -190 141
3156 141 17 -173 -174 2 151 261 84 85 -11 -34 239 56 91 338 278 -8 5 -114 80 77 233 109 -209 -79
3180 -79 -24 -240 55 -222 114 169 -185 -308 -153 -192 254 1 32 114 -293 -417 166 -161 261 494 94 178
3202 178 -281 -49 236 172 154 287 -201 -179 13 -109 157 168 198 157 -348 -151 -64 -56 411 217 48 145 -275
3225 -275 -272 -86 -32 438 -199 37 122 -170 -95 533 23 171 163 -204 67 -265 91 337 -211 49 -99 -208
3247 -208 -193 -41 -159 120 -192 -55 -202 -276 -131 193 -88 86 -30 -31 256 -42 283 210 -53 335 -70 -217
3269 -217 78 -99 352 12 54 148 -127 -293 -89 -268 124 24 -429 24 -348 -136 19 -104 76 83 -124
3290 -124 12 162 76 296 -3 84 120 -138 128 10 7 97 -87 127 -138 -276 68 -153 30 384 78 -194
3312 -194 101 -294 -14 87 4 -54 35 -174 169 -187 69 260 145 343 -52 -65 -24 26 385 361 -109 129
3334 129 -126 -333 168 73 190 316 -299 -88 -211 -145 190 -291 152 256 -253 -312 -139 -97 89 306 229 375
3356 375 -126 -136 225 -199 130 218 -16 -77 -437 -254 112 241 64 171 -44 -284 -142 101 208 41 43 -149
3378 -149 -353 18 -234 -4 466 95 -65 -11 -295 14 77 255 192 -100 85 207 -146 50 17 -202 308
3399 308 -368 -5 -150 -105 -6 -92 -186 42 -62 -162 192 -211 11 304 -2 137 -203 -55 130 284 169
3420 169 74 65 -161 -254 -37 37 138 113 116 -391 -34 -155 -67 262 69 -53 5 -131 -60 -136 151 427 -124 -129 32
3445 32 -174 -59 99 112 385 85 -111 10 -105 115 291 45 244 2 -130 171 -363 342 175 153 -34
3466 -34 -121 -381 -19 -259 134 252 42 -50 -238 -463 -94 120 -25 135 -231 -214 4 -315 251 240 -34 109
3488 109 -109 -42 4 12 332 167 -62 78 -52 -99 106 -105 199 288 -63 -237 -312 -22 392 -48 -68 136 -196
3511 -196 12 -45 141 115 83 231 174 -523 -188 128 116 305 230 63 -35 -378 16 29 7 80 -53 -68 71 -395
3535 -395 -65 176 -19 -13 118 -107 202 67 333 410 -19 191 -172 112 249 32 144 128 -173 70 -110
3556 -110 -397 188 -89 -106 412 0 -251 -368 -66 199 289 -125 51 -35 -37 185 48 159 281 -61 38 -230
3578 -230 7 340 86 73 84 -316 -98 -181 -273 163 27 -83 -12 -277 -69 96 -106 18 -51 -48 116 -195 -29
3601 -29 20 -28 418 72 55 -153 -234 142 72 79 380 -26 88 -115 -224 -81 50 -31 208 -19 -133 -14 -290
3624 -290 -15 285 -85 -2 -269 -227 268 81 254 492 208 -192 -295 -98 135 204 130 332 -69 -192 -23
3645 -23 1 219 29 -48 146 -144 -56 -8 -205 70 117 -110 -63 -417 -50 184 8 180 61 77 -14 -23 18 -39
3669 -39 239 133 154 40 -77 -53 -10 461 212 -47 -84 -293 196 -164 67 72 -118 -4 -257 -339 -37 40 33 127
3693 127 -148 -179 86 -174 162 -288 -46 170 -63 -118 7 -10 142 163 -13 35 -342 -155 121 -276 12 127
3715 127 -19 -294 -215 -251 81 41 7 278 -337 -130 -57 -108 225 118 35 -46 -24 128 -29 32 191 -33 -137
3738 -137 72 -145 -72 70 -25 71 -89 -147 -189 -336 91 195 178 75 200 -287 10 -59 86 245 -174 157
3760 157 81 -102 102 247 28 301 4 -71 -158 -67 68 250 -110 393 -166 -191 13 -283 24 -22 118 224
3782 224 -302 -253 -39 122 154 81 -144 -6 -10 -56 459 -12 145 59 8 -106 28 -45 223 289 128 400 -280
3805 -280 23 -156 24 131 -178 -51 0 -232 -82 1 162 -11 -75 -142 -92 -95 -56 74 107 207 -49 -62 -127 -156
3829 -156 -144 -41 -44 261 -42 -290 161 -204 129 58 -102 -67 -207 -63 -166 42 175 189 -131 -5 53 -75
3851 -75 139 123 96 189 -54 104 16 269 72 -65 123 201 -488 -21 -26 -280 101 -19 4 -120 -107 -140 -67 -54
3875 -54 183 259 -350 32 -87 -194 228 -23 254 199 -190 363 -96 138 -10 -90 208 119 -109 196 -70 -46
3897 -46 187 -246 50 199 -257 -67 94 -143 111 -58 -357 -107 -455 -119 130 -90 167 -104 118 96 -92
3918 -92 -3 27 20 152 69 -195 13 -212 306 257 152 -229 -114 -215 22 67 144 -86 -198 125 -173 -116 163
3941 163 90 -139 14 -19 -115 -113 126 118 198 179 216 -275 6 130 65 73 -121 -96 113 -101 -144 186 0 170 68
3966 68 -149 -235 -230 -15 158 -188 302 90 -385 5 64 -46 151 188 195 -42 120 130 267 129 502 104 173
3989 173 -38 -142 -61 -236 -39 0 -272 -79 58 -243 97 212 19 116 -124 -217 84 -76 181 377 87
4010 87 7 -152 -44 246 204 123 52 107 -28 -30 67 127 36 -126 165 -236 -82 52 164 243 -111 -90 -47 -350 -203
4035 -203 89 45 120 44 -46 35 -268 24 293 366 186 -71 114 -121 -60 -7 -28 26 172 4 -123 -57 -368 3
4059 3 243 -170 -134 -170 65 140 24 348 -82 -305 -149 7 -183 232 -246 20 -9 -130 -33 -76 33 203 167
4082 167 -418 252 -126 95 12 -150 14 268 -386 -37 -183 -172 107 66 326 -96 -122 60 193 -201 244
4103 244 5 -13 -15 -240 -4 -53 211 108 84 -3 102 -288 -174 262 27 403 -64 -19 43 -413 -89 293 -114
4126 -114 218 -147 -204 -159 -205 147 326 -15 -44 -137 -230 76 -102 191 293 -109 147 -164 -294 322 202 88
4148 88 -94 -226 -207 -147 -245 103 109 98 -131 -427 32 -4 -198 132 249 3 120 -273 -49 57 273 248 97
4171 97 109 -47 16 44 217 47 311 104 -92 -54 -139 -50 97 -88 205 32 -292 -82 -331 17 347 -28
4193 -28 -84 -115 -145 0 -141 81 261 127 333 112 -89 -60 -45 154 163 -166 -90 -111 -86 47 67 69 42 -163 -203
4218 -203 94 -90 621 193 -122 -68 -274 66 -8 -128 143 77 11 54 1 30 208 73 31 87 -340 -26 92
4241 92 -78 217 129 -253 -98 9 -257 6 89 247 -147 -49 -37 -189 -13 138 53 252 27 -231 86 -102
4263 -102 143 170 -26 -152 -114 -167 250 -272 -83 258 -72 -182 -385 -270 38 -116 -58 -4 -206 -290 -178 -78
4285 -78 26 -64 -33 281 -364 -39 119 51 376 -5 106 434 -16 -208 -58 -1 261 285 -305 144 151 -204 -129
4308 -129 -195 133 -175 -264 -138 -101 23 205 -160 -73 -174 -437 -83 -201 43 246 -27 69 178 55 114 38
4330 38 28 113 -257 188 162 -189 19 170 27 121 42 -136 191 10 -67 -57 -49 325 -66 53 95 29 113 -217
4354 -217 -245 -25 -116 -31 193 -21 339 351 -181 107 -9 -350 213 -104 -157 70 -235 107 -276 91 215 46
4376 46 123 -108 -55 48 15 41 171 -143 129 227 -145 -243 300 -226 253 226 -62 -199 -29 149 62 -41 251
4399 251 18 -310 89 79 -136 -196 -14 -98 -94 -328 35 -202 124 117 -38 -1 -1 -227 137 -233 146 50 -77 -77
4423 -77 -216 -241 222 -13 -15 -3 -93 -101 -95 -80 88 202 -100 98 -100 -238 -41 -232 21 -32 -83 219 -164 -25
4447 -25 93 -40 78 -67 -211 -68 -12 35 282 -81 64 -47 -290 93 211 -121 112 -257 -161 49 -268
4468 -268 68 -176 57 -5 136 -51 309 -145 201 66 76 182 -8 -220 -21 431 298 -31 10 145 37
4489 37 -67 198 -2 186 63 -101 199 -42 -136 90 -38 -205 249 -248 -36 -58 -345 200 181 35 127 -222
4511 -222 166 -105 -43 285 199 131 349 21 187 29 -173 150 143 24 4 -172 -112 106 -96 5 -66 -24 -21 -119
4535 -119 107 224 -47 163 -49 -7 164 40 -161 237 96 -7 -245 -348 69 102 158 486 26 116 27 18
4557 18 218 -65 40 -8 -152 -262 75 26 64 -201 -182 101 198 150 53 19 107 121 -55 -84 200 36 14 -76 134
4582 134 61 -202 27 -77 -18 -25 -141 98 52 -75 107 121 17 231 45 22 42 -218 -54 238 -24 138 -199
4605 -199 -316 64 35 229 98 -72 -101 22 -52 9 84 24 195 2 40 -64 35 -93 -13 -43 -105 -64 -44 -12 -133
4630 -133 -29 -187 131 187 -19 -204 -7 -10 108 -328 -122 246 -51 -42 54 -25 280 45 9 -13 -227 -67 167
4653 167 -5 -48 49 -411 -71 -335 43 48 -21 74 -182 -134 17 -96 128 393 -157 332 26 -240 -100 -42 -20
4676 -20 207 -34 277 79 186 59 65 98 250 -205 48 90 -324 170 197 -20 364 -81 -118 111 -58 111
4698 111 163 -167 -169 -33 -35 -3 -28 235 -30 196 -147 4 -240 -30 80 -115 -55 142 21 -166 6 148 -72
4721 -72 -203 103 -211 -306 93 89 105 -169 3 -72 -346 64 156 -113 390 82 12 -108 23 57 200 -168 259
4744 259 159 -340 -61 -67 15 1 -11 -73 -70 -116 143 15 -4 216 -56 82 -112 140 166 -2 -14 166 -83 -136
4768 -136 263 -168 -52 -52 -54 145 -233 11 -68 -265 134 7 -31 -105 -303 -152 107 -223 -277 14 -47 56 -97
4791 -97 -224 89 93 204 156 18 -77 42 102 253 56 116 -48 -102 82 150 106 403 -79 -122 -121 -234 50 -66
4815 -66 6 204 112 -205 -104 -275 112 109 230 124 79 -96 -111 -84 -43 -116 -33 22 284 -36 274 115 349 -42
4839 -42 -304 76 -286 -308 46 -92 -17 218 -134 52 -326 -342 374 -172 56 84 -165 -34 -320 -16 -139 -4
4861 -4 105 -92 -197 -150 -54 -49 75 -8 -146 235 -81 9 -111 82 -264 -8 -148 -76 -91 -161 205 66 -155 -140
4885 -140 -83 113 -99 42 139 141 -14 -244 -84 -210 -186 -37 374 -135 54 99 -33 166 205 48 -59 -24 -265
4908 -265 44 -276 171 -88 -170 -13 -198 -28 212 53 -81 -88 -75 73 51 -126 112 -77 -68 288 -3 46 0
4931 0 -13 131 48 -16 -205 -136 -236 259 -109 290 138 72 11 -297 38 219 -81 100 68 -96 66 -76 214
4954 214 202 45 32 -190 -43 70 -95 115 -129 -23 86 50 -71 137 -315 -117 -96 -356 -99 67 -46
4975 -46 -11 -94 216 312 -116 90 92 -9 32 72 175 118 -132 -59 80 107 64 -84 38 221 -150 -225 186 -8
4999 -8 24 52 -29 -63 -197 -94 -176 169 267 2 66 -201 -366 -40 63 188 -137 -79 -82 -58 -102 -348 246 77 132
5024 132 215 -15 116 0 71 37 186 114 114 -204 132 186 -276 -106 -102 -330 25 131 202 332 -94 -15 6 -102
5048 -102 -259 69 53 -31 -99 22 -106 -106 183 1 45 -53 -123 185 92 -167 -22 -101 59 102 -94 -168 -3 -99
5072 -99 -109 -115 51 268 -130 -58 -169 53 176 132 -96 232 -20 5 189 -62 160 -42 82 -28 21 2 138
5095 138 100 -15 -79 -192 134 -106 -63 57 -11 67 -130 -101 -15 -158 189 333 -259 -42 -6 59 211 -50 -3
5118 -3 67 -134 -85 35 99 48 117 223 182 97 -43 146 179 -138 123 97 142 117 -78 -131 -64 -17 299 109 119 -331
5144 -331 230 -30 -167 256 199 -98 -89 62 -4 131 -113 -40 -66 -56 100 26 99 -11 154 -118 119 50 -86
5167 -86 115 24 -18 0 102 75 -8 315 56 135 60 73 -179 188 105 122 -30 -136 63 -26 -38 209 -51 173
5191 173 298 -224 -52 234 -117 455 -85 -187 28 -86 -41 31 -249 112 101 -215 -184 51 76 116 70 16 -196
5214 -196 -188 -93 -176 -57 102 283 206 -196 -89 -29 9 70 153 20 144 27 -163 117 -91 65 172 -46 -68
5237 -68 159 -122 174 -79 -171 123 -263 -137 -44 -135 138 141 -329 226 90 69 145 -224 -11 13 100 179 1 31
5261 31 111 123 237 52 24 -66 91 76 -83 -168 -74 52 -149 -42 6 -77 40 120 -48 -22 -246 -31 2 65 285
5286 285 -68 -61 -63 -182 -410 -138 -97 36 -263 -125 227 -65 14 178 157 169 51 -69 101 55 174 240 -170
5309 -170 26 28 -219 -157 -136 -71 115 -40 9 -159 8 158 -160 63 244 6 -60 169 17 14 109 82 6 15 -16
5334 -16 3 -12 169 -131 -228 -84 7 -172 -125 -111 -18 34 40 182 1 -24 70 130 110 115 -112 -6 35 49 209 -60
5360 -60 -117 277 -129 94 -56 -12 84 126 13 -167 -20 133 -38 26 178 -82 -19 -57 -69 13 -95 -22 228 -13
5384 -13 -204 -229 -228 249 58 -61 169 -3 20 -16 -203 79 195 -222 65 81 -208 104 26 -166 -5 40 109
5407 109 -46 -177 -198 -191 -173 52 -188 41 -179 -255 -85 9 -258 327 13 21 56 111 -42 43 176 124 -196 -2
5431 -2 119 245 108 -98 306 119 9 48 -264 18 42 -107 -48 95 -88 -65 240 -62 63 -92 163 102
5453 102 99 19 278 -170 -50 230 -101 35 103 165 -21 425 -87 116 20 320 -58 -97 93 23 -36 -150 -122
5476 -122 -121 195 87 249 113 -249 222 22 240 -73 -50 307 175 110 189 21 -94 -35 -65 -138 -323 -28 257
5499 257 8 -251 0 -32 -43 122 -88 -114 335 9 -43 -289 116 -30 107 62 -90 -132 187 -158 1 24
5521 24 178 69 -42 27 82 -168 169 195 -195 140 -297 -138 -58 274 -329 314 -215 -28 20 33 9 315 34
5544 34 60 39 -6 -248 6 -192 -42 21 10 131 84 -253 -279 -54 -83 -88 219 -4 -111 52 -201 108 68 -220
5568 -220 -36 -163 -118 205 -180 143 -205 -53 102 -71 77 -71 -221 45 -86 -225 -116 -169 -151 -142 78 93
5590 93 -229 -50 75 4 52 56 232 -75 -50 -55 -28 -162 -135 -96 68 -187 195 13 1 204 -58 180 176 51 363
5615 363 56 278 10 222 -119 -145 -23 -182 -188 -7 -74 -272 101 150 -6 301 159 -320 103 -43 86 90
5637 90 -33 284 -26 -291 114 -120 -117 122 -205 -43 111 68 -13 -48 -101 41 -159 -35 -108 -69 48 3 -81 105
5661 105 111 53 -26 -318 32 -118 20 266 -3 7 40 9 -212 -40 48 143 -76 178 34 56 90 1 38 108 -20
5686 -20 142 -14 -165 99 -13 -46 72 73 -53 42 -62 248 -19 -76 -20 -96 -135 287 -240 -5 162 -1 -38
5709 -38 -35 25 169 134 -90 31 -41 -74 -231 -127 138 20 -14 96 -260 -55 -8 13 3 -131 -58 201 -227 82
5733 82 7 52 41 -144 44 19 -27 97 59 257 83 -105 146 74 278 -89 33 -103 -139 -147 -29 105 58 158
5757 158 -130 85 -53 146 -12 29 -42 -11 47 -8 -52 43 -90 -70 -62 71 -41 -111 96 68 81 -59 30 -67 87
5782 87 41 -71 128 71 -157 -58 -136 150 171 -7 -158 -39 -34 41 64 176 172 -55 -76 105 26 -97 90 256 107
5807 107 -60 42 -227 -153 -39 0 -104 137 -191 -170 46 33 276 -79 151 95 42 247 -102 -204 232 83
5829 83 130 39 -82 106 -125 56 194 -128 190 -10 -66 122 174 -221 -198 27 -164 131 -119 153 204 -287
5851 -287 6 -2 -131 302 50 -212 -29 -91 78 -25 145 11 -268 3 177 -49 -111 102 -189 -74 23 278
5873 278 295 31 -34 -109 -67 -2 -104 98 -36 -79 130 -33 -262 49 173 4 156 121 157 66 7 -103 -261
5896 -261 46 110 -201 -112 -31 -59 -111 97 -21 -76 -57 -73 -70 51 64 3 22 -2 -66 -155 5 51 0 -216 -88 0
5922 0 -59 -112 35 51 -196 -178 -105 153 73 96 81 -67 58 170 -69 37 34 -67 125 14 164 -197 171 -40
5946 -40 33 -162 -10 152 -23 241 -102 -58 104 94 156 35 -55 -110 -22 37 148 -202 139 -323 -68 -104 -1
5969 -1 217 189 39 -116 188 46 170 145 153 36 -14 -8 42 92 130 -31 74 41 -70 280 70 150 35 162 -211
5994 -211 142 79 164 139 118 47 -98 93 54 21 -267 -72 -159 249 118 -74 110 10 84 14 -53 -40 -113 -42 30
6019 30 153 -26 235 90 82 70 -90 347 49 -182 -70 25 -335 -203 -228 -61 -132 16 -108 61 -88 66
6041 66 37 -39 198 169 -14 237 -104 -67 -27 255 108 -128 157 -132 -54 -124 11 -111 19 -38 239 -299 -56
6064 -56 82 -43 -34 -47 213 -181 286 98 199 87 -61 6 87 43 82 -67 121 109 41 -24 -46 -1 108 -44
6088 -44 -37 92 -235 142 82 168 161 -176 90 11 -201 184 -178 104 131 10 -96 -62 -182 106 -147 202 -2
6111 -2 -130 -202 138 82 118 226 -48 -261 -181 65 -22 -112 77 79 -115 -29 -20 -109 -167 -75 4 368 -100 248 -331 11
6137 11 -2 -38 -25 129 -69 140 165 10 -58 3 -18 61 -210 -69 209 -20 -40 -107 -169 88 -56 -21 87 111 50
6162 50 7 -64 23 -190 44 233 61 -7 207 -19 143 90 17 24 -29 197 -89 20 -174 149 -65 71 -15 -10
6186 -10 30 138 98 137 38 -134 20 68 -131 -130 172 -128 8 -66 -245 -33 -97 124 228 -182 -166 301 -1 -167
6210 -167 78 -150 258 14 9 -45 -63 101 71 -68 -22 -6 4 220 -143 -168 -63 -33 -176 1 -50 39 32 110 174
6235 174 -125 25 -222 -96 -138 -130 114 95 -223 -219 252 -23 71 70 36 155 -70 143 80 -148 285 -49 -157 40
6259 40 -213 -135 256 220 33 -130 -148 149 8 58 26 -31 97 28 9 -100 19 -48 -67 9 -14 -65 -175 26 -30
6284 -30 -54 46 54 -191 114 -59 -286 -131 -109 -65 -106 71 -41 -55 132 -51 162 45 -36 -149 -81 100 0
6307 0 -47 -46 -300 12 82 -52 0 145 -142 -80 32 57 32 324 64 -24 155 -80 -35 -94 -135 -38 35 249 61
6332 61 -88 -105 47 17 118 72 -137 281 -170 206 18 15 166 -17 -75 82 -24 181 239 67 -9 82 -254
6355 -254 144 104 6 212 -30 285 -101 -282 -118 109 -49 235 132 -38 -30 -213 -152 -112 102 12 -179 -52
6377 -52 -27 -269 21 215 -45 106 -193 -237 132 62 22 -45 48 2 -17 -161 41 -104 -60 171 -18 -100 -7 94
6401 94 -140 18 105 -7 63 -243 -87 -65 41 -122 53 129 -65 -31 79 -15 285 38 -173 369 58 -103
6423 -103 195 -11 44 -128 1 6 -178 25 -47 -70 179 201 42 337 64 -85 -177 49 -63 -48 -20 60 -46
6446 -46 -24 65 41 -62 92 -37 -145 50 5 226 5 -72 -27 114 11 25 -86 130 -129 -158 -4 93 66 -57
6470 -57 -271 172 174 -174 138 19 135 16 -149 130 -98 23 175 -147 -71 50 -106 95 69 -90 265 118
6492 118 32 -112 49 1 42 -92 38 172 -20 116 -141 57 -37 -74 12 102 -228 -95 -151 -159 84 106 217 9
6516 9 -42 257 53 -109 17 157 -9 82 -247 -68 190 -85 -50 -147 -25 -41 -80 -176 60 -83 17 -108 -57
6539 -57 22 -63 -17 159 -136 -70 141 86 151 143 131 26 1 18 78 36 6 -146 -17 -62 80 -4 -57 -234 201 -197
6565 -197 -46 128 -68 261 13 -124 -3 28 12 184 19 21 128 -71 37 46 -268 -236 71 142 217 -250 -37
6588 -37 91 -118 -40 -43 97 -156 -213 130 -126 -45 81 4 -110 59 -41 9 154 78 -51 74 131 -39 -42 -32
6612 -32 -111 -100 -64 -201 62 -140 -72 174 -132 78 -39 -13 -150 119 -165 -107 97 -138 -77 43 7 74 -72
6635 -72 187 68 -30 133 -96 -295 45 50 55 85 23 165 52 -130 57 146 -86 90 -142 43 251 -20 44
6658 44 67 172 -146 -160 90 1 18 154 122 81 -150 -107 139 71 32 98 -38 -57 58 -1 -66 221 15 56 -13
6683 -13 -80 -14 16 -146 9 173 9 65 21 116 -14 -113 104 5 501 -43 55 17 197 -150 -133 -187 175 170 -91
6708 -91 11 -13 -46 212 -141 116 -7 -323 -105 26 -102 108 53 -63 200 -272 -87 -139 -32 -85 57 -257
6730 -257 64 276 69 136 -191 22 -25 -19 2 -55 -80 -3 156 -173 -51 -81 -181 251 -28 44 -38 103 50 2
6754 2 68 64 206 94 -151 -214 -33 -149 -145 -6 122 51 -221 121 -103 -159 0 257 -121 69 65 90 63 -150 42
6779 42 -17 36 10 50 -6 119 -155 -51 -262 -4 -142 6 114 110 138 204 199 -222 -87 -60 -162 -23 -155 -280
6803 -280 -55 -135 103 -86 117 188 89 -135 -201 107 -43 -2 4 -31 -159 -318 -62 -34 -34 136 245 308 326 -27
6827 -27 -35 22 203 182 56 168 107 221 305 23 -51 14 98 -6 -157 25 138 -128 32 37 -34 -44 154 1 -81
6852 -81 -62 -35 -150 -135 -213 151 -143 77 -60 -242 75 -141 80 -173 240 312 7 -253 90 388 106 -111
6874 -111 -39 39 -73 81 51 127 -100 250 81 164 153 157 -138 198 -82 73 51 74 38 33 -32 113 -104 268 140
6899 140 162 17 -43 8 -175 -94 88 -222 -98 42 69 17 -133 114 -35 -182 -171 -95 -72 227 -74 -83 -46 -113
6923 -113 -9 157 9 -33 -174 -105 143 -39 195 -118 -41 -36 -128 -117 -22 69 287 41 165 62 99 -152 18
6946 18 -150 -179 -62 156 155 -93 195 67 94 76 -131 89 -396 -101 -7 12 -44 15 -240 259 -21 68 44 -53
6970 -53 74 -88 -58 -40 -203 254 90 -175 33 75 -91 40 106 51 -26 -36 184 2 84 46 -80 33 -116
6993 -116 112 335 135 149 347 -15 172 289 115 193 -61 17 85 -13 71 -58 143 310 -138 -290 108 150
7015 150 118 48 -116 -46 -12 9 -21 -51 -103 -97 167 183 -224 111 -63 66 183 -10 -283 116 -184 -196 -220 35
7039 35 94 135 92 64 43 -56 -187 130 -44 179 66 -3 -51 259 5 -290 -254 194 -35 -99 -39 -30 79 201 -99
7064 -99 -22 -2 -137 -92 -127 -73 123 -1 -135 58 -464 70 204 81 -121 -308 53 25 4 150 -5 -5 -27 118
7088 118 141 -272 227 34 27 -193 -34 -82 -208 33 107 109 -141 -33 -14 -121 84 -118 194 57 30 175 29
7111 29 14 203 -66 26 -1 106 -10 35 211 -11 135 -200 49 40 -70 -94 -39 -25 -113 159 -27 -70 -10 -235
7135 -235 -131 56 147 -94 245 -22 112 -94 -20 -64 177 166 169 118 -8 -72 49 164 60 -257 99 75 -101
7158 -101 -147 54 -14 -193 106 148 43 -110 -44 207 -113 84 61 17 -59 165 45 -15 -6 14 -188 246 -25 -141
7182 -141 21 -210 105 37 269 -90 -131 -61 29 14 -158 -95 -60 89 -133 -165 -56 229 -80 -8 -73 -138 136 -41
7206 -41 29 188 -73 -223 -76 -36 -205 -24 -1 -63 -124 46 -265 34 35 128 -32 124 4 -201 99 33 22 -47
7230 -47 -364 -94 65 -51 61 13 164 -89 170 29 -108 -86 81 -104 -240 92 56 -164 -73 314 -173 220
7252 220 -30 95 198 23 16 148 -101 49 82 183 44 72 -93 176 -7 196 -33 113 -81 -92 91 -41
7274 -41 -48 3 81 100 -15 -35 -115 -269 -109 -212 60 -107 -135 59 98 -4 -43 -67 -76 -65 112 16 157 65 -117 -200
7300 -200 -175 -107 88 3 123 -154 -72 -240 -234 173 -194 82 104 -116 -16 107 -243 55 -38 -13 -72 -98 127 -2
7324 -2 -72 -143 -24 -33 -40 215 48 58 196 142 -115 81 -242 269 -54 -100 -106 -25 63 -286 -130 -48 321 -30 100
7349 100 -15 -52 -213 -141 32 -179 -6 152 -203 -34 112 -102 -84 -67 195 65 -245 33 33 35 88 -137 78
7372 78 61 127 113 91 -25 -40 -68 -231 -31 -154 -32 174 -147 -69 -2 -8 149 162 12 128 202 -10 345 144
7396 144 54 -167 7 89 -146 -32 -158 -42 -156 -52 140 14 -20 -103 61 80 -51 -2 171 77 232 235 4
7419 4 -35 -26 -194 161 160 -203 3 -71 -10 -215 64 23 273 -315 -187 -78 38 -206 -157 180 -22 -30 95 -173
7443 -173 115 132 -126 80 -184 69 205 73 93 1 31 -13 -47 25 -6 18 225 -116 -49 1 107 21 6 396
7467 396 64 -75 170 207 -149 -122 -38 94 -194 -180 88 -106 -77 113 -45 -47 -157 -168 287 -64 32 228 -186
7490 -186 -80 -226 -86 -129 83 -21 64 -118 244 -36 268 150 -63 -49 58 -168 3 -77 111 61 177 81
7512 81 -53 -26 -176 -138 -55 -198 97 -166 7 1 -202 -76 -142 25 -38 189 77 149 65 156 163 -26 20 -142 -127
7537 -127 181 -45 -171 -43 95 3 -58 6 120 55 -100 85 -6 180 188 -230 13 155 12 10 -84 -15 -184 166
7561 166 -4 -33 157 126 96 64 -2 41 -210 3 -75 25 40 -40 -228 66 101 69 82 -156 -122 32 65 -60 -78
7586 -78 52 -4 -35 145 -97 -178 -315 -206 56 -35 48 78 219 88 -11 56 94 55 51 -4 170 239 86 33 218
7611 218 -17 -215 -12 -170 33 458 -11 72 -52 185 -47 -87 -58 -28 -141 -18 -111 63 -29 -149 -146 -92 -37
7634 -37 -215 35 182 41 -97 75 -87 -30 -219 -20 -61 -183 -5 -41 28 -14 133 19 5 -2 -118 -67 229
7657 229 131 -197 -228 -53 44 -110 -38 -36 22 205 154 184 -92 -64 227 -13 -151 -132 -116 -154 25 34 -17 195 56
7682 56 53 -151 -222 -322 131 130 -74 -34 58 163 -110 149 -46 -31 -218 82 -35 -174 25 -163 -102 17 -77 -6
7706 -6 11 -31 131 -47 -81 126 8 141 139 107 -104 -43 -41 -154 -206 66 145 -128 46 15 -110 -84 87 -170 98
7731 98 20 -122 -19 98 46 35 70 2 35 -168 21 -5 231 -33 253 -55 132 71 2 -96 58 278 -43 -148
7755 -148 -120 302 25 234 -136 66 41 -161 145 179 92 74 78 -98 -63 0 -59 45 -18 26 84 209 -169 -30
7779 -30 50 -136 96 83 55 106 -148 31 151 28 -133 -157 2 -26 187 -229 218 -396 -131 302 -9 -24 69
7802 69 92 -96 63 28 -36 51 -1 82 -89 -37 78 -88 91 106 151 -22 72 -127 167 -131 142 -83 -61 127
7826 127 64 -57 -63 110 -90 137 39 -141 23 -194 -175 -19 73 155 126 -151 112 -23 -14 -66 -275 -129 61 -18
7850 -18 41 7 -19 -45 104 20 77 -87 147 85 -118 25 -106 143 -15 47 5 -27 51 -10 -289 184 -247 66
7874 66 -100 129 23 30 151 192 164 200 -31 176 186 -270 50 -138 206 89 20 141 261 -53 200 180 -250
7897 -250 -17 -206 177 -33 -79 239 -13 98 70 102 -197 156 -2 -123 -4 8 337 -99 13 93 -203 53
7919 53 40 -97 -98 81 231 -81 -58 -85 -125 141 -125 40 146 99 154 -13 106 91 123 -237 -112 -22 6 50 29
7944 29 -113 55 408 -3 24 84 -106 174 212 -266 102 -215 7 123 -129 11 22 -170 89 1 172 -10
7966 -10 163 -22 40 169 55 80 -146 50 -264 188 -147 -116 -62 88 -96 -42 0 -54 -117 4 155 -85 -21
7989 -21 -101 -23 -49 301 298 -6 167 39 0 -68 295 94 79 59 113 -52 -197 -50 179 35 32 64 -32 95 -83
8014 -83 -138 18 178 51 -81 108 -190 -117 97 77 -14 -1 114 -20 -76 -92 -32 -107 -164 -73 100 -97 96 216
8038 216 33 28 -153 -48 67 -58 -93 -40 57 18 -99 -6 129 -127 -14 159 95 -99 75 236 52 22 -107
8061 -107 -38 29 48 -2 43 302 -48 194 -20 212 -77 86 -56 -102 -57 -122 74 8 97 -75 -37 6 257 102
8085 102 4 -75 76 33 -14 79 -203 58 104 364 49 -1 -178 -236 169 -112 -23 -93 173 61 -79 25 135
8108 135 38 53 -175 -20 -150 -70 -29 53 86 -118 141 271 43 204 37 206 208 -58 72 91 168 82 191 -167
8132 -167 3 -163 169 -142 -126 8 10 -63 -36 224 -45 -161 101 150 -48 -69 138 106 76 -124 -36 73 -70
8155 -70 35 -34 -102 143 -64 -238 -47 3 40 -46 124 212 75 36 243 -11 87 -239 143 92 95 70 171 170 -71
8180 -71 105 -49 149 182 232 -68 -115 -17 -3 -115 -91
8191i1
##END NTUPLES=NMR FID
##END=
