##TITLE=1H_Pr 4687-pip
 CDCl3, 8 sc, 
 27.3.2020
##JCAMPDX= 6.0         $$ Bruker NMR JCAMP-DX V2.0
##DATA TYPE= NMR FID
##DATA CLASS= NTUPLES
##ORIGIN= UXNMR, Bruker Analytische Messtechnik GmbH
##OWNER= root
$$ XWIN-NMR		Version 3.5
$$ Fri Mar 27 14:13:38 2020 Russian Standard Time (UT+4h)  she@DPX200
##.OBSERVE FREQUENCY= 200.1315
##.OBSERVE NUCLEUS= ^1H
##.DELAY= (6, 6)
##.ACQUISITION MODE= SIMULTANEOUS
##.ACQUISITION SCHEME= undefined
##.AVERAGES= 8
##.DIGITISER RES= 18
##SPECTROMETER/DATA SYSTEM= spect
##.PULSE SEQUENCE= zg30
##.SOLVENT NAME= CD3CN
##.SHIFT REFERENCE= (INTERNAL, CD3CN, 0, 15.7039)
##AUDIT TRAIL= $$ (NUMBER, WHEN, WHO, WHERE, WHAT)
$$ ##TITLE= Audit trail, XWIN-NMR		Version 3.5
$$ ##JCAMPDX= 5.01
$$ ##ORIGIN= Bruker BioSpin GmbH
$$ ##OWNER= she
$$ F:/spectra/data/she/nmr/H-F/1/audita.txt
$$ ##AUDIT TRAIL=  $$ (NUMBER, WHEN, WHO, WHERE, WHAT)
(   1,<2020-03-27 14:12:26.43 +0400>,<she>,<DPX200>,
      <created by zg, POWCHK disabled, PULCHK disabled
       configuration hash MD5:
       00 E9 B6 7A A2 85 ED C7 34 08 36 98 17 FE 4E 26
       data hash MD5: 16K
       5A A1 88 47 4F 86 52 46 F3 BF 2B 12 6B 78 CB 75>)
$$ ##END=
$$ 
$$ hash MD5
$$ B4 98 1C C3 2A 6F 9A 85 D7 90 B2 EF 8B AF FA 06
##$RELAX= 
##$RELAX= 
##$RELAX= 
##$RELAX= 
##$RELAX= 
##$RELAX= 
$$ Bruker specific parameters
$$ --------------------------
##$DU= <F:/spectra>
##$EXPNO= 1
##$NAME= <H-F>
##$PROCNO= 1
##$TYPE= <nmr>
##$USER= <she>
##$AMP= (0..31)
100 100 100 100 100 100 100 100 100 100 100 100 100 100 100 100 100 100 
100 100 100 100 100 100 100 100 100 100 100 100 100 100 
##$AQSEQ= 0
##$AQ_mod= 1
##$AUNM= <au_zg>
##$AUTOPOS= <>
##$BF1= 200.13
##$BF2= 200.13
##$BF3= 200.13
##$BF4= 200.13
##$BF5= 200.13
##$BF6= 200.13
##$BF7= 200.13
##$BF8= 200.13
##$BYTORDA= 1
##$CFDGTYP= 0
##$CFRGTYP= 5
##$CHEMSTR= <none>
##$CNST= (0..31)
1 1 145 1 1 1 1 1 1 1 1 1 1 1 1 1 1 1 1 1 1 1 1 1 1 1 1 1 1 1 1 1 
##$CPDPRG= <>
##$CPDPRG1= <>
##$CPDPRG2= <>
##$CPDPRG3= <>
##$CPDPRG4= <mlev>
##$CPDPRG5= <mlev>
##$CPDPRG6= <mlev>
##$CPDPRG7= <mlev>
##$CPDPRG8= <mlev>
##$CPDPRGB= <>
##$CPDPRGT= <>
##$D= (0..31)
0 1.2 0 0 0 0 0 0 0 0.06 0 0.03 0 0 0 0 0.0002 0 0 0 0 0 0 0 0 0 0 0 0 
0 0 0 
##$DATE= 1585303945
##$DBL= (0..7)
120 120 120 120 120 120 120 120 
##$DBP= (0..7)
150 150 150 150 150 150 150 150 
##$DBP07= 0
##$DBPNAM0= <>
##$DBPNAM1= <>
##$DBPNAM2= <>
##$DBPNAM3= <>
##$DBPNAM4= <>
##$DBPNAM5= <>
##$DBPNAM6= <>
##$DBPNAM7= <>
##$DBPOAL= (0..7)
0.5 0.5 0.5 0.5 0.5 0.5 0.5 0.5 
##$DBPOFFS= (0..7)
0 0 0 0 0 0 0 0 
##$DE= 6
##$DECBNUC= <off>
##$DECIM= 24
##$DECNUC= <off>
##$DECSTAT= 4
##$DIGMOD= 1
##$DIGTYP= 9
##$DL= (0..7)
0 120 120 120 120 120 120 120 
##$DP= (0..7)
150 150 150 150 150 150 150 150 
##$DP07= 0
##$DPNAME0= <>
##$DPNAME1= <>
##$DPNAME2= <>
##$DPNAME3= <>
##$DPNAME4= <>
##$DPNAME5= <>
##$DPNAME6= <>
##$DPNAME7= <>
##$DPOAL= (0..7)
0.5 0.5 0.5 0.5 0.5 0.5 0.5 0.5 
##$DPOFFS= (0..7)
0 0 0 0 0 0 0 0 
##$DQDMODE= 0
##$DR= 18
##$DS= 0
##$DSLIST= <SSSSSSSSSSSSSSS>
$$ [...]
##$SUBNAM2= <"">
##$SUBNAM3= <"">
##$SUBNAM4= <"">
##$SUBNAM5= <"">
##$SUBNAM6= <"">
##$SUBNAM7= <"">
##$SUBNAM8= <"">
##$SUBNAM9= <"">
##$SW= 24.9337058887773
##$SWIBOX= (0..15)
0 0 2 0 0 0 0 0 0 0 0 0 0 0 0 0 
##$SW_h= 4990.01996007984
##$TD= 16384
##$TD0= 1
##$TE= 0
##$TE2= 300
##$TE3= 300
##$TEG= 300
##$TL= (0..7)
0 120 120 120 120 120 120 120 
##$TP= (0..7)
150 150 150 150 150 150 150 150 
##$TP07= 0
##$TPNAME0= <>
##$TPNAME1= <>
##$TPNAME2= <>
##$TPNAME3= <>
##$TPNAME4= <>
##$TPNAME5= <>
##$TPNAME6= <>
##$TPNAME7= <>
##$TPOAL= (0..7)
0.5 0.5 0.5 0.5 0.5 0.5 0.5 0.5 
##$TPOFFS= (0..7)
0 0 0 0 0 0 0 0 
##$TUNHIN= 0
##$TUNHOUT= 0
##$TUNXOUT= 0
##$USERA1= <user>
##$USERA2= <user>
##$USERA3= <user>
##$USERA4= <user>
##$USERA5= <user>
##$V9= 5
##$VALIST= <valist>
##$VCLIST= <CCCCCCCCCCCCCCC>
##$VD= 0
##$VDLIST= <DDDDDDDDDDDDDDD>
##$VPLIST= <PPPPPPPPPPPPPPP>
##$VTLIST= <TTTTTTTTTTTTTTT>
##$WBST= 1024
##$WBSW= 4
##$XGAIN= (0..3)
0 0 0 0 
##$XL= 0
##$YL= 0
##$YMAX_a= 348495
##$YMIN_a= -313298
##$ZGOPTNS= <>
##$ZL1= 120
##$ZL2= 120
##$ZL3= 120
##$ZL4= 120
##$ABSF1= 10
##$ABSF2= 0
##$ABSG= 5
##$ABSL= 3
##$ALPHA= 0
##$AQORDER= 0
##$ASSFAC= 0
##$ASSFACI= 0
##$ASSFACX= 0
##$ASSWID= 0
##$AUNMP= <proc_1d>
##$AZFE= 0.1
##$AZFW= 0.1
##$BCFW= 1
##$BC_mod= 2
##$BYTORDP= 1
##$COROFFS= 0
##$CY= 11.3945322036743
##$DATMOD= 1
##$DC= 2
##$DFILT= <>
##$DTYPP= 0
##$F1P= 16.9975609425685
##$F2P= -3.02152046262296
##$FCOR= 0.5
##$FTSIZE= 0
##$FT_mod= 4
##$GAMMA= 1
##$GB= 0.15
##$INTBC= 1
##$INTSCL= 1
##$ISEN= 128
##$LB= 0.24
##$LEV0= 0
##$LPBIN= 0
##$MAXI= 10000
##$MC2= 0
##$MEAN= 0
##$ME_mod= 0
##$MI= 1.114404
##$NCOEF= 0
##$NC_proc= 0
##$NLEV= 6
##$NOISF1= 3.799351
##$NOISF2= 2.8
##$NSP= 1
##$NTH_PI= 0
##$NZP= 0
##$OFFSET= 15.70392
##$PC= 1
##$PHC0= -9792.452
##$PHC1= 23.00082
##$PH_mod= 1
##$PKNL= yes
##$PPARMOD= 0
##$PSCAL= 0
##$PSIGN= 0
##$REVERSE= no
##$SF= 200.130013532006
##$SI= 16384
##$SIGF1= 3
##$SIGF2= 2
##$SINO= 400
##$SIOLD= 16384
##$SREGLST= <1H.CDCl3>
##$SSB= 0
##$STSI= 0
##$STSR= 0
##$SW_p= 3612.71676300578
##$SYMM= 0
##$S_DEV= 0
##$TDeff= 0
##$TDoff= 0
##$TI= <>
##$TILT= no
##$TM1= 0
##$TM2= 0
##$TOPLEV= 0
##$USERP1= <user>
##$USERP2= <user>
##$USERP3= <user>
##$USERP4= <user>
##$USERP5= <user>
##$WDW= 1
##$XDIM= 8192
##$YMAX_p= 0
##$YMIN_p= 0
$$ End of Bruker specific parameters
$$ ---------------------------------
##NTUPLES= NMR FID
##VAR_NAME=  TIME,          FID/REAL,        FID/IMAG
##SYMBOL=    X,             R,               I
##VAR_TYPE=  INDEPENDENT,   DEPENDENT,       DEPENDENT
##VAR_FORM=  AFFN,          ASDF,            ASDF
##VAR_DIM=   8192,          8192,            8192
##UNITS=     SECONDS,       ARBITRARY UNITS, ARBITRARY UNITS
##FACTOR=    0.0002004,     1,               1
##FIRST=     0,             0,               0
##LAST=      1.6414764,     0,               0
##MIN=       0,             -313298,         0
##MAX=       1.6414764,     348495,          0
$$ Real data points
##PAGE= N=1
##DATA TABLE= (X++(R..R)), XYDATA
0@%%%%%%%Qj6J6j6K4l2L7m5N6o9Q2r6J14j36J56j81K13k46K80l20L66m15M70n33
31b83N99o71P55q44R41j051J167j293J435j592J762j950K159k391K651k941L268
48A721l642M073m574N167n884O766p883R358j1403J4448j9528L0016q7783K17189
62A48041J88052l32373k92703O8629L18984J14947j44450j88128n254J12298J08722
73I6765J3024o3362j05882m3706P3063J30697J6104j38588j37611N4532J83559
84G8595P0485j46049j51013N8500J84405M9639j33145j09715N9898J19978J0545
95I2123r2176n5151L2315M4979L26j7852j3346k2340j2161M1521N8634j4551q1704
108c9383k6587Q2105P9845l5310r6072k1479O4550M6928k0687m1825k0803p384
$$ plain form
0 0 0 0 0 0 0 0 0 8 -8 8 -8 16 -16 21 -24 32 -37 45 -51 63 -73 83 -98 115 -131 149 -171 195 -220 250 -283
31 -283 316 -355 400 -444 497 -554 613 -680 755 -837 925 -1025 1134 -1257 1394 -1547 1721
48 1721 -1921 2152 -2422 2745 -3139 3627 -4256 5102 -6301 8147 -11381 18635 -69148 148041
62 148041 336093 3720 -288983 -220354 98630 213577 69127 -119001 -124255 -11957 96765
73 96765 109789 46427 -59455 -103161 -30098 100599 116703 -21885 -159496 -104964 78595
84 78595 149080 3031 -147982 -89482 94923 144562 11417 -98298 -38400 81578 92123
95 92123 -53 -55204 -22889 22090 22416 4564 -8782 -31122 -43283 -1762 56872 42321 -39383
108 -39383 -65970 16135 95980 60670 -35402 -56881 7669 54597 33910 -7915 -28718 -36102
120c6102J0736L8922L1699k8163o8257j8240P4031Q5885j7231j07084n3284P9120
132g968J04682j6680j13200n0401O9443P0517l0176o6981J883M6426q99l5122
144b8476J1942M8204r88n2743j3260N3259L4189l9634m6234K1415M2269k3303
156F640n4075J4173O7615J657q5895m3734Q1161R7868k8407j18656l8053J01154
168A448J01979l1654j13825m4289O9569P8230q487p0621m2066J7707L9023K3290
180B0304R68k4319l9637n494N7938N7947k6659q1934j7888P5113N7875m4324p8920
193d9030j072O5178K6432m6010m3816J7620M3733R055k7372k0462J2243K8561
205A5060J3911j0668k1426j2335J0105K6875J3415k6288m4139p835M5163M2272
$$ plain form
120 -36102 -25366 13556 45255 17092 -51165 -69405 4626 90511 73280 -33804 -87088 -7968
132 -7968 96714 80034 -33166 -83567 -14124 56393 26217 -40764 -38881 7545 6646 -28476
144 -28476 -16534 31670 30682 -22061 -35321 17938 52127 12493 -33741 -12326 29943 6640
156 6640 -47435 -33262 34353 36010 -49885 -93619 -12458 85410 57003 -61653 -99706 1448
168 1448 103427 71773 -42052 -86341 -16772 61458 52971 -17650 -59716 -42009 -2986 20304
180 20304 21272 -3047 -42684 -48178 9760 67707 41048 -40886 -58774 16339 74214 29890 -49030
193 -49030 -50102 15076 41508 -4502 -48318 -30698 13035 22090 -5282 -25744 -13501 15060
205 15060 28971 18303 -3123 -15458 -5353 21522 34937 8649 -35490 -43325 1838 44110
217D4110j9989o0450k0268N0054N6779p920n2264k3111K9560L5044J965j8006
229A5504j5060j0088n686J4030K6375M08m1063l1808K6960N3073O265m5039k8053
242c4182K5257L8620J731k5848j2344R700P461n745m764L360j3j0217p970N834
256i120J2314J400r799j635J0850M316j0226j323K0359J1994k5369l3033J1648
269a7624M6025J2053m6500m6394J6573N6124J9787l6485m1757J709L6943L1798
281C2252r03k9810k9475K138L5877L1690j3434m9673k8669K9045M9416M095m5025
294a2476l6600J6563M5309J6962k6135k9695O589K9114J1618j4870j4195L010
306d806Q360j172p148k216J220L81J1P04l834o132O753K0005N352k2510j8581
$$ plain form
217 44110 24121 -36329 -56597 -6543 50236 42316 -9948 -33059 -3499 31545 33510 15504
229 15504 444 -9644 -15330 -1300 25075 25483 -15580 -47388 -20428 32645 38910 -6129 -34182
242 -34182 -8925 29695 31426 5578 -6766 2934 10395 4650 -114 3246 3233 -6984 -14954 -9120
256 -9120 3194 4594 -5205 -6840 4010 8326 -1900 -3223 17136 29130 3761 -29272 -17624
269 -17624 28401 40454 -6046 -52440 -35867 20257 40044 3559 -38198 -36489 454 32252
281 32252 31349 1539 -27936 -25798 10079 41769 28335 -21338 -50007 -20962 28454 32549 -12476
294 -12476 -49076 -32513 12796 29758 3623 -26072 -19483 9631 21249 6379 -7816 -4806
306 -4806 3554 2382 -4766 -6982 -5762 -5381 -5370 -4666 -8500 -14632 -7879 12126 17478 -5032 -23613
321b3613J7073L4833M544l4442k8767J2444L4883J1314k5330k9409k449K2607
333f312K2062R84j8756j8314K887K2270K0473r27k3045k0842O174K8697J5685
346C1036j9697l1938n105K3491J9634p103j9546o101J0331R446L574K738r41q270
360A549n730Q689J2199k173j3426p293N101N008l460m417M383M154o673q989O482
375d596J7198P214j2465j7209k9J9408J6353q216k4988j2710J1413J9886O219
388A7478j4690k0360o294J5352K3304O935j8768k4945Q59L1346K3226j4925l3257
401a4739q701K1971K0422m079j9708j3230L653J1777Q241j965q042p227K561J1222
415B156P402l845o491j392J938J706j66n91n02j880n468n638L005J0927N333r654
$$ plain form
321 -23613 -6540 28293 32837 -1605 -30372 -17928 16955 28269 2939 -26470 -28919 -6312
333 -6312 15750 16734 -2022 -20336 -17449 4821 25294 24367 1322 -19520 -13346 15351 31036
346 31036 11339 -20599 -25704 -2213 17421 10318 -9228 -15329 -4998 4448 8022 10760 9819 1549
360 1549 -4181 4508 16707 14534 1108 -6185 -1084 3924 464 -3953 430 4584 -2089 -11078 -4596
375 -4596 12602 19816 7351 -9858 -9887 9521 25874 17658 -7330 -20040 -8627 11259 17478
388 17478 2788 -17572 -23866 -8514 14790 21725 2957 -21988 -21129 10217 33443 18518 -14739
401 -14739 -23440 -1469 18953 14874 -4834 -18064 -14411 -2634 5607 3642 -4400 -11627 -9066 2156
415 2156 9558 5713 -778 -2170 -232 1474 1308 717 215 -1665 -7133 -12771 -9766 1161 6494 -3160
431c160j3632M62J8400J5519o539k0200p515J3178J5360K013j1667j4115n778
444a7674R015J6372L953j4655j8028J210K0670J6859o372j8713o758J0558J5188
457A1625M256q339j2632n439P098J0160J564q235q543k471N416R346L569m420
471B955o991j583O903Q217J292n904m376j032k02J635N367J170r466j0413K286
486a0142J3330Q505o314j1454l634R105J1790M024o261j1384n118P943J3544J730
500A5664j4105j3557P06J3313R531l508j2673p683O563J3827O265o773j0821k253
514e504Q793P180j990o597m177p74Q63K374J195j946k911j430J048K303K961L128
530D516M26n331n635K724J1370M422j1117j2495m2J0484Q763k135j1347r695K259
$$ plain form
431 -3160 -16792 -16330 2070 17589 11050 -9150 -16665 -3487 11873 13886 2219 -11896 -17674
444 -17674 -8659 7713 11666 -2989 -21017 -19807 863 17722 11350 -7363 -14121 -3563 11625
457 11625 15881 7542 -5090 -10529 -3431 6729 8293 58 -8485 -10956 -5540 3806 7375 2955
471 2955 -4036 -5619 1284 9501 10793 4889 513 -519 -721 914 6281 7451 -2015 -12428 -10142
486 -10142 3188 11693 5379 -6075 -9709 -604 11186 15210 8949 -2435 -7553 390 13934 15664
500 15664 1559 -11998 -11292 2021 11552 8044 -4629 -12312 -5749 8078 14343 7570 -3251 -5504
514 -5504 3289 10469 8479 1882 -2295 -3069 -2206 168 1363 -583 -3494 -4924 -3876 -1573 1388 4516
530 4516 4942 -389 -6024 -3300 8070 12492 1375 -11120 -11162 -678 8085 5950 -5397 -15092 -12833
545a2833J3647J0464l644j5054p882Q630J6754O342j1493j6055l673J1733J4548
558A1484q6j6270j4170M960J6045P315p608j0792k364O952P834L309j933o115
572a439o215J272R475O706n387j1709m178N427P772K463m406o235k368N258N984
587B420L754j577n220k915J674N371M917j447r226p806L701J2804M434j0039j2104
602a1259K308J1016P559k711q677k503K932P450L171k950n190l550J624L364J438
617D022j704l152l794m1O104L363j864m132q3M756J780k327j549L471K730n681
633A899p565K337J0546L147r842j2193R08J4090J1490o168j5873o756J1756J6530
647A4306K923j3366j4982O19J3206J1351k131j3270j3614q18J6392J7259n280
$$ plain form
545 -12833 814 11278 7634 -7420 -15302 -6672 10082 16424 4931 -11124 -14797 -3064 11484
558 11484 11398 -4872 -19042 -14082 1963 9278 1670 -9122 -11486 -4534 3300 6609 4676 -1439
572 -1439 -7654 -6382 3093 9799 4412 -7297 -11475 -6048 1724 4187 -219 -6454 -8822 -3564 2420
587 2420 6174 4597 -623 -3538 -1864 3507 8424 6977 -2249 -10055 -6354 6450 10884 845 -11259
602 -11259 -8951 2065 9624 6913 -1764 -4267 -1335 6115 9286 6336 1146 -2404 -780 2584 4022
617 4022 2318 -834 -4628 -4669 1435 4798 2934 -1198 -1281 3475 5255 2928 1379 4850 7580 1899
633 1899 -5666 -3329 7217 10364 522 -11671 -10763 3327 14817 8649 -7224 -13980 -2224 14306
647 14306 17229 3863 -11119 -10500 2706 14057 11926 -1344 -14958 -15776 616 17875 12595
660A2595k3723j3831J4684K7641O351k2131k2918M310K4755J4390j1754k2259
672a1890p458J3534J6266O0j4104j0014K557R493O221M48n111p292j071Q095Q903
687H637j282j0371o927N816R617q45r429m304N801N243k648n929P65P091M050
702E285n873o930L133R510L860p596r435J105R019N035n655p929o36M870K097
717a40J35J571p51m581k269N741R262N46j0142q241M396J1910M284q940j0541
732g760n49Q334P237j914p434l294L353L750J771J915O02m485o029J799R756N353
748A2405p021j3014k256J0718R505k738j0795n451M092Q385N006k484o816m069
762d533J985N984O747n42r642r315K301J1853Q708o878j6350n920J3256J6494
$$ plain form
660 12595 -11128 -24959 -10275 17366 23717 1586 -21332 -17022 7733 22123 10369 -11890
672 -11890 -19348 -5814 10452 10512 -3592 -13606 -11049 -1556 4665 5113 2 -7290 -8361 -266 8637
687 8637 7355 -3016 -9943 -4127 5490 4645 -4784 -9088 -3287 1956 -692 -6621 -5856 1235 5285
702 5285 -588 -7518 -4385 5125 8985 1389 -8046 -6941 2078 7113 1458 -6471 -7107 -2237 -140
717 -140 -5 1566 815 -3766 -6035 -294 8968 9514 -628 -8869 -4473 7437 11721 2781 -7760
732 -7760 -8309 25 7262 5348 -2086 -5380 -2027 1723 3494 5409 6011 1526 -4503 -2704 7052 12405
748 12405 5384 -7630 -9886 832 10337 7599 -3196 -8647 -4555 3830 8836 6352 -464 -4533
762 -4533 -2548 3436 10183 9641 -1 -9316 -7015 4838 13546 6668 -9682 -15602 -2346 14148
776A4148j476j6325r711P941J4368L636q572r690q59O996N924j103n531n217m9
791e520M655L554p74l702k971R90M356L629k744n091R94N243R39n579l908M711
807a218O209k673r609l309Q874Q422k839j0975l770O963J0654R41q545p731K336
822f270Q252M447k627p072m358J202O572M974k161p500n605L584J0682M886p017
837A989r772k90R313O928k883p113l992K397M676K131j387l756l297O90M062L456
853C152q11l269j783M76L195L255N25l612l822P69L235K445p44k790k599o52K248
870g82L726J733k656m873j306M940O302J061n408p120J08O791P055j584j0430
885b443o937N620J0436L389q057q948R72P114O853j271o009m843Q42O176M541
$$ plain form
776 14148 12672 -3653 -13364 -5423 8945 12581 4009 -5681 -6540 456 6380 5277 -254 -5471 -5520
791 -5520 -865 2689 1915 -1787 -4758 -3768 588 4217 1473 -3618 -2624 2619 3558 -2021 -5929 -1218
807 -1218 4991 2318 -7291 -10600 -1726 6696 3857 -7118 -10888 -3925 6729 7670 -875 -8606 -6270
822 -6270 1982 6429 3802 -3270 -7628 -6426 146 5120 2959 -4541 -10146 -6562 4120 9006 1989
837 1989 -7783 -8073 1240 8168 5285 -1828 -5820 -3423 1253 3384 1997 -1759 -5056 -4366 -304 3152
853 3152 2341 -928 -2711 -2235 960 4215 4740 1128 -2694 -1925 1310 3755 3011 221 -2378 -3030 -782
870 -782 2944 4677 2021 -2852 -4158 782 7084 8145 2737 -4383 -4275 2516 9571 7987 -2443
885 -2443 -9380 -3760 6676 10065 2008 -6940 -5968 1146 7999 6728 719 -4124 -3282 2894 7435
900G435k094p035l488K854O393J013m823m306J037L986J781j803k067J017J974
915A874m52k433K0L425J977m008n022O53N410K911l210n684j442L397M680K078
931D174k810n516k789N346P368N69p069p085J411P717M844l647p824l350M069
946d592O808K051l909n683j549M513N858J619m360n610j188M637N843k35o024
961a821m858J431N561L150j604m972j846K519K672K092pk663l004J331L906J670
977C557j308l819j620K263R48P91R8j114j604q44J022M133J477k850l323n37L118
994C88M844K72n021m720R31N392L300k029m568l598J832N550L537k343n761k767
1010d761L808P762J144o560m732L42N241L157p79n917j290K76L089L224q04j971
$$ plain form
900 7435 5341 -1694 -5182 -2328 4065 5078 255 -4051 -3014 972 2753 950 -1117 -100 1874
915 1874 1422 -1011 -991 2434 4411 403 -4619 -3966 1444 4355 1145 -4539 -5981 -2584 2096 4174
931 4174 1364 -4152 -6941 -1595 5773 6342 -727 -7812 -6401 1316 6160 2513 -5311 -8661 -4592
946 -4592 2216 4267 358 -5325 -6874 -2361 3497 5116 756 -4854 -6042 -1405 4438 4203 -1821
961 -1821 -6679 -5248 313 3463 1859 -3113 -4959 -2440 232 2324 2317 -346 -3350 -2019 1887 3557
977 3557 2249 -1570 -3190 -927 21 812 910 -204 -1808 -2652 -1630 2503 3980 1130 -2193 -2730 388
994 388 5232 5504 483 -4237 -3306 2086 5386 3357 -1211 -4809 -2977 2573 6110 3767 -1994 -4761
1010 -4761 -953 6809 7953 1393 -3339 -2997 2244 5401 4622 -1295 -2585 -2309 780 4004 3200 1229
1026A229n178J888M012K876p54l462k506P29K594K855q19m251k556J099K468K897
1042C121q54l066k569K61M346K937j826m300j931K703M240R2k980k341p10J116
1058a761K186J341j230l343j476K094L403J231k277k800n36K102K269J393j800
1073G96l313j587J624L355P77j710l808j188J957M593J185k920m077n5L559L995
1089C183k98l698l189N64K922L028j03l285m787P44N485K761j878l594k240K308
1105b077L580J836j806k350k640L026L244J493l071m081J45K314K891j36j284
1120A084l172p70L403K865R01m185j391N79K380O49O95j598j831o81P63K364Q4
1137B139j047k502j84J226J911J837j597k482n85J103L556J120k388l762p96K864
$$ plain form
1026 1229 -3949 -2061 1951 4827 4073 611 -1895 -1166 1428 4283 3464 -787 -3343 -2244 224 3121
1042 3121 2267 -799 -3368 -3107 1239 4176 2350 -1950 -3881 -1178 3062 3154 174 -2167 -2877 -1761
1058 -1761 425 1766 536 -2807 -4283 -2189 1214 2445 168 -2632 -3168 -1066 1203 2596 796
1073 796 -2517 -4104 -2480 875 1652 -58 -3866 -5054 -3097 1496 2681 -239 -4316 -4371 -812 3183
1089 3183 2885 -813 -4002 -3438 -516 2512 2409 -876 -5663 -4919 566 3327 1449 -2145 -4385 -2077
1105 -2077 1503 3339 1533 -817 -3457 -431 2813 4306 1235 -2846 -2701 -387 2504 2368 1084
1120 1084 -2088 -2858 545 3410 4311 126 -1265 -686 1694 2343 3038 1440 -391 -1072 -309 2055 2139
1137 2139 1092 -1410 -1594 -368 1543 3380 1783 -699 -1284 -181 3375 4495 2107 -1655 -2451 413
1153D13L240r5k747l804l39L728L774l32l987k952J232M136K326j833m012j754
1169c006J563L656J720k068m386j796K732L745R94k794l522k55K959L085K81k505
1185D03k949j00K627K504p48k883j898N74K267J009k55j703j685m0K258K153m30
1202A104j841j459K07J743J191r1j726j682j36J798J744m50j871j394L55J578
1218i30J779K75j567k075l7K412K308J55l120k311M52L047J726j115k867j200
1234c068R69L131J317j373k354j084J359K725J604j117l213k176K267L044J788
1249C819k054m436k61K541M109n88k496l009R13K071K666M88k457k407j073J908
1265b66M335m60k773l854J606K766L523j867m004k019K127L509O39j786j848r00
$$ plain form
1153 413 3653 3558 811 -2993 -3332 396 4170 3838 -149 -3101 -1869 2267 4593 2760 -1252 -3006
1169 -3006 -1443 2213 3933 1865 -2521 -4317 -1585 2160 3154 360 -3162 -3417 -458 2627 2908 403
1185 403 -2546 -2646 -19 2485 1737 -1146 -3044 -2470 -203 806 551 -1152 -2837 -2877 -619 1534 1104
1202 1104 -737 -2196 -1989 -246 945 854 -872 -2554 -2690 -892 852 402 -1469 -2863 -2508 -930
1218 -930 849 1124 -443 -2518 -2555 -143 2165 2320 -800 -3111 -2659 388 2114 999 -1868 -3068
1234 -3068 -2099 1032 2349 976 -1378 -2462 -1103 1622 3226 2109 -1104 -3280 -1013 2031 3819
1249 3819 1765 -2671 -2932 -391 3718 3130 634 -2375 -1462 609 3275 3763 1306 -1101 -2174 -266
1265 -266 4069 3609 836 -3018 -1412 1354 4877 3010 -994 -3013 -886 2623 3262 1476 -372 -1272
1281a272P28J776K004j092l056j621J446M001Q67k529l627l68L189K229K2k819
1297a22j791M90K350J415n71j620j456pJ193J101K65j293j948k58J840K023j98
1314A413k376j077O27J787N85o38j075q29J74Q26N44K43m20j042j341N25J689
1331c85J832o86l516j196K713L281K68l371k189Q72K481J491o51j929j779k75
1347c039J679L187L24l225l278O56M088L667j858n348j793L456N254Pm339l489
1363d051J247L571J942j105k750j390L98J994K657N34l015l371Q65M430K469k328
1379B097m446r07L708K960o76l550q33Q47J933M20o75p05k28L72J92M40J044m21
1397A572j337q47J069J213l4j016n83K4L42K51J52O89n43j227p62J411J959Q5
$$ plain form
1281 -1272 -544 1232 3236 2144 -912 -2533 -1087 2914 3781 1252 -2375 -2743 446 2675 2697 -122
1297 -122 -1913 -1423 927 2342 1771 151 -1305 -1312 -119 982 1247 -46 -1994 -2252 -412 1611 1413
1314 1413 -963 -2040 -1413 374 959 321 -754 -1583 -1409 -583 -39 204 -216 -1258 -2599 -2074 -385
1331 -385 1447 761 -2755 -3951 -1238 2043 2311 -1060 -3249 -2377 104 1595 944 -985 -2764 -3039
1347 -3039 -1360 1827 2151 -1074 -4352 -3696 392 4059 2201 -3147 -4940 -1484 3770 3777 -562 -4051
1363 -4051 -2804 767 2709 1604 -1146 -2536 -2138 -144 2513 3047 32 -3339 -2474 1956 4425 2097
1379 2097 -2349 -3256 452 3412 2736 -814 -1647 -800 1133 1553 878 173 -55 317 509 949 1993 1572
1397 1572 235 -612 457 1670 1636 620 37 61 403 654 806 1495 952 -275 -1037 374 2333 2418
1415B418j562j884l65K257K459r50l151j847J439L124J221k336l111k4K526J642
1431A856K91j793j777p33K226J830J23j780k417o80K160M348j827l450j999J335
1447b287L482J062k060k505l26K669P43l43j131P7j276J67J156J606j85k458j563
1464c172J422K950N97k491j655N56J998P26n10j064n87J9L2J077Q33j80k113j298
1482b860J240K755O05k241k250L4L050J742j582j595K04j2P08Q87O28j146k022
1499a855K72J712J716o24j826p36J88K038R29r50j495K52M39O60J486j245j199
1516b38o83M89J751O15r30j014q78M40J508J073l64j860q15N97J587J331r64k266
1534f21o30J311J817N81j517k032j49J591J382M96j592j262o62J338J950N67k268
$$ plain form
1415 2418 856 -1028 -1393 864 3323 2373 -778 -2625 -1186 1938 3159 823 -2288 -2312 214 1856
1431 1856 2147 354 -1423 -2156 70 1900 2023 243 -2174 -2854 -694 3654 1827 -1623 -3622 -2287
1447 -2287 1195 2257 197 -2308 -2634 35 778 435 -696 -619 -1895 -1728 -572 1034 849 -1609 -3172
1464 -3172 -1750 1200 1797 -694 -2349 -1793 205 931 421 -643 -1230 -1211 -1179 -102 731 551 -1562 -2860
1482 -2860 -1620 1135 1740 -501 -2751 -2717 333 2075 493 -1102 -898 -910 -202 685 1313 167 -1855
1499 -1855 -1583 129 1845 1221 -605 -1341 -1153 885 1814 864 -631 -379 60 720 2206 961 -238
1516 -238 -921 -432 1319 1934 1004 -10 -888 -448 1060 2133 1769 -91 -906 -309 1278 2609 1645 -621
1534 -621 -1251 60 1877 2458 941 -1091 -1240 351 1733 2229 637 -625 -1287 51 2001 2568 300
1551C00k021M21K149J773o75k939p72J147J586R05j424j090o94M68J324J219m94
1568A183j942r32J006J437P78j200j804l92J020J470K52j279o41m34N89R20Q22
1585H53l51j653q42J030J688L06j407j087l63J396R32m47k16j475N31m33K181
1602F43K91r94j460o62J541J448O06j383k038J17J672J492n17j641r34K82J321
1619b16J539j67j792j343K72K048J543p58k408o50J338J774O17j260j382p33J064
1636e14J513P36q01j427j257J788J357r0o91k023N34L98J607O74j663n91l71J423
1654F02P04o8n56j497K69J287Q52k63j031r58P18R65M18o03k69n56m10M34J157
1673A195L07j037j012k72J327J147l84j283q59K43P63J157j32j282j074J05J535
$$ plain form
1551 300 -1721 -1300 849 2622 1947 -992 -1764 -617 969 1874 450 -640 -1334 -866 458 1677 1183
1568 1183 -759 -1691 -685 752 1530 330 -1474 -1866 -846 624 876 -403 -1044 -1478 -889 31 853
1585 853 502 -1151 -1993 -963 725 1031 -376 -1463 -1826 -430 502 55 -161 -1636 -1105 -1538 643
1602 643 934 -60 -1520 -2182 -641 807 1413 30 -2008 -1891 -219 1273 756 -885 -1819 -1537 -216
1619 -216 1323 1156 -636 -1979 -1707 341 1884 1126 -1282 -1932 -594 1180 1797 537 -845 -1578 -514
1636 -514 999 1735 934 -493 -1750 38 1395 1305 614 -1409 -875 -477 1130 1804 141 -450 -821 602
1654 602 1306 1238 682 -815 -546 741 1593 1330 299 -659 59 1024 1442 839 570 14 -396 38 1195
1673 1195 1502 465 -547 -819 508 1655 1271 -12 -871 -628 135 1292 1160 -122 -1196 -1091 444
1690D44Q99k77j734j284P69J777J274j511j424p49R49K209o2j203j660k33J269
1707e47J275N00j443j407l62J635J676p32j378j108P90J202J139q91j428l71N23
1724i27J032N56n09j309n65J014Q85l4k76j104l93R75R33J81q24k90j34K72Q14
1743B97p8R7o88k73o2O61Q39o42n86p79P06N58J008o78m45j050P80Q49P47N8j864
1764e45n41O38J733L52j073j732M7R58J482J69j211j176J81J124J186q9j104j241
1782h42M10J283R31o8j639j189P85J585O70j382o35l60K61R12Q00j62j507l74
1800e21N69J144r3l22j171k29J485k19L97j001j87N3o41J858n60J8q61r48K09
1819a020J535R75j000j621J06J014J140p37o41l96o89J784N75P82j697j112L68
$$ plain form
1690 444 1343 1066 -668 -1952 -1183 594 1868 357 -1067 -1816 -867 1342 1280 77 -1583 -1816 -547
1707 -547 728 1228 -215 -1622 -1984 -349 1327 595 -783 -1891 -1101 101 1240 349 -1079 -1450 -927
1724 -927 105 661 152 -1157 -1722 -708 177 143 -133 -1237 -1630 -655 278 459 -365 -655 -789 -517 297
1743 297 219 316 -372 -645 -707 -46 793 151 -435 -1214 -508 50 1058 380 -65 -1115 -335 514 1261 1319 -545
1764 -545 -1086 -448 1285 1637 564 -1168 -1121 -163 1319 1488 277 -899 -718 406 1592 1503 399 -842
1782 -842 -432 851 1782 1714 75 -1114 -329 1256 1926 544 -91 -451 -190 722 1522 1360 -147 -521
1800 -521 48 1192 1099 777 -394 -623 862 643 1040 39 -148 -95 -736 1122 562 580 -281 -1229 -1020
1819 -1020 515 1490 490 -1131 -1025 -11 1129 392 -249 -645 -1334 450 1025 1807 110 -1002 -634
1836f34O08Q82o38O24k771J335M43o73R02j155k10M17K00R11M95j981M67p26J168
1855c36J871j938l61j146J152M52j10M36j163q74J008J653p2k84j399k15N14R87
1873A75R06j063j459R1J352O90j32r54l69k76P31P49N27p19j361J24R42R51L75
1892A280j545p12M38J022Q11k96j038o34K85P85O35M2j462l08O39O11P43j64j047
1911H5n75N83Q41L92n38r76l0M38N09K19m40m58j03r1R90O1o01m69l1K56K55P37
1933A054j80r94k17K76P95M01p57p68l00O18P55K66p47n48l53L67R91J64n84r58
1953g19j10P26J048r2j008j059m4J234J016l20j155r22L00J357M38m48j253l18
1971a329L50J277O01p16j222m68R98J122nr71q68m62J160J249j66j296p02N99
$$ plain form
1836 -634 -26 856 218 842 -1929 -594 -151 -824 78 -1077 -1287 -870 -670 241 736 -1245 -778 -1504 -336
1855 -336 1535 -403 -764 -1910 -758 -306 -416 20 -1143 -2017 -1009 644 572 288 -1111 -1326 -812 175
1873 175 1081 18 -1441 -1350 2 692 560 -394 -763 -1039 -308 441 968 249 -1112 -988 -46 905 1280
1892 1280 -265 -977 -539 483 1294 998 -40 -674 -389 396 1031 1073 -389 -697 -58 553 1296 1132 85
1911 85 -490 93 934 1326 788 -188 -218 220 729 948 508 50 -53 -144 846 907 306 -163 -194 62 317 1054
1933 1054 874 -120 -337 -61 734 1135 378 -390 -690 -72 683 949 202 -346 -699 -332 659 823 239 -719
1953 -719 -829 -103 945 853 -155 -1214 -1258 -24 992 672 -483 -1405 -1105 252 690 242 -1011 -1329
1971 -1329 -979 298 899 183 -1039 -1507 -509 613 608 -363 -1231 -1693 -533 716 550 -746 -1448 -849
1989h49R39N25o99m86l48L14K09P13o63J62k28l95N48O80j55q05k42J56N18L13
2009B07L54q47kL99k96N21M67r80m31o9L46J157j22m33K66k198Q08J939N74j563
2029I7p23k79J721N00n48r72j54L59Q53K6Q40j071j849J392P16Q62j120j093k13
2048f56J387J068q9r47j619M33O74R97q8j090o60K22J019O3P11j342q36N27R52
2067G26N07n99r35l42O00J072J31q36k31p02J305J04m69m93M32m12K33J60j5q5
2087A51K07m52m95J009k04K47p73r00Q07L79O18m59j30K30j380J097M50m77J88
2106A13q14J48Q91l5l18j27j628J215P67R65j972j57K10L43L12J24K56q19l9M08
2126a57P07M54p52j463K14M26J170L99j655k86M18Q72M13l39m91l64M43K18O3
$$ plain form
1989 -849 90 615 -84 -570 -918 -604 -395 318 -345 -183 -411 -806 -258 422 267 -538 -780 -624 -106 207
2009 207 561 -286 -288 111 -185 336 803 -177 -608 -677 -331 826 704 271 537 -1661 -853 1086 1660 97
2029 97 -626 -905 816 1316 768 -204 -358 1 854 880 1720 649 -1200 192 908 1770 650 -443 -656
2048 -656 731 1799 1710 763 -856 -423 251 1248 1160 70 -590 -368 651 714 1425 83 -753 -226 726
2067 726 1233 634 -301 -643 -43 1029 1160 324 93 -609 696 800 331 -162 270 -142 91 251 236 151
2087 151 358 -94 -589 420 216 463 -310 -1210 -403 -24 594 135 5 235 -1145 -48 402 -75 113
2106 113 -701 -553 338 303 -15 -142 -1770 -555 212 1177 -795 -952 -742 -399 -87 37 293 -526 -565 -157
2126 -157 550 1004 252 -1211 -997 -571 599 998 -657 -943 -525 347 760 421 -70 -434 9 227 290
2145B90j10n79m84R37K63N50k05q62j03j00O82O85r14Pl12L63M33L0j9k55n28
2166b31K48Q09p2m20k57l28L27M83j12k4m89j54L26M84J53p57k11K17J06J159
2186A257k37p96m24L86K81O11o72j93n19K34L01N79l4l69p73J55P99M3l08p45
2206d24O5J37N74J42k54m36o01L77N49M12l84q03k28L76P96M61p55o65j19K74
2226e06J008m53l51l99Q8K33N67J08n93o50r7O58Q99k82o39n69L37O16N48o17
2246i4n86l0M7K88P95n41j86r61M00J205L7j79q56o5K75O90r5k41n17J7L44J04
2268a49N1M42q53m8L43M05L43l35o24n5N31M41J93o56m95N7M02O16k2L5p07n99
2290f84P63O24j99o7o52N5L39P81j00l41o56J10K41O67M23j101m86j90R21O93
$$ plain form
2145 290 180 -399 -883 54 317 867 662 -200 -303 -403 279 964 50 57 -255 108 541 571 552 297 -231
2166 -231 17 826 754 334 77 -251 76 559 447 423 -66 -220 106 590 743 -14 -225 -8 98 1257
2186 1257 1020 224 -200 186 467 1078 406 213 -306 -72 229 808 774 405 -368 -213 586 629 321 -424
2206 -424 -359 -222 352 494 240 -196 -797 -420 129 541 157 -646 -874 -498 298 759 4 -661 -780 -506
2226 -506 502 49 -302 -701 -613 -380 187 295 -298 -948 -1045 -387 512 230 -409 -978 -641 -25 523 -94
2246 -94 -680 -710 -663 -375 420 -121 -307 -1268 -868 337 374 195 -661 -726 -451 239 144 -97 -614 -597 -253 -149
2268 -149 -98 344 -509 -557 -214 191 534 199 -425 -480 51 492 685 29 -466 -409 -7 609 587 622 -85 -684
2290 -684 79 703 504 437 -215 -160 179 960 860 519 -137 -27 214 881 1304 203 -283 -473 448 1141
2310A141o82m96n40M08Q51K18l76m84q5o0N16J30k6p09n80O21P57Ln16l62k00
2331d71P46P24o64m84l90L19K72L13m40J24l72K64M22j21J3m48m01K06N33j10
2351C5o1r7k26j09J16L31J43l25r9m35L85P10l1n20m19k8M30J82l7k93j72k05
2373g25O83J37j75k23k25m06J023J80j87o26m26L76P64K50m94p23K21L54K93M26
2393D97p67n0k89L27Q47k76l40o79M33L63L97l24n23o5K34M99J35L01q48j80M37
2414A29K60j94R4l47k79M12M48K12m31l58K01j58M72J28l05J8j15l19L01K54J00
2435E23k17m24K13L67K2o5m87j38L32J33K54L98o77n05L79M53Jj16n83n2J36M13
2457C60L42n89j63j67L56K29L63m24n69K9j9M93M04n30l5o79R29K22j57m77m03
$$ plain form
2310 1141 459 -37 -577 -169 682 900 524 40 -45 -105 411 541 515 -194 -774 -153 604 607 91 -271 -471
2331 -471 275 999 335 -149 -539 -220 52 365 -75 49 -323 -59 363 242 255 -193 -594 -388 145 35
2351 35 -26 -123 -349 -458 -342 -11 132 -193 -292 -727 -342 368 337 -183 -602 -630 -200 -18 -55 -348 -520 -725
2373 -725 -42 95 -80 -303 -528 -934 89 269 82 -544 -970 -594 170 420 -74 -797 -576 -222 71 497
2393 497 -270 -320 -609 -282 565 289 -51 -730 -297 66 463 139 -384 -449 -215 284 419 720 -128 -308 129
2414 129 389 195 289 -58 -337 75 523 735 304 -54 147 -11 461 589 284 302 187 -132 169 423 523
2435 523 306 -118 95 462 484 419 -68 -206 126 259 513 911 234 -271 108 561 562 446 -137 -189 -53 360
2457 360 702 113 -50 -217 139 368 731 307 -262 -233 -252 241 645 115 80 -599 330 552 395 -82 -485
2478d85P1L31M38o87J97k62j62N10N54p65n03K02P2P93l01q3q09J93N33M70l1
2499B76k08m68p26P14Q97l87p9p04L07L49l90R48q13k31j73lO03l19P5l08M6j89
2521g83P24K44n40J45On27O61L83j153P13n94k8K63J522j035o12q7R61L01o17
2541e3J07J68o6L24r7K95k75j503J301J6K24k06o7j16p70J96R77J317k185L68
2561d5l42O32P88n18j457J403n29M28O69o72l82o78N16N00O79j536P35l77L18
2580A32J19L58r10QR5N48j17N03q55M33l05o9O50l40o99QK86J91J65l20J91j33
2602f1J01P7K59l91l13K22j18M84k52J6k88j48N88n7n9j92j24k14L51j03K58k59
2624b23J75o64M95j55K30J9k04J36j70L58l28Q2j55L30q27N84J53j67J77J64p97
$$ plain form
2478 -485 -414 -83 355 -332 -135 -397 -559 -49 505 -260 -763 -561 -489 304 3 -80 -889 -696 -163 307 276
2499 276 68 -400 -1126 -412 485 98 19 -685 -378 -29 -419 529 -284 -515 -688 -691 -88 -407 -332 -640 -594 -783
2521 -783 -59 185 -355 -210 -204 -731 -70 313 -840 -127 -721 -749 -486 1036 1 -611 -698 263 564 -53
2541 -53 54 222 156 480 383 678 403 -1100 201 217 441 235 168 52 -718 -522 455 1772 -413 -45
2561 -45 -387 245 1033 515 -942 461 -68 360 1029 357 -25 -703 -187 313 992 -544 191 -186 132
2580 132 251 609 -301 -293 -198 350 233 736 -119 314 9 -60 590 250 -449 -441 -155 36 201 -119 72 -61
2602 -61 40 117 376 -15 -328 -106 -224 260 8 24 -264 -412 176 119 60 -132 -256 -470 -119 -222 36 -223
2624 -223 -48 -712 -217 -372 -142 -123 -327 -191 -361 -3 -331 -249 -404 -74 -901 -317 -164 -331 -154 10 -787
2645g87J316m62j29l08M08m79l1J83M61o38k40L50O40M1o88N0l43J443J15q86
2665A6m15K42o48J591j124N32l71l17M73L49K93l68j1p77R12R3m15Q7n04Q93n59
2686b8L55K56r08K46R19n86p48K92J22o49J089M27m37m90k4k15M99L50J99M2o
2707G05j343J44J123o6k74J1k29M32Q6j61k59l69l41J018n33N5Q81q14q50K96
2727d88J367j211N95j85k47m15J098k05K08m28N3K62P1J62o36p75N09J65K71l39
2747a68l97J00K39J3P08j05q43K97L02j02k54N3K69l77n3K46K71o61j54L51M71
2768B06L17m05n49K29R30j583J086K03q16k36M16L75k32qK43m84J20k29j46J211
2788F48m95r68M90l71O12m4l17k21L66J095q03j49N8l1q10O18J091k57l25k08
$$ plain form
2645 -787 529 67 -62 -370 38 -441 -472 -289 172 -466 -706 -356 284 325 -363 -313 -656 787 902 16
2665 16 -399 -157 -805 786 -338 194 -177 -494 -21 328 621 253 242 -535 377 470 55 142 -362 531 -28
2686 -28 327 583 -325 -79 840 254 -494 -202 -80 -729 360 787 350 -140 -164 -379 120 470 669 711 705
2707 705 -638 -494 629 563 289 300 71 503 589 428 169 -200 -541 477 -56 -1 880 66 -784 -488
2727 -488 879 -332 263 78 -169 -584 514 309 517 89 142 404 475 637 1 -774 -265 -100 171 -168
2747 -168 -565 -465 -226 -213 495 390 -453 -156 146 44 -210 -157 112 -265 -318 -72 199 -462 -616 -265 206
2768 206 523 118 -431 -202 728 -855 231 434 -382 -618 -202 173 -59 -67 176 -308 -188 -417 -563 648
2788 648 153 -815 -325 -696 -84 -128 -445 -666 -300 795 -8 -157 -99 -130 -940 -322 769 512 187 -21
2808b1m47P48l62Q29m77p88Q35J35l21k42K8L25k41j83N74R9l85J27l91O44M0
2829E26k97l9k72M8P25k98j51l2j68q4L76l4m5j23r0j37O9M02j42k54k32J07L59
2852B14k7j52k43j43J47K15R2k01K4j20M21n4O9m29j22K05K58o1Q4m46l50K07
2874d12K71K51j46j67j44o3K16J91K13k71j35k13R8N23k31q0l04M1L63J21r9k22
2896a99j41k95M56J47J33p1l17k07O42o8p5k84j48J00N62o3L3p43K70L85k97L27
2918A47o9l09j31L18j26M79m42o0K08K77j1K9l45l90J88K95L74r0m28k00P7M82
2940B73K26p5m92K14j1K06k03K08j93K0J97j19l5L1k26N2j51K43N4l15j45M22
2962A81j2l96N04j06J97l09l08K06M65m1m97K01n6M17k29j72Q8m43M20K6K57K22
$$ plain form
2808 -21 -468 280 -82 747 270 -518 317 452 131 -111 -83 242 1 -182 392 491 106 233 -158 486 526
2829 526 229 190 -82 -34 691 393 242 210 42 -42 334 300 255 132 42 -95 -26 376 234 -20 -252 -145 214
2852 214 187 35 -208 -351 -204 11 103 -98 -74 -194 227 173 242 -187 -309 -104 154 93 177 -269 -619 -412
2874 -412 -141 110 -36 -203 -347 -410 -194 -3 210 -61 -196 -409 -311 212 -19 -99 -403 -362 1 122 23 -199
2896 -199 -340 -635 -179 -32 101 30 -287 -494 148 80 5 -279 -427 -327 235 172 205 -538 -268 117 -180 147
2918 147 78 -231 -362 -44 -170 309 -133 -193 15 292 281 310 -35 -425 -237 58 432 342 -86 -286 -209 273
2940 273 499 424 -68 146 135 341 138 346 153 173 370 251 216 247 21 73 -78 165 219 -96 -241 181
2962 181 169 -227 277 171 368 59 -249 -43 422 381 -116 85 29 446 217 45 133 -310 110 136 393 615
2984F15q57k52N46m3J7J47l79j86L63J30Q4j33j83j43J82M37l05m5k60L90k50
3005a25K47k50K07l62M8K97j13K68l63k65L99k9K34m90k49M28L4K72k19J11l07
3026b27J06N0K9j48Q7j16k3N4j58K14J56n25O21r8M7l02m6K41k86L81j14O6o9
3049f0k49J40K80n5J28l9j67j54Q0K09k08M66m97k28K56L44k48M3m09K64K66L33
3071D95k50l37L60l65l2K33K06l19k76K37K55L08n59K0K8K86J2L54l63k77J53
3092A69N2J90L1l43j74J70J1L93k85j88O6R2q8J47r4j70J45n80M92M1K1j85J16
3115B9J12J11jj12k49k21J19L37P2k17j57rK7L05J62J01n32j31m4J64L19j86j41
3138a42j13j74M48J32k44j33n3j22L15J76l9l40k40P8L50K95k97q8k40L99j51
$$ plain form
2984 615 -242 -494 52 9 26 173 -206 -392 -29 101 185 52 -131 -274 -92 345 40 -5 -265 125 -125
3005 -125 122 -128 79 -283 -235 62 -51 217 -146 -411 -12 -41 193 -297 -546 -118 -84 188 -31 80 -227
3026 -227 -121 -71 -42 -190 -103 -219 -242 -188 -346 -132 24 -501 120 22 69 -233 -279 -38 -324 57 -57 9 -60
3049 -60 -309 -169 111 56 184 145 -22 -176 -96 113 -95 371 -126 -354 -98 246 -2 41 -368 -104 162 495
3071 495 245 -92 268 -97 -129 104 310 -9 -285 -48 207 515 -44 -24 4 290 302 656 293 16 169
3092 169 221 411 442 99 -75 95 106 499 214 26 92 184 96 243 149 -21 124 -456 36 77 98 -87 29
3115 29 141 252 251 139 -110 -331 -212 125 197 -20 -177 -186 -159 146 308 409 -123 -254 -298 -134 185 -1 -142
3138 -142 -255 -429 19 151 -93 -226 -279 -401 -86 90 51 -289 -529 -451 -101 194 -103 -191 -431 -32 -183
3159a83K33k71m3j86O02ql18m7k16J3O04l87J7M41l63j97J57K48K9k76p9K1J09
3182a00L67m15L5P7L72l1j65k13k4p0O6N63j58q6l28Q2J16O8j8L11m52j76J91
3205A2L86k23Nk21J64J35L20k58m56M19l64M17k45L10n4o36K67J83j21L67J3o45
3227b25R4P5L97l47K15m17M79k7R0j64O2j35j23K74m0q0j61R2j71K82P7J12m26
3250f7o0q7J89K06k97L39k10j84J73l3j19j33N0L81j20Q1l51J7J02n8L54k38j77
3273b42j85M19j41K07n1m2n00K09N38n0k92Q6k74J68L68n65O7K3K64j84K38j1
3295E0j27P4j37J7L91j91J57o08N61m5l58O40l01k64j59J67K71j74Q3k02r3Q0
3317a68L15R4l6m21J33L90p1l4k02p6l92N30j20O1j2J98l57N10k63K63k75n36
$$ plain form
3159 -183 50 -221 -264 -450 152 144 -174 -221 -437 -424 180 -207 -190 251 -112 -309 -152 96 125 -151 -230 -209 -100
3182 -100 267 -148 -113 -36 336 305 140 -73 -97 -167 -101 462 304 218 -110 -28 88 156 138 449 -3 -179 12
3205 12 398 175 180 -41 123 258 578 320 -136 283 -81 336 91 401 347 -289 -22 161 40 407 420 -225
3227 -225 -131 -56 341 -6 209 -208 271 244 334 170 232 97 -26 248 208 128 -33 59 -112 170 247 359 -67
3250 -67 -127 -214 -25 181 -116 223 13 -171 2 -31 -150 -283 -233 148 28 109 -242 -225 -123 -181 173 -65 -242
3273 -242 -427 -8 -149 58 7 -35 -535 -326 212 162 -130 -44 -318 -150 218 -347 -280 -257 7 -177 61 50
3295 50 -77 -3 -140 -123 268 77 234 -374 187 142 -216 424 123 -141 -300 -133 138 -36 47 -155 -248 -168
3317 -168 147 241 205 -216 -83 307 236 202 0 -76 -468 62 -58 3 -9 189 -168 342 79 342 67 -469
3339d69P38r8J35j76l2k32L28l4J84q4k85N3n2j73M59Ll49j50K26L9N6J48k22
3362A3k71L79Q6j41j06m2k42N47Q4k28O3j30J7l95L64p5k2j16J19J63J38j67P
3385D5l86J22r3K78k11K66J0j40R9rM0k96m1L44n09M15l91N05m05K31L65j46l0
3408F3l51j42N43k27K31j30k06J19k09j89Q35o84q3N54m76O35j63j63J04m96K56
3429a79K84l86k4K66k36J8O40j04j27j18k73N81j42m36K28l4j02M05o8k6j51o6
3451e0L88J3j19K38k45j66m21K65L29L69l69p8l7r7J88m16O1K24k68K51j46O9
3473a7M7j94L46M13m17J14j63k88J51K39L48l49k21o4k3L81j80j36j92J88J4L68
3495C65j75p8l45L32k21M02J23k45j41K6j11J63r4J31l14J57k58J28J87q7j52
$$ plain form
3339 -469 269 171 306 130 98 -134 194 160 344 260 -25 28 -24 -197 262 265 -84 -234 -8 31 87 235 13
3362 13 -258 121 207 66 -40 -82 -324 223 307 79 142 12 29 -366 -2 -77 -99 -215 -96 67 205 38 45
3385 45 -341 -219 -312 -34 -245 21 31 -109 -10 -19 21 -275 -316 28 -481 -66 -457 48 -357 -126 239 93 63
3408 63 -288 -430 113 -114 117 -13 -219 -100 -309 -498 337 -347 -430 124 -352 283 120 -43 61 -435 -179
3429 -179 105 -281 -305 -39 -275 -257 383 279 152 34 -239 342 200 -236 -8 -42 -144 261 193 167 16 -50
3451 -50 338 351 232 470 225 59 -362 -97 232 601 232 154 117 20 208 -208 -147 77 -191 60 -86 -17
3473 -17 30 -164 182 595 178 292 129 -159 -8 231 579 230 9 -55 -78 303 123 -13 -205 -17 -3 365
3495 365 190 112 -233 99 -122 280 403 158 17 43 -68 95 1 132 -182 -25 -283 -155 32 -55 -207
3516b07k01O17KJ02n32N9l55M57P0l71M28k2j77k5L21k70J61J3p6n4p4J39j43
3539a38j26K44R6k84K06l29k34L39j32N17n24l29j77Q72R9K67k45j84J44K80M4
3560D06o27P02l82L35n46j35M71l45M38r4l91M4J28n5r0OJ55j11j8K13M07j97
3582C14Qm6Q0k37m59L53R65j545R75o60O21j55j55M17r25k3R53K00L1l70K25m26
3604A41m66M73M00o69j73L01J57k90N2O1L58o34M83O4J7J8n6j95K75l11L30k53
3626H3J10l22J57l43L88J54l02J21R2L73r12k97J454n75K87p73P50q36R0K85m7
3647f3M78p57k72P63K69p49P36l8q21r1N80j91NL7N12k23l35K85o34P54m77M7
3669a85j67L4M20k83J17n22R90l99o82L40J64l12L64J27l27M42j41l29M20J0j10
$$ plain form
3516 -207 -408 209 211 313 -219 -160 -515 -58 12 -359 69 47 -130 -155 166 -104 57 70 -6 -60 -134 5 -138
3539 -138 -264 -20 76 -208 -2 -331 -565 -226 -358 159 -365 -694 -871 1 100 367 122 -62 82 362 406
3560 406 -221 481 99 434 -112 -247 224 -121 317 223 -168 -124 4 -51 -141 -135 20 -91 -109 104 511 314
3582 314 322 276 356 119 -340 13 978 -567 408 -252 369 214 59 476 -449 -472 481 681 712 342 567 141
3604 141 -325 148 548 -121 -294 7 164 -126 -74 -13 345 -289 194 258 275 293 237 42 317 6 336 83
3626 83 193 -129 28 -315 73 227 -75 46 138 511 -401 -698 756 181 468 -305 445 -391 -301 -16 -63
3647 -63 415 -342 -614 149 418 -331 405 367 -454 -545 35 -156 -151 -114 398 175 -160 125 -509 245 -232 -185
3669 -185 -352 -318 102 -181 -64 -586 404 5 -677 -337 -173 -485 -121 6 -321 121 -20 -349 71 81 -29
3690b9J64r1j00K24r0n8r5J82Mk24K31j43o5J23q7P4K49k51P9j28O3k3K41k85
3714c5J80l8j4q7Q8N3L0k75j9K03m2K2q6J80j38J78j54j26R3P2J48k08j2L02k98
3739A7K11j52K60m22J36L46o56K48j20L73o9j11k53Q3k33L71J38k20J77l25L02
3760A01mJ26k41j83K81m3L13m34L5k78K67K77j01q0j40M6J27j43N0O2k14J7J44
3783a5k41M72l10j40J33n7R6k17J76k3P9m3k61J94k22K31j89M81k76P8j94J33
3805a15J92j71L45j84l31N50Mp93O51k70Lm9P68l90nJ62l49n13P04m35K58o9l26
3828c63JR04J0o14K46m84n77O42Q11n35M58L68o43p66N51M51p29M02j55l40N12
3849A50o73P93j02o68M82K16N23n96k49j6N90n18k42M53q50J091J00J38m54P76
$$ plain form
3690 -29 135 44 -56 168 78 20 -75 107 111 -113 118 -25 -90 33 -54 20 269 18 97 -31 32 9 250 -35
3714 -35 145 107 93 6 94 147 177 -98 -117 86 44 66 -20 160 22 200 46 -80 13 85 233 25 13 315 17
3739 17 228 76 336 -86 50 396 -260 -12 -132 241 172 61 -192 -109 -342 29 167 -53 124 -201 101
3760 101 97 223 -18 -201 80 37 350 -84 -49 -327 -60 217 116 36 -104 -58 69 -74 -24 38 -176 -159 -15
3783 -15 -256 216 -94 -234 -101 -158 -62 -279 -103 -126 -47 -90 -351 -157 -379 -148 -337 144 -132 -54 -248 -115
3805 -115 77 -94 251 67 -264 286 290 -503 148 -122 -119 -168 600 210 205 367 18 -495 209 -226 32 -37 -363
3828 -363 -362 542 552 -62 184 -300 -877 -235 576 41 499 867 224 -542 9 460 -269 133 -22 -362 150
3849 150 -523 270 168 -500 -18 198 721 125 -124 -140 450 -68 -310 143 -707 384 484 622 168 944
3869I44j090K35M28o57J435j171K83j51P7k0r3J84m22j24K47m47L12J81r31Q61
3889H1r5O22r01M70q5L98n30r9M09k92k6L54k48J93o39L19k07k6J44J52j70m4
3911b20L94l75r5K20K09l70J73j65L75l16K95k69J5P9M5l46N7j14J93J89j25K14
3933F3l97j39L41K63k71j43K54L3O6k58r0J26K48j72J48k27R9O19o32k59Q37l00
3955B09l25K33k91K66o1K20m65J68k93K38M33q88K81N29j92L85j91L73o51K87
3975B65l85l4J402j317L52M9l21M97r3m61J36j24O10o37r7L22q4O50m69l90P93
3996F64r78L05M70l81k15P70n26m17O68k28n9k88p2L40j92Q8P7J77j88J93o39
4017d31R61o55Q5L43K65m29n56M57R9m1n3J5k86M23l57PO6O6o5k09L32j46J54
$$ plain form
3869 944 -146 89 517 -140 1295 124 407 256 333 313 220 404 -18 -142 105 -342 -30 151 -780 81
3889 81 -14 608 -293 177 92 490 -40 -139 270 -22 -48 306 58 251 -388 -69 -276 -302 -158 -6 -176 -220
3911 -220 174 -201 -296 -76 133 -237 -64 -229 146 -170 125 -144 -129 -50 -5 -351 -294 -408 -215 -26 -151 63
3933 63 -334 -473 -132 131 -140 -283 -29 4 70 -188 -278 -152 96 -76 72 -155 -56 563 -69 -328 509 209
3955 209 -116 117 -174 92 31 251 -214 -46 -339 -101 332 -556 -275 254 62 447 256 629 -22 265
3975 265 -120 -154 1248 -69 283 332 11 508 415 -46 90 -34 576 -61 -158 164 80 730 261 -129 664
3996 664 -314 -9 461 80 -135 635 109 -308 360 132 73 -215 -287 53 -139 -51 26 203 15 208 -431
4017 -431 530 -125 -40 303 568 139 -417 40 139 98 45 60 -226 197 -160 -153 -87 -21 -86 -295 37 -109 45
4040D5m75n5L61K5M6M4k29R3K00K84k52k0J3k64L79k46p8j6k21J56J27O3K3j56
4064a53J0j03N12m8n67L19j8Q2K18k88L16l32R6K3k64J52qP5j20q3J40m4O9J06
4088I0k40q9J83o3Q2M3M5KK4K41l86J67j79J6K57k75j08J64l5K08j0K00l64j14
4112a41P5J09J7j09K06k75N8OK68N3J5k60k8K44j87j33L4N3J04k04K65j56M2p7
4136b1L45m80M98r6n02J97K28R3m60L25mj81K38Q3Nk56j75L79j40R8k56P1j51
4159a62K9O0J15j55j46J54L3k38L24qj61J69j22oJ70j21l10M52l04R4R9j36J75
4182EJ37j90J28J9j54j2K39k70J35j19o1M47m77jJ47J60j55j51K06J16j98j6Q8
4205B3k31J76J70l31K45l28L65j3K07k46j29RK30Q4m3j00j05J8l1q8K07j25J66
$$ plain form
4040 45 -430 -485 -124 -99 -53 -9 -238 -145 55 339 87 67 80 -184 195 -51 -129 -145 -366 -210 -83 -20 3 -153
4064 -153 -143 -246 266 218 -349 -30 -48 34 252 -36 280 -52 44 67 -197 -45 -53 22 -98 -181 -41 -85 -16 90
4088 90 -150 -239 -56 -119 -37 6 51 53 77 318 -68 99 -80 -64 193 -82 -190 -26 -61 147 137 337 -27 -141
4112 -141 -66 43 60 -49 157 -118 -60 -54 214 267 282 22 -6 238 51 -82 -48 5 109 -95 170 14 56 -21
4136 -21 324 -156 342 246 -256 -59 169 262 -198 127 123 -58 180 263 268 12 -163 216 76 174 -82 -11 -162
4159 -162 -133 -73 42 -113 -259 -105 -72 -310 14 6 -155 14 -108 -114 56 -65 -375 77 -227 -133 -34 -170 5
4182 5 142 -48 80 99 -55 -67 172 -98 37 -82 -143 304 -173 -174 -27 133 -22 -173 33 149 -49 -65 23
4205 23 -208 -32 138 -193 52 -276 89 76 283 37 -92 -83 147 231 188 88 -17 1 -30 -118 89 -36 130
4228A30k2j77K47j29L34m98K80L7j42o1Q0j06R8J16K94l59j05l28K84K00n1J35
4250B57j54j05n2MJ41J57l18Q2Q9j79j8J6Q3K67j31L0npjK4j74K59k61K4J05K6
4276A59k43J30K0l39K18j55j12M48Q4m48O7j15J39K60K4k48L49j08k31r8J21J10
4298C2l73K94r3K46j46j17J98k23J69J58j95Jk17K91L0j61L14m27K42o00N60O2
4320D5k12M55j63k79k31M04l50K0K24l81L25n14K46l41O73M2L22N7l42O6J70l76
4342a40L06L17n14P46j493R20L65q92O2P99p59N66j71l61J009p43M45r10O36L16
4362E04p90J147N5p71l71N00N4p75n14J483r51K42M64J97n58L6J51K47k57m64
4382c71R6K57p91Q95K54l12R56o02m36O90p99j82n16j38J667j046L25r4J47j96
$$ plain form
4228 130 108 -69 178 49 383 -115 165 202 60 -1 79 -27 71 187 481 122 17 -311 -27 173 122 257
4250 257 103 -2 -54 -50 91 248 -70 12 101 -78 -96 -80 3 270 139 169 164 157 156 180 6 265 4 28 133 159
4276 159 -84 46 66 -273 -55 -210 -322 126 210 -238 -171 -286 -147 113 137 -111 238 130 -101 -199 -78 32
4298 32 -341 -47 -140 106 -40 -157 41 -182 -13 145 -50 -49 -266 25 55 -106 208 -219 23 -577 -17 45
4320 45 -167 288 125 -154 -385 19 -331 -311 -87 -468 -143 -657 -411 -752 -79 -37 285 342 0 66 236 -140
4342 -140 166 483 -31 715 -778 142 507 -385 -323 476 -283 283 112 -249 760 17 462 -448 188 504
4362 504 -286 861 916 145 -226 274 328 -447 -961 522 -429 -187 277 474 -84 -48 103 350 93 -371
4382 -371 -275 -18 -809 86 340 28 984 382 -54 636 -163 -345 -861 -999 668 -378 -53 -147 0 -196
4402a96P56p99n30R34o67R8j57Q34N30p73N4K49K96q22Ll05Q96J29r78Q84j77
4423B59m17Nl42N95Q23r3q10k17O44j92k26O2l6L90j10p31M93o88R29p95Q02p67
4445d22L91l08m14O15J44K71k97k29J56J05R7n91M59l83Q95o09n74P57j27o37
4465g01J109M26p97q8N8L8o26N13N37o30j48K46MJ95m1l09J05l83L91O13n03M05
4487D14p57k27N09j14O3K84J83q28P84m60N90k43l90N24l43q4LK33qJ00j30K21
4509C24j99k00p5L93l80L96j19J34l39n4L85k54nP1j74K88k78K21p3l7m7K1K92
4532B91l36M06l73m3k9j8j67J66J99k47J14Q7P3j99O1K55l98J27k1j25J72J52
4554A47l06J80n2k4K88k85R5j39j82K77j19JNM4J49l69O03k52k70N40m38P1p5
$$ plain form
4402 -196 560 -239 -769 165 -502 -404 -561 273 803 30 84 333 629 -193 -190 -495 401 530 -448 436 259
4423 259 -158 -153 -495 100 923 830 20 -197 447 255 29 91 55 445 335 -396 97 -591 338 -457 345 -422
4445 -422 -31 -339 -753 -138 6 277 -20 -249 -93 12 109 -482 -23 -406 489 -120 -694 63 -64 -701
4465 -701 408 834 37 -51 7 45 -581 -68 469 -161 -309 -63 -59 136 95 -214 -109 -492 -101 512 9 414
4487 414 -343 -570 -61 -175 -112 172 355 -473 311 -149 441 198 -192 332 -11 -95 -92 141 133 233 103 324
4509 324 125 -75 -150 243 -137 259 140 274 -65 -119 266 12 7 78 -96 192 -86 135 62 25 -22 -1 291
4532 291 -45 361 -12 -55 -84 -102 -269 -103 96 -151 -37 50 123 -76 -15 240 -158 -31 -52 -177 -5 147
4554 147 -159 21 -31 -55 233 -52 43 -96 -278 -1 -120 -119 -114 -70 79 -290 313 61 -209 331 -107 -36 -111
4577a11j50M08k86J75j83K95k39J31k39L29l20M30l45J68J12n6J15j73lJ97l66
4598a11L8L65m18K69m77O50q9j68l30K37J78lm17L36k06Q9L6Q3l50M75j66N0l68
4621b97O60j23k30N0O7k55J40M6k22J86J7NJ61k21R5o8r3J86l36K88Q2Q3j82O4
4645A03l3J72k37K42p4o4J18j17k73N23k64k19L68J19k38j8j66K90ok73j9J75
4667A09l7j77L67o6J37m85K76m0J8j09K15j78N6l25J37J36k68Jk4K34k2k80J84
4690a41Q3M2p2r2O7L01j62J67n6k53j12K22J99j01pj70j16K4j81R7Q9%j7O4K56
4715A31j86N0J53r9K2p11N83r5K21Q8m43J40K91K05j99k33K7jK5n9K05l47K67
4738C5l61N03l49J20J33J0k24J6k03L74K39k66j98O0j98M15l00J95l9n8K42P0
$$ plain form
4577 -111 -261 147 -139 36 -147 148 -91 40 -199 130 -190 240 -105 63 175 119 234 61 58 255 -111
4598 -111 -73 292 -126 143 -334 316 227 59 -271 -34 144 141 -276 60 -146 -57 -21 62 -288 187 21 71 -297
4621 -297 363 240 10 60 127 -128 12 58 -164 22 39 44 205 -16 79 11 -82 104 -232 56 138 221 39 103
4645 103 70 242 5 247 173 109 227 110 -163 360 96 -123 245 364 126 108 -58 232 226 -47 -66 109
4667 109 72 -105 262 196 333 -152 124 84 102 -7 208 30 86 -239 -102 34 -234 -233 -257 -23 -45 -325 -141
4690 -141 -58 -16 -88 -180 -113 188 26 193 137 -116 -228 -6 193 92 85 -85 -201 -177 -358 -261 -172 -172 -189 -125 131
4715 131 -55 -5 148 49 71 -640 -57 -152 69 157 -286 -146 145 350 151 -82 -55 -56 -31 -90 115 -232 35
4738 35 -326 177 -172 -52 81 91 -133 -117 -320 54 293 27 -171 -111 -309 106 -194 1 -38 -96 146 216
4760B16k33l29O76n32p7L13P3j24J08k0l51L94j80J40P1k73r0K27r7o1r7K43j90
4783a93J68qK31l41O4j13J23K02J24j14k69n1L85j1j34j60k84N30q4J34k80n6
4805a37M3j7K99m18J90k26M62l35O6K21j58r6nQp5L48Q6k76o5k85M52o8j14k20
4829c20Q6K17p4K30j38J24k27K38nL5k19J60r2R1l4j43k01J76o8M36l83K04j59
4852f6k55L54j04J95k41O4j63K29M6k42K57Q4J4l0p5n1l01J51J37J60k08j75L01
4875H1j88L29k74lk1J57j97L58k1k83K54j34K43K9m21K90k35J90k24J8o8P7J34
4898I1R1j77L81m69J18J72NL1n61K47k44L85m4J89l96M10o7l80J33J37k32K53
4920G3Nk9j56N2J32PN4m50N40k47k81K68Q1K10o37K00L25m05M91n08P4J56k47
$$ plain form
4760 216 -17 -346 330 -202 -279 34 107 -17 91 71 -280 114 -66 74 145 -128 -218 9 -88 -149 -246 -3 -193
4783 -193 -25 -33 198 -143 -79 -192 -69 133 257 143 -126 -177 208 197 63 -97 -381 149 65 199 -81 -137
4805 -137 -94 -111 188 -230 -40 -266 196 -139 -73 148 -10 -106 -111 -103 -178 170 256 -20 -85 -370 82 14 -100 -320
4829 -320 -234 -17 -91 139 1 125 -102 136 131 166 -53 107 15 106 72 -71 -272 -96 -164 272 -111 93 -66
4852 -66 -321 33 -71 124 -117 -53 -216 13 59 -183 74 158 172 142 67 16 -285 -134 3 163 -45 -220 81
4875 81 -107 222 -52 -55 -76 81 -116 242 221 -62 192 58 301 330 -91 199 -36 154 -70 -52 -120 -43 91
4898 91 182 5 386 -83 35 207 212 243 -318 -71 -315 70 26 215 -181 229 162 -218 -85 52 -180 73
4920 73 78 49 -107 -55 77 84 138 -312 228 -19 -300 -32 49 259 -378 -178 147 -258 233 -275 -201 -45 -292
4943b92J40J9L62j49K12n48P59j89n35K60Q1q7m4K15o78n4R08l62r9j88Q6Pq58
4966a034M17L46k77K43k22l18N74R2k31J393j196L74r92J001o23L52O55m77n07
4985d30jM41j34L14k36o75P18J17q1M76K8j06k83J51n20L40j02j34n4r5L33p31
5007f64Q35L3K30k83r4k68M58l7q5k26K43k0j74O4K9k78K48p1q3K68N8j19l23
5030b59N7K76k37K39j36J54k32K99L51K29m22j49l38M62O8n71L19L0m86K11M15
5051B80j1l87q29J074p53R79N35l89k35K40j86J35p48O3N1J82J58M03o77J57k77
5072b35Q4K57j88J74j28P24n89L94o22K05K17p18M20N0M28q50N82j27j87R5J23
5093A09k2j61QJ43m9k0k5kl9j31L3M06k03j42M72m35J24J30l59K22J16J46n32
$$ plain form
4943 -292 -152 -133 229 80 292 -256 503 314 -221 39 120 33 -11 204 -474 -528 380 18 -81 -269 -183 -176 -1034
4966 -1034 -617 -271 -548 -305 -527 -845 -271 -179 -410 983 -213 161 -831 170 -453 -101 554 77 -430
4985 -430 -431 10 -124 190 -46 -721 -3 114 33 509 537 431 148 299 -221 119 17 -117 -171 -266 67 -664
5007 -664 171 204 434 151 57 -211 247 210 125 -101 142 122 -52 12 41 -237 11 -60 -143 125 183 64 -259
5030 -259 -202 74 -163 76 -60 94 -138 161 512 741 319 170 -168 294 362 -209 110 140 -346 -135 280
5051 280 269 -118 -947 127 -626 353 888 499 264 504 318 453 -295 -232 -181 1 159 562 -115 42 -235
5072 -235 -151 106 -82 92 -36 688 99 493 -129 76 293 -425 -5 45 473 -377 205 78 -109 -14 109
5093 109 87 -74 -66 77 28 8 -17 -19 -58 -189 -156 250 47 -95 377 -58 66 196 -163 59 175 321 -211
5116b11L35j52O5J13q0l13j6O23o31L92j94j52K42k3j35rJ34k37J22O8K07m82
5138c34L05K49o5k24J30Q3n24J92L68j50J96l04j80j79M89j65M25j06l86L30M2
5159A92l26k67M26R5k65R7j33K2J57L5J61k96M68n91K74o14J058l8j036L71m72
5180f82M86L16k56O9l18n37Q81m35L38r75o6J900r49N63m08q48M1N36P89J47n84
5201Hj91J06k1O33o80K72k31k54J97J041q69J50n62k73N59M7n44P26j32L9l75
5222c54Q20j085K09K22r4k60R3M59K8P1J3j75N53j98m54J40n3O3j69P4oj39r3
5245c35R93q97N35L10o39k41kJ56M3J42l32L09J58m02K42J65l68r0L30K30m94
5266a87L52K19q8j49k60O58l81r55j13K065j399M79K42o22Q4j8n6L28k20R7l63
$$ plain form
5116 -211 124 -28 37 150 70 -243 -259 364 -267 125 -69 -221 21 -2 -137 -146 -12 -249 -127 -59 148 -334
5138 -334 -29 220 155 -69 61 144 -380 -188 180 30 226 -78 -258 -437 52 -113 312 206 -180 150 192
5159 192 -134 -401 25 120 -145 -48 -181 -159 -2 33 194 -102 366 -225 49 -565 493 455 -581 -210 -682
5180 -682 -196 120 -136 -67 -385 -922 -41 -476 -138 -1113 -1179 721 -228 335 -73 -921 -880 -344 445 592 8
5201 8 -183 -77 -98 535 -145 127 -104 -358 -161 880 11 161 -401 -674 -115 -68 -612 114 -18 21 -354
5222 -354 466 -619 -410 -188 -282 -542 -449 10 38 109 122 -53 500 302 -152 -12 -65 -2 -171 -97 -103 -242 -335
5245 -335 658 -239 296 606 -33 -274 -276 -120 -77 65 -267 42 200 -202 40 205 -163 -253 77 307 -187
5266 -187 165 384 296 147 -113 545 164 -791 -904 1161 -238 241 483 -139 -55 -73 -129 199 -21 76 -287
5287b87K16L13L98m73j52k26R2K38j26L28j03q1o7N4o3m90L52l99O15Q0M33n34
5309A18K88j66n35k40K59N05K2l14j12M9K1k89P89p17J32N28n33O08p08N40k73
5330b8L20m06kk78O46l24J03J45Jn17K4P49m56Q2Jo1r0k80K92J42j52K3K25J69
5354C28J1m06o32M40Q06L1r51r5J268r91L83J8L9M1p0N25p05j68L46k2n59Q98
5376E35K44q19j05K69Jl43J16k54N50J14j22K3j45k51J76K41n07K75J56m77L23
5397@j35R5Pl8M27m63J39J33J95o62K97K02L89j339R43O2q10O68N51n60m3K65
5419C23M63N9o46j133n19J856m01l0k42J370j116R46n97j58j068P17L03M30l37
5438B20k15k37M44l63OL62n21M34q54J150l99n05K14n00L89M94Rr37N38N45p24
$$ plain form
5287 -287 -71 242 640 167 15 -211 -119 119 -7 321 218 137 70 124 61 -429 -77 -476 139 219 652 118
5309 118 406 240 -295 -535 -276 229 251 -63 -175 -126 -105 -394 395 -322 -190 338 -195 413 -295 245 -28
5330 -28 292 -114 -116 -394 252 -72 31 176 177 -340 -316 433 -23 59 60 -1 -91 -371 -79 63 -89 -66 159 328
5354 328 339 -67 -699 -259 547 578 -373 -468 800 -191 192 210 249 290 220 745 40 -128 218 196 -363 535
5376 535 779 -40 -145 124 125 -218 -102 -356 194 308 186 209 64 -187 -11 230 -277 -2 154 -323 0
5397 0 -135 -40 -33 -71 356 -107 32 165 360 -302 -5 197 586 -753 190 252 -558 110 661 101 58 323
5419 323 786 845 199 -934 -1453 403 2 -28 -270 1100 -16 930 333 175 -893 -176 127 557 220
5438 220 5 -232 212 -151 -145 217 -304 130 -724 426 27 -478 -264 -764 -375 119 128 -809 -271 274 -450
5459d50O5P72J96o71K10K85j272K39Q22L80N26k108O63J57o60k40K494j546J165
5478A027j708N96l61L44R43l40j024P68k4M04j072j136J050L20j77J35j56L44
5496f7l30L98k69N9M37nj82R7n94L17M63m12j51m07J394j221r2R63o94L25k48
5517b19J36k99L12L2k84P74p08p83J499l86O6k09j7L68l18L40p15O08m14N36m12
5538i3L40J40j73k60K19j78N3l72M60j30K3j66K71o7p6j33L23m70R1L01j42J78
5560A39M4j93k30N31k94J67j0j23r6O5J85K6J31k75k21K24k62N0N6RO6j91L8L82
5584B18k69n40M48q8L07m0K38o52L78k12P8J18L88n96P18l09k80q1N39n08K2L07
5606A84j18k46P2P1n2K40k68N56l82r5N9J58k81j99J77J66j69J2OL14j06n0K5
$$ plain form
5459 -450 -385 387 583 -88 122 407 -865 -626 196 576 1102 -1006 -343 -186 -846 -1086 1408 -138 1027
5478 1027 -681 -85 -446 -102 841 501 -523 245 221 625 -447 -1583 -533 -213 -390 -255 -411 -67
5496 -67 -397 1 -268 -209 228 223 41 138 -456 -139 324 -88 -239 -646 748 -473 -565 398 -296 29 -219
5517 -219 -83 -382 -70 -38 -322 452 -256 -1039 460 74 140 -69 -86 282 -36 304 -411 197 -217 319 -93
5538 -93 247 387 214 -46 173 -5 48 -324 136 6 29 -137 134 67 -9 -142 181 -289 -198 103 -39 139
5560 139 183 -10 -240 291 -3 164 154 31 -65 0 185 211 342 67 -154 70 -192 -142 -86 -77 -11 -202 -164 218
5584 218 -51 -591 -143 -231 76 36 274 -378 0 -212 -134 -16 372 -224 494 185 -95 -176 363 -145 -123 184
5606 184 66 -180 -108 -37 -89 151 -117 439 57 -38 21 179 -102 -301 -124 42 -127 -115 -109 205 99 49 74
5629G4j94Q8L48k14j74N9k00N1M60n13K08m4J48j06q5K57l37K69K6o7J3k30K45
5652H2n7lj34K61l21L60k62K14l60L73j61p8J78K73n07j2K08k36K14O9q9p2M13
5675C53l69K46l7K56k88n23N19k54K50l31J28m3K65k18r9L23j25j44L68m71O8
5696a26J03k47K36M00j40l39M67o85K92K71k63j12k00l90Q92k88M81p88L30P55
5716F49m53M56l91k18K06M63j377M38l92P08j31n49K98M30Q0q02P52m72k14P08
5736A89l19J95l19K98k01N6j11m39P39m50J64L57N2m18J04j63J41K60mj80k52
5757c01N61k50j61K35k55J01l17L31P6nLn06q3O25L69k53q90O80R62r52j32R52
5779G90q98K76K44l98J45j14m7j47j05M74m61L92K92Q0l54k91M7K01N8j91J61
$$ plain form
5629 74 -120 -32 316 102 -72 -13 -213 -162 298 -215 -7 -51 97 -9 -94 163 -174 95 121 54 67 -163 82
5652 82 25 22 -112 149 -172 188 -74 140 -220 153 -8 -86 92 365 -142 -154 54 -182 32 101 12 -60 353
5675 353 -16 230 193 449 161 -362 157 -97 153 -178 -50 -93 172 -46 -145 178 53 -91 277 -194 -126
5696 -126 -23 -270 -34 366 226 -113 354 -331 -39 232 -31 -143 -343 -733 159 -129 352 -436 -106 649
5716 649 196 652 261 43 249 712 -665 -227 -619 89 -42 -591 -293 137 217 -585 167 -305 -519 189
5736 189 -130 65 -254 44 -157 -101 -212 -651 88 -362 -198 159 211 -207 -103 -266 -125 135 131 -49 -301
5757 -301 260 10 -151 84 -171 -70 -387 -56 20 15 18 -488 -571 54 423 170 -720 -40 922 -30 -162 790
5779 790 -108 168 412 14 159 45 -2 -149 -254 220 -241 151 443 523 169 -122 -75 126 184 -7 154
5800A54k2K42l14J72m44J5L79o67M39o9L71J02m63J4o1k28m73Q06l2J23j28Q6
5822Bk13J5M04k90K80n26K32JL65k25O9m4J8jj44k7k41N98k78j0n8r0m3P8R6J24
5848I2l14L53j49k18M30j56q3PJ11k19Q5N07o29J61k58O0j5O59r26N23K04P1J54
5871D50q53L97K10m29l33O07p85L30J093p38m57Q08J41k06n57R9J279j921J088
5890B23N58j148j21Q92j171P14j5K91o47O54n33j09Q11o25O71o86O66l2j05m73
5910a85k86K82l42P58K25j292R95j114N16J65M36p11Q64m14R79q57k00M51m62
5929a92L90q09M22l35j70O02Pj86M14p90J176o88O6J10K2J40J15k23K3n7O7O5
5951A69l90J06J0J45L3P5R0l77K30l34M3J02p6M50j20m0j66k3j47J97O6P2k11
$$ plain form
5800 154 132 374 60 232 -212 -197 182 -485 -46 -115 256 358 -105 -91 -152 -380 -853 -47 -79 44 -84 2
5822 2 -211 -196 208 -82 198 -328 -96 -95 270 45 114 70 88 87 -57 -84 -325 273 -5 -15 -73 -163 -206 -128 -32 92
5848 92 -222 131 -18 -236 194 38 -45 -38 73 -146 -61 446 -183 -22 -280 -220 -235 424 -502 21 225 296 450
5871 450 -403 -6 204 -225 -558 49 -736 -406 687 -51 -508 300 441 235 -322 -223 1056 -865 223
5890 223 781 -367 -488 404 -767 -53 -68 223 -424 230 -303 -412 399 -226 445 -241 425 393 288 -185
5910 -185 -471 -189 -531 227 452 -840 155 -959 -443 -278 158 -553 311 -103 876 19 -181 270 -192
5929 -192 198 -611 -189 -524 -694 -92 -85 -271 143 -647 529 -159 -93 17 39 179 294 71 94 37 104 169
5951 169 -221 -115 -105 40 73 148 238 -139 91 -243 -200 -98 -174 276 156 116 -50 -73 -220 -23 43 115 -96
5974i6j57L73l3j80K47j4M8j19kj58j23Q5O2K00k81p2J97n3J85l21L68k46M6j09
5998a53K06j50J18N9lk07N1K16m13n8M94K05m93n1J50k44J16L53j80K2j92K00
6020D6q1K39m72L59j86K06n5n4K69j00m17K31j68K8K8J73k35J01l8l23N84j08
6042B7j61Q0P3j40N23k99k13r8L44m33K88Q6k47N43om10K14j67J35J80m91K78
6064A06M1j80l00j04K97p71P84%P14k55J69j40j026N38l02N11l69L50l12P5j3
6085a87j41P83j085K80n0J81L46n43R77m63K96l14j83K61J85j223J218m32p34
6104h28J130l75L62l0M57m91P3K0k44N28j099R77m17N35o18J21j4j01Q8J21n0
6125A45J25m64K6J54L1K60l35M0j27L23q3l47L12J16m00K12j17R7k88L04N6K38
$$ plain form
5974 -96 -253 120 87 -93 154 140 188 69 67 -91 -214 -129 -67 133 -148 -220 -23 -76 109 -212 156 -90 -44 -153
5998 -153 53 -97 21 80 77 -130 -79 137 -276 -334 160 365 -128 -179 -29 -273 -157 196 16 38 -154 46
6020 46 -35 204 -268 91 -95 111 56 2 271 171 -246 -15 -183 -155 -127 46 -189 -88 -126 -449 135 27
6042 27 -134 -54 19 -121 402 103 -110 -208 136 -297 -9 77 -170 373 367 -43 171 4 139 319 -172 106
6064 106 147 -33 -333 -437 -140 -911 -127 -127 587 332 501 361 -665 -127 -429 82 -287 63 -249 -174 -187
6085 -187 -328 455 -630 -350 -400 -219 127 -416 561 98 394 80 -103 158 343 -880 338 -94 -828
6104 -828 302 -73 289 259 716 225 298 318 74 602 -497 480 63 598 -20 101 87 -14 74 195 145
6125 145 270 -194 -168 -14 17 277 -58 -18 -145 178 95 -252 60 176 -224 -12 -129 -32 -320 -16 40 278
6147B78n52J19K21k88L67ok15M3j84N4L01j92Q2M9k79K38p0J31m0k39j06L52j17
6170e3R2P6j18J00j13M9q4j43L06K06m52J44PL28m56O2L11k04j25M8J58L9m11
6193b33M48p4K98j62N5l82r6K5JK85M1j94j69Q9k05Q9L16o27L39p00O83mO98m74
6217D7M22k27m44O58p80M43o71K28O37k64l90PN10j42L56p2n81J85r59J363j355
6238a029J069N77j142k66J053q50K25N11q13R34m53l14O09m40l69O83K24l33o66
6257g90J239R0r26r1J45O51L23k03m17L73m01m34R64j5j90j58N04j276J084n49
6277g7M02o20K16J18l49J07P0J17r5J10K30j93n38P10l91M34j27n18N52j74J07
6298I1j78J04Q5r4k31P1K62j97J02K69l79RK43k4K66l41k77J82L49m11J05P4j49
$$ plain form
6147 278 -274 -155 66 -222 145 139 -76 -33 -217 -163 138 -54 28 77 -202 36 -34 97 57 -182 -288 64 -53
6170 -53 39 115 -3 97 -16 33 -51 -194 112 318 -134 10 17 345 -111 -49 262 58 -67 -19 139 178 -233
6193 -233 215 141 439 277 332 -50 -146 -121 -120 165 206 12 -157 -68 -273 -184 132 -495 -156 -856 -173 -177 521 47
6217 47 469 242 -202 456 -324 119 -552 -324 313 49 -341 -334 176 34 390 318 -263 -78 -1037 326 -1029
6238 -1029 40 617 -525 -791 262 -588 -363 148 -665 269 -184 -498 111 -329 -698 -15 209 -124 -790
6257 -790 449 539 -387 -478 -333 318 641 438 21 394 -7 -441 523 508 318 160 664 -612 472 -77
6277 -77 325 -295 -79 39 -310 -203 -133 -16 -111 -1 229 36 -502 208 -183 251 124 -394 158 -16 91
6298 91 -87 17 102 8 -223 -152 110 -87 15 284 -95 -86 157 133 399 58 -219 -37 312 -99 6 80 -69
6321f9p2j20L08J23j18O15p56l71N00M5L67k13k16N55j227Q83j88J81N8P4P1o81
6343b51K3O7k27J55K55p2J27J21J07p17J92P55o27M36r0o26J060j99p97Q51o93
6364a50K81l60j76K60k8M34m42M47n64N52n40p1P65l80J62n03P35n07o8L07k91
6385a37Q2j68P19l11k65K78n6K95m54J57pj48J52r9P3m69Q03m10k67Q6K1J43l27
6408c09K31J53j48K0Q9K5J53n16O06l16K41M2k4k44j87K28J34Oj16p8J45J97o17
6431b85J51K69n72M85Q6j30K3P4m0P8j25q8K39l30J32p9Q1M3R9J09k87L41o9J5
6455B20J2k68M02j39n0k76K81l76J34O4J64k84k8L15l51l5L54j03L41k18L87m86
6477F0j36k69M19k71n05Q89j96m06N23L46j012L95k50N70q6j18L16N55j186P31
$$ plain form
6321 -69 -141 -261 47 170 52 667 -89 -460 40 85 452 239 23 578 -649 234 46 227 285 359 430 -251
6343 -251 -228 -161 -388 -233 22 -50 77 198 305 -412 -220 535 -92 344 254 -372 688 489 -308 543 -150
6364 -150 131 -229 -405 -145 -173 261 -181 266 -298 254 -286 -357 408 28 190 -313 422 -85 -153 154 -137
6385 -137 -55 -223 496 185 -80 198 142 437 -17 140 133 -15 137 38 111 -358 445 35 -232 -146 -125 18 -309
6408 -309 -78 75 -73 -53 36 61 214 -302 304 -12 229 271 247 3 -184 44 178 184 68 -10 135 332 -285
6431 -285 -134 135 -437 48 134 4 27 101 61 139 14 -74 165 -165 -33 -112 -31 12 111 220 -67 274 205 220
6455 220 232 -36 366 227 177 -99 182 -194 -60 4 168 -116 -144 171 -180 -215 139 36 377 159 546 60
6477 60 -76 -345 74 -197 -702 187 -9 -415 108 454 -558 -163 -413 157 71 -47 269 824 -362 369
6497C69kk35n03J073j207M43O16o3r46K37m0k80M96l09J94K72k67N11m80p50R78
6518A07j90J105o81J33n2K60L9o06k21p54K88L56N78r69N18l33k22O49N99j477
6538h73Q04p1J62J66n48M09L86q95J77J191m05m28K83J13n75RN01j733J602J09
6558C84L50l74l73M49o98K73L7K32m05l85R29q07l31Q39m11J89k4M16m00J80j84
6579a14L14k37J44l06J79K18J2j95l31O66k17R6K20m21l6P4Q1j70N6J26j76n0
6601f7Q9l06P9L98k31p6L55j68k50O0J24K88l61l9J28k49O2J64j49m0L23nl32
6624b03L13N3Jq5j74J43l1k29P4K6R1J07j3J58q8l44L13l01K99k81J80k00L70
6647A79mk11J64k2k05J44k09j61O19j92J39k54j12J0K6m5M1L6J69N1j33J76k77
$$ plain form
6497 369 367 132 -371 702 -505 -62 554 491 -455 -218 -258 -538 -42 -351 -157 115 -152 359 -121 -871 107
6518 107 -83 1022 341 474 422 682 721 115 -106 -860 -572 -216 362 -607 -89 -422 -644 5 604 -873
6538 -873 -69 -140 22 188 -360 49 435 -460 -283 908 503 75 358 471 -104 -95 406 -1327 275 384
6558 384 734 360 -13 436 -262 11 48 280 -125 -510 419 -388 -719 120 -291 -102 -126 290 -110 70 -114
6579 -114 200 -37 107 -199 -20 198 210 15 -316 350 133 229 449 28 -8 66 147 -23 33 159 -17 -67
6601 -67 22 -284 -205 193 -38 -114 241 73 -177 -117 7 295 -66 -105 23 -226 -164 0 -149 -189 134 129 -203
6624 -203 110 163 164 79 -95 48 17 -212 -138 -112 -21 86 73 231 143 -201 112 -189 110 -171 9 -191 179
6647 179 175 -36 128 106 -99 45 -164 -325 294 102 241 -13 -125 -115 -89 -134 -93 -57 112 163 30 206 -71
6670g1j90N63k59O7J30j66K5mk95L67j41r7K23j25j87L29j07J38K0l89J72j64
6692a61J09J74k93L04k11j98L05J59j64j06L76j76n32M09j38N6J0J38m12L96m4
6713AJ57m82J86J2K46P9l22j3qL71l17M47l62l8j8K17k10J68j80J22J9K9k10j58
6737b64K42J70j12P8k06K15k62J89L12k82j9Lp3qr2j73N09l69J34J7R0l3P4m30
6761b90N09j17l11J18R2PR8q8q4M1J21j11j48N8K83k32J89m4J78j42k15L55M4
6784C11k98M6o4j35RM5K5J06j10n8L31j76rj39k61M14P0m30N42j05k1J3j93O5
6808b2P1j28N40m22j21j49L67j41J91O2k28j13Q4L8o7Pp5J46n62P07j60K88l11
6831Bk18L93k39J04l98M50J57m81K99j88j36m55O01P5M31p8R0j028M58o67N4J006
$$ plain form
6670 -71 -261 302 43 110 240 74 99 95 -200 167 26 -71 152 27 -160 169 62 200 220 -169 3 -161
6692 -161 -52 122 -171 133 -78 -276 29 188 24 -82 294 118 -414 -5 -143 -87 -77 61 -351 45 1
6713 1 158 -324 -138 -126 120 199 -123 -136 -144 227 -90 357 -5 -43 -61 156 -54 114 -66 56 75 104 -106 -264
6737 -264 -22 148 36 114 -92 123 -139 50 362 80 61 64 -9 -17 -109 -282 227 -142 -8 9 99 66 140 -290
6761 -290 219 102 -209 -91 1 8 106 18 -66 -25 96 -15 -163 -105 178 -54 135 91 269 127 -88 267 311
6784 311 13 59 -5 -140 -131 -86 -61 45 -65 -123 208 32 23 -116 -377 37 107 -323 219 114 93 106 -87 -22
6808 -22 49 -79 461 39 -82 -231 136 -5 186 248 20 -93 -9 29 -38 -31 -106 40 -522 185 25 313 2
6831 2 -216 177 -62 42 -356 94 251 -230 69 -119 -255 -710 -109 -34 397 319 409 -619 -161 -828 -774 232
6853B32N63k56j344k61R71m84O57j05%q89J91K95O96l60P64k62p65N98P63j033
6873b9m39R81p77N65K5n74J55j98J33O57m23J81l61J04k03N41k54m83M00L59q3
6894B77o61O98n10J9O49n55L82nk80j87K62m12J04P62n99p8j6J87m7j26J99j77
6916a14j7J85k58K72n4J02r8L23k28Kk03K52m91N33n0k08j55K64r6L10l07O00
6938E64k88n06L15j19l18L46p27P37m4P5j84l72J73n39K150j351l71K26K81k00
6958a52K33r40q20J279Q4R25j119K84p92J135k54J50K62p66O35O41q73R8j61K16
6978F5k63L51l08l4K07k60Q73r7n74O87l15k55k16j15K14P58j174J121j235M98
6998g2m74l75J038n99O5J743o74j390Q10K65k50O46q12O4p36J142l14M45k98M51
$$ plain form
6853 232 795 539 -805 -1066 -95 -579 78 -27 -27 -916 -725 -430 266 -94 670 408 -357 241 1004 -29
6873 -29 -468 513 -264 301 326 -248 -93 -291 -158 499 76 257 -104 0 -203 338 84 -399 1 360 277
6894 277 -384 314 -196 -177 472 -83 299 294 14 -173 89 -323 -219 543 -56 -134 -150 37 -10 -136 63 -114
6916 -114 -131 54 -204 68 14 116 18 341 113 115 -88 164 -327 206 156 -52 -207 57 -39 271 -36 564
6938 564 276 -230 85 -34 -352 -6 -733 4 -40 35 -149 -521 -348 -887 1263 -88 -459 -233 48 -152
6958 -152 81 -859 -1679 -400 -316 609 -510 -226 -1018 117 -137 13 275 -491 144 785 -88 10 -151 65
6978 65 -198 153 -155 -189 18 -242 631 534 -40 647 332 77 -139 -254 -40 718 -456 665 -570 -72
6998 -72 -546 -921 117 -482 -417 1326 652 -738 72 337 87 733 -79 -15 -751 391 77 522 224 675
7018F75n96j197J102o49J130o28M09L11l34l74J57J72r77O06K41p2L10l18R2M43
7038E03n04M3m34K76L52n22L5J30J64j03K22j11j32j27L63l41L80k58L3l61P46
7059C54l49J48k08p5O1K6J36j09L28n62L42p6JJ35j67Q0K55r4k55M7J99l71J19
7082c5Kj76p6L59L3k48K63m03J70K42l42j23M42l25L54j06L25l37K55m00J07k40
7104b59J50K34L97jl92L45J13o13J32K30j00p79L54J55K01Q1o6p5j9M25L05r67
7126a49Q32o54j6J49L78m81P57p16J14o40K94k4m26r8n17J959o12M20k95om07
7147a38M20P73q93o56O46k33R7j96L44L13n07K71p14J92J05M78n2j09l7M71j717
7168a142J29J194L25l91r28R21K0j22j064J234q22K03O98m55K49P16r30J00j91
$$ plain form
7018 675 79 -1118 -16 -665 465 -163 246 557 223 -151 6 178 -799 -193 48 -24 286 -32 60 503
7038 503 -1 42 -392 -116 236 -286 -251 -121 43 -60 162 51 -81 -208 155 -186 194 -64 -31 -392 354
7059 354 5 153 -55 -130 -69 -43 93 -16 312 -250 92 16 17 152 -15 65 320 226 -29 18 217 -154 -35
7082 -35 -33 -209 -285 74 107 -141 122 -281 -111 131 -211 -334 108 -217 137 31 356 19 274 -126 -19 -259
7104 -259 -109 125 522 521 129 474 587 -26 106 336 236 -543 -189 -34 167 248 182 107 88 513 818 -149
7126 -149 683 29 13 162 540 59 816 100 214 -426 -132 -156 -582 -680 -1197 762 150 570 275 269 -138
7147 -138 282 1055 162 -494 152 -81 16 -180 164 477 -30 241 -473 -281 -176 302 250 141 104 575 -1142
7168 -1142 -1013 181 506 115 -813 108 128 6 -1058 176 -646 -443 255 -200 49 765 -165 -65 -256
7187b56L49k83n25Q57p06P60m37O36n44R2l0J89P2j52J97r6p9L28j331N56R7R60
7209F54o70k53K51J41P26j195N4M14l22O40N3N28j812J138q25M51n0j1j96O97
7229D13l65N79l42l17N41p42j77j66K54O49l58o32R27m02n7J58J23q7k75j1k90
7250e77P53l91m0Q49j289R89q25r07J044N87k63K56r38R38J069j448J031j216
7268c78M93l74l45P96J24M5j10K82j036R78j72j038P22L48j227J516n09r19J542
7287G38j094L73o73J849j269L50n6p6Q29q95l6M25k21j08O9L16n30M95o30J9J43
7308A8k76K33n72L65N56n15M02p6m7k26M9N01j058P64m24N41J83p15L67j23P56
7329G03k64j276Q85j53L56k66J36P48j502M36k37R0M44l80Q57r33J480r47mp76
$$ plain form
7187 -256 93 -190 -715 142 -564 196 -241 395 -149 -57 -87 102 174 22 219 123 44 372 -959 -403 -306 654
7209 654 -16 -269 -18 123 849 -346 -292 122 -200 440 493 1021 -791 347 -478 -27 -77 -88 -284 413
7229 413 48 627 285 -32 509 -233 -410 -576 -322 327 -31 -663 264 -138 -195 -37 86 -1 -276 -287 -577
7250 -577 176 -215 -255 594 -695 294 -531 -1438 -394 193 -70 186 -752 186 1255 -193 838 -378
7268 -378 115 -259 -604 192 316 361 251 533 -503 475 303 -735 -13 335 -892 624 115 -804 738
7287 738 -356 17 -656 1193 -76 274 218 142 971 76 40 465 244 136 205 521 -9 486 -144 -125 18
7308 18 -258 -25 -597 -232 324 -191 211 135 88 -138 -89 412 -646 118 -306 235 418 -297 70 -53 703
7329 703 439 -837 48 -105 251 -15 121 869 -633 -197 -434 -344 100 -280 577 -356 1124 177 173 -603
7349f03K81m16JN26j5k47k53J084L7j124L61k79n42J343r05K66k37P76L99j046
7369e93r9L84J03J53L23k64j79k70R57p85Ko1K56O40o30K00o06P04k62j25L17
7390A65J72j79k88q0J51k26M75J80om95K92o5j3l48L67j86m9L73k23L42j07m31
7412a79L27j97j83M27m35O82r61J63O79o44K68J45o09N97R3L17p19P31n23J27
7432A06k3L17m30j30K06l18J29j78L62O3l00k39J57O57l93L4l51K42j46j70k74
7453f79K15K99k93M55l83R6K10j15M59k23R0j62R0L42L93j415L71L13m92N11J81
7474B63j203J282k55P0J29p18R51j215P88J05L49p06O1J62m6J68k24rK6k81M20
7495A17j82L00n0k53J14r6J70k54K25j73K50K29p05R8L78M6j31j1j80K5K09l62
$$ plain form
7349 -603 -322 -738 -737 -211 -226 -473 -726 358 395 -729 -368 -647 -1189 154 -751 -485 -722 54 453 -593
7369 -593 -692 -308 -205 -52 271 7 -172 -442 515 -270 -268 -329 -73 567 -63 137 -469 235 -27 -152 165
7390 165 337 158 -130 -210 -59 -285 190 370 364 -131 161 96 83 -265 102 -84 -133 240 17 359 252 -179
7412 -179 148 -49 -232 195 -240 442 -519 -356 323 -321 -53 92 -517 80 173 490 -229 502 -21 106
7432 106 83 400 -30 -160 46 -272 -143 -321 41 104 -196 -435 -278 379 -14 20 -331 -89 -235 -405 -679
7453 -679 -464 -165 -458 -3 -386 -290 -80 -195 264 41 131 -31 59 401 794 -621 -250 63 -429 82 263
7474 263 -940 342 87 157 286 -432 519 -696 92 197 546 -160 -99 63 17 185 -39 -48 -22 -303 117
7495 117 -65 235 185 -68 46 -50 120 -134 91 -82 168 397 -308 -210 168 214 83 72 -108 -83 126 -236
7517b36L39j70R3j41K0K74k0J05l10K83l39r8K1n8M11j34R5l51M2K86J3j70j32
7540a77K65k87M49k91K29j26j95R6n8O4j18J7n9L0K37j08K12j09J47N6l19q0J70
7563D5k8L7l14K09J77j68j30J86K9J0r0J02j24r9n6N3K27p5J50j43L1J6P7j68
7587d6o8J9r7K65q2j24j3J63j60Q2MO9j09J21Kj62J11K5K96k85J02j87k38Q8J94
7612c0N5N9k07O5Q0k28J77K51l32j04J84Rp1L50k2l27L13j83K0m69K11L01Q57
7635I59k207O41L30N42L11r68O13m79m0J23K98J88J15L52j420J225J30q98L6K1
7655a28O59m61k92K97M75m70K67n37M20j95M45j76l07n64L62Q02o97J65j50j07
7675a92r5L09k36l38O61m24k13P28r42N40M92p28J027o43k24Q56n17k23N62n22
$$ plain form
7517 -236 103 -67 26 -115 -95 179 159 264 -46 237 -102 -200 -179 -237 174 40 135 -216 -174 112 125 -45 -177
7540 -177 88 -199 250 -41 188 62 -133 -37 -95 -31 -149 -132 -191 -161 76 -32 180 71 218 274 -45 -125 45
7563 45 17 54 -260 -51 126 -42 -172 14 43 53 -37 65 -59 -158 -214 -161 66 -9 141 -2 29 45 122 -46
7587 -46 -114 -95 -192 73 -9 -133 -146 17 -143 -61 -57 12 -97 24 26 -136 -25 0 296 11 113 -74 -312 -224 -30
7612 -30 25 84 -123 -58 22 -206 -29 222 -110 -214 -30 -21 -92 258 236 -91 222 39 59 -410 -199 102 959
7635 959 -1248 -607 -277 265 576 -392 221 -258 -298 -175 123 311 426 778 -642 583 713 -185 -149 -128
7655 -128 531 70 -222 75 550 80 347 -190 230 35 480 304 -3 -567 -205 597 -100 65 -85 -192
7675 -192 -287 22 -214 -552 109 -315 -528 200 -742 -202 290 -438 589 -54 -278 578 61 -162 400 -122
7695a22N0l69J69n83M04N49p65J099J51m02m79m36P26M15o53O2J27L51k57n2l47
7716c62N11M31o23M1j31M44J4p06N57O5l0pN6L4n45N54j77k53q3R51m04n44Q4
7739a23P5n38N18J95l45J67M5q7q82J116m23n80R52q23R07l94J050o26p65n0M53
7760a58N76q60K82R8J184j564l41J443j95j205Q39K71o68J57l0J92J10q14Q75
7779A92P79o28k86l51N80q12O22o70L33J41j43O1o34J146j201J028L11p05P04
7798D67J63j114p4M76K35m92J53L08M88m15L92o90K41j092R28K44K52j116L52
7817b94K77k05N65k40r46J463l71n50N31p42j1k50J291r39J033l43K62k83m39
7836a91J85o21P50q2qp43R65p20N43m0m61M64L12l67j74N29n83n8j131Q88K54
$$ plain form
7695 -122 -72 -441 -272 -855 -451 98 -667 432 583 181 -298 -734 -8 407 -246 -184 -57 294 37 -15 -362
7716 -362 149 580 -43 -2 -133 311 325 -381 176 241 211 204 260 294 -251 303 126 -127 -210 741 337 -207 -123
7739 -123 -48 -586 -68 127 -218 -51 -6 -93 -975 141 -282 -862 90 -733 174 -220 830 204 -561 -611 -158
7760 -158 418 -442 -160 -62 1122 -442 -783 660 465 -740 99 370 -298 -141 -171 21 131 -683 192
7779 192 971 343 57 -294 286 -526 96 -574 -241 -100 -243 -182 -816 330 -871 157 468 -237 467
7798 467 630 -484 -558 -82 153 -339 -186 122 610 195 587 -103 138 -954 -26 218 470 -646 -294
7817 -294 -17 -222 343 103 -843 620 249 -301 230 -512 -523 -773 518 -421 612 269 531 248 -191
7836 -191 -6 -627 123 41 33 -710 255 -465 78 38 -423 41 353 -14 -188 341 -242 -300 -1431 -543 -289
7857b89Q73k83k44r45J261p56R95p19K8N73j92m50l2q15J952k17n84j046J272
7876C82l70J35n13O6l33J118M70j548J260j743J101L96p27j97L48m09M81j197
7894a280J237N75j455J030R27k245J147q4P83p51J2N01j153Q88Q98p89p78k16
7912g53L71k54M09j06K82n50J189n27r99J108n3M71j030Q79n07m61O71j029J075
7931A86m08J509j290L22L32j135Q48n15M71k45L29k41m22M94k38J92M5j86o63
7950f15R25k56J00k46J58m91P90l85N51o30K07J91q5l65J2M06k92j55J06k31K38
7971f7J90J5q3j58J10j36L74r2q2m6j46J0O0K33%j28k21J86j13L4pL34l24q3K93
7996A53j29J1l1N9j17o1J85j94J72J33k5l46L51k6R2j81J67m91K99j2r6K78l37
$$ plain form
7857 -289 584 301 57 -888 373 -383 612 -107 -79 494 302 -148 -180 -995 957 740 156 -890 382
7876 382 12 147 -366 -300 -633 485 955 -593 667 -1076 25 421 -306 -503 -155 -564 -83 -1280
7894 -1280 -43 532 -923 107 1034 -1211 -64 -148 635 -116 -104 397 -756 132 1030 241 -537 -753
7912 -753 -382 -636 -227 -333 -51 -601 588 61 -938 170 117 588 -442 437 -70 -531 140 -889 186
7931 186 -222 1287 -3 319 651 -484 364 -151 320 75 404 163 -259 235 -3 189 234 48 -615
7950 -615 310 54 154 -92 66 -425 365 -20 531 -99 108 299 214 -151 -139 267 -25 -180 -74 -305 -67
7971 -67 123 138 55 -103 7 -129 245 153 71 25 -121 -111 -51 182 182 54 -167 19 -94 -60 -67 267 -57 -140 153
7996 153 24 35 4 63 -54 -115 70 -124 48 181 156 -190 161 135 227 46 213 -278 21 9 -87 191 -146
8019a46K09j22n0J33l35N21j06q9p6M3J78kq7j59K07j54J25j41k03J13J12k29
8041b58R4N5J8K2p9J25j47N00k10j22L9O3Or5J5k9K44jk01L77k57P6p33P51k94
8066d1K56K51n52M27l12L88n90O13p40L42M0j38R7L89M0k33r90m8j23J329j510
8087a105J050M22o17N28J00m19N53n00l88J96K22k02J16j7j65J75J65l9j20q5
8107a30j91L12j15q9J45J78j60P4qJ2L%j27j4J02o4Q0Q5k88K58r5J36p7pJ53l61
8133a88N99o77K83m7J40j45K04k08J39o1p5o0j12J84j56K07j60K48M34p99m92
8154g42P50P0n85J98L86m0P50m91o16M02O48j079m42J071O13j568N06M26k38k1
8174bj51l64L37o3N82j195J133m43P7L41P9q96M22P99l24k34k29
$$ plain form
8019 -146 63 -59 -109 24 -311 210 104 15 -61 -18 160 158 71 -88 119 -35 90 -51 -254 -141 -29 -258
8041 -258 -164 -109 -91 -69 -148 -23 -170 330 120 -2 37 100 106 11 26 -3 241 240 39 416 159 235 -498 253 -41
8066 -41 215 466 -86 341 29 417 -173 440 -300 42 82 -56 41 430 470 237 -753 -801 -924 405 -1105
8087 -1105 -55 367 -250 278 378 -41 512 12 -376 -180 42 -160 -44 -61 -226 -51 114 75 -45 -130
8107 -130 -321 -9 -124 -213 -68 110 -50 24 16 28 31 31 -96 -110 -8 -72 8 93 -195 63 -32 104 27 20 173 -188
8133 -188 411 -266 17 -30 110 -35 169 -39 100 39 -36 -96 -208 -24 -180 27 -133 115 549 -250 -742
8154 -742 8 78 -507 -309 77 37 787 296 -320 82 730 -349 -791 280 893 -675 -169 257 19 -2
8174 -2 -153 -517 -180 -243 339 -856 277 -166 -89 252 331 -565 -143 656 332 98 -131
8191a31
$$ Imaginary data points
##PAGE= N=2
##DATA TABLE= (X++(I..I)), XYDATA
0@%%%%QqQj6J6j6K4l2M0n6P0q1R8j19J36j60J91k22K58k98L39l88M45n04N74o54
30c47P34q22R23j033J152j285J433j591J765j958K170k404K663k948L264l620
46a904M021m475M995n600O307p154Q192r489J1168j3439J6704k1832L1104n3095
60c4497J94738J88254m35133k26660J74010L40819J5161k33529j82056P5308J60139
71C6554Q3893m9710q8395o9378K2310J02330J00191l8811j47082q7838J02437
82c3499J62937L720j81646j20892J02732J77958j980j61485q2609J04922J26690
93I6848j5673j06040l4262O3584N5108j5861l7326j6202q690j628L0900L0966
105D1724l5116p4574l263Q9006N9254n8078q9213J0693Q9310M2293m2022m9855
$$ plain form
0 0 0 0 0 0 8 0 8 -8 8 -8 16 -16 24 -32 38 -43 55 -64 72 -88 103 -119 139 -159 180 -208 237 -267 307 -347
30 -347 387 -435 488 -545 607 -678 755 -836 929 -1029 1141 -1263 1400 -1548 1716 -1904
46 -1904 2117 -2358 2637 -2963 3344 -3810 4382 -5107 6061 -7378 9326 -12506 18598 -34497
60 -34497 160241 348495 -86638 -313298 -139288 201531 216692 -16837 -198893 -123585 36554
71 36554 120447 70737 -17658 -87036 -64726 37604 137795 98984 -48098 -135936 -33499
82 -33499 129438 133158 -48488 -169380 -66648 111310 109330 -52155 -134764 -29842 96848
93 96848 81175 -24865 -59127 4457 59565 43704 6378 -9824 -18514 -20142 10758 41724
105 41724 6608 -67966 -71229 17777 77031 18953 -70260 -59567 29743 72036 30014 -19841
117a9841o156J6067J7186K2551L133m4621n7161O136P6391N4369m8946r9966j3899
130i4757J03772Q9115m5881j12201j7858R5052O5300n0775p4888Q523N1808l162
142A4048m1801M464L8780p993n0107l022N8581K8969m3386l7671L3285M6488k0389
155B0246m6801J7602N6892j2517q2708k4328Q4461O9320o1305j13965k343J18389
167B2943P7568o5941j10967m648J00989O9805l7575q0733k2412M3416M3190K666
179C8301k5564l3031k4747J1207N3576L3423m4547p0799R052Q6851M4333n8368
191A9687o9537K1954P4963J4437n9007m0262K7897M1689o832l9571j7850J9600
203a2832K7134K941j8818j6712L158K1476K4658K202k8564l0361J0302M5897K2499
$$ plain form
117 -19841 -25997 -9930 7256 29807 32940 -11681 -68842 -62706 13685 68054 19108 -80858 -94757
130 -94757 9015 98130 52249 -59952 -77810 17242 82542 31767 -43121 -34598 17210 14048
142 14048 -27753 -23289 15491 7498 -42609 -45631 12950 41919 -1467 -39138 -5853 40635 20246
155 20246 -26555 -8953 47939 35422 -47286 -71614 12847 82167 20862 -93103 -95446 22943
167 22943 100511 34570 -76397 -81045 19944 89749 52174 -28559 -50971 -7555 35635 38301
179 38301 12737 -20294 -45041 -33834 19742 53165 8618 -62181 -53129 33722 78055 19687
191 19687 -49850 -27896 47067 61504 2497 -37765 -9868 31821 24989 -14582 -32432 -12832
203 -12832 14302 17243 -1575 -18287 -15129 6347 31005 33207 4643 -25718 -15416 30481 52980
216E2980l8833n8386k955N6197L9873l1164n8535p996M5939L5743r399k6046r370
229a1952N542Q653J4894J5270j1319l9107j9243L3979M2068j3939n3500k0011
241d8665L6768L7346r225l0854o292J9299J3819m331n138M045O64q603o306O300
255a173P810n682j3990l631R106L553q485p60J7332P986k1825j9688K3316M2120
269C5989r27m9720l1521L2901N2488q08n2345l6458J8818M2326J8077j9766l3875
282b4821j4065K0712L9893J8493k5987m3046p487M3677M1027j4963n3056k4817
294d4440L0545M1806k42l8972k6059J6982L2356N736k0249j1507J0380J3779l4
307A0081o534l37L519K7k804k490m477m341M562J1536k177k1686j0649K3771L0323
$$ plain form
216 52980 14147 -44239 -47194 9003 48876 17712 -40823 -48819 -2880 32863 23464 -2582 -11952
229 -11952 -6410 2243 17137 32407 21088 -18019 -37262 -3283 38785 24846 -28654 -48665
241 -48665 -11897 25449 16224 -14630 -20922 -1623 12196 7865 2727 6772 7436 -1167 -7473 -1173
255 -1173 6637 955 -13035 -16666 -7560 -4007 -12492 -13252 4080 12066 -9759 -29447 -6131 35989
269 35989 35062 -14658 -46179 -13278 39210 38402 -13943 -50401 -31583 10743 28820 9054 -24821
282 -24821 -38886 -18174 21719 40212 14225 -28821 -36308 7369 48396 33433 -19623 -44440
294 -44440 -13895 27911 27669 -11303 -37362 -20380 11976 17712 -2537 -14044 -3664 10115 10081
307 10081 3547 3210 6729 6756 3952 1462 -3015 -7356 -2794 8742 6565 -15121 -25770 -1999 28324
322B8324n452l4794j5377K7008L5739m66l3221k3915J0063K7020J1706j3671k5506
335a2542j2038J1741K2858J0986j2027k2506q540J8395K9503O156k5827k5838
347a9679P186K8402J2408j7952k3992k983J4273P979l109m258k615n512j33J1849
361A864J1450m264j2357k241R670O646m990o143J858J310q287p332O734J2795
375F713o11j5736j1526Q832K1839J0686j3930k1580j852K0567J8045l508k0776
388b837j7150L057J8433J5049o844k4481j7314J2117L1480J2990k3513k8749M582
401b3180L1147J7596j2601k2946o284J1645J2855J288q939j0952m372N787R694
414G38L059o709o541K326O405L911O96M42m67j150l051j983M054P270j152j2859
$$ plain form
322 28324 22872 -11922 -27299 -291 35448 34982 1761 -22154 -12091 14929 26635 12964 -12542
335 -12542 -24580 -12839 10019 21005 8978 -13528 -22068 -3673 25830 31986 6159 -19679
347 -19679 -12493 15909 28317 10365 -13627 -16610 -2337 5642 2533 -1725 -4340 -9852 -9985 1864
361 1864 13314 9050 -3307 -5548 4122 10768 5778 -365 1493 2803 -5484 -12816 -6082 6713
375 6713 6102 -9634 -21160 -12328 9511 20197 6267 -15313 -17165 3402 21447 17939 -2837
388 -2837 -19987 -16930 1503 16552 9708 -14773 -32087 -19970 11510 24500 987 -27762 -23180
401 -23180 7967 25563 12962 -9984 -16268 -4623 8232 9520 581 -10371 -14743 -8956 738
414 738 3797 -2912 -9453 -7127 -722 3189 3885 4327 3860 2710 -341 -2324 1730 9000 7848 -5011
430e011j1326N175J7140Q388j2954j8287O87J9814J4788m734j4357q762L290J3811
444G662J1712m661j8770j3816Q022J9869P483j5085j9033n16J7252J3559j427
457A2251j0977q863L051J1636R298l239j0929o929J509O978N040k254q868o464
471h760J243Q458O638j932o568k210L607L614L059K964j345r186o870N223J1773
486I708J464j2271j2165M52J1773Q927j791r805p748K158J2729J1697l533j5281
500c686q541P878J3876L922j0766j3683l553R314J1579p0j0883r448L720J1563
514A222O904l746p478r84L285L001J599l82l686m124r33R31K429M17K66j789n598
531h666j265O472R689J186j0007r590N608J4084M152o887j1882n736P091J1409
$$ plain form
430 -5011 -16337 -11162 5978 14366 1412 -16875 -16188 3626 18414 13680 -677 -9439 -6149 7662
444 7662 19374 14713 -4057 -17873 -9851 10018 17501 2416 -16617 -17133 119 13678 12251
457 12251 1274 -7589 -4538 7098 16396 13157 2228 -4701 -3192 3786 8826 6572 -2296 -8760
471 -8760 -7517 941 7579 5647 -921 -3131 476 4090 7149 10113 8768 -418 -7288 -2065 9708
486 9708 11172 -1099 -13264 -12812 -1039 7888 6097 -3708 -11456 -9298 3431 15128 11595 -3686
500 -3686 -12227 -4349 9527 13449 2683 -11000 -14553 -5239 6340 6270 -4613 -14061 -10341 1222
514 1222 8126 4380 -3098 -4082 -797 2204 3803 3421 -265 -4389 -5322 -4391 -1962 -1545 -1279 -3068 -8666
531 -8666 -9931 -3459 6230 7416 -2591 -12181 -6573 7511 11663 4776 -7106 -12842 -5751 5658
545E658M415j0709j4211k499J4516J4371p28j4232j1513N687J6090J1395o845
558A1395j7875p611J0523J5873J168j4018j1331K046R617O194j132m886n110j766
572f913N950R438L716p962r308P87Q377N956k086p162n692r18O133M769n47n148
588f10m121o42O188O042K819m990p863k656Q411J1132j397j2409r866M246J2889
603G173L600q705r076p19O771O849J779o285l851m16N421M950q76l883k881k502
619b651J744L521J814m902n175J84M932J531k768j288L801K107l759m316M762
634d63R331o12j1538q763N471J3343M467j1785j5238m16J5479J3015m401j5798
648g908r065Q709J6032O928q141j4250o602P278J6014Q324j2781k3100n344K1299
$$ plain form
545 5658 10073 -636 -14847 -17346 -2830 11541 10813 -3419 -14932 -9245 6845 18240 11395
558 11395 -6480 -14091 -3568 12305 13473 -545 -11876 -9830 -213 5981 4849 -37 -5147 -6913
572 -6913 -963 8475 12191 4229 -5079 -4292 4085 10041 7955 793 -4899 -5817 316 5085 4538 -610
588 -610 -4731 -5373 815 6857 9676 4686 -3177 -5833 2578 13710 12313 -96 -9962 -5716 7173
603 7173 10773 2068 -7008 -7727 -956 5893 7672 1387 -2464 -2880 2541 7491 6615 2732 -149 -2651
619 -2651 -907 2614 4428 -474 -5649 -5465 -533 998 -1770 -3058 743 2850 -909 -5225 -463
634 -463 8868 8256 -3282 -12045 -6574 6769 11236 -549 -15787 -16203 -724 12291 7890 -7908
648 -7908 -16973 -8264 7768 14696 6555 -7695 -14297 -7019 8995 17319 4538 -18562 -23906 -2607
662b607K2312m405k6846j5845J4760K6908O904j9285j9832K378J9214J3389o661
675A0384j7490o825P704J0422K374m794p348m707L282Q999O139m537r536k378
689h311R026R604k842j0624k286P749M347m826n791Q55O337Q80o523m919M725
704b599R410J199q984n881M845J0427K682q090p363J648O773J515k818j611j586
719d33l474l81O072O320k967r577m131Q170J2145q6j1341p709M064R934L977o251
735D332q789j487N249L936j030m73j303l622k435M480R088K137r100r456K752
750e721J2463O366q016j2293k338P412P920M83o743o958o97N311O721K711l659
765B962q592m393O956J2446K835j1332j3941J73J5769J1089q085j8122m956J3210
$$ plain form
662 -2607 19705 15300 -11546 -27391 -12631 14277 21181 1896 -17936 -15558 3656 17045 10384
675 10384 -7106 -13931 -6227 4195 6569 1775 -5573 -10280 -6998 2001 8140 3603 -5933 -8311
689 -8311 715 10319 7477 -3147 -5433 2316 6663 1837 -3954 -3099 3238 4118 -2405 -7324 -2599
704 -2599 6811 8010 -974 -6855 -2010 8417 11099 3009 -4354 -2706 4067 5582 2764 1153 -433
719 -433 -3907 -4288 1784 8104 5137 -4440 -8571 -401 11744 11658 317 -7392 -3328 6606 10583 4332
735 4332 -4457 -5944 -695 3241 2211 1738 435 -3187 -5622 -1142 7946 10083 983 -8473 -5721
750 -5721 6742 13108 5092 -7201 -9539 -2127 5793 6276 -467 -7425 -8122 -2811 3910 6621 2962
765 2962 -5630 -10023 -3067 9379 12214 882 -13059 -12886 2883 13972 5887 -12235 -17191 -3981
779c981J3235j110j1965p851N005R605M477m109o489k690K565N400J678l378m835
794d443j163K035L867J472l444m163K200N653L43m840j652N395N120m053q493
809f166p7R326N683o908j1100l25R599P967l346r623m557O064R313K178n952o161
825d085q58M636O962R06m913p805j760O286Q007M14q849q481M004J0573M595n865
841C767p603m76N675N287J81l851l810j404K016M111J253l351m104r65K108L612
857B446J629j130l816j856K812M254J047k100l345j426Q26K991J629m63m236m011
873d749M79O300L736j657o380m565L650P845N145n256r806k872Q797Q563k500
888F730r721o887M476Q568L409n039p166j573M109O519J810l963o279p43N387
$$ plain form
779 -3981 9254 8144 -3821 -11672 -6667 2938 7415 3306 -3183 -5873 -3308 2092 3770 392 -4443
794 -4443 -5606 -3571 296 1768 -1676 -5839 -3639 2014 2357 -2483 -4135 1260 6380 2327 -6166
809 -6166 -6243 3083 8766 1858 -9242 -9567 32 7999 4653 -4970 -9527 -3463 5850 8028 2076 -4085
825 -4085 -4943 -307 6655 7561 2648 -5157 -6917 -631 7376 7790 -1059 -9540 -5536 5037 9632 3767
841 3767 -3836 -4312 1363 6650 6831 2980 -830 -2234 -218 3893 5146 1795 -2309 -3274 -1166 2446
857 2446 4075 2945 -871 -2727 85 4339 5386 3286 -59 -1485 -659 2332 3961 3498 -738 -4749
873 -4749 -4270 2030 5766 4109 -2271 -6836 -3186 4659 9804 4548 -5258 -8130 667 9230 6730
888 6730 -2991 -9878 -5402 3166 6575 1536 -5630 -7203 -3094 3425 5235 1272 -5007 -5750 -363
903c63N640j333o260l777L120M143P9k982k379J054K140n09j604N32L508J067
919B076l696l294K690N418Q93m734m860L03N046L024r41l985m473M71N937O071
935E946k358p682l762N468Q093J860o236p338l9O407N226j124o050m859J389N803
951G44M546j545n681l849K157O257M304k775o303k794M530N089J147m602m464
966c239M92L024K486k64j150l380q39K332M564J381m349k644J556J753J760k67
982C216j847r98j233J07J840K504o65l514k579J293M374K355r73n234k970L852
998d72N869P45l711n421o49L148M561R46m934n376n89N866N612j586o173l869
1014f033L647N902J495l880l582j032J645M440L48k114l376k299J991L807J827
$$ plain form
903 -363 5277 3944 -2316 -6093 -2973 1170 1249 -1733 -4112 -3058 -918 -1427 -3031 -2499 1009 2076
919 2076 -1620 -4914 -2224 3194 4087 -647 -5507 -5204 -158 2866 1925 -2060 -6533 -6062 -125 5946
935 5946 3588 -4094 -7856 -2388 5705 7565 1329 -6009 -6048 359 5585 4461 -1589 -6448 -5059 744
951 744 5290 3745 -1936 -5785 -3628 2629 6933 4158 -2145 -4939 -409 4680 5827 1225 -3239
966 -3239 -2747 277 2763 2499 1349 -2031 -2870 -538 4026 5407 1058 -1586 -30 1723 3483 3216
982 3216 1369 371 -862 -755 1085 3589 2924 -590 -3169 -1876 2498 4853 3880 -1354 -4324 -472
998 -472 5397 6142 2431 -2990 -3639 -491 4070 5016 82 -5294 -5883 -17 5595 4009 -2164 -6033
1014 -6033 -2386 3516 5011 1131 -2451 -3483 -1838 2602 2950 836 -2540 -4839 -2848 959 2786
1029B786k508l648n30K053L962R37k247m102o73K170M142J218l581l834j385K423
1045b817M304N26l118m468K27M743L431j269l412j465J177K378J556M67k925l027
1061c692K36K591K821l08l202k343R24K865J920L7k229k508L91K982L016o39k952
1078i0k606l7L446K715p99m247k863J687M855K349k133m374j525L158L884J320
1094D740k225l794k038K825M545P16l305m636N81L057L909Jm011l651R72L724
1110A410K936P53m567l048J291L677J392k042k077j951J063L104J503j053l940
1125a549j86J254K305K20k02r88j046q19K055R74m49j527j525m34K304J527r83
1142I31j230k588M15K546K219Mk674k908Q59L491K610j617l843k232J656L606
$$ plain form
1029 2786 278 -3370 -3900 -1847 2115 3052 805 -3297 -3970 -1800 2342 3560 -21 -3855 -5240 -2817
1045 -2817 1487 2013 -1105 -5573 -5346 -603 2828 1559 -1853 -3318 -2141 237 1793 2260 -665 -3692
1061 -3692 -3456 -865 1956 1648 -1554 -3897 -2973 -108 1812 1849 -380 -2888 -2497 485 3501 2862 -90
1078 -90 -2696 -2733 713 3428 2629 -1618 -4481 -2794 2061 4410 2277 -2097 -3622 -464 3420 4740
1094 4740 2515 -1279 -3317 -492 4053 4769 1464 -3172 -2591 466 4375 4376 365 -3286 -2314 1410
1110 1410 4346 5099 532 -2516 -1225 2452 3844 1802 -275 -2226 -1163 1941 3444 2391 -1549
1125 -1549 -1735 -481 1824 2044 1842 854 -192 -1011 1044 2018 1569 42 -1483 -1917 387 1914 931
1142 931 -299 -2887 -2472 74 2293 2297 -377 -3285 -2426 1065 3675 2058 -1785 -4017 -2361 1245
1158A245K077k846m273j147L083M121O35l315l511j41L491L235j29l132l496K01
1174c902L809L111j354l814k547J590L161J765p38k952j951J390L193J679j582
1189H58l057j000K085K322N01j217j966j253P38K984O78j735j791p17J488K113
1205A031M83n99j694q03J158J886J117j414k323o48J417J659P11q20k009j341
1221b189Q18L128J678j271l211j248K447L091M78k289k505m30K001K160L24k359
1237F23k422J59J937K292N96j900k363m96J963L439M80l681l373Q39M261J863
1253D217j328l958r47P71K447J795r45k974k034J461L589J656j479l873k027K917
1269g12L208K441l819l956j07K932K727m75l456j991M30K633J301P71j968k248
$$ plain form
1158 1245 3322 476 -3797 -4944 -1861 2260 2895 -420 -3931 -4072 -581 2654 2525 -607 -4103 -3902
1174 -3902 -93 3018 1664 -2150 -4697 -3107 54 1819 1081 -1871 -3822 -2432 761 2440 858
1189 858 -2199 -3199 -1114 1208 1709 492 -1474 -2727 -1989 995 1673 -62 -1853 -2570 -1082 1031
1205 1031 1514 915 -779 -1582 -424 1462 2579 1165 -1158 -1806 -389 1270 1981 1161 -848 -2189
1221 -2189 -1371 1757 3435 2164 -1047 -2295 152 3243 3721 1432 -1073 -1503 498 2658 2982 623
1237 623 -1799 -1640 297 2589 3185 1285 -1078 -1574 389 3828 4308 627 -2746 -1907 2354 4217
1253 4217 2889 -1069 -2016 -1245 1202 2997 2052 -922 -2956 -1495 2094 3750 2271 -1602 -3629 -712
1269 -712 2496 4937 1118 -2838 -2945 -13 2714 2239 -1217 -3208 -2778 -145 1156 1927 -41 -2289
1285b289j058K640L232J10l530l250J474L524J373j434l291j228K001K418M15
1300A107j342j484n71J041J791M28n18j630j215M74K279J347j524k332j179K020
1316a308J614K50j164j201J72R19Q12R3M80r39r47o9J056J273M78j733k502o9
1334b785L209K794j614l225j250K247K907L96j532k197o56J101J933J954j234
1349B048l259k066K051M465J237l556m788L06M849M338j939n297k007K978L991
1364C351Q30k928k709k50J890J667J144o88l339j962K110M123J036l537l809Q43
1380b228M421K053k069l619m27K302J870k83j464j375N22M80K42l8Q21n44j287
1397f23l38J538J004n36q57j028K90J293r7p11K27n10r25k59J712R85m98k278
$$ plain form
1285 -2289 -3347 -707 2525 2635 -895 -4145 -2671 853 2226 792 -2499 -3727 -1726 692 1107
1300 1107 -235 -1719 -2290 -1249 542 970 452 -1178 -2393 -1919 360 1707 183 -2149 -3328 -1308
1316 -1308 306 556 -608 -1809 -1637 -718 94 187 667 -272 -1219 -1288 -232 1041 1519 -214 -2716 -2785
1334 -2785 424 3218 1604 -1621 -2871 -624 2283 2679 1147 -1050 -1706 -605 1328 3282 2048
1349 2048 -1211 -3277 -1226 3239 4476 920 -3868 -3562 1287 5625 3686 -1611 -3618 -640 3351
1364 3351 4181 1253 -1456 -1706 184 1851 2995 2307 -1032 -2994 -884 3239 4275 738 -3071 -2228
1380 -2228 2193 4246 2177 -1442 -1869 433 2303 2020 556 -819 -297 183 425 387 1208 664 -623
1397 -623 -961 577 1581 1045 188 -840 -550 743 646 -65 162 -348 -1273 -1532 180 1165 667 -1611
1415a611r96Q96K657J473k092l212j30K720K326N5l345k419J046L056J445j649
1431B20k039r82O42K265J253n78j762j185k35L301J050j481l302r96L540K243
1447A954k78l140j882J372K505R52j289j110k26O3N80J214P70j349j826m25K041
1464g4K414m51k895j238J303J831N52p19j260j54N03O61R21J35p85j536j76J285
1482C17K473j009k079j531R77K802J963k928j530rJ553Q8O32J58j578j159R89
1499A29J497J095j668j131q77J303J232k55n92j300Q2N86J949k7j321j238l7J369
1517G96Q46R1j108j285k95J196J230J90j348j568j26J416J495Q6j471j466n66
1534a887K005K098m82k575j216Q01J639O75l12j678j237O47J410J428m81j990
$$ plain form
1415 -1611 -2607 -1711 946 2419 327 -2885 -3015 -295 2031 2086 -1259 -3678 -2632 424 1869 220
1431 220 -1819 -2801 -2159 106 1359 781 -981 -2166 -2401 900 1950 469 -2833 -3829 -289 1954
1447 1954 1676 -1464 -3346 -1974 531 1483 194 -916 -1142 -1079 -499 715 1485 136 -1690 -2115 -74
1464 -74 2340 1889 -1006 -2244 -941 890 1442 723 -537 -691 -188 473 1394 1529 744 -792 -968 317
1482 317 2790 1781 -298 -1829 -852 1950 3913 985 -545 -554 999 1087 1719 1877 299 -860 129
1499 129 1626 2721 1053 -78 -955 348 1580 1325 733 -567 -485 101 2050 2023 702 -536 -573 796
1517 796 1642 1733 625 -660 -955 241 1471 1661 313 -1255 -1381 35 1530 1616 145 -1321 -1887
1534 -1887 118 2216 1734 -841 -2057 -1256 383 1058 746 -932 -2169 -1522 -112 1316 835 -1155
1550a155j534J054K968O06k219j628j204J975J939L27j146j878j18J009J562K29
1566G87j150j444l68J337J908K18j682j615L32J778R57q81j105m32L83O29P15
1583C67R0m36j553J83P81J916l34j747p26O46J469K18j5p79j329L51K52K163J17
1602A634j816n28r00K282J580j165j795n13P71K030N51j135j882m50J135J702
1618A501N89p74k054q70J793J665L12j415j944K6J949J649n99j559r29q6J829
1635A083Q02j55j442j791N47J416J008j47k067j88R30J413O25q15j719K37j4J099
1653H22P97j038q32r92Q11J122P35r88j395k78P71J313k08o13n76k81O41NJ118
1672I34m73j297o29N08J472L91q80j327n29R51J053L57n64j221m47O47J467M26
$$ plain form
1550 -1155 -2689 -1635 1333 1939 -280 -1908 -3112 -1137 802 1129 -17 -1895 -2013 -1004 558 787
1566 787 -363 -1807 -2175 -838 1070 1288 -394 -2009 -1677 101 1058 177 -928 -1360 -977 -348 367
1583 367 457 21 -1532 -1349 -568 1348 1014 -733 -1459 -813 656 874 859 80 -1249 -898 -646 1517 1634
1602 1634 -182 -710 -1610 672 2252 1087 -708 -1221 -450 1580 2131 996 -886 -1336 -201 1501
1618 1501 2090 1316 -738 -1608 185 1850 2162 747 -1197 -1171 778 2427 1828 269 -660 -746 1083
1635 1083 1885 1730 288 -1503 -956 460 1468 1321 -746 -934 -4 1409 2034 1219 -500 -263 -277 822
1653 822 1619 581 -251 -1243 -432 690 1425 437 -958 -1236 -465 848 640 27 -549 -830 -189 -184 934
1672 934 461 -836 -1465 -957 515 906 26 -1301 -1830 -879 174 531 -33 -1254 -1701 -1054 413 839
1690H39n64k138O3Q94K151K2j795j626J77J670J464m07j775j251P10J749R43l15
1708H11j531j415Q62J917R90j308j709o96J626J623K4j438j308K48J276J044k00
1725H16p13j110J75Q38J066k01p87q85J57J253K37j4r44l84M80M46L13J92n10
1744D25l13m97N39Q20N05j092o57l09Q85P58K72p54o82m32Q74Q81M45j000j431
1763g63K2J199J303k8j611r28K64J331Q69m64j339p98L53J398Q19l21j764r18
1781a376J006J734J00q10j702l58J055J592k15j443p64L38O34R31N6r07j046n0
1799a225J059J000m99r53r75P92N74J082n97J11o78o89N34K71J60m97m67l53L15
1818a035J137N33j450j68m67J056Q09k98q34j75o26J178R90J64p56j664J244K68
$$ plain form
1690 839 275 -1863 -1800 -906 1245 1267 -528 -2154 -1977 -307 1157 750 -1025 -2276 -1566 183 1126 811
1708 811 -720 -2135 -1273 644 1634 326 -1383 -2079 -453 1170 1194 -244 -1552 -1304 -28 1016 816
1725 816 103 -1007 -832 6 1072 871 84 -801 -644 609 846 832 -112 -496 -16 430 743 935 425
1744 425 112 -385 154 974 1479 387 -270 -579 306 1064 1336 582 -100 -532 342 1223 1668 668 -763
1763 -763 -741 458 1761 1733 122 -806 -542 789 1658 1194 -145 -943 -590 808 1627 1306 -458 -1376
1781 -1376 -370 1364 1464 654 -1048 -1406 -351 1241 1026 -417 -1181 -843 -209 722 778 -129 -1175 -1225
1799 -1225 -166 834 335 -618 -1593 -801 -227 855 258 369 -309 -998 -464 -193 -33 -530 -997 -1350 -1035
1818 -1035 102 635 -815 -983 -1450 -394 415 117 -717 -892 -1518 -340 650 814 58 -1606 -362 -94
1836i4O66o23n96j479J140J609L30p25j302ro61J602Q83k91r92j033J203R88R81
1855A597j451j208N56J429l26l17j79q25q92K039J352l34j227j181N50O05R92
1872A180K39j164j237M96J163P73n19q01p74K68J056O97j30j196p49M98J105P81
1890A686p10j275m03N78J058N62r38q92l07J033O26j41k65j046l41P87R14q9m30
1909D07j323jJ148P66j87r18o93K48R21N55m97o84m9j95O51K01P0l93r09M04L56
1930a22L61R3m44o41m99R19J011l61n84j039N1J091Q73k90j031n10J57R08M48
1949C91j10q50q20l6J642N02j59j481o97N87J335Q36j200j342l43J440J315k69
1967G41j038r56J84O39J089q8q12q75R4J326P38j11j396p30N29J185K13l77r24
$$ plain form
1836 -94 572 -51 -647 -2126 -986 623 953 228 -1074 -1083 -1744 -142 741 450 -542 -1575 -372 616 1597
1855 1597 146 -1062 -506 923 597 280 101 -724 -1616 423 1775 1441 214 -967 -417 188 1180
1872 1180 1419 255 -982 -486 677 1450 931 130 -644 -376 680 1377 1247 51 -698 -200 905 1686
1890 1686 976 -299 -702 -124 934 1496 558 -334 -641 392 1018 877 612 -434 -775 12 926 837 407
1909 407 -916 -917 231 997 810 -108 -801 -553 368 923 426 -258 -307 -502 149 350 420 27 -882 -478 -122
1930 -122 239 332 -112 -753 -1252 -333 678 317 -267 -1306 -1255 -164 709 419 -612 -1122 -965 -57 391
1949 391 281 -569 -1389 -1425 217 719 560 -921 -1618 -1031 304 1140 -60 -1402 -1745 -305 1010 741
1967 741 -297 -1253 -1069 -430 659 571 -241 -1116 -1022 304 1042 931 -465 -1195 -666 519 732 355 -569
1986e69l53N02J153M11j207p53M18N16M09K50p54k06j18K26P53L39l79o99N8K16
2006B13N70J6o51J64l45l57J793l95n27l65m2j56K81K85M15n94j605O53K469j66
2026A656j296q72j51R17K81J44k84j073N57L01N49L39o51j109p0J185N84j02j026
2045a21p71p5J123Q19l72j204j8L59O31L31l57j221r8O86J123l02j41j476M57
2064f27O2J011l47k53r57K97N67J90J47p80l08N38O17m78O30q38j62k21J049m99
2084c62j88O76o15o42O23L03M84r03m04M01J38P27L44o15j036K42J89Q57qk16
2104el54k30M20J84J95m8r55m77J634O19j081r75J042l17P54N67j173m3j131J502
2124A28L47O49n60p57m55O15P24O10r7j960L66P90Q76m5j179p6q4L03M95J77r33
$$ plain form
1986 -569 -922 -420 733 1144 -63 -816 -398 118 527 777 23 -183 -301 -75 678 1017 638 -61 -3 213
2006 213 783 799 148 312 -33 -390 1403 1008 481 116 74 -82 199 484 899 305 -1300 -647 1822 1656
2026 1656 360 -512 -663 254 535 679 395 -678 -121 180 729 1068 417 -692 -762 423 1007 905 -121
2045 -121 -892 -967 156 975 603 -601 -619 -260 371 702 345 -876 -974 -288 835 533 392 -1084 -627
2064 -627 -565 446 99 -154 -1111 -814 -247 -57 90 -690 -998 -460 157 -321 309 -529 -691 -912 137 -362
2084 -362 -550 126 -489 -1131 -508 -205 279 -624 -1028 -627 -489 238 582 -33 -1069 -827 -638 219 211 -5
2104 -5 -359 -589 -169 15 210 162 -793 -1270 364 983 -98 -1073 -31 -348 406 973 -200 -243 -1374 128
2124 128 475 1124 564 -193 -648 -33 691 1301 1204 -756 -390 400 1276 1231 52 -24 -108 195 690 867 -66
2145f6q5J93j15J363q8j147l97K37P85J54j86n96j21o3M24M24l27l73k50J01O91
2166E58J73k66l73n00K56O22Q5k43l88m26N60L46R2l98l83o78Q44O93rj50o62
2187b47m81L05O45K54m74o61O7L31L61K39l41o01n96R03O48J45p81m42M7J94O58
2208A73j39m02k17k3M70N01j82l68n16j3L59O92R6r44r30N76Q94L39n33o49J27
2229f89K81L50M69r8n91n32L89O68L40l85j146N1Q42M56K51m72n85k07O27N36
2249E55R6m00o56j42O82O87q9n14p27J20P88N51l62n50l01Q0P85K47n09k95k1
2270B5k39N63M18j91l48k46rN49J55k95j55k48K09K45M0J03k64n70j20Q54K78
2291G54L9q33k79L20N85j16l67k72j04n0L69M58j62o27m62N12P44M54o71j179
$$ plain form
2145 -66 -151 42 -73 1290 1202 55 -342 -105 680 834 648 52 -69 -132 292 716 389 16 -234 -133 558
2166 558 731 465 92 -408 -152 470 555 312 -76 -502 58 404 496 98 -285 -963 -119 574 565 415 -247
2187 -247 -728 -423 222 476 2 -659 -592 -261 100 339 -2 -603 -1199 -296 352 497 -284 -726 -679 -485 173
2208 173 34 -368 -585 -608 -138 363 181 -187 -703 -716 -357 335 431 -513 -1443 -867 27 366 -167 -816 -689
2229 -689 -408 -58 411 313 -278 -810 -421 247 587 202 -944 -893 -51 405 656 184 -401 -608 19 555
2249 555 651 251 -405 -547 135 822 733 219 -508 -388 400 951 589 39 -262 -182 603 850 341 46 25
2270 25 -214 349 767 576 228 -18 -27 522 677 382 227 -21 188 433 473 576 312 -258 -378 476 754
2291 754 793 -40 -319 1 586 470 103 -169 -273 -323 46 504 342 -285 -747 -235 509 963 292 -887
2311h87mQ37O53l5o39q87N10N44L57k78l41p29J95P30M44r2j065k97P42N05j79
2332H4j83k96k09N12K18K34p00j5l36L34L41j01k29ok97L83M37K18m51l37j42
2353e41J98K09N4J52k03m31K34J82K71L76q50m55K86N44K25m24j33l35J28O46
2373A33J63J31n30n94O07P75K12p98o39O9N80N02J25n65q64N35K56N93j61o47
2393a17k29O47N64j47j96o52k76L02P74m3k58n66n1L62M28J65o18k77N2M06L19
2414E89j28n17J92j90J81O59l45l40j16k16L03O08j51m22O1j69O2k2J80J8l86
2435a49j20L09J6L83m31l21J5J61N13j25j81l52m01N50N74q8n82k72J84K48L13
2456B44j98l14l26r8O19N80l59o31l57K56N72K97k47k09o69J66P31n7R0o68J72
$$ plain form
2311 -887 -891 -54 599 564 -75 -962 -452 92 449 171 -170 -899 -704 26 470 378 -687 -984 -242 263 84
2332 84 -99 -395 -604 -92 126 360 -340 -355 -691 -357 -16 -117 -346 -352 -649 -266 171 389 -62 -399 -541
2353 -541 -343 -134 -80 72 -131 -562 -328 -146 125 501 -349 -804 -518 26 251 -173 -306 -641 -513 133
2373 133 296 427 -103 -697 -90 685 897 99 -540 -471 109 611 736 171 -693 -158 98 691 530 -117
2393 -117 -346 301 865 718 522 -130 -406 -104 670 627 369 -197 -248 114 542 707 89 -188 -136 270 589
2414 589 461 -56 136 -54 127 786 441 101 -15 -231 72 680 529 107 168 -1 61 39 219 237 -149
2435 -149 -269 40 56 439 8 -313 -298 -137 376 251 70 -282 -683 -133 441 353 -229 -501 -317 -69 244
2456 244 46 -268 -594 -692 -73 507 148 -483 -840 -584 -12 285 38 -171 -840 -674 57 0 90 -578 -406
2477d06k9P88j14m02m25k18J79P00j19j78m62N1K92O19k82N2q84L79N50M28k56
2498B63o18m6p5K84Q54l88L5j48m70O9J85M90o18k93K23O5M12J54p57K39Q32j035
2520c43J12O56m86l96J80J519m9j352k81N14l53J209n52P62j32o01p71J216j50
$$ plain form
2477 -406 -435 353 239 -163 -588 -806 -627 73 -46 -224 -686 -635 -343 276 -6 46 -838 -459 91 519 263
2498 263 -355 -401 -476 -192 662 274 309 161 -309 -240 -55 435 -183 -476 -253 -188 224 378 -379 -140 692 -343
2520 -343 -231 425 -61 -457 -277 1242 1193 -159 -440 74 -279 930 378 1140 1008 407 -364 852 702
$$ [...]
8191d36
##END NTUPLES=NMR FID
##END=
