##TITLE=1H_Pr 4687-carb
 CDCl3, 8 sc, 
 23.3.2020
##JCAMPDX= 6.0         $$ Bruker NMR JCAMP-DX V2.0
##DATA TYPE= NMR FID
##DATA CLASS= NTUPLES
##ORIGIN= UXNMR, Bruker Analytische Messtechnik GmbH
##OWNER= root
$$ XWIN-NMR		Version 3.5
$$ Mon Mar 23 14:40:20 2020 Russian Standard Time (UT+4h)  she@DPX200
##.OBSERVE FREQUENCY= 200.1315
##.OBSERVE NUCLEUS= ^1H
##.DELAY= (6, 6)
##.ACQUISITION MODE= SIMULTANEOUS
##.ACQUISITION SCHEME= undefined
##.AVERAGES= 8
##.DIGITISER RES= 18
##SPECTROMETER/DATA SYSTEM= spect
##.PULSE SEQUENCE= zg30
##.SOLVENT NAME= CDCl3
##.SHIFT REFERENCE= (INTERNAL, CDCl3, 0, 15.7039)
##AUDIT TRAIL= $$ (NUMBER, WHEN, WHO, WHERE, WHAT)
$$ ##TITLE= Audit trail, XWIN-NMR		Version 3.5
$$ ##JCAMPDX= 5.01
$$ ##ORIGIN= Bruker BioSpin GmbH
$$ ##OWNER= she
$$ F:/spectra/data/she/nmr/H-F/1/audita.txt
$$ ##AUDIT TRAIL=  $$ (NUMBER, WHEN, WHO, WHERE, WHAT)
(   1,<2020-03-23 14:39:23.79 +0400>,<she>,<DPX200>,
      <created by zg, POWCHK disabled, PULCHK disabled
       configuration hash MD5:
       00 E9 B6 7A A2 85 ED C7 34 08 36 98 17 FE 4E 26
       data hash MD5: 16K
       FD DB BD 84 0A 8E 1C 0B 97 3D 18 C7 D9 B6 1A 92>)
$$ ##END=
$$ 
$$ hash MD5
$$ BF D3 63 20 3F 42 8F 6A F1 26 0C 35 92 23 47 CF
##$RELAX= 
##$RELAX= 
##$RELAX= 
##$RELAX= 
##$RELAX= 
##$RELAX= 
$$ Bruker specific parameters
$$ --------------------------
##$DU= <F:/spectra>
##$EXPNO= 1
##$NAME= <H-F>
##$PROCNO= 1
##$TYPE= <nmr>
##$USER= <she>
##$AMP= (0..31)
100 100 100 100 100 100 100 100 100 100 100 100 100 100 100 100 100 100 
100 100 100 100 100 100 100 100 100 100 100 100 100 100 
##$AQSEQ= 0
##$AQ_mod= 1
##$AUNM= <au_zg>
##$AUTOPOS= <>
##$BF1= 200.13
##$BF2= 200.13
##$BF3= 200.13
##$BF4= 200.13
##$BF5= 200.13
##$BF6= 200.13
##$BF7= 200.13
##$BF8= 200.13
##$BYTORDA= 1
##$CFDGTYP= 0
##$CFRGTYP= 5
##$CHEMSTR= <none>
##$CNST= (0..31)
1 1 145 1 1 1 1 1 1 1 1 1 1 1 1 1 1 1 1 1 1 1 1 1 1 1 1 1 1 1 1 1 
##$CPDPRG= <>
##$CPDPRG1= <>
##$CPDPRG2= <>
##$CPDPRG3= <>
##$CPDPRG4= <mlev>
##$CPDPRG5= <mlev>
##$CPDPRG6= <mlev>
##$CPDPRG7= <mlev>
##$CPDPRG8= <mlev>
##$CPDPRGB= <>
##$CPDPRGT= <>
##$D= (0..31)
0 1.2 0 0 0 0 0 0 0 0.06 0 0.03 0 0 0 0 0.0002 0 0 0 0 0 0 0 0 0 0 0 0 
0 0 0 
##$DATE= 1584959963
##$DBL= (0..7)
120 120 120 120 120 120 120 120 
##$DBP= (0..7)
150 150 150 150 150 150 150 150 
##$DBP07= 0
##$DBPNAM0= <>
##$DBPNAM1= <>
##$DBPNAM2= <>
##$DBPNAM3= <>
##$DBPNAM4= <>
##$DBPNAM5= <>
##$DBPNAM6= <>
##$DBPNAM7= <>
##$DBPOAL= (0..7)
0.5 0.5 0.5 0.5 0.5 0.5 0.5 0.5 
##$DBPOFFS= (0..7)
0 0 0 0 0 0 0 0 
##$DE= 6
##$DECBNUC= <off>
##$DECIM= 24
##$DECNUC= <off>
##$DECSTAT= 4
##$DIGMOD= 1
##$DIGTYP= 9
##$DL= (0..7)
0 120 120 120 120 120 120 120 
##$DP= (0..7)
150 150 150 150 150 150 150 150 
##$DP07= 0
##$DPNAME0= <>
##$DPNAME1= <>
##$DPNAME2= <>
##$DPNAME3= <>
##$DPNAME4= <>
##$DPNAME5= <>
##$DPNAME6= <>
##$DPNAME7= <>
##$DPOAL= (0..7)
0.5 0.5 0.5 0.5 0.5 0.5 0.5 0.5 
##$DPOFFS= (0..7)
0 0 0 0 0 0 0 0 
##$DQDMODE= 0
##$DR= 18
##$DS= 0
##$DSLIST= <SSSSSSSSSSSSSSS>
$$ [...]
##$SUBNAM2= <"">
##$SUBNAM3= <"">
##$SUBNAM4= <"">
##$SUBNAM5= <"">
##$SUBNAM6= <"">
##$SUBNAM7= <"">
##$SUBNAM8= <"">
##$SUBNAM9= <"">
##$SW= 24.9337058887773
##$SWIBOX= (0..15)
0 0 2 0 0 0 0 0 0 0 0 0 0 0 0 0 
##$SW_h= 4990.01996007984
##$TD= 16384
##$TD0= 1
##$TE= 0
##$TE2= 300
##$TE3= 300
##$TEG= 300
##$TL= (0..7)
0 120 120 120 120 120 120 120 
##$TP= (0..7)
150 150 150 150 150 150 150 150 
##$TP07= 0
##$TPNAME0= <>
##$TPNAME1= <>
##$TPNAME2= <>
##$TPNAME3= <>
##$TPNAME4= <>
##$TPNAME5= <>
##$TPNAME6= <>
##$TPNAME7= <>
##$TPOAL= (0..7)
0.5 0.5 0.5 0.5 0.5 0.5 0.5 0.5 
##$TPOFFS= (0..7)
0 0 0 0 0 0 0 0 
##$TUNHIN= 0
##$TUNHOUT= 0
##$TUNXOUT= 0
##$USERA1= <user>
##$USERA2= <user>
##$USERA3= <user>
##$USERA4= <user>
##$USERA5= <user>
##$V9= 5
##$VALIST= <valist>
##$VCLIST= <CCCCCCCCCCCCCCC>
##$VD= 0
##$VDLIST= <DDDDDDDDDDDDDDD>
##$VPLIST= <PPPPPPPPPPPPPPP>
##$VTLIST= <TTTTTTTTTTTTTTT>
##$WBST= 1024
##$WBSW= 4
##$XGAIN= (0..3)
0 0 0 0 
##$XL= 0
##$YL= 0
##$YMAX_a= 240153
##$YMIN_a= -242737
##$ZGOPTNS= <>
##$ZL1= 120
##$ZL2= 120
##$ZL3= 120
##$ZL4= 120
##$ABSF1= 10
##$ABSF2= 0
##$ABSG= 5
##$ABSL= 3
##$ALPHA= 0
##$AQORDER= 0
##$ASSFAC= 0
##$ASSFACI= 0
##$ASSFACX= 0
##$ASSWID= 0
##$AUNMP= <proc_1d>
##$AZFE= 0.1
##$AZFW= 0.1
##$BCFW= 1
##$BC_mod= 2
##$BYTORDP= 1
##$COROFFS= 0
##$CY= 11.3945322036743
##$DATMOD= 1
##$DC= 2
##$DFILT= <>
##$DTYPP= 0
##$F1P= 16.9975609425685
##$F2P= -3.02152046262296
##$FCOR= 0.5
##$FTSIZE= 0
##$FT_mod= 4
##$GAMMA= 1
##$GB= 0.15
##$INTBC= 1
##$INTSCL= 1
##$ISEN= 128
##$LB= 0.24
##$LEV0= 0
##$LPBIN= 0
##$MAXI= 10000
##$MC2= 0
##$MEAN= 0
##$ME_mod= 0
##$MI= 1.114404
##$NCOEF= 0
##$NC_proc= 0
##$NLEV= 6
##$NOISF1= 3.799351
##$NOISF2= 2.8
##$NSP= 1
##$NTH_PI= 0
##$NZP= 0
##$OFFSET= 15.70392
##$PC= 1
##$PHC0= -9696.631
##$PHC1= 11.40082
##$PH_mod= 1
##$PKNL= yes
##$PPARMOD= 0
##$PSCAL= 0
##$PSIGN= 0
##$REVERSE= no
##$SF= 200.130013532006
##$SI= 16384
##$SIGF1= 3
##$SIGF2= 2
##$SINO= 400
##$SIOLD= 16384
##$SREGLST= <1H.CDCl3>
##$SSB= 0
##$STSI= 0
##$STSR= 0
##$SW_p= 3612.71676300578
##$SYMM= 0
##$S_DEV= 0
##$TDeff= 0
##$TDoff= 0
##$TI= <>
##$TILT= no
##$TM1= 0
##$TM2= 0
##$TOPLEV= 0
##$USERP1= <user>
##$USERP2= <user>
##$USERP3= <user>
##$USERP4= <user>
##$USERP5= <user>
##$WDW= 1
##$XDIM= 8192
##$YMAX_p= 0
##$YMIN_p= 0
$$ End of Bruker specific parameters
$$ ---------------------------------
##NTUPLES= NMR FID
##VAR_NAME=  TIME,          FID/REAL,        FID/IMAG
##SYMBOL=    X,             R,               I
##VAR_TYPE=  INDEPENDENT,   DEPENDENT,       DEPENDENT
##VAR_FORM=  AFFN,          ASDF,            ASDF
##VAR_DIM=   8192,          8192,            8192
##UNITS=     SECONDS,       ARBITRARY UNITS, ARBITRARY UNITS
##FACTOR=    0.0002004,     1,               1
##FIRST=     0,             0,               0
##LAST=      1.6414764,     0,               0
##MIN=       0,             -242737,         0
##MAX=       1.6414764,     240153,          0
$$ Real data points
##PAGE= N=1
##DATA TABLE= (X++(R..R)), XYDATA
0@%%%%%%%Qj6J6j6K4l2M0m8N6p2Q8j04J20j36J60j87K12k45K84l24L67m17M71
30B49n30N97o70P50q39R35j039J155j282J420j573J743j930K137k368K627k917
47a535L246l623M061m576N191n944O886q105R756j2130J5855k2587L8523j41086
61a16068j26669L24835J33533j48668j99819L7909J23272M6768m8555l1751j7667
72b2880Q367K6733K1611l9300m2220J8470N8403M899m3395l0682J7798L5622K4265
85C7691j8002m4947o843O6011M2809o7407r1256L5331J14214J6471j00214n7452
97g3594M4994M3691j1169P25K5722j8210n3687J853N7091K3164k2849o274K191
110A3648l5944k5260N3186N9833m0613q1029J0369P0192l06n9239K100O2365P730
$$ plain form
0 0 0 0 0 0 0 0 0 8 -8 8 -8 16 -16 24 -24 32 -40 48 -56 64 -72 88 -99 113 -132 152 -172 195 -222 249
30 249 -281 316 -354 396 -443 492 -547 608 -674 746 -827 916 -1014 1123 -1245 1382 -1535
47 -1535 1711 -1912 2149 -2427 2764 -3180 3706 -4399 5357 -6773 9082 -13505 25018 -116068
61 -116068 -242737 82098 215631 66963 -132856 -94947 28325 75093 26538 -5213 -22880
72 -22880 -14513 12220 33831 -5469 -47689 -29219 29184 34083 -9312 -39994 -22196 13426 37691
85 37691 19689 -25258 -32101 33910 76719 9312 -81944 -46613 67601 84072 -16142 -73594
97 -73594 -28600 15091 3922 4647 30369 12159 -41528 -39675 17416 40580 17731 11457 13648
110 13648 -22296 -47556 5630 65463 24850 -56179 -45810 24382 24076 -35163 -33063 29302 37032
123C7032o0983k3602N1629M5106k1661n1042j5704L7266M9636l410o9134n1658
135g6525M3727Q4250P869p0243m6416J7857L4065K7207K6910j1660o9986l8181
147g1126P0131Q2792l6854r4806M747Q4997Q137q2881k6918P3730M8196m9332
159A0813n8926J3998M7588J5875j4340j6881r352P113K2411O420k5267j8541J8530
172e59K1161j3489k2088M741J2944o283q854Q836J1291M6k749p810j8261K406
186a8668M5169L1975m4270p0071O464P1909L0666m1763m0569K056J2074O727J9866
199A1565J3644k7698l4605J8679M5737j422l9836n358L3963P783l1088j2494K5718
212D588J5350k1990k3748Q855K6602R635j8663k6108n1L3039K7001j6788l6020
$$ plain form
123 37032 -23951 -47553 4076 49182 27521 -23521 -39225 -1959 47677 44267 -24867 -76525
135 -76525 -32798 51452 59321 -10922 -57338 -39481 -5416 21791 48701 37041 -32945 -71126
147 -71126 -995 81797 44943 -49863 -45116 39881 48018 -34863 -61781 11949 60145 10813
159 10813 -48113 -34115 13473 29348 15008 -1873 -11225 -4112 18299 24719 -548 -19089 -559
172 -559 20602 7113 -14975 -10234 2710 -3573 -12427 -3591 7700 7746 4997 -2813 -21074 -18668
186 -18668 26501 58476 14206 -55865 -49401 22508 53174 11411 -29158 -27102 -15028 -8301 11565
199 11565 25209 -2489 -37094 -18415 27322 25900 -13936 -19294 14669 22452 -8636 -21130 4588
212 4588 19938 -2052 -25800 -16945 9657 19292 629 -25479 -25530 7509 34510 17722 -18298
225a8298j590K9813J0532j8275o401J4403j219k2437m649K1498R934j3426o867
238f982P351k984j0728J0977K4772j514k7157j0040J7978J3455n344n869j468
251B447r000p555J1955J6582p110k1718l844J5970J1062j564l480m662q608K73
265i252J7961J6044j0143k7746j3257J6428K8151P962k5490l3082J065L7272K3810
278B9723k2154l2511O001L0065N694j9620n249J5289L845j4435m430J2418L387
291H023j3056n080J1265M690j2018o988J1766J2260n851j3539k7J4278J0047o509
305I261j4154l169J1736R594o674j2583m98Q147l96p745J934J0913N28j3433o359
320a2898J2000J4737m74j2263q872K153R939Q072l143j2677q444M580R338K253
$$ plain form
225 -18298 -19888 9925 20457 2182 -4219 10184 8965 -13472 -18121 3377 13311 -115 -6982
238 -6982 369 -2615 -13343 -2366 22406 20892 -6265 -16305 1673 15128 9784 3915 2447
251 2447 -6553 -14108 -2153 14429 7319 -14399 -18243 -2273 8789 7225 3745 -917 -9525 -9252
265 -9252 8709 24753 14610 -13136 -26393 -9965 18186 26148 658 -32424 -31359 5913 29723
278 29723 7569 -24942 -18941 11124 16818 -2802 -8051 7238 11083 -3352 -7782 4636 8023
291 8023 -5033 -10113 1152 5842 -6176 -13164 -1398 10862 5011 -8528 -8555 5723 15770 9261
305 9261 -4893 -8062 3674 13268 6594 -5989 -6487 1660 1264 -6481 -4547 6366 6894 -6539 -12898
320 -12898 -898 13839 13365 1102 -7770 -5617 4322 12394 9251 -3426 -11870 -7290 2048 4301
334D301l952l856l941l066O010J4006M055j5259j5018Q213K2004N667j8075j6744
348a5655N123J6166M286j0581r330J702N658J494l91K059N3n108j701R347R379
363A2501o880j5122J069J8390P445j7803j7883Q865K2050J892k0812j2907J1912
376g283J8089O72j3217p060O445Q935J519l482k213q93k050n06M238L805m321
391B678r212k174P984O923l060p295j002N021L454m69k05J098j079l731j331M463
407B063N282k583j0457o262P581J2566n32j4923q953J0686J6017o33j4533o265
421a0946J0027J0317k936q748j431M538R24l339m54K829j426n931p57Q246N744
436F657o603r930L021J3974N342j0983j0802N253J2888J446j0584o511M448N313
$$ plain form
334 4301 349 -3507 -7448 -10514 -4504 9502 13557 -1702 -16720 -8507 13497 19164 1089 -15655
348 -15655 -10532 5634 9920 -661 -9991 -8289 -2631 -1137 -1528 531 584 -4524 -6225 3122 12501
363 12501 5621 -9501 -8432 9958 17403 -400 -18283 -9418 12632 14524 -6288 -19195 -7283
376 -7283 10806 11478 -1739 -8799 -2354 6581 8100 4618 2405 1512 -538 -1044 3194 6999 2678
391 2678 -6534 -8708 -724 6199 3139 -4156 -5158 -137 3317 2848 2643 3741 2662 -1069 -2400 2063
407 2063 7345 4762 -5695 -11957 -4376 8190 7658 -7265 -16218 -5532 10485 9852 -4681 -10946
421 -10946 -919 9398 6462 -2286 -3717 821 1745 -1594 -2048 781 -645 -6576 -7333 913 6657
436 6657 54 -9876 -6855 7119 12461 1478 -9324 -4071 8817 10263 -321 -6832 -2384 2929
450B929j911l408J560J596l814k962N768Q383k007j0717l434J0512J0620m301
464H814j3492m389R438R053l463j0297l842N095N361n49l147p15Q32k99M98L933
480B831L332l673p442N4R565N627q463j2248J127J2710N613r356j0643K139J0112
495A285M280m488m794P82L411J430k19M98L89k551l614J181N946J519p976p136
511a0057N586J1171o36j1882m184J0241Q590m767p679K117O252q41m988N83M654
526D160o4n470l322K714M613O47m501l909K793O641O36o704k613O963N659m696
542C547o591K239M780k597m139L844M418o167r084L232J1815L117r259q040K906
557e979R305N539m100r689l257R472J0145n283j4603k788J1796P399n820p051
$$ plain form
450 2929 1018 -2390 -830 766 -3048 -6010 -242 8141 6134 -4583 -8017 2495 13115 8814
464 8814 -4678 -9067 371 9424 5961 -4336 -8178 -3083 2278 1729 -1418 -2133 -1301 -1600 -1102 2831
480 2831 6163 2490 -4952 -4898 4667 10294 1831 -10417 -9290 3420 9033 -323 -10966 -8827 1285
495 1285 5565 1077 -3717 -2935 476 1906 1687 2185 2574 23 -3591 -2410 3536 5055 -2921 -10057
511 -10057 -4471 6700 6064 -5818 -10002 239 8829 4062 -3617 -1500 4752 3911 -1077 -494 4160
526 4160 4096 -1374 -4696 -1982 2631 3278 -1223 -5132 -2339 4302 4938 -1766 -4379 2584 8243 3547
542 3547 -3044 -805 3975 1378 -2761 1083 5501 -666 -9750 -6518 5297 8414 -845 -8885 -5979
557 -5979 3326 8865 4765 -4924 -8181 1291 11436 6153 -8450 -11238 558 7957 2137 -4914
571d914k11N56j51N979P425m692j2933j298J3596Q462p601j0221O57O961L181
586D796k939n770l006M971Q204j548j1373l439J1078P775o950o733O077N734o993
601a16o457P707Q891n845j0071J680O822j247m519K227L703k288l059J545J412
616C85q03K082L171k513m373K615L445n818m898R594J0214j0703j8688L216K0682
631G608O106j4569r807O354P416o73j666L63j955q81M564K223o659n612M690O310
647C812j146k693m84m823n470Q380J5833k508k0403n976J8343J1752j2360j1754
661i497Q867J0953o776j1520K076Q476J547k608j247k607k611L331N041j614k494
676f83M635K207q997o046J0348J0570p298j0797M650O999q278p920J1791J3065
$$ plain form
571 -4914 -5125 -4569 -4720 1259 8684 3992 -8941 -10239 3357 11819 4218 -6003 -5346 1615 4796
586 4796 1857 -3913 -6919 -1948 6256 4708 -6665 -10104 974 8749 1799 -4934 1143 6877 -116
601 -116 -6573 1134 10025 4180 -5891 -4211 2611 1364 -3155 -928 2775 487 -2572 -1027 385
616 385 -418 1664 4835 2322 -2051 564 4009 -1809 -6707 2887 13101 2398 -16290 -13074 7608
631 7608 13714 -855 -10662 -4308 3108 2435 769 1132 -823 -1704 2860 5083 -1576 -7188 -2498 3812
647 3812 2666 -27 -511 -5334 -10804 -2424 13409 10901 -9502 -15478 2865 14617 2257 -9497
661 -9497 -630 10323 3547 -7973 -5897 2579 4126 1518 271 -2336 -4947 -1616 3425 1811 -683
676 -683 3952 6159 -2838 -8884 1464 12034 4736 -6061 -1411 5588 -2690 -10610 1181 14246
690A4246j0250j7536M323J6983J272j2534l104R117N260m011o726m674K205J1661
704F232Q020j1349j8415J810J8674N883j1859n355P129L60p869L076J1792j861
718F268j3132R42J4104j23j6524m599J5349J0611q135j2111k522M442O864O122
732G556k228j0062k620R304L673q823k120J2523M571j4880r844J1729J1135q273
746A641r137P831P787q944r672O997J0359k041n510J868J068n427j201P064L998
761F681l364k475j393n522j366J1202Q343j0833j3456P153J4401m901j4339M085
775e784J6209J48j4738m687Q229L797k512K141K586o902q001M101R016Q03l824
790E82q40j651l585L216Q177j412r421J297J1449r62j4926l087J5154P848j0884
$$ plain form
690 14246 3996 -13540 -9217 7766 9038 -3496 -6600 2517 7777 3766 -2960 -7634 -5429 6232
704 6232 14252 2903 -15512 -13702 4972 10855 -1004 -6359 770 1130 -6739 -3663 8129 6268
718 6268 -6864 -5922 8182 8059 -8465 -13064 2285 12896 4761 -7350 -9872 -5430 1434 7556
732 7556 5328 -4734 -7354 1950 5623 -3200 -5320 7203 11774 -3106 -12950 -1221 9914 1641
746 1641 -7496 335 8122 -822 -10494 -3497 6862 4821 -689 1179 2247 -3180 -4381 2683 6681
761 6681 3317 842 -551 -6073 -7439 3763 12106 1273 -12183 -5030 9371 4470 -9869 -5784
775 -5784 10425 10573 -4165 -8852 -623 3174 662 2803 5389 -1513 -9514 -5413 3603 4406 582
790 582 -258 -1909 -5494 -2278 5899 4487 -4934 -3637 7812 6850 -8076 -11163 3991 11839 955
805I55q861N474M652n178j495P949L421o663m838K228J677N83M994K943p686q261
821h106M610Q699k130o099K990M387n679n571O212O526n614n448P550O847q789
836C85j0889N714J3316J227r324o099L68L256N402K747o226p778M296J0245k236
851D404j1667k42J2183M286q597n224L393Q55k430M812P201n731j3435m48J3190
866B550O279p184o768J512L180Q85P04m64k552R11N045m05p793k082Q380M463
882F661p034n117N575L956o205m298O707O292m372o048J931L649j437j020L637
897B877J489m179l257J477J867P63J909j68n381l153N761N747m579o470M439P876
913G018l450r558Q36R646K718o665m233K212J787o56J022J440k349l109J265L492
$$ plain form
805 955 -7906 -2432 2220 -2958 -4453 3496 6917 254 -4584 -2356 -679 -96 4898 7841 155 -8106
821 -8106 -3496 5203 3073 -3026 -36 4351 -1328 -6899 -687 5839 225 -5223 2327 9174 385
836 385 -10504 -4790 8526 9753 429 -5670 -5302 -2046 3356 6103 -123 -7901 -3605 6640 4404
851 4404 -7263 -7505 4678 8964 367 -4857 -1464 -609 -3039 1773 8974 3243 -10192 -10640 2550
866 2550 8829 1645 -5123 -3611 -431 454 1158 694 -1858 -947 4098 3693 -4100 -6182 2198 6661
882 6661 -373 -5490 85 4041 -2164 -6462 245 6537 2165 -3883 -1952 1697 260 -760 2877
897 2877 4366 187 -3070 -1593 274 1037 2946 2778 -2603 -5756 5 5752 1173 -5297 -858 7018
913 7018 3568 -5990 -5154 4492 7210 545 -3688 -1476 311 -345 677 2117 -232 -3341 -2076 1416
929A416N38j870j656p28J899M747R44p762o804O634J2357j096j3922o067R320
944b050Q897l132o654j89K715p9l19J982Q36k124j275J308J175l96m83n94o96
961a078J008K136j227m074l7N184K014m740l163M047L933l111m126K578M740j336
977B748m871n38L831J506k578k333J059K577N91k884k883J915N440J163n791m455
993e503L969O183j021n534p00L786K17l522R9M198M85m932k630L932M692j169
1009B550m819j651L357L799n19l750j725K221K332r42j770P42J002k069j941K833
1025c50M049j658n662p92N746L693l498m901J116M693J046l638k451K047L005
1040B445o28l228r53K611J887j723k328J317K707p45l179K99M118J398m343l777
$$ plain form
929 1416 1954 84 -1572 -2300 -401 4346 5290 -2472 -9276 -2642 9715 8619 -5303 -11370 -2050
944 -2050 6847 3715 -2939 -3128 -413 -492 -811 1171 2007 -117 -1392 -84 1091 695 212 -382 -1078
961 -1078 -70 2066 839 -3235 -3272 1912 3926 -814 -3977 70 4003 892 -3234 -656 4084 2748
977 2748 -2123 -2661 1170 2676 98 -2235 -1176 1401 1992 -892 -3775 -1860 3580 4743 -1048 -5503
993 -5503 -1534 4649 3628 -1906 -2606 1180 1397 -2125 -2026 2172 2657 -2275 -4905 -973 3719 2550
1009 2550 -2269 -3920 -563 3236 2717 -1033 -2758 -537 1795 853 -917 -175 827 -1242 -3183 -350
1025 -350 3699 2041 -3621 -4413 1333 5026 1528 -3373 -2257 2436 3482 -156 -2607 -560 2445
1040 2445 1817 -1411 -2364 247 2134 411 -1917 -600 2107 1362 -1817 -1518 2600 3998 -345 -4122
1056d122K879N587L3n953l673L412N501K64m752l273J855L779J101j554j547o87
1072a150k97J075K775J064l425m428J079N949K335n037n370J990O100J278m902
1087i64l323L100M444j034m545o85M386K460l531m095J650M775M12m408k435K918
1103h75L091j164k737K29K158K60j534j56J679N16j767j132J615J893j176k808
1119a908O4L136J318l140l102K179M671R0n000k637L789M773q92m831j921K948
1135d63L046n29k288r18K48J5M90J803P87k608l369J055N331K646m490n965J221
1152c988P076L147n309o177J438O404K082m603m215J676M147O49k785j517J364
1167f11J416m11o17O81K62j231n52J755J485j877k801Q04L589Q66l519k800K244
$$ plain form
1056 -4122 -1243 4344 4377 -1576 -5249 -1837 3664 3928 -824 -4097 -2242 1537 2638 1084 -463 -1150
1072 -1150 -1447 -372 2403 3467 42 -4386 -3307 2642 4977 -60 -5430 -3440 2660 3938 -964
1087 -964 -4287 -1187 3257 2223 -2322 -3007 1379 3839 308 -3787 -2137 2638 3050 -1358 -3793 -875
1103 -875 2216 1052 -1685 -1456 702 962 -572 -728 951 1467 -300 -1432 183 2076 900 -1908
1119 -1908 -1844 1292 2610 -530 -3632 -1453 3218 3308 -1692 -4329 -540 4233 3341 -1490 -3411 -463
1135 -463 2583 2054 -234 -1152 -904 -889 -399 1404 2191 -417 -3786 -2731 2600 5246 756 -5209 -3988
1152 -3988 3088 6235 926 -5251 -3813 2591 4673 70 -4145 -2469 1678 2327 -458 -1975 -611
1167 -611 805 394 -223 458 720 -511 -1063 692 2177 300 -2501 -1697 1892 2758 -761 -3561 -1317
1184a317M025m7l890j754K950L138j361l648j10L749J648l413l303K092M257l13
1200B703m261j611K985K554j269k238K79J359M8n90M66P19q82j586K56K281J390
1217B603k148l566%M374K984l205n215L85N487K399l754l517J709L185l24k144
1233g47q7J181l00q54O48R79q52j673N0K000J582q97k873j347K795L898o95m975
1251b167j777M406L603k965m422J367M206j67l583n80K610O56j876k49J915N84
1267A561j790j475Q36K182J317j286l153j004L182K937k018l766Q08L542m94l416
1283b037L55L773J07l761n22L633R68l596j527L314K471k190l142p9K111J772
1299A650lj984j948J097K860l30l210J16M124O55m832k091M573L280l472l652
$$ plain form
1184 -1317 2708 2661 -1229 -2983 -33 3105 1744 -1904 -2014 1735 3383 -30 -3333 -1241 3016 2703
1200 2703 -1558 -3169 -184 2370 1101 -1137 -858 501 549 -41 425 1144 262 -1324 -1068 1213 2603
1217 2603 455 -3111 -3111 1263 4247 1042 -4173 -3788 1699 4098 344 -3173 -1464 1721 1397 -747
1233 -747 -834 347 47 -807 -159 820 -32 -1705 -1655 345 1927 1030 -1843 -3190 -395 3503 2808 -2167
1251 -2167 -3944 462 4065 1100 -3322 -1955 2251 2084 -1499 -2079 531 1187 -689 -938 977 1561
1267 1561 -229 -1704 -868 1314 2631 1345 -1808 -2812 370 3307 1289 -2477 -1669 1873 1379 -2037
1283 -2037 -1682 2091 2198 -1563 -2085 1548 2516 -1080 -2607 707 3178 988 -2154 -2233 -122 1650
1299 1650 1647 -337 -2285 -1188 1672 1342 -1868 -1752 2372 3027 -1805 -3896 677 3957 485 -3167
1315c167K574L265k212l352J448L302j98k125m33M43j99M76J374j3j080j56j36
1332a89j438M97L793J048n188l680M691N600l328o597J691P006N34o220k495L668
1348f07L087o45j056o45j700p00K439K304j109k159l47J42MJ734J517k503l141
1365c385K813N059k299p203L01Q302K912o835n107L382M331r50k015Q93L20j734
1381a215k20J714J65r66R99J102j923j731J848J725j807q33L004O06m925k143
1397d600N393M022m299m623L188M441k752m592K100M956K9l728j711O24J089K000
1413A537J384k311l434J180L569p46l309J182L798j118m130O63L610j050l146
1428b321K542M555k952o958O93P375K494m988l726J508K206M59K1p06j655O62
$$ plain form
1315 -3167 -593 2672 460 -2892 -1444 1858 1660 -465 -898 -455 -654 -178 1196 1183 103 -53 -189
1332 -189 -1627 -1130 2663 3711 -1477 -5157 -466 5134 1806 -4791 -3100 3906 4440 -1780 -4275 -607
1348 -607 2480 1835 779 134 -1566 -2266 173 2477 1368 -791 -1138 -996 -992 742 2259 -244 -3385
1365 -3385 -572 4487 2188 -5015 -4714 3588 6500 -335 -5442 -2060 2271 1321 -694 199 519 -1215
1381 -1215 -1435 279 444 -522 477 1579 -344 -2075 -227 1498 -309 -1142 1862 2468 -2457 -4600
1397 -4600 793 4815 516 -4107 -919 3522 770 -3822 -1722 3234 3263 -465 -2176 -1552 -463 1537
1413 1537 2921 610 -2824 -1644 1925 1179 -2130 -948 2850 1732 -2398 -1735 1875 825 -2321
1428 -2321 221 4776 1824 -5134 -4441 2934 5428 440 -3286 -1778 428 887 908 202 -1453 -791
1444g91L125k32m538j132M794K840l400k853J900Q90k658M73M800N59n873k787
1460d883M614L638k664k647K023J686j979j458J318P49k95J087N89k926k308K995
1476d61L459k224l185K249K954l068l906L107N200j495m889J30L319m20k331J320
1492b41K561j246k707L24J464k54q9J412l20k090J90K053q44k477K086M264j756
1509B330o153l56N945K148m067k077K626P56k806k49L253Q37k707j009J766L66
1525F03j377L10J230m18m68J041n37k881J06M540J776m464l385L002L316k019
1541C75k335K427K215k768k786K075K898j018k035P04J144q85q99N41K28R6J372
1558A349N15k928k437K904M137j354m128K90L144n07k754J127L169j012l582L49
$$ plain form
1444 -791 2334 2102 -2436 -3568 1226 4066 666 -2187 -287 603 -2055 -1582 3218 3777 -2096 -4883
1460 -4883 -269 3369 705 -1942 81 1767 -212 -1670 -352 397 102 1189 1778 -1148 -3456 -461
1476 -461 2998 774 -2411 -162 2792 -276 -4182 -1075 4125 2630 -2259 -2129 1190 770 -1561 -241
1492 -241 2320 1074 -1633 -1309 155 -99 -188 1224 904 -1186 -996 1057 213 -2264 -178 4086 2330
1509 2330 -3823 -4179 1766 3914 -153 -2230 396 1152 -1654 -1903 1350 2187 -520 -1529 237 603
1525 603 -774 -464 766 348 -120 921 384 -2497 -2391 2149 3925 -539 -3924 -922 2394 375
1541 375 -1960 467 2682 -86 -2872 -797 2101 1083 -952 -248 896 11 -888 -347 -119 -23 1349
1558 1349 1864 -1064 -3501 -597 3540 2186 -1942 -1652 1492 985 -1769 -642 2527 1515 -2067 -1718
1574a718L316J0k975l29K731J018j774j571l8Q47J686J099j736k837N57L184K29
1591A699k834k51K959J36l576q67L657J765k794j961J937J542j690j189J605J326
1607A464j101j142L32L88j32L03K43n74j56R29k71j943J17L273J159l586k769
1624c466K800L579j391l466L59K891K38k146o95J095N83m2J56k06j054l08J015
1641e8R32m2l12p43j243K15K636J333k885k989J902M007n08m193r48L433K131
1658B668j978k341L95J574L81k35j43m75l91K16M94J70J4r9p01m83R77J131q32
1677C42j839N77K487O9k844j007K684J957j794k466P11K287J41j789p25J086J121
1694I98k39j244p11Q68J425L7j604o57J189R89q14q55P36O79r78p99J297J128
$$ plain form
1574 -1718 1598 1608 -1367 -1696 1035 2053 279 -1292 -1330 -483 1203 2302 566 -2271 -1714 1470 1699
1591 1699 -1135 -1386 1573 1709 -1867 -2734 923 2688 -106 -2067 -130 1412 -278 -1467 138 1464
1607 1464 363 -779 -447 -59 -191 112 355 -219 -375 554 283 -1660 -1543 1730 2889 -697 -3466
1624 -3466 -666 2913 1522 -1944 -1585 1306 1544 -602 -1297 -202 381 339 495 289 -765 -1073 -58
1641 -58 874 832 520 -223 -1466 -1251 1385 2718 -167 -3156 -1254 2753 2245 -1948 -2896 537 2668
1658 2668 690 -1651 -1256 318 699 464 321 -154 -545 -329 165 335 349 250 -451 -934 43 1174 342
1677 342 -1497 -920 1567 1636 -1208 -2215 469 2426 632 -1834 -1123 1164 1305 -484 -1209 -123 998
1694 998 759 -485 -1196 -328 1097 1134 -470 -1127 62 1051 237 -618 118 797 -181 -980 317 1445
1712A445j417j814J008K470L4k652j411J929K515l22k507j441J515K344Qk213
1728e09j267J365J701m60j539l5J008J2p11L49Q91n32j481K72J947O81j867j729
1746a904J058K203K01j999j326J103J812k4j719q13J237J277o28j401K24J315
1762F16J23j286l50J291O64j240j077Q34J495l27j490l79J222Q88p40j082K88
1779e50J170J38j128n46J132R32q59j489M61J808K46j890j051J440J725o56j944
1796a061k35J689R20j063j133M47J144j62r45r7R95K00j068n58J064J107p74j700
1814a230J02J908P84j520j571Q22J820Q3j625o70J097R71p63r55M36R83k54j131
1832g13p9J287O30j230j242P03J775J99j819j105J257J729l49j759m93J296R05
$$ plain form
1712 1445 28 -1786 -778 1692 1726 -926 -2337 -408 2107 1785 -722 -2163 -648 1696 1704 -509
1728 -509 -1776 -411 1290 830 -709 -744 264 276 -435 -86 805 273 -1208 -936 1011 1692 -175 -1904
1746 -1904 -846 1357 1558 -441 -1767 -664 1148 1124 -595 -1408 -171 1106 478 -923 -699 616
1762 616 739 -547 -897 394 1058 -182 -1259 -425 1070 743 -747 -1126 96 984 244 -838 -550
1779 -550 620 758 -370 -916 216 1148 289 -1200 -739 1069 1315 -575 -1626 -186 1539 883 -1061
1796 -1061 -1296 393 1313 250 -883 -436 708 546 -399 -496 499 699 -369 -927 137 1244 470 -1230
1814 -1230 -1128 780 1564 44 -1527 -705 1115 1198 -427 -1097 0 971 208 -747 -311 672 418 -713
1832 -713 -792 495 1125 -105 -1347 -644 1131 1330 -489 -1594 -337 1392 1043 -716 -1209 87 992
1849I92p29q94L18O88k05o26K82Q51k63j208q9J404R63j226j721M12K041P27j720
1868cj681P86J996K86j789j041J179J400n06j430O6J221K68j093m10R91O13r74
1886a21q74P05J186k93j342k40J161P06q59r41M60J180k2j292n52J214J243p55
1904E64j778j1J844Q68j522j485Q93J767j55j657m65J186Q13n50o87J61L50j71
1922c5j74L60M80l69q66k07J042J009p15j691j52J994J254j675k264P60K788N69
1940B108k405j621J257J824r5j219m44M17K50p9J44J71k00m08o8M54M92j99r18
1959e39l81J171J223q94k091J00K366R43j942j709J233J820n82j737J84J564L36
1976A065j239q16N93R30J96n98n72M6O55R5o62j83Q77M40j131q21J067J146r76
$$ plain form
1849 992 263 -631 -313 375 170 -456 -174 677 414 -794 -883 521 1484 258 -1463 -1051 990 1717 -3
1868 -3 -1684 -898 1098 1384 -405 -1446 -267 1133 627 -803 -737 484 752 -341 -751 240 853 -121
1886 -121 -995 -290 896 603 -739 -979 182 888 29 -912 -452 728 706 -586 -1138 76 1319 564
1904 564 -1214 -1225 619 1487 -35 -1520 -627 1140 985 -672 -1137 49 862 312 -375 -214 136 -35
1922 -35 -209 151 631 262 -604 -811 231 1240 525 -1166 -1318 676 1930 255 -2009 -1249 1539 2108
1940 2108 -297 -1918 -661 1163 1068 -151 -595 -178 72 -7 137 308 108 -300 -368 86 578 379 -539
1959 -539 -920 251 1474 580 -1511 -1411 955 1898 -44 -1753 -520 1300 718 -1019 -835 729 1065
1976 1065 -174 -990 -397 533 729 131 -441 -395 260 355 -307 -490 387 827 -304 -1125 -58 1088 112
1995A12j264R61J642q34k209J99K443P86j856j528P34J448K18q32o45J24Q07M49
2013G55q28r67N14J444n3j349k03R84p7j069M90J760k50k476p12K432J542j512
2031D25j796O05J532o9j083l35N40O82K90n73j115o6J357P24j098p71R19N37j340
2050f35o83J769J392j579j977R38J930l91j621K55J489j22j284m02Q27N69o7j24
2068B84m26l76L64N24m74m69J070R19j449j929J060K610j34k420m51J858M32j702
2086g09l20J648O56j369q79P26O02k63q7L41j57k26J46k88o01N60J581j45k148
2105i32p36J911J096j458q56J477P83j777j272J639J687r39j492L82R60l18o81
2122e26K15N32J50J02l18j117l83J670J417j226j867N44J620n42j316R71J550
$$ plain form
1995 112 -1152 -191 1451 617 -1592 -1393 1050 1836 -20 -1548 -814 634 852 20 -625 -501 306 755
2013 755 -73 -1040 -526 918 865 -484 -687 297 220 -849 -359 1401 1151 -1325 -2037 395 1937 425
2031 425 -1371 -766 766 697 -386 -721 -181 501 791 218 -897 -963 394 1118 20 -751 168 705 -635
2050 -635 -1318 451 1843 264 -1713 -775 1155 764 -857 -602 887 765 -519 -921 -94 475 408 284
2068 284 -142 -518 -154 370 -104 -573 497 1416 -33 -1962 -902 1708 1574 -846 -1297 561 993 -709
2086 -709 -1029 619 1275 -94 -973 -247 355 92 5 346 189 -37 109 -179 -780 -220 1361 1216 -932
2105 -932 -1668 243 1339 -119 -975 502 1285 -492 -1764 -125 1562 623 -869 -487 473 155 -526
2122 -526 -311 221 371 473 155 -962 -1345 325 1742 516 -1351 -807 813 271 -1045 -74 1476
2139A476j040j965O28J982k63j789J73J749J04j622p89Q99J065M19l20j178j029
2156a500Q90J812q8j777k29J620O0j791j39J983N14j778o56J481L72j577l15J882
2174G64Q33j554j362O77R77J73j54j84n02j35O68J94j033m0J660N39k158j391
2192b028J809J910j021j785O86J425q02j334O79J394k88j066J39N35m06m36O41
2209E2O45k57m09k65n23R0J448R09j613j897J104K287m94k381R4K338M19k052
2227e05r52J284R64n09k59L58l73q02K78J067K39n87l79k06j13N25P93m93j269
2246i39L45J715j33k175n16K332J355j734j814R15J405l72q32M08O22n68o01K71
2264c16M11k0J45R3n16l98N95M69o35m01R64N99j303j106J251J538q53j638N28
$$ plain form
2139 1476 436 -1529 -901 1081 818 -971 -798 951 1055 -567 -1356 -457 608 1027 707 -471 -1500
2156 -1500 -610 1202 1114 -663 -892 728 788 -1003 -1142 841 1355 -423 -1079 402 774 -803 -1118 764
2174 764 1597 43 -1319 -642 335 508 354 170 -332 -467 201 395 -638 -678 982 1521 -637 -2028
2192 -2028 -219 1691 670 -1115 -429 996 194 -1140 -461 933 645 -421 -282 253 -153 -589 52
2209 52 697 440 31 -234 -757 -667 781 1690 77 -1820 -716 1571 1077 -1304 -1210 1128 1547 -505
2227 -505 -1457 -173 791 282 23 381 8 -794 -516 551 790 203 -176 -382 -495 30 823 330 -939
2246 -939 -594 1121 988 -1187 -1703 629 1984 250 -1564 -649 756 384 -448 -40 582 14 -587 -316
2264 -316 95 75 220 313 -203 -601 -6 463 -172 -573 391 990 -313 -1419 -168 1370 517 -1121 -593
2283e93J577l74j602N6J530N32j070q16J95N67L85O5m41n44L53O13l12p17M00
2302a96R81m14j170K41J229k02j279J50J665P9j822o95J517J245p90j225O0P04
2320G8K86j56l11k09K70M98k08p49J2Q75K42q62l03R34K70j171m43J331Q95j121
2340A58j308N76J291o8r38j73N98J84l06k07N5K06L11j82n21l1O28K22p57l81
2360f43Q77O91r71j099P06J458k12j463k68J125N50p76n87N17N45k04m96r6L14
2379c2L10j31l57p3M35K75n83n03N71Q62m32j084R6J102K81j017m37Q60N61p36
2399c2p16N03Q64j24q41k87N71O25j88p01k61N92O30l51q47kQ45L14o71m78N65
2420A0M24n03m37N22N83n19q06K76J016J19r26o03O14R30q7r53n08O87R60j66
$$ plain form
2283 -593 984 610 -992 -936 594 1126 56 -760 -565 2 387 452 11 -533 -180 433 121 -596 -196
2302 -196 785 371 -799 -558 671 469 -810 -660 1005 1084 -738 -1433 84 1329 539 -686 -626 78
2320 78 364 208 -103 -312 -42 456 248 -501 -489 386 628 -234 -537 397 667 -504 -947 384 1279 158
2340 158 -1150 -574 717 649 -289 -462 136 320 14 -193 -138 68 379 197 -324 -355 273 495 -262 -643
2360 -643 234 925 -46 -1145 -439 1019 807 -656 -924 201 751 -25 -612 -95 450 246 -250 -346 -32
2379 -32 278 147 -210 -283 152 427 -156 -659 -88 774 342 -742 -646 456 737 -280 -717 143 704 -32
2399 -32 -748 -245 619 495 -346 -633 -62 563 375 -326 -587 5 635 284 -563 -565 280 594 -77 -555 10
2420 10 434 -69 -506 16 599 80 -726 -450 566 685 -241 -844 -230 700 613 -340 -848 -161 799 633
2440F33j102l99Q93P05m30p57J27N58Km63J36M59j52o37L6P97K65p51o52M61R26
2461F55L1r59n26O01R45j51j014l46Q49O83n13q47J82Q87R9p96l93O24N38m02
2481A47n28J47N07j6m49n6L64J75l96l02L75M99j99p17r8P81N27o63q95L12J076
2502E91J98j002p17O94R99k15r62k58P18M99l54n28P6L93M7k73K0K86k0m98p5
2523c81N61M52n17q41J98J019L66r26q74N51J091L0j022n30O85O87k15o98k1M77
2543I2K11l83k09K72K62k45l20J82M67r2n61j55O03M77m78p02J89Q17J39p51m87
2564f72O45O56l53p83R4P05K95o58m64L90O17j13o34j51N31L68l56n56J71N70
2584C02N9m75k41M19L19l85m39M04N73k67p82lQ30L78o80o48L16P54M5o72l27
$$ plain form
2440 633 -469 -868 25 730 300 -457 -330 228 230 -233 -97 362 210 -427 -391 406 671 -80 -732 -271 655
2461 655 686 -273 -799 -198 747 596 -418 -764 85 768 255 -592 -410 477 576 -220 -613 11 549 147
2481 147 -381 -234 273 257 -192 -248 116 291 -105 -407 -32 467 268 -449 -547 234 761 98 -797 -485 591
2502 591 789 -213 -930 -236 763 548 -414 -672 46 545 191 -337 -261 132 179 -94 -74 212 192 -306 -381
2523 -381 180 632 115 -726 -528 491 857 -69 -943 -392 699 729 -293 -823 -138 549 334 -364 -385 92
2543 92 303 -80 -289 -17 245 0 -320 -138 329 237 -324 -479 124 601 123 -579 -390 427 566 -185 -672
2564 -672 -27 629 276 -507 -413 292 587 -71 -535 -145 472 359 -275 -426 105 473 117 -439 -268 302
2584 302 361 -114 -355 64 383 -2 -441 -37 536 269 -513 -516 314 692 12 -636 -320 434 479 -193 -520
2605e20M33N23j76n33n9M26K38l37l54L56M02k57o42J45Q21J34q72m59O90O77
2625F36l20p99P3O91J72n40l40L06M34o5l39j49K33K27j91l11K14M48r4o89j71
2646e74P90N28o91q10M08Q83m8q73k32P45M24m79n03J64L60Q9k07p7O0J85j56
2667a4k69R0M42J50n29m85M10P57k34q04J9Q82J77q87m69P75P08m92p14J39N88
2688B40P6m13j34K47K56m6l62k48K46N34j4n52k11M59K48m51k16N82L62p34o25
2709g56O32Q09l76q62J82Q19P4p86l29M40N94L2m28n20rO36M41m16o31K26N97
2730C69k02n90K52O71k31p03J29P23j15q51Q0R60K64q85o62M84P18M2l61l73k2
2751c03L04L55k45m65J45O90n3q57k07Q24M58o63m41N71L27o79l63P13O17n39
$$ plain form
2605 -520 -87 436 260 -273 -332 94 332 -5 -359 -3 399 142 -500 -355 466 600 -272 -731 -41 636
2625 636 316 -483 -410 281 453 -87 -427 -121 313 248 -91 -240 -7 220 29 -282 -68 380 286 -403 -574
2646 -574 216 744 53 -757 -349 534 486 -387 -619 126 550 71 -432 -268 92 181 -26 -103 -43 142 -14
2667 -14 -283 -193 249 399 -130 -615 -205 552 318 -486 -467 415 592 -295 -764 11 719 227 -487 -348 240
2688 240 316 -97 -231 16 272 226 -136 -384 -138 396 382 -170 -381 78 326 -125 -341 241 603 -131 -756
2709 -756 -124 685 309 -553 -371 448 522 -264 -593 -153 441 473 45 -475 -484 152 593 177 -454 -228 369
2730 369 167 -423 -171 500 269 -434 -305 418 303 -548 -468 492 756 -129 -791 -307 411 453 92 -281 -303
2751 -303 1 356 111 -354 -209 481 428 -429 -636 188 646 -17 -458 113 440 -239 -602 111 728 189
2771A89p19J90N77q1l43J01K52j7j18k38k21K29O59J68q92n74P20Q42n50q50M37
2792b39Q92l22r76J02Q69J32n79o3L47j08m55J41N56R8l28k72j06R8M35K94m58
2813E8o15L93P89l42r97J62J217K36j189n64P65N59l82l03M02J21n61k26M56L74
2833C53j26k17o7r8J9K76J6l62K2O12Qr33l50J064P32p79q78M57P38m20o04M29
2855a08P46k83p72l6N19J51j10p6J3j40O0J31k06j36M77M08o45p02M11Q93k39
2876C56q04K33Q25k64j014N3J069K83p63m67M05K54j93n0K04j8q3qj08k62K82
2897g0N15j15o92o0P13J9p44l8R58K52j006o23P95P25l62o30K27L39k08k81K00
2918h6K53o8n3p4j50m6L30J71l63j89M99J75p49l73Q29Q09o17j044K56R30k8o81
$$ plain form
2771 189 -530 -340 237 156 -187 -86 166 149 31 -207 -428 -199 460 628 -264 -838 -118 724 174 -676 -239
2792 -239 653 331 -645 -543 326 458 -121 -184 163 55 -400 -259 297 395 67 -205 -311 -213 222 516 58
2813 58 -557 -164 625 283 -714 -552 665 901 -288 -852 -87 472 90 -213 189 310 -251 -477 -21 353
2833 353 227 10 -57 -155 -136 140 156 -206 -184 428 436 -497 -847 217 949 170 -708 -251 487 67 -537 -108
2855 -108 638 355 -417 -453 66 217 107 31 44 -96 -36 95 -111 -247 230 638 -7 -709 -298 595 356
2876 356 -448 -215 610 346 -668 -615 454 737 -26 -493 -88 166 -27 -77 127 109 26 18 -90 -352 -70
2897 -70 445 330 -362 -422 291 310 -434 -472 486 738 -268 -891 -96 629 267 -363 -136 203 -5 -286 -86
2918 -86 167 99 46 -28 -178 -224 106 277 -86 -275 224 399 -350 -723 106 915 298 -746 -490 440 412 -269
2940b69k2N95Lm52j72K83J43m5L4n2j33oJ52j24r9L29K96n13o54L92R26q4r25
2963c97j17Q08J97p28l43P11M33m38n13J78K97Lm1j4l8mJ04q0k71J39M83m9n91
2986b71j11N47K25n36k56O82L19p37n26N28P54k15p24m8N30J46k69k43M4K68J62
3007B69r8m29j12M59L40l58l96K04L81k88l44L70M66l60o25K49O62j0p28j12O05
3028A45L13m00m85J26L87K66j61m21j59L68L80k17m70J82M18q7m83O5N10M5n37
3049b15j28M74K24n06k76M42M50k78n08K5L77J83j49l06k7K88K15k56l63J60M91
3070C17N4o12k32M98M29m04m35K34M49j44m34N0M30L8l53j24K71J49j91k04J06
3091a08K57J19k90l44J71N14J11n57l64M35N12j94o28Q0M99J62m79k08L39K31
$$ plain form
2940 -269 -291 304 307 -145 -317 -34 109 64 98 46 -87 -93 59 -65 -164 165 461 -52 -706 -314 612 528 -397
2963 -397 -514 294 491 -237 -580 131 564 126 -387 -209 88 91 50 36 -2 -6 98 18 -253 -114 369 320 -271
2986 -271 -382 165 390 -146 -402 280 599 -138 -664 -136 618 403 -321 -369 161 307 38 -205 -161 107 269
3007 269 171 -258 -370 89 429 71 -325 -121 260 -28 -372 -2 464 104 -521 -272 390 380 -348 -460 145
3028 145 458 58 -427 -301 86 352 191 -230 -389 -21 359 142 -328 -146 272 185 -298 -233 277 322 -215
3049 -215 -343 131 355 -151 -427 15 465 187 -321 -296 81 264 115 -191 -218 70 285 29 -334 -174 317
3070 317 371 -241 -473 25 454 50 -385 -151 298 154 -280 -230 200 238 -115 -239 32 181 -10 -214 -108
3091 -108 149 268 -22 -366 -195 319 430 -127 -491 -56 456 262 -366 -286 213 375 -104 -312 27 258
3111B58k07k29J48K41p8l15NK70J63j89l53NM56J72l50l96K55N00o2n03j69M81
3133A03K43l24l48K27L35q6l60RL41R1l12j91K04L06q4l46j05L33K73k21l87Q8
3155b11M45N7m04k29L25L25k20m23J52M12J8m03j56L66K90k44l66P4L68O6l10
3176f8k05K03L06o8l60l0L43J60k95l15K35M36j36m89j0M40K17l85l11J98L73
3197B39l8l45r1K65J59j83k15J10K89o2l05n7L16K21l13l30J55M83%m77k01M07
3219B7L96k44m29l0M53J40l45j83J59K22k6k32l4K14L9j89j30K35K52j98l80Q2
3241b01M29Q1l99l19L24M49j14n09p1M22K62l01l29J36L35Nk93j09K53J59j75
3262C5k26O1K82J3k98j23K92K26k48l01J51L89l2m30j13L74K80k72l99J23M30
$$ plain form
3111 258 51 -178 -30 211 133 -182 -177 93 256 67 -286 -281 175 347 -3 -399 -144 356 294 -209 -378 103
3133 103 346 22 -326 -99 236 150 -210 -201 140 231 -81 -272 -68 238 154 -192 -297 36 309 88 -299 -211
3155 -211 234 291 -113 -342 -17 308 88 -335 -183 229 247 -156 -312 54 344 100 -266 -192 176 242 -68
3176 -68 -273 -70 236 168 -192 -222 121 281 -14 -329 -94 342 206 -283 -293 147 364 -21 -332 -134 239
3197 239 201 -144 -235 30 189 6 -209 -99 190 128 -177 -234 82 303 -10 -340 -185 298 298 -179 -380 27
3219 27 423 179 -250 -280 173 313 -32 -215 -56 166 140 -92 -126 88 127 -62 -192 43 295 97 -283 -201
3241 -201 228 309 -90 -409 -85 364 250 -259 -330 92 354 53 -276 -140 195 200 -93 -202 51 210 35
3262 35 -191 -130 152 165 -133 -256 36 262 14 -287 -136 253 221 -209 -322 52 332 60 -339 -216 214
3283B14O4l90k08K61L51j12l25r7K83K25j84k92Q2K86jk79l5K91P0k92j90K86
3305HK93j78m05N9M56J11m40l19K58M62l7m25j88K85L26j27l06p3K99J54k36k24
3327b47J90K43j18k55M6L23o2l49l7M21J75l22l73K01L98L5l69j57K22K57p5l10
3349a63o9L21J93k07l37P9L87ll03j36L30J88l00l13K41L57q9l93L6K98R6l11
3371i8j02K34K15j55k80o6K64K12r9l62ML25J72l06l04K94L78j48m54J9L72J06
3393B21l06j23K99R0k59j65K07K71p0k31j26J77J89m1k28j00K41K34k23l62R5
3414b10M45R1m44k31L55K74k83k78L19K52k34l52J27L52K0k26j44J43J26j3j55
3435f6j48J82K82n9m12j24L82K92l10k97K21L05j88l96J79M42p1m30m8L38J41
$$ plain form
3283 214 278 -112 -320 -59 292 180 -145 -242 41 266 82 -210 -128 158 157 -122 -157 134 204 -88 -278 8
3305 8 301 123 -282 -223 233 344 -96 -415 -157 305 268 -157 -345 -60 266 139 -167 -240 59 213 -23 -247
3327 -247 -57 186 68 -187 -141 182 120 -229 -266 155 330 8 -365 -164 234 269 -100 -257 -35 222 147 -163
3349 -163 -232 89 282 75 -262 -183 204 201 -102 -238 92 280 -20 -333 -92 265 176 -217 -181 117 213 -98
3371 -98 -200 34 249 94 -186 -252 12 224 125 -237 -233 92 264 -42 -346 -52 326 178 -276 -257 115 221
3393 221 -85 -208 91 181 -78 -243 -36 235 165 -66 -192 -15 174 133 -95 -195 46 280 57 -305 -210
3414 -210 235 326 -118 -349 6 280 -3 -281 38 290 56 -296 -169 183 203 -23 -167 -24 102 89 -66
3435 -66 -214 -32 250 191 -221 -345 37 329 19 -278 -57 248 60 -336 -157 285 214 -216 -264 74 215
3456B15k31j35J40J55l1j96r0R2K34J31k70k69J91L06j10l55J28M07n0n21j20
3477c79N08K42l53k41K22J89j91j70J26K30m1j89j10Q7J10J02j12j38P6K02m7
3498A23l93RM79K16m78m34L47M36j40m23J46L53j47k79NK54R9j42n3J7k0K3mm4
3522e0M9K19n5l57j79L90M18k70n08J57M44l5m65oM62J32m15k14K23J95q3j05
3544e3J11J0j02l7k0N8R9J41j64l33Q4M12J3m28l4M49Q1m92k28M68L55k80l90
3567b80J29K77p9j78O2J39L5j09q9p3P7K58J7k33j55K16J58k49j26L39K43l86
3589gm29K92M80j31m28QM30ml60j37L23J82q6j79j10K6J24J85j32j32M3J80j47
3612ik67J86M02j36m60KM52O2m65l5M24J85l57l26J96K94J5j79n0k5O8R6m6j08
$$ plain form
3456 215 -16 -151 -11 144 113 -83 -173 -81 153 284 14 -255 -64 242 132 -223 -95 312 262 -259 -379
3477 -379 129 371 18 -223 -1 188 -3 -173 -47 183 142 -47 -157 -70 40 142 30 -108 -32 170 123
3498 123 -270 -261 218 434 -44 -478 -131 305 165 -258 -112 241 94 -185 -180 74 173 31 -22 -5 -25 -2 -6 -50
3522 -50 -1 218 163 -194 -373 17 435 165 -343 -186 258 223 -242 -248 214 346 -69 -283 -60 135 52 -53
3544 -53 58 68 -34 -71 -91 -33 66 207 43 -290 -206 206 219 -209 -243 206 287 -205 -433 35 390 110 -280
3567 -280 -151 126 47 -131 -69 70 105 -4 -93 -166 -89 169 186 -47 -202 14 172 -77 -203 136 379 -7
3589 -7 -436 -144 336 205 -223 -215 215 211 -149 -286 37 219 133 -46 -156 -130 -6 179 47 -85 -42 138 -9
3612 -9 -276 -90 312 176 -284 -282 170 232 -233 -268 156 341 -16 -342 -146 148 163 -16 -66 -91 -23 73 27 -81
3636h1R8J73p7l09oL54J48l25k19L30J93l38k70K87M06k07l52L1K65K9j58o5J12
3659A9N2m1o7p3M9K07Q8k91k14K46K42j95k80J94L52k04l82R1M05Rl32p9K62O5
3683A23k27r6J95J47l5j89r0P6J54J08j36k33J38K44n6l30M4L59O8l81j58L28
3705E3J50k23j66K53J67k02k44J04K32N7j64j34K8J50O9q0j90O1K47m0k69j21
3727b62K98K47k48k82J92K27j21k70J35L05r0k86m1K14J09j01j53N1J29L7p1j45
3749a26M6J96P4k45j71K02K49j23k82O9L19l7l22j1K73J10k20j56J31J59n5j56
3771g6L3J18K1r1j11LJ84N9j60j45J01K30l1l03m5L60R7l04j92K01K36r6k54M4
3795a21J90K2j43n6J15R7q8j26JJ18J12j23j80P4K44J9l07r6K45K56k12k79J00
$$ plain form
3636 -81 17 190 113 -196 -202 152 300 -25 -244 86 279 -59 -329 -42 364 157 -195 -164 101 130 -28 -93 19
3659 19 71 30 -37 -110 -61 146 234 -57 -271 -25 217 22 -258 -64 288 84 -298 -207 198 207 -125 -204 58 123
3683 123 -104 -200 -5 142 107 -82 -172 -96 58 166 30 -203 -65 179 123 -207 -163 196 264 -117 -275 53
3705 53 203 -20 -186 67 234 32 -212 -108 124 181 17 -117 -89 61 130 50 -140 -79 168 128 -141 -262
3727 -262 36 283 35 -247 -55 172 51 -219 -84 221 131 -155 -196 18 127 26 -127 -76 53 90 19 -126
3749 -126 -80 116 190 -55 -226 -24 225 102 -180 -111 208 171 -151 -162 111 221 1 -155 -24 135 80 -76
3771 -76 -43 75 96 5 -106 -103 81 140 -20 -165 -64 166 135 -168 -213 147 244 -60 -252 -51 185 89 -165 -121
3795 -121 69 91 -52 -108 7 104 16 -110 -109 9 121 -2 -182 -108 136 155 -152 -248 -3 253 41 -238 -138
3818a38K91Nk41p1J85J05j27j05M3J32j1j26k5J08J29j31j43PK64M0k63j47J91
3841b8K10q1k13n5K52Q2j96j40J46J66q2k00j3J88P5j23r6N2J42J3j70o8J64J28
3865A53j32j58O0J83K4k70l3K17J34j81j78J04K48pk33q2J73J41j09j68M1J65
3887I2N4j42j21Q4J30kj97J1K24Nj59j24J35J69q5k56N1K37L4k16j34J82J84n9
3911I7k11l4J78J12j23j50N6J63Pj51j11J72J04j24j40J20J57m4j95o1K29J11
3933A62j37k19J04K17J8k07p7J57J21n6j62j1J59O4j48j05O7J72Lk06j8J60R6
3956A54j96j44J66J67r9j71K5J63P1j73r4Q8J66q2j71K4J24Q5q7j66O7J58O7k04
3980f2r5J85P1q8j27K7J93rj82qJ45Q2j47j49J11J60j6j83l0J52J07p8j59nJ78
$$ plain form
3818 -138 153 158 -83 -154 31 136 9 -96 -53 79 68 -58 -83 25 154 23 -120 -113 151 191 -72 -219 -28
3841 -28 182 101 -112 -167 85 167 -29 -169 -23 143 61 -139 -152 36 111 -12 -108 -56 86 99 -71 -139 25 153
3865 153 21 -137 -77 106 130 -140 -173 44 178 -3 -181 -77 171 164 -69 -151 22 163 54 -114 -73 92
3887 92 146 4 -117 -33 97 95 -102 -91 133 138 -21 -145 -10 159 74 -182 -131 106 140 -76 -210 -28 156 97
3911 97 -114 -148 30 142 19 -131 -75 88 95 -56 -167 5 109 -15 -155 -35 122 78 -117 -178 51 162
3933 162 25 -194 -90 127 145 -62 -139 18 139 83 -79 -90 69 133 -15 -120 -53 119 122 -84 -102 58 154
3956 154 -42 -186 -20 147 48 -123 -98 65 136 -37 -131 -43 123 41 -130 -106 18 103 16 -150 -83 75 142 -62
3980 -62 -157 28 99 11 -116 -89 104 95 -87 -95 50 132 -15 -164 -53 107 91 -92 -122 30 137 59 -100 -105 73
4005G3Q9j65j11N4J67Oj71p7J94O5j38r4J13J37r6j61NJ62O5j64r7J35J11l6j79
4030a13m8J90J00p9j79nJ87L6j27r3J22J32j20j64N2K42m6j57p5J56R0j30r8Q3
4054d4J38k0j22q5J27J14j7j54k5J56N2j48j37J34J92j5k79m5K38J16j73j83J74
4077fJ61j14j80M4J75J7j16r4O7J06l5o2n0J15Q3j09j45L4J89O5j79j45J53J71
4101A45j13j95P6J91pj87k6J20O7r3p1O2J10l5q7l4Q6R8qj77o3J55J58j14j95
4126a37Q2J84m7k06kJ96R4j73j66J34J53q3j05O5Q7k2j08l7N7R7J5q1j07O5J33
4151H8k5j95L0J76Q0k10j51J91J78j36j96J15J29k7j57L9J15N2j04l7l5P7N5k9
4175B3n7j4P3O9j58o3J38J72j44k28R9K60o6k25J8K25Jj88r4J57J20p3q3J5j6
$$ plain form
4005 73 162 -3 -114 -60 107 113 -58 -135 59 124 -14 -108 5 142 46 -115 -110 52 117 -47 -144 -9 102 66 -113
4030 -113 -161 29 129 50 -129 -134 53 89 -38 -131 -9 123 3 -161 -109 133 87 -70 -145 11 101 -29 -127 -44
4054 -44 94 74 -48 -133 -6 108 91 -63 -88 68 120 -28 -165 -31 161 146 -133 -178 60 176 3 -180 -6
4077 -6 155 41 -139 -95 80 97 -19 -113 -46 60 25 -37 -87 28 111 2 -143 -109 80 145 -34 -179 -26 145
4101 145 32 -163 -87 104 97 -90 -116 4 71 -22 -93 -31 79 44 -43 -77 9 107 99 -78 -141 14 172 58 -137
4126 -137 -55 129 82 -124 -126 70 164 -9 -175 -41 112 29 -76 -11 76 54 -54 -91 -34 63 78 -3 -110 -45 88
4151 88 63 -132 -102 74 154 -56 -207 -16 162 26 -170 -55 74 47 -110 -71 44 96 -8 -45 -80 -3 52 23
4175 23 -34 -48 25 94 -64 -127 11 183 39 -189 -90 170 104 -121 -103 122 123 -65 -159 -2 118 45 -38 -23 -39
4200c9N9pl0mP4K3q9j26N9K06l7j91mJ90L6k79rK58Q6j59k03J03J66k0j15J6J8
4227a8L1n6J4k0M6O7L1j88j2J87K9j78n7J99J22k07j91J73K25j06k15M7J75Oj63
4252e9j6J18O1p7n8j6MJ07J7r6j06P2J13l4j52R7J64r1k07PK49J8j77k6J32J08
4278A52k23p7J13J38l2j06l7K0R9K1q0o3M9J18k4j97J8K21M8k21n1J27J22j78
4302d3o0J51J20j60j61R9J31J1r4m9P5J1l0j5n7P8R5m8j02q6J12J54j47j00J26
4327A1J10j13j46M1K40j5j95o7J43N1j02l0P1N6l0r1j5J2J22Oo6r6N3J29k3j53
4353i7N0J63pk32jJ77P3j24j07J20J12r9j29N0J22kp7n1L6N6J2m0n9M5P4%j52
4380h7n8K24P1j87j25J00J54m0j50L5J45j2j53l7J38L6l8q8M5J6Pj9n7M4J21k3
$$ plain form
4200 -39 20 13 -17 -21 53 76 -13 -139 -80 126 89 -102 -106 84 120 -159 -168 90 176 17 -186 -83 83 63 -52 -36 -18
4227 -18 13 -43 -29 -49 -3 64 95 -93 -105 82 111 -67 -124 75 197 -10 -201 -28 197 91 -124 -77 98 104 -59
4252 -59 -75 43 104 27 -31 -47 -43 64 81 -15 -121 -49 64 30 -122 -25 139 48 -159 -152 97 115 -62 -88 44 152
4278 152 -71 -148 -35 103 71 -35 -72 -52 47 68 -12 -75 -26 92 68 -129 -111 110 158 -63 -114 13 135 -43
4302 -43 -103 48 168 8 -153 -54 77 88 -6 -55 20 31 1 -14 -71 7 102 54 -48 -134 -22 132 -15 -115 11
4327 11 121 8 -138 -97 143 128 -67 -134 9 60 -42 -72 -1 55 25 -66 -81 -69 53 59 -7 -103 -50 79 56 -97
4353 -97 -47 116 109 -123 -124 53 126 2 -105 15 127 28 -101 -51 71 69 -8 -59 -23 33 45 5 -54 -9 65 65 -87
4380 -87 -145 79 150 -37 -162 -62 92 52 -98 -63 82 70 -83 -120 18 54 16 -72 -27 -11 -4 -23 -80 -36 85 62
4406F2j14n1P9J38p4j53J3J56Lj49K0J33N3j16j24J06J10l7j08L2O2Qp3k6J6N8
4432B4P1r0j32Q2J36l2j14n3J62L6j19q7J13J07q4q8QJ05j9p9QO4M3q3n9rR2N3
4460E6p1o4M2N9Mq3m8J37N4p5j07O6J29pj55m4J38M3r0p8P3M3L4q1k0M5MK7r0
4489e9J9R3L1r8o7P5J17l8j54JJ61mj23l7O5R3m4j15J9J01Ro9j6QN8ln3k7O3N0
4519E6n7o7K6J14j5j18l1J31R2j14j26N1J73m8j22l5J18M0m9p2L4P6jn1n7O5Q9
4546A02p2n8l7R7jm3o8P9K7l8n9K3J28k1j22j2P2O8n8p9K2P3K9q4o8O7O4J8q6
4575c7m0O1O9l9q9O4Q8o4q3oQ0M7n3o7N0Q9l4m9m9R2N2p5n4j5J27j0m4p0M8P6
4605F5m1o2KP0K8r5k8K5J06o6o6RR5L5r3l4L1M8J0j02JP5J9m8m1J5P1K5r6n7J39
$$ plain form
4406 62 -52 -103 -24 114 40 -113 -100 56 59 -90 -70 63 116 0 -124 -18 92 55 -53 -21 41 49 -24 -50 -34 24
4432 24 95 5 -127 -45 91 59 -55 -108 54 90 -29 -116 -3 104 20 -68 -60 45 26 -53 -45 19 62 -21 -80 -89 3 56
4460 56 -15 -79 -37 22 26 -57 -105 32 86 11 -96 -30 99 92 -63 -107 31 74 -16 -94 -21 22 56 -25 -45 0 4 31 -59
4489 -59 -40 53 84 -14 -81 -6 111 73 -81 -80 81 77 -46 -83 -18 75 31 -84 -65 36 45 -24 -40 -32 26 23 -30 -57 6 56
4519 56 -1 -68 -42 72 57 -61 -92 39 131 17 -109 -58 115 67 -55 -90 28 68 19 -53 -19 57 56 5 -52 13 102
4546 102 30 -28 -65 32 31 -12 -80 -1 26 -12 -71 -48 80 59 -63 -75 -3 65 7 -72 -50 23 52 -32 -100 -33 31 49 -37
4575 -37 -77 -16 53 14 -75 -11 77 13 -70 -76 4 51 -2 -69 -19 70 36 -13 -62 30 82 7 -47 -62 65 55 11 -59 -11 65
4605 65 24 -38 -36 34 62 -33 -61 -36 70 4 -62 -53 42 77 -16 -50 -19 29 39 -63 -62 13 32 -16 -57 -42 29 54 -42 -99 40
4636D0J6n1r1N9R2l2q0k1P2P0m7p4M6O4rp2l3Q0L9n7n8MJ10j1l7p8J02N4n5q0
4666c8qP8J6m7p0P8O5m8o8L7N0J5r1l9P5O4k6j19J1Q8L0n3n6OQ5kp4m9P4O2j8
4697B8q1K9P2l0p1L5N2K0m9q7Q5P8n3r9KR8M7m2p9mJ17nq6m5O9Q1l5p6k5Q3M7
4728G6r7nK5M7k3q8K5O0L5q5j4M5L3kn9l7O4O7p8o5M5P3L0j06l8R0N2o1o5J3R6
4759E3jj01j7R9K7l0o5lP5k3l3j1N2Lrm1j9Q4J6p0JJ1Q0p0p1O7P5Mj17m2R6L6
4791E6l3m6J3J2j7Nj8J7L0On7j9P5J0m6n3K5O3J2j33J6R3N8o3r7O5N4Nr1j6P0
4822dL2n5k1M2J3OJ8o8J4N3j0k9k4P6qp0j6Q4K2l2p0J4P4oq2pO1L7m5m8J3L9K0
4855B3l2MjK2kl0l3L9L6j6n9k0Q8Mp8jO4L1r4j8L8N9k1o5M9L8mn1RJ5L0kj8o5
$$ plain form
4636 40 56 5 -86 -27 65 33 -47 -68 4 74 27 -47 -1 63 54 -18 -51 29 68 11 -47 -43 67 56 19 -59 43 97 42 -38
4666 -38 -46 32 48 1 -69 9 74 26 -42 -5 45 60 -31 -70 5 69 43 -76 -65 23 53 0 -56 -50 35 33 -41 -90 -16 46 28
4697 28 -53 -24 48 18 -53 -18 34 54 5 -82 3 81 28 -71 -69 29 76 34 -45 -49 68 63 -23 -68 1 82 47 -29 -54 29 76
4728 76 -21 -26 -1 46 23 -65 -40 20 55 -30 -44 1 34 32 -27 -64 0 67 -11 -76 -31 42 72 -34 -72 18 70 9 -56 -43 53
4759 53 52 -49 -66 33 60 30 -35 -38 37 14 -19 -30 22 25 16 -25 -44 40 56 -14 -13 -2 78 8 -63 4 79 83 -34 -76 20 56
4791 56 23 -23 -10 2 -15 -10 -28 -11 19 25 -32 -51 24 34 -12 -65 -40 23 35 -98 -82 11 69 6 -91 -26 28 33 -58 -74 -4
4822 -4 28 -27 -48 -6 7 13 31 -37 -23 30 20 -9 -33 43 35 -35 -51 33 55 23 -47 -33 41 35 -47 -54 7 44 -1 -49 -36 3 23
4855 23 -9 -5 -6 16 14 -16 -49 -10 26 10 -49 -69 19 23 -55 -56 8 39 -55 -73 -35 24 3 -62 -13 25 21 -30 -21 -6 24 22 4 -61
4889f1P5J9K9o2m0Q0K0q2n1J07L9o8n0J7P7J9p7JJ9L7o9j5L1J3L2n9J5kL1Kl6
4920il4O2K9o1m7L7P0lq1OO1Nm9k8M1K7k0n7NoN8J8n6K5L7m1j5l3K5O8qq5K1Q3
4954D5Rm9p8Q7K1k0p6O1M9mm2l9M1K6Jj4l7J2J5K3r6K6P1rn2l7M7O8m9q5O9P5
4986E9l7q2K9Q1m3o2RP7k0j3m6L6%N6m1l4QpR3p0m2L3O4jj21N0R5Jp1n5O7J9m9
5019a7l2P2KJ6n8j0J6K5M0o2j2J2M1k5l7jO9pm2l4N1N8o0o3K9N4j0n9J0P5op4
5051c9oK0J3J4MoNL1j3m3j4O6L3n9q4P8O2m6m5j3Q0j6p3J3L3M8nq6M8kjj0OK8
5085B1pJ3k9j2J8L1l0o1M8Q5p5l8oP0J0m9o9N4N6rn1J2J4J5l2qPL5J5k3m8M8K7
5118C2qn9j0P6K9r5l9Q2L5o3k6N9K2k3j7mL8J3k2l7L2J8Ol3nJJ1J5l3nKO5o5l8
$$ plain form
4889 -61 14 33 62 0 -40 40 60 -22 -73 34 73 5 -45 -28 49 68 -9 -8 11 48 -21 -36 -5 8 40 -19 -4 -6 25 27 -9
4920 -9 -43 19 48 -13 -60 -23 47 44 -37 -31 30 35 -14 -42 -1 26 6 -51 -46 -52 6 24 -32 -7 30 -11 -26 -59 -34 34 26 -59 -38 45
4954 45 54 5 -73 14 35 15 -61 0 49 45 3 -36 5 31 32 18 -19 -7 8 31 -65 -39 32 23 -29 -66 -19 49 0 -85 -16 59
4986 59 22 -60 -31 50 7 -55 -46 31 11 -2 -48 -12 -12 44 3 -31 -23 -30 63 -7 -49 -16 48 47 -74 -24 71 72 1 -54 13 32 -17
5019 -17 -49 23 25 41 -17 -27 -11 14 54 -8 -20 -8 33 8 -29 -30 39 32 -10 -44 7 65 5 -58 -29 25 15 -44 -34 41 35 -39
5051 -39 -45 -25 -12 2 6 0 5 36 23 -20 -34 32 65 6 -78 0 62 16 -29 -42 38 22 -51 -38 -5 43 38 -48 0 -2 -3 -13 -7 21
5085 21 14 27 -2 -14 4 35 5 -56 -8 77 2 -36 -42 28 38 -11 -80 -26 30 21 -30 -18 -4 11 -21 -29 -22 13 28 5 -43 5 32
5118 32 24 -35 -45 31 60 -35 -74 8 43 -20 -46 13 35 12 -5 -9 29 42 20 -17 15 33 39 6 1 2 13 28 -5 -10 -8 57 -8 -46
5152d6L4L9Jn0NO5km6l5L2L9j5l8j6L1L4k8k6J7L1j7k4k1NO4j3m5j0M8K1m8j0
5184b4L2N9r8pM8K7jn3kJ7P0o2Rk1O6j2m0m0N9J8l4k7JJ4M5m4m0M6K5Lq5L9ON0
5218D4o6j6K2N7j7l8jL2j2j8l2K5M0j5k0j2NO6n7l5K1P3Jq1j7N8J4k8nKL3j2k7
5251a6pL6K4k2l1L7nK8J3m5qN2m9k9K7M5j4o6mO3lj9n3K7O0Pq3qM9%k3L0n1K7
5285a1K5k2k4L0K8j1l6k3L5J3mkm1P6%o5PL1M2j6p0M8L4Lo6K7K9ql0j7jL8K0k9
5319A0l3K5L5k1l9J4N7pn8j4J9J9M1o5RK1K6n3qM0J6kn0k8N7J1k8m4M9K8j3m2
5351b8MK5N7p3l1L3L7Rn6K6PJ5l3k5L1K9k4rnK5Qlm0K3L3ml1n0N1Q1n5r2M4P8
5385E7k2Jq6N1K7Kl4m1M4K8l4jJ1K7k1J0p8O6Kl9k7O2J9j8on2O2K9n8j5OO2k0
$$ plain form
5152 -46 -12 27 28 -22 -17 48 46 0 -35 -3 36 21 -17 -33 -2 32 4 -22 -5 26 9 -15 -36 -31 33 20 -25 -35 13 34 -14 -24
5184 -24 8 67 -31 -38 10 37 36 -17 -19 -2 68 6 15 -6 60 48 8 -32 27 45 11 -16 -15 -1 44 0 -40 6 31 34 -51 -12 -6 44
5218 44 -22 -38 -16 41 24 -14 -15 17 5 -13 -45 -20 20 5 -15 -27 -22 44 -13 -48 -27 46 47 -34 -51 7 21 -7 -12 -10 23 11 -16
5251 -16 -23 13 37 15 -16 21 16 44 57 12 4 56 7 -22 5 50 36 -30 -34 29 26 7 -46 -19 41 48 -35 -43 6 6 -17 13 -38 -11
5285 -11 14 -8 -32 -2 26 15 -21 -44 -9 4 0 -2 -43 33 33 -32 -25 6 48 32 -38 10 44 47 -19 8 37 29 -1 -18 -19 19 39 10
5319 10 -23 2 37 16 -23 -9 48 41 -17 -31 -12 7 48 -17 -8 13 39 -14 -22 18 34 32 -18 -46 11 22 -6 -50 -1 27 14 -28
5351 -28 -24 1 58 -15 -46 -13 24 33 -23 3 10 25 -8 -33 -2 27 3 -6 -11 14 22 19 -21 2 35 31 0 -50 1 82 27 -65 -21 57
5385 57 35 36 -50 1 28 30 -4 -45 -1 27 -7 -8 3 30 9 19 -59 7 9 -30 -57 5 24 6 0 -52 10 39 -19 -34 -28 34 14
5418A4k0j9O3j1k3k2K3J4J9nn6J9N3Oq5K7M8j8m7QnN3l1k1RK6Qj9l9P7nk4m3N
5452b1L5J5o3J7J0K9J7n7k3N1j0K3p8K5P4j4r9J8M3j1K5n0L9J7lj3j8L8nRo2N2
5484A0J4Jl2j8L1K8Kr0L3N6K1n8k5J2L3Jn9L3N0ppk7J1KJ3l5j0L8J4m3j9L7R%
5518A9p6K7N0J2n4l9M7M5Kl9m2L1M3m3J1LK4l7m5M4k0L2J7k0l0K3P6n4l5K2N4
5549D8jo1OM0pk7k6M9M2m1km7N9Jl2npJ6nj7K6k9L6K3o1j7O1K3n2qNK7o1LK2N1
5585C2l2l4K9Onj9rM9j0K3l9Mk7P0np8J3O2J1n7j7K1P4n6l1jN0J1k9OJ5J1m0r
5619a1K6kjj4oJ8k0L4l8j4K5O0l5n4J1L0M6n1l3N7pk7m8O1Lk5j1j3M7%l7J1K2
5652DQJ8m7JkN8nl6k1L8j5m5K0L5K4ln8J1O0Nk4m7L0K7k0j2j2L2j2kJ3k6M0mn5
$$ plain form
5418 14 -6 -25 38 27 4 -18 5 19 38 33 -23 -4 49 55 -30 -3 45 27 -20 -12 -17 36 5 -16 -7 19 27 8 -31 46 41 17 -26 -21
5452 -21 14 29 -34 -17 -7 22 39 -18 -41 10 0 23 -55 -30 44 30 -69 -51 -8 -19 6 -44 -5 12 9 -4 -22 16 11 20 -42 10
5484 10 24 25 -7 -25 6 34 36 -54 -21 35 56 -2 -27 -15 18 19 -40 -7 43 36 29 2 13 15 28 -7 -17 21 35 -8 -27 10 19 19
5518 19 -57 -30 20 32 -22 -61 -14 31 33 -6 -48 -17 26 -17 -6 -3 21 -16 -61 -17 -37 -5 12 -8 -38 -15 61 7 -28 -6 48
5549 48 47 -14 -8 32 25 -2 -28 21 63 22 20 -27 32 33 1 -4 -11 5 0 -17 9 -20 16 39 -22 -39 22 45 -7 -15 -10 17 -44 -41 -19 32
5585 32 0 -34 -5 1 -4 -23 -32 17 7 30 -9 -5 -32 38 33 -45 -32 30 41 -16 -33 -12 62 6 -25 -26 24 35 6 12 27 38 -2 -11
5619 -11 15 13 12 -2 -8 10 -10 24 -14 -28 -3 57 22 -32 -21 9 55 4 -29 28 21 -6 -54 7 10 -15 -26 -39 8 8 -29 -18 4
5652 4 12 30 -17 -16 -18 40 35 -1 -22 16 1 -44 -24 11 35 32 -26 -15 45 50 26 -21 9 36 16 4 -8 24 12 10 23 -3 37 33 -22
5687b2J4L7k7K3n1rQ2j3q4LO0Nj8k4J3L0K2o2KMO1m5j4%%J1lKJ8K6j0m9k0L5K7
5722B4k3rL5K5n3k8L1L0j2l7pQM6km4L5pK3k6l9K0K6J2k6jk8O7k2p4K8M6k7oj0
5756b5L7kk6j6L5Nm9J4J3L5j1l1J0j6M6L3l9n9K5K0K3n4M0JK6k8n2P0J8On4J3
5788HMk2%lM0Jmj5k5M3L9n7l8N4LKm5j6L0M1m2lpK0j0j3lL8Pn2j6J1L8%k1jlK3
5826FPm4QM8j0n3j4L3M2nl9k4P9jp0k2M2M8l9j3mK5J1j8J7k0J9K7k4j5J4pL6p8
5860c8M2M0j0n0j7N8ko0QM0K0k3ool0L6j2l6L2J2K0l8nJ2OJ4rmpK7j4k1PK8L2
5895D6p7J2M6k0k5j7M7NJ2m8J9K4mk3j7L7jj8nJ2qJ6%o4M4L0%l5k5L6J9k5lj4
5929b4L6J0m6j2L1K0mk6J0nQmm5M8J5Jk6j2M0j2k5kk1O2On3J7J3M4k3k5j7J9K7
$$ plain form
5687 -22 -8 29 2 25 -26 -35 47 34 -50 -47 13 18 0 -24 -11 19 41 -21 -19 -15 46 1 -13 -13 -13 -2 -5 -3 15 41 31 -18 -38 -3 24
5722 24 1 -8 27 52 -1 -29 2 32 20 -17 -24 -16 30 28 -16 19 12 35 9 -30 -10 16 28 2 1 -27 40 18 -56 -28 18 -9 -15 -25
5756 -25 12 10 -16 -32 3 8 -41 -27 -14 21 10 -21 -11 -27 19 52 13 -46 -21 -1 22 -32 8 9 35 7 -45 25 43 49 -5 8
5788 8 12 -10 -10 -13 27 28 24 9 -16 27 66 9 -29 25 28 30 -15 -31 -1 40 -2 -5 -12 8 -2 -15 -18 20 27 -25 -41 -30 8 8 -13 -14 -17 6
5826 6 13 -31 -23 25 15 -38 -52 -19 23 18 -21 -45 34 33 -37 -59 -17 31 -8 -21 -25 0 11 -7 10 -10 9 36 12 -3 11 4 40 -38
5860 -38 4 44 34 -16 -33 25 23 -37 -29 11 31 8 2 -4 -34 2 -10 -46 -14 -2 18 -20 -25 -13 -7 7 -2 -6 -13 14 0 -21 -14 14 46
5895 46 -31 -19 27 7 -18 -35 12 17 29 -19 0 24 20 -3 -20 17 16 -2 -7 5 -3 13 13 -51 -7 23 23 -12 -37 -1 18 -7 -10 -24
5929 -24 12 22 -24 -36 -5 15 11 -15 -5 -10 -2 -6 -51 -3 12 13 -13 -25 15 3 -22 -24 -45 17 23 -30 -13 0 44 21 -4 -21 -2 25
5963B5qk3J2M4k0j8k9M2j7nmOPmmOJ3J0k9j4J2L5m3j3qN3mk7Jj5K2k3L7n8M0L4
5999C3m2lKJQk3N0j8kl5J8j0P9q0k0JO5j5rl1M2j0j3JKj0M6l7j8J8M7Ql7NoJ1
6035A8j2rQJ6kRl5qR0q9l5M5J0Kjk2k5N4Ok1k5J8L8Mm1k7PK5l4OJ9J4j6oL4k5
6071a0K3n8J6QK8K1k3k1L9j0j7LJL5l2oLJ3K0k7k9L3K0Jn2L0QLl5KN0j9om8L8
6106BJ9oj2j9NrK8l0QJ6L8m9qrKK9o5K3L7J2n6nO9Jk6%l2M7lj4NpJ3J0Kn5J0K6
6144cj4L1k2N5k8k8J3j3M8k2rQJ2J3o7M3j5Qrk1J5J3kOl7J1N0mp1NK7K6k6j2J9
6179@K4l4l5N8j8J3l2mJ3K6J8l9J1jQ%k5JN8k7k9K4RJ5l2pk3M4J4k8J8mk6J1q
6214gJ1j6%KOK1lk3K7j1k0K2l0j1K8K2j9m4KJ01l0j0m5J2N7l8j9J9Jkk1J7j3m
$$ plain form
5963 25 17 -6 6 50 30 12 -17 25 8 3 -1 5 12 8 4 10 23 33 4 -10 2 37 -6 -19 -27 26 22 -5 -4 -19 3 -20 17 -41 -1 33
5999 33 -9 -12 -10 -9 -1 -24 26 8 6 -29 -11 -21 58 -22 -42 -41 24 9 0 -31 11 1 -12 -11 -9 -19 27 -10 -28 -10 37 45 8 13 7 18
6035 18 6 -3 5 21 19 28 -7 -15 75 -14 -49 -4 6 8 7 -15 -40 14 20 -1 -26 -8 30 34 -7 -34 -27 -2 -36 -30 -11 3 -13 -19 15 -10
6071 -10 13 -45 -29 -21 7 28 5 -16 23 13 -4 -1 0 35 3 -3 0 13 33 6 -23 10 30 31 -21 9 17 20 -15 -13 37 18 12 -36 2
6106 2 21 15 3 -16 -11 -20 8 -22 -14 2 40 -9 -17 -26 -24 5 -60 -37 0 12 -44 -49 20 21 -5 -5 -37 10 7 -7 -2 -9 4 14 16 -39 -29 -3
6144 -3 -17 14 -8 47 19 -9 4 -9 39 17 8 16 28 41 -26 17 2 10 1 -20 -5 8 6 12 -25 -14 36 32 -39 -34 -7 19 -7 -19 0
6179 0 24 -10 -45 13 -5 8 -24 -28 -15 11 29 -10 1 0 8 8 -17 -16 42 15 -14 10 19 34 2 -5 -28 16 30 2 20 16 -10 1 -7
6214 -7 4 -12 -12 -10 -4 17 14 -9 18 7 -13 9 -21 -32 -4 18 -1 -45 -43 58 28 18 -27 -15 42 4 -15 4 5 3 -18 -1 -14 -18
6248a8jrL6k1JlKK5k4Mj0KK3Mk3pL3LjMj4PK0m1j8JN2opk0k1P0j1k3k1N0m2j7
6286b1J2J4J5rj2j4J7J6l7QlJ2J0m9M3j0J2k8KK2MNj1k0rM9l9l0L4JJ2J2jk2K6
6321A1%k9K5L8m6kpL7l8MK5k0NL3k6j4M0J0k6k9J5jJ9j7k6J2J4Pm1KO1l8k9J3
6355a8J0QQm5j2K7J6okJ0K2j8Rk3N%N1l7ol6N4Ko3K9J4RLk2QJ7l6K9lqL5k5L1
6392C7k7K4l8j6L4qkk4J1J4K7oo3K8P3o3j7%J8%Jm6J8J4J5j4kQj3L8m0K5l0K9
6426El9J7J0J0J2l1QJJ8m4rO2J0k7J1k1J5J4l3lO5m2ml7M7K1r%j1rNJ2oj1j1M3
6462C9n3J7JJ3Jk5J0j0j4J0JK5k3ljJ5oK8k0l0K7nqj5RQL2m4Rj5L1OJoK5j9m3
6499c2L8K3mj9qj0K5K5k8m3L5J9J1k2j1RN3n7rLL5l9K3m1J8N3n8nK9Jl1Mk5N0
$$ plain form
6248 -18 -19 -28 8 -13 -12 -15 -13 12 -12 -8 -18 -16 7 11 -12 -19 14 17 16 20 6 13 33 -8 -26 -25 27 21 14 -6 -27 43 32 9 -12 38 -4 -21
6286 -21 -9 5 20 11 -1 -15 2 18 -19 -11 -14 -2 8 -41 2 -8 4 -24 -22 0 4 9 -2 -22 -31 18 -21 -51 -17 -16 -4 8 7 -15 11
6321 11 11 -18 7 45 -1 -3 -10 27 -11 -7 18 -2 3 36 10 -4 36 46 20 -9 6 5 24 7 -19 -7 7 14 -27 -25 36 -2 -31 -18
6355 -18 -8 0 8 -37 -49 -22 -6 -12 -14 -4 18 0 9 -14 -9 -9 42 5 -1 -37 17 19 -44 -15 -1 8 11 -11 -3 14 -22 7 4 -4 31 6 37
6392 37 10 34 -4 -20 14 6 4 -20 -9 5 32 26 -37 -9 64 1 -16 -16 2 2 3 -43 -25 -11 4 -10 -12 -4 -17 21 -19 6 -24 5
6426 5 -34 -17 -7 3 15 -16 -8 -7 11 -33 -42 20 30 3 14 -7 8 22 -11 -14 51 9 5 -32 15 36 27 27 16 7 12 24 18 7 -4 39
6462 39 -14 3 4 17 18 -7 3 -7 -21 -11 -10 15 -8 -11 -12 3 -3 25 5 -25 2 -3 -11 -26 -17 -9 23 -21 -12 -27 4 10 11 5 30 11 -32
6499 -32 6 29 25 6 -2 -12 13 38 10 -33 2 21 32 10 -1 8 61 4 -5 -2 33 -6 17 -24 -6 47 -11 -16 13 14 -17 -13 -38 12
6533A2oJ5l0qKj0J9MJ2Ol5lRQK9k2l6M1J6k3Jk1M2L2n5l5K4J4J1j6K6j4K0l7J0
6568Boj2M8l1j5P1k1j5k2K4J6m0J3j6qM6l9nML2k5%oJk1K4j7oL2J3J5p9M6K1q
6603A6l3K1J4on8K7NM4j4j8pJ2J8Ll5MN4l2pJ1rJ0lm3kO8j3l0K0j2J6km8J2L9
6638B2K1n9K3Mom3L0ML9k5k3Nj2Kj5K4mK4j8Rk8J2K6nl8J3QL1j6k5L0lL1j4l5
6673a1J7Lnl8K9N5l3k6PJ0Qj2kJ7j3K4m1K3oLL5m6j0OL7n1J8LK2j5j3KpK8l5j6
6709c3M6J0j9ml0M2K2m0j5pL4%l5K0K7j7j0%oJ2J4l2j2K9KkJL7l0K9m8J6kL5l7
6744cJ1%J5Ok4j9PJ6j0oJ3K1kk7k3L9pPk5Pj4L0j6k2M0jk4J2J7m2K8j8j1M2k4
6779g%ojJ1NOqpL9n7JJ1M3j4j7kK0LPk5MK6N%n1lJ3M4k1l4rP5k7n0J5L2Lk1j2
$$ plain form
6533 12 6 21 -9 -17 -15 -25 -6 -2 10 16 -19 -22 -13 -5 24 2 -34 7 23 0 1 -20 22 54 -1 -36 -12 2 13 -3 23 9 29 -8 2
6568 2 -4 -16 32 1 -14 57 36 21 -1 23 39 -1 12 -4 -12 34 -5 -10 -6 26 1 1 -5 -4 -25 -1 -18 -24 8 21 36 -43 3 24 16
6603 16 -17 4 18 12 -46 -19 -14 30 16 -2 -9 3 21 24 -11 -7 47 15 8 19 10 20 17 -26 -28 40 27 -3 17 5 21 19 -29 -17 22
6638 22 43 -16 7 11 5 -38 -8 -4 35 10 -13 -8 -20 -18 -33 -9 -13 11 -7 2 -26 -14 12 7 -31 -18 -10 21 5 -20 10 7 38 24 -11
6673 -11 6 9 4 -34 -5 50 17 -9 -2 8 16 4 2 19 6 30 -11 12 6 9 44 -2 -12 -6 31 -20 -2 1 23 8 -5 -3 -10 18 -17 -33
6709 -33 13 23 4 0 -30 12 34 -6 -21 -28 6 6 -29 -9 18 1 -9 -9 -15 -3 11 -21 -33 -4 -2 -4 -3 34 4 33 -15 1 -1 34 -3
6744 -3 8 8 23 29 5 -14 -7 9 -1 -7 6 27 25 -2 -25 14 7 14 -11 -4 -18 12 -4 -26 14 13 -11 1 18 -24 4 -14 -25 17 -7
6779 -7 -7 -13 -14 -3 2 8 0 -7 32 -25 -24 -13 30 16 -1 -3 17 20 27 2 6 32 37 37 -14 -17 -4 40 19 -15 -24 51 24 -26 -11 21 24 3 -9
6818iK5lm5KM4R%l6k4J0N7k7j9j8N8Op7K6kOPj6%M1ooj5j7K2O1p3J6mNMmJ7k3
6856hJ0j1%J4L7l9k5J7M8m4KrL2j1%j8L0%K1l0l6K4K2kk8j3K4%j4k6K7L0m6K4
6890Bk6K3L9m5j6QK2m5M5m8N0Ml2m6M9L1Oj3j5JM1m1l3L8K5J7j2l7j4N5k9n9N3
6923bM2j7k9j0K2L6nl7%K5oj3l7L6L4k1j4m6P2J3l7m6K6N2j6n2QK2Ok3j5NM8m5
6957b4k8LK9J9j8LJ4J9J0l3l6M6Kkj5QOnJ2l1M3kNm6MM0Mrro%qj2K0lK3j0l8J8
6996gJ2K6k1k6J9qj0k6P2jm8j5K8J3K2m4j7M3KKn4j8L5MJ6l5KL4L0m5K3LK1k0
7030A2k6K1K8l3J7k9K8M3p5k4M6J2K7l7l8O6mk8LrJ2K0m2j6K4K8J2op6M4L9m4
7062ej6J4J5J7j9Qk3PJ0pk9J7L8k6j3%L5m5km1O7L3m1l1M0M0m7k7NN7Ll1j7NL7
$$ plain form
6818 -9 16 13 -32 -30 14 23 23 -13 -37 -27 30 3 -16 -34 24 30 -47 -21 -23 -17 -10 -26 -26 15 9 3 -12 -29 -7 54 -19 -3 -7 -2 2 -2 15 -8
6856 -8 2 -9 -9 5 42 3 -22 -5 43 -1 1 -8 24 13 13 -5 25 25 46 16 -20 4 26 24 -4 -17 7 7 -7 -33 -6 24 -22 2
6890 2 -24 -1 38 -7 -23 -15 7 -38 7 -41 9 13 -19 -65 -16 15 21 8 -7 -6 35 -6 -39 -1 24 41 29 -8 -22 33 4 -55 -2
6923 -2 40 23 -6 -16 6 42 37 0 0 25 19 6 -31 5 39 18 4 -42 30 43 6 -40 -14 38 22 -30 -22 0 6 -17 -32 -27 21 -24
6957 -24 -52 -49 -20 -1 -19 -16 -2 17 27 -6 -42 4 6 4 -11 -3 3 -2 10 -21 22 20 25 -21 -17 23 27 18 9 3 3 -5 -17 3 0 23 13 -25 -7
6996 -7 5 31 10 -16 3 -5 -15 -41 31 30 -18 -33 -5 8 30 -14 -31 12 14 16 -38 -56 -21 -17 -1 -36 -34 0 30 -15 8 11 32 12
7030 12 -14 7 35 2 19 -10 18 61 -14 -38 8 20 47 10 -28 38 34 6 9 0 12 32 -10 -26 -2 26 38 32 -44 0 39 -5
7062 -5 -21 -7 8 25 6 14 -9 -2 8 1 -28 -11 27 1 -12 -12 23 -22 -24 -65 2 35 -6 -37 3 43 -4 -31 -26 31 34 3 -14 -9 28
7097B8j9l2L3K7k7l1ML1J3rl0K1J4k3J1l1K4L3mm0m7P9Om7rL6Oj4l7L2Jj0K8j2
7131Ej4K5j6j5J4j4L7l8K%L8k6k2lK2Pom0L4M5j4l0j1L8mlk9PJ9k8K4mmM0pj6
7167A3j1lO9j3l1j6K5m%k8KJk6j0j6O2j7L3o3L7K3k3k5mPK8k3k3K7K0poOK9J1
7202D4n3l2O1J2k7l7OO6k1k0lOJ8Po8L8kM9j9l2OnM5Kk8k7Q3o4n7O3J5pk6%%M5
7238C8ko1K9j2J8J6m0J4LJ9m7J5oK9j9OQL1l6l6LJ7K1j8l2L7J9j5l2MJ2L6k4M
7272aj3KJ6jj4M6%k8j7K7Pk0k0j5N8K8k6q5P1L2j6o9lM6L1Nn0rJJ7Ql9N5qqj8
7308a0j3jK2J8m7J6K4J1n2oK9J6k5K8j7L1j2n6J9%O2n1o%M3j1m8K0L7K2k4j2j
7341FKK1k0jLj0mj4J9J0L1m1K5j6J8k7oKJ4Jj1n6N9J3J4l6l1J7L6k6oJ9K1Mq1
$$ plain form
7097 28 9 -23 10 37 10 -21 -17 14 27 18 -12 9 23 0 11 -20 4 37 33 -7 -54 25 31 -16 -25 11 17 3 -34 -2 -1 -11 17 5
7131 5 -9 16 0 -15 -1 -15 22 -16 -14 -14 24 -2 -24 -27 -5 2 -4 -44 -10 35 21 -9 -20 18 14 11 -18 -11 8 -20 4 0 -4 36 29 13
7167 13 2 -1 68 55 24 8 33 29 29 1 3 4 -22 -32 -48 14 -3 30 -33 4 27 4 -21 -25 -18 10 -13 -36 -9 11 4 -2 4 33 44
7202 44 -9 -41 20 32 5 -32 -26 40 19 -1 -4 2 20 27 -41 -3 -5 44 25 -7 -1 -6 39 41 13 -14 69 5 -52 11 26 19 -7 -7 -7 38
7238 38 36 -25 4 -8 10 26 -14 0 3 22 -25 -10 -16 13 -6 0 8 39 3 -33 -30 -13 8 -10 -42 -5 14 -1 -33 -29 -17 19 -5 -1
7272 -1 -14 -12 4 3 -11 35 35 7 -10 17 24 4 -16 -31 27 55 29 -56 15 47 31 -38 -41 5 36 41 -9 -18 -17 0 8 -31 24 16 8 -10
7308 -10 -23 -24 -2 16 -31 -15 9 20 -32 -38 -9 7 -18 10 -7 24 12 -44 -25 -25 37 -14 -20 -20 23 12 -36 -16 21 43 19 7 6
7341 6 8 29 9 8 11 1 -3 -17 2 12 43 2 27 11 29 2 -4 -2 12 13 2 -54 5 18 32 -4 -35 -18 18 -8 -14 5 26 30 -51
7376e1L5lK2j5qL1J3k6j5k2M7J1m4J7J1J6Kk8Lj7L4Qn0M3K5j6l1N%jK1m0L8k8
7410a3L9k6J6kQk4J6j6J6J0l7J6j8K6J6j6m2K7N2o1l2J4K5J1pOK1%j7k6RJ3k4
7443b0NK7k7J0Nk8nO6K3n4j5K1K3m1jJ8kM4n1Mj3M7j9mmj2N8m9k9M4KJ9o2K3L
7478FK9l9k6L9J1j8j5j0L1J1j9j8lJ2K5m9%K1K1k4mJ8LJ3n0oO4J3l2j0j0K7J6
7511B7o6RK1M9%l5k9L9K7n5jN0k3nj8K2J7Rl6l0J7L6k6%J2KJ1l6J2lKK8k2j4M3
7546C4k9Km3MK7L4l7j2K5M5m1j6k6L2K1k1L2l4L0m0JJ2K1k1k7PK7J2M7q7K3K0
7578B2k3j1l6M5QqJ5k5M2k2j2jL3j0J3o9L6J4Nk2L5k4J0j8k5MN7kl1l1oO7l5m4
7612d9J9J1M4j3m6OM0j2J6j7j1M0J3n2k8M9J5m6nM7qpk4K5L7j0k4j4%K5rl0jO0
$$ plain form
7376 -51 -16 -19 3 -12 -20 11 24 -2 -17 -39 8 19 -25 -8 3 19 21 -7 -4 -21 13 21 -29 14 39 23 -8 -3 -3 -4 17 -23 15 -13
7410 -13 26 0 16 14 22 -2 14 -2 14 24 -13 3 -15 11 27 11 -31 -4 48 -13 -45 -31 -6 5 -2 4 25 25 8 -18 -9 4 -20
7443 -20 -15 12 -15 -5 0 -28 -33 33 56 2 -13 8 31 -10 -11 7 5 49 -2 2 -11 36 17 13 9 -3 55 6 -23 21 23 42 -20 3 6
7478 6 35 -4 -30 9 20 2 -13 -23 8 19 0 -18 -21 -9 16 -33 -33 -12 9 -15 -19 -1 2 15 -35 -41 23 36 4 -6 -16 11 27
7511 27 -39 -30 -9 40 40 5 -24 15 42 -13 -14 36 13 8 -10 12 29 38 2 -28 -11 25 -1 -1 11 13 24 -12 0 -3 -1 27 5 -9 34
7546 34 5 7 -36 -32 -5 29 -8 -20 5 50 9 -7 -33 -1 20 -1 31 -3 27 -13 -12 0 21 0 -27 -20 7 19 66 -21 2 22
7578 22 -1 -12 -48 -3 5 -3 12 -13 29 7 -5 -6 27 17 30 -39 -3 11 16 -6 29 5 15 -3 -28 -24 33 31 0 -31 -37 30 -5 -49
7612 -49 -30 -19 25 12 -34 -28 12 0 16 -1 -12 28 41 -11 -39 10 25 -21 -26 21 13 6 -18 7 44 34 10 -4 -4 21 12 -18 -19 41
7646D1ll1l1K9K3j6j0J0nK3Kn1L5Qk2l3J6j5N0qn6K5K5k8K2j8L2Qk4oj0J5M0l2
7680El1LO4l9pk7L9Kj4m2L2L2j0k9M7K5k8j8j9J7jK5k9Oj5K6oLm3P0k5j5l4M6
7714A0J1j8l8%N4Kk3k2M7j4k9kj0M8oj7k7LM0jj0j2L1J6j6o8L4L4l1J7mJ9J4k7
7748El6M1L3k4%k4QJ1j6Jj0L1L2m6k1J7J3j4k8mO1K0m2m6L3M8l5n3J2M5k7j2J
7781b6K3K6k9rk6L2jL4m4J0K2k4Kk2L3L0k4k7J0N0l5m7M4M1j3n6K1%J9Pl1K0p
7814CJ9j4j4j1M4k1Jj3J6J1l8OK2K2j4j5kj3QJ9o6M5K4j3qk2M4j9j9J1K3n0K3
7847a1K5l7K9Pj3k8j1O0l0jj8K0K3j5k2k0M3J9jl5K9PK0l4j9J9J3j5k5L4L5%l6
7880A2l1J1L9k9J0k1N4m2Qj1J5L4m5l7M2K5Ql0k9%L9j1m7K5J1j4J3m5M0K7k5o
$$ plain form
7646 41 38 7 -24 5 28 12 2 12 7 30 32 -19 16 24 2 -31 -15 -30 20 12 -44 -19 6 -22 0 -18 14 22 -2 -8 -18 -3 37 5
7680 5 -26 -23 41 2 -5 -32 7 9 -5 -47 -15 17 7 -22 25 50 22 4 -15 2 1 26 -3 3 -12 14 8 11 -32 38 13 -2 -36 10
7714 10 21 3 -35 -35 19 21 -2 -24 23 9 -20 -22 -32 16 10 -7 -34 -31 9 8 -2 -14 17 33 17 -51 -17 17 -14 3 -1 18 32 5
7748 5 -31 10 43 19 19 -5 3 14 -2 -1 -11 20 52 6 -15 2 15 1 -27 -31 30 50 8 -38 -5 43 8 -45 -33 12 -15 -27 -26
7781 -26 -3 23 -6 -15 -41 -9 -10 24 -20 -10 12 -12 -10 -32 1 31 7 -20 -10 40 5 -42 2 43 30 -26 -5 -5 14 21 -10 10 3
7814 3 22 8 -6 -17 27 6 7 -6 10 21 -17 -11 11 33 19 4 2 -11 -3 16 -50 -5 19 6 -2 -24 20 1 -18 -7 16 -34 -11
7847 -11 14 -23 6 13 0 -28 -39 21 -9 -10 -28 -8 15 0 -22 -42 1 20 19 -16 13 20 40 6 -13 6 19 4 -21 13 48 48 12
7880 12 -19 -8 31 2 12 -9 45 3 11 0 15 49 4 -33 9 34 42 12 -17 -17 22 11 -36 -11 0 -14 -1 -46 -6 21 -4 -10
7912a0k5M8Nn6LNO8k1j1Lj9K2k3J3K0J2k6j4oJ0J2ml4J3M2Qj5j1J5J0j2k6K5L1
7946E2l0l9J3J8K5j7l3LL4k8j2OL1k5j8J1j5L9j1Om2L4K2qk0k8M3J5m8J9J5j5
7978cJ6m7J3oM2j2k5M4k8j0j2j3O4j1%pj6M7nnk8MJ9rl3M0qJ6j7n7N8Kk9j0NM3
8014B2j4k7rL5Lk7J7m0J7M6j2k8k4N1Ln3J9J7L5l3j4RmJ8k4J2K4JJ0n9K5L1pk7
8048gj9K9Qlj7PK1K1m4plJ4J5l1RM3ml3lj1L6j2j1LlL6m0k7J4L0J5m1l1M4M3l2
8084Ik4QJ1Jk7oL2K2j2j6j7L2Jl5K9j5M4k5l1RJ8K3k8j0OK5mk7k4M7J6k4rL4k8
8119EPm2L3JMj3J4kJ5k8LlL7j9k1k0LO0k4oj9K3Ol6QoJ8j7lPJ2L9n8j0K2J2rO
8157am9K1N3k0moM5j4k9k8M9K5l8l2J5M5J0k2l1nO0m2qKK4Qm3j5N7qJ7ko0N3
$$ plain form
7912 -10 -35 13 18 -38 -35 -30 38 17 6 9 -10 12 -11 2 22 34 8 -6 -12 -2 10 6 -28 -15 27 35 20 9 24 34 22 -4 21 52
7946 52 22 -17 -4 14 39 22 -11 -8 26 -2 -14 -8 23 -2 -20 -9 -24 15 4 10 -32 2 24 16 -4 -32 11 26 -22 -3 12 -3
7978 -3 13 -34 -21 -27 15 3 -22 22 -6 -16 -28 -41 23 12 12 5 -11 36 31 26 -2 2 21 12 -21 19 11 27 10 -47 11 13 -16 -26 -21 22
8014 22 8 -19 -28 7 10 -17 0 -40 -23 23 11 -17 -41 10 13 -40 -21 -4 31 -2 -16 -7 -11 7 -17 -5 19 20 30 -29 -4 27 20 -7
8048 -7 -26 3 11 8 -9 -2 19 40 -4 -11 -14 0 15 -16 -7 36 32 -1 -4 -15 21 9 -2 1 -2 34 -6 -33 -19 11 26 -15 -46 -2 41 9
8084 9 -15 -7 4 5 -22 -28 4 26 14 -2 -19 13 14 -21 8 -7 37 12 -19 -10 8 31 3 -7 -1 24 20 -7 -31 16 32 8 -1 33 5
8119 5 12 -30 3 4 8 -5 9 7 22 -6 -3 -6 31 12 -9 -29 -26 34 10 4 -15 8 14 -22 -14 -20 -2 -19 -22 -15 -3 36 -22 -32 -10 2 -7 -1
8157 -1 -50 -29 24 4 0 -6 39 25 -4 -32 17 42 4 -28 -13 32 42 20 -11 -16 44 2 -6 -4 20 28 -15 -30 27 19 36 34 -26 27
8191B7
$$ Imaginary data points
##PAGE= N=2
##DATA TABLE= (X++(I..I)), XYDATA
0@%%%%%%%%qJ6j6J6j6K4l2L7m5N6o4P2q8J04j20J39j63J88k15K46k78L12l53M00
32B12m48N03n63O28o99P76q64R59j063J178j304J444j599J771j966K185k432K718
50A436l052L448l922M506n247O217p555R535j2794J9334n2244J67958J12533k55403
64a5250j74442Q2448J77595J2992p7053m6002J6152J9925K9289N517l3084l5579
76c7492L0721M8348r285n8283k0979K9537L6002L075k7021l4806R544N8868K6675
89E4904o7349o4145N7472J08775j0372j13880m3631P2156N4626k5117k4527J1103
101A0015j6488m1679J3674O1804J5303l9585j7619J0577j2211o980N0730M3735
113G1276n0735p5281K2970P5483n344o6081j361N7494l63o3445j4757N9279L6700
$$ plain form
0 0 0 0 0 0 0 0 0 0 -8 8 -8 8 -8 16 -16 21 -24 32 -32 40 -48 56 -64 75 -88 100 -115 131 -147 165 -188 212
32 212 -236 267 -296 332 -367 409 -455 504 -559 619 -685 759 -840 931 -1035 1150 -1282 1436
50 1436 -1616 1832 -2090 2416 -2831 3386 -4169 5366 -7428 11906 -40338 127620 240153 -15250
64 -15250 -189692 -107244 70351 83343 6290 -39712 -23560 -3635 25654 31171 -1913 -37492
76 -37492 -6771 41577 32292 -25991 -46970 -17433 18569 21644 -5377 -40183 -30639 28229 54904
89 54904 -12445 -76590 -19118 89657 79285 -34595 -78226 -6070 48556 23439 -1088 10015
101 10015 -6473 -48152 -34478 27326 42629 3044 -14575 -3998 -16209 -23189 27541 71276
113 71276 20541 -54740 -31770 43713 38369 -27712 -29073 28421 28058 -35387 -50144 9135 45835
126D5835l6349m7938N791M8887L5257k2404o3024k4197O0583P0917k1636q6478
138c4756l4499M4320M6050Q792o284k6346n2302r543P8179O6287n2869r0780K0266
151d3485R1376L046q3735j7530P8198L5599o6007n8176L0283N5301K988l1641
163c783j8511K210J4790J9611K077k2751j1203K3758K1343j6162k3188P259J6145
176A1595o532j1867O359Q510o665r413m567n165R842L4871J3979m7712n1507K9759
190b8513P7288J4654o0379m1712J8586K7468M877L702m65k8475k6169K4441M2495
203B7798q753m2514j495L8301Q394l0818q862K9075J3789k4827k0482J5052K4461
216A9119j953k5980k0115R699L1380J4076k6339l3008Q480L6269R822k1907q208
$$ plain form
126 45835 9486 -38452 -32661 16226 51483 29079 -33945 -58142 2441 73358 51722 -34756
138 -34756 -69255 -24935 21115 29907 23623 -2723 -55025 -64568 13611 79898 27029 -63751 -43485
151 -43485 47891 50937 -32798 -50328 27870 63469 -2538 -60714 -30431 24870 27858 -3783
163 -3783 -22294 -20084 -5294 14317 16394 -6357 -17560 6198 27541 11379 -11809 -4550 11595
176 11595 5063 -6804 -445 8065 1400 -8013 -12580 -17745 -7903 26968 40947 -6765 -58272 -28513
190 -28513 48775 63429 3050 -38662 -20076 7392 12269 15971 15506 -12969 -39138 -14697 27798
203 27798 19045 -23469 -24964 13337 21731 -9087 -17949 11126 24915 88 -20394 -5342 19119
216 19119 17166 -8814 -28929 -19230 12150 26226 -113 -33121 -24641 11628 21450 -457 -8665
229h665J5752K257j8157j005K2415O715j9566j1374P974J132q194Q193J8013p120
243H370k6649l210K5495J5014r829r771J164j558j974J1302J1342j1943k1824
256a4071K20J8829P653r648r074k722j675N288J6036Q744j5172k2588K5K5429
270G274K2758n715l0635k3346J3355L6573J1095l2493l1374J2966L2353J417k4081
283i853n302J7944N734j3415k922J4256M359j2718m684J1271L689j2795o807J0994
297b49Q503r974j3608L360J5068O028r938j1630L067J4972Q060q758j1478K656
311c921J0198l3q304J64P818k417j3434l496J3695J1359o286j3911l796R127J2041
326H804M531o575j1095k890R295R597j541q479n384j492K92N400Q281k111j5753
$$ plain form
229 -8665 7087 9344 -8813 -9818 12597 19312 -254 -11628 -3654 -2522 -10716 -2523 15490 8370
243 8370 -18279 -21489 4006 19020 9191 -580 584 -974 -2948 8354 19696 7753 -14071
256 -14071 -13851 4978 12631 2983 -6091 -8813 -10488 -5200 10836 19580 4408 -18180 -18155 7274
270 7274 30032 24317 -6318 -29664 -16309 20264 31359 -1134 -32508 -19542 12811 14228 -9853
283 -9853 -15155 2789 8523 -4892 -7814 6442 10801 -1917 -6601 4670 8359 -4436 -11243 -249
297 -249 8254 -1720 -15328 -11968 3100 9128 -810 -12440 -9373 5599 13659 4901 -6577 -3921
311 -3921 6277 6244 -2060 -1896 5922 3505 -9929 -13425 270 11629 5343 -8568 -12364 -3237 8804
326 8804 13335 6760 -4335 -7225 2070 11667 10126 1647 -3737 -5229 -4937 463 8744 6633 -9120
341i120r216J3702K0622m32k0401j1305J2650J8044J85j4356q470M899P050m20
355C432l877j248j028l998m33P893N870p906j1491N466J8196L706j8259j2576
369a6253J4011K0481m312k3245q809J6133J5664o219j7091m832J0172R349j163
382C886n713j651J903J336J704M079K094m987p218P94Q507M093o719q553J13O103
398b29K716k317j677R26N2j381J339N280L699l886q249j706R341R092n503j5538
414h041n227J2796J2566o252j6236l094J3092R567n637r223J003P259K026l400
428A199p94K420j257m991o9O444K170q561q465N082J2439J274j2564p826R300
443d199J3279r83j1573m074P754O389l015m869O62J481l285k427M625N272m559
$$ plain form
341 -9120 -18336 -4634 15988 15556 -4845 -16150 -3500 14544 14729 373 -8097 -3198 3852 3432
355 3432 -445 -1693 -2721 -6719 -7152 741 6611 -1295 -12786 -7320 10876 14582 -3677 -16253
369 -16253 -2242 18239 13927 -9318 -18127 -1994 13670 7451 -9640 -14472 -4300 5049 3886
382 3886 -1827 -3478 -1575 -239 1465 5544 7638 2651 -4567 -3773 4734 8827 2108 -6445 -6332 -229
398 -229 2487 170 -1507 -581 -529 -1910 -571 4709 8408 4522 -3727 -5433 3908 13000 7497 -8041
414 -8041 -13268 -472 12094 5842 -10394 -13488 -396 9171 3534 -5689 -4686 2573 4599 1199
428 1199 405 2825 1568 -3423 -3492 2952 5122 -3439 -11904 -6822 5617 6891 -5673 -13499 -4199
443 -4199 9080 8097 -3476 -7550 204 6593 3578 -1291 -629 852 -2433 -4860 -235 5037 478
458D78r775o5J1945P988p164j1976O76J2776P662o504j0480q44P562M545l259
473C565n249j176J384K18K51K393J426l760m762L007R575L244r221r083N170J2987
489I969J946j2291r411N153J0356R33q059n415K300M496J119j085r5M80j139j282
505b025K555N029j66p553m761O633Q785m055j2544k389J1111O630p464q259L577
520d896P589n79m836J343N209k43n087j627M167L808j611n420k897L306N069j381
536A914o820j428P302M672n439n740M022O370j677l963L085L666n574o973M741
551a842J0352q57j1704o356O261R340J656o983p738J071J0744P435p524j2670
565h815J441J3938N440r529q631J725L683M28K800L023o483j0771K307J4519N661
$$ plain form
458 478 -9297 -9362 2583 10571 3407 -8569 -7893 4883 12545 6041 -4439 -5283 2279 6824 3565
473 3565 -1684 -2860 -1476 -1258 -1007 1386 2812 -948 -5710 -2703 6872 10116 895 -8188 -3018 9969
489 9969 11915 -376 -9787 -4634 5722 6655 -1404 -6819 -4519 -23 1096 11 -84 396 -743 -2025
505 -2025 530 5559 5393 -2160 -6921 -288 8497 4442 -8102 -10491 620 7250 -214 -8473 -4896
520 -4896 2693 2114 -2722 -1379 3830 3587 -1500 -3127 1040 4848 3237 -2183 -5080 -1774 3295 1914
536 1914 -4906 -6334 968 5640 201 -5539 -1517 4853 3176 -787 2298 5964 390 -6583 -1842
551 -1842 8510 7653 -4051 -10407 -4146 5194 6850 -133 -7871 -6800 3944 11379 3855 -8815
565 -8815 -7374 6564 12004 2475 -6156 -4431 -748 -320 2480 5503 -980 -11751 -9444 5075 10736
580A0736j0556r576M457R348J822m986m793k10N413N259m166j0739j324J1406
594B091N828r037p609O357O541n904n135Q239Q109o771r677L748Q640j223n774
609a577J290L412k929l881J685K353q49O24K176k213l607K950M519l398l393P968
625E130O948j1171j4956P378K0352J174j8908r294J0091R050k902m359L59pj69
640a284L721J739n533l713O219O344l164n651q38j480k038P154J0424o684j9287
655a4071j779K0343R913j4898j1824J0632J1552p624j1168M747J0459n1o133k444
669b346q45r35L200M183k383m070K632K115o596l199J0813R067q728j1132N572
684b652Q922o023o831J0117R844j2181j6179P253J7717j178j4871k268J0978M378
$$ plain form
580 10736 180 -9396 -4939 4409 6231 1245 -3548 -3758 1655 6914 2748 -7991 -9315 2091
594 2091 7919 -1118 -8727 -2370 4171 -1733 -6868 1371 9480 2709 -6968 -3220 5420 4197 -1577
609 -1577 -287 3125 196 -3685 -2000 353 -496 128 2304 91 -3516 -566 3953 555 -2838 5130
625 5130 12078 907 -14049 -6671 13681 14855 -4053 -13347 -3256 5794 2892 -1467 -1108 -1115 -1284
640 -1284 2437 4176 -1357 -5070 1149 7493 4329 -1322 -2160 -3640 -5678 1476 11900 5216 -14071
655 -14071 -15850 4493 14406 -492 -12316 -1684 9868 2244 -8924 -4177 6282 6231 98 -2346
669 -2346 -3191 -4126 -926 3257 874 -3196 -564 1551 -5045 -8244 2569 11636 2908 -8224 -2652
684 -2652 6270 247 -6584 3533 13377 1196 -14983 -7730 9987 8809 -6062 -8330 2648 7026
698G026o584n970L41N720R005K492j2856j4184O887J9574K463j6029p001Q420
712f96K757o940J938J0091k555j2497J612J3757m46j5056j594J6696P684j2784
726A967j2713K267Q862N491Q47n522r218o34J0058L892q261k399J0775L063j3970
741e495p045J3971J1183r789j0446P317P745q896q794Q344J0399m474q368J293
755c055L070l149p8P263L065n503l931N26j121Q90Q925M409j2048j1806Q761J4056
771A0274n899j4206M694J5397k201j5850k516J2211N349m604r94J692n353n401
785g407O056R096j715p264j991M94j245L007O274k261q872J362J0457j189j2958
800h156m66J5775N680j3590r267P568O802m937k777O380J906q100m660M764M171
$$ plain form
698 7026 442 -5528 -5187 533 9538 12030 -826 -15010 -8123 11451 13914 -2115 -9116 -696
712 -696 2061 -4879 -2941 7150 4595 -7902 -6290 7467 7021 -8035 -9629 7067 14751 1967
726 1967 -10746 -8479 383 5874 6721 1199 -8019 -8653 1405 5297 -2964 -5363 5412 8475 -5495
741 -5495 -12540 1431 12614 2825 -7621 -304 7441 -1455 -10249 -1905 8494 4020 -4348 -3055
755 -3055 15 -3134 -3212 4051 7116 1613 -2318 -1792 -2913 -2023 6902 11311 -737 -12543 -3782 10274
771 10274 4375 -9831 -5137 10260 8059 -7791 -10307 1904 7253 2649 1655 3347 -2006 -7407
785 -7407 -1351 7745 6030 -1234 -3225 -2731 -3976 -969 5305 3044 -5828 -4466 5991 4802 -8156
800 -8156 -8622 7153 12833 -757 -10024 -2456 4346 -591 -3368 3012 4918 -3182 -7842 -3078 1093
815A093J10J944P99o849n709O777R272k943p604J965M686m698n021O051O111n924
831F0o028O382N811q331q452Q264J2963k149j1993m248N030N496L078m79o598
846a194n874N165Q954l405j1106J168J2266K452j0770n209O124L884j934K381
860B902M275o193j0801L053J4076L587j0823p510L740N060O7j086o91j635P99
875a180L859o95o314m11Q512L529p865n198N941M400n918m083O525N166n983o585
891f300L000N126j114j909K712J092m083k340L215L115p5k12j020m070j608N722
907A251M509n285o265M393P057m012q616K553J0203J261q354l781M424L336j046
922A628k91O31k183k565J801L384n55k923j248P55K106K784p31o447l450P986
$$ plain form
815 1093 1203 3147 3946 -2903 -8612 -1835 7437 4494 -3110 -1145 3541 -1157 -6178 -127 5984 60
831 60 -5968 414 6225 -2106 -10558 -2294 10669 8520 -3473 -7721 -2691 2805 5883 5404 -1194
846 -1194 -7068 -1903 7051 3646 -7460 -6292 5974 8426 -2344 -7553 -1429 2455 521 2902
860 2902 7177 984 -9817 -6764 7312 10899 76 -7434 -3694 1366 1433 347 -344 -1979 -1180
875 -1180 2679 1984 -4330 -4741 3771 7300 -565 -5763 178 4578 -1340 -5423 1102 6268 285 -6300
891 -6300 -3300 1826 712 -1197 1515 2607 -1476 -3816 -601 2514 2439 2227 1207 -2863 -4471 1251
907 1251 5760 475 -5790 -1397 5660 1648 -6968 -4415 5788 7049 -1305 -5086 -662 2674 1628
922 1628 1337 1968 -215 -2780 -979 2405 1850 -1073 -2321 -1566 540 3324 2593 -3854 -7304 682
938F82R983m309j3918k746J2105Q053o365q466P70M451K63j271J087M15k164r88
954b418J961J474o49p47l0M8Q49J269j382l252N92M689R01n291k746M371L707
971C346l538l841L031M622j860m742N34M563J156l191k045J739K322m01k924j796
987c025K527M233o01n901k823N248N823k314o005N5M729O55l408L5L642j36m868
1004b134j570M547L610k817n083l11M325L006j920l871o49L210K323j364k068
1019g66N58J152j404j331K439K828k657n146M75N892K380m770m413K385N085K05
1035B912m107j725K925K856j362l234k54K880J356k319k205J408K396j012k889
1050b374O73L781N63m286k458L979N006j530o055j965M933M804j693n601k164
$$ plain form
938 682 10665 6356 -7562 -10308 1797 9850 3485 -4981 -4211 240 503 -768 319 734 -1430 -2418
954 -2418 -457 1017 368 -379 -409 -361 488 1757 375 -2877 -2285 2404 3305 -1986 -4732 -361 3346
971 3346 -192 -4033 -1002 3620 1760 -2982 -2448 2115 3271 80 -1965 -226 2096 1695 -1229 -3025
987 -3025 -498 3735 3134 -2767 -5590 -342 5481 3167 -2838 -2783 1946 2601 -807 -772 2870 2734 -2134
1004 -2134 -3704 843 4453 1636 -3447 -3758 567 3573 1653 -2218 -2867 343 2666 1302 -766
1019 -766 -208 944 -460 -1791 648 3476 819 -4327 -3852 2040 4420 -350 -4763 -2378 2707 2912
1035 2912 -1195 -2920 5 2861 1499 -1735 -1989 891 2247 -72 -2277 -869 1527 515 -2374
1050 -2374 -1701 2080 2643 -1643 -4101 -122 4884 3354 -2701 -4666 267 5071 3378 -2223 -4387
1065d387L349L832k51k892j651L58R33J338J703j14l357k785K641N478N49n855
1081a111m215L571N904m22n795k534L993M015k034m523K74M636J663l981l255
1096c814K741M605o90m754j553L604K815k098l127N05K403J03j802j75J667L87
1112H17j619o97J869J614j430k341O78K998N01l312k255K723L902j230n076j356
1128d214M598L994k360n044m94M216K875j657k849m01J252O43L09P64k39k521
1144a128k087K059M602O40n278m447L143P023J077o480m853L520O714M19n748
1159h24l516L072M369m82l694j359J963J555q23r88M79M36q15k31J612J005j901
1176a42k151J428L283o3l833j956K962L480j247m182r41L519K638k127l439P20
$$ plain form
1065 -4387 -1038 2794 2543 -349 -2000 -1642 -709 629 2332 2218 -1139 -3924 -1283 4195 4744 -1111
1081 -1111 -5326 -1755 4149 3727 -2068 -4602 -609 3406 1372 -3151 -2877 1759 3422 -559 -3814
1096 -3814 -1073 3532 2842 -1912 -3465 139 2954 856 -2271 -1766 637 740 -1062 -1237 430 817
1112 817 -802 -1499 370 1984 554 -1787 -1109 1889 2390 -922 -3177 -454 3448 2218 -2858 -4214
1128 -4214 384 4378 2018 -3026 -3520 696 3571 1914 -935 -1336 -84 559 868 1632 1393 -1128
1144 -1128 -3215 -1156 3446 4086 -1192 -5639 -2496 4527 5604 -876 -5729 -2209 4505 4924 -824
1159 -824 -4340 -1268 3101 2619 -1075 -2434 -471 1084 261 -727 -248 188 -627 -858 754 1759 -142
1176 -142 -2293 -865 2418 2355 -1478 -3434 -472 3008 1761 -2421 -3362 157 2795 668 -2771 -2051
1192b051L848R34l582k428K895L822j259m483p56L684K196k221k590O40J867L1
1208E47q96K60N84o47r83P91K088M49k446k536J224M211J391m138m422J841N626
1225B944J104m804l159K745L537q58k594O7J670l5r01M87P72q84j352M89J852
1242A080O40j672k406j28L022K767j851m613m78M913K869l657m123K159M419p43
1258B198m008l43L046O13k185m81J773K99j875r47J582K008K43j892k322K59L424
1275A392K155k708l523J279L638o34l440L68L560k21l785l25L757Q23l567j079
1291b310L542J992k831k963J076K904R94j151k177j183J541K469o66l033K27L586
1307B017J90m520j277M925K803m035l550K949L407k344l377J890L359r25k906
$$ plain form
1192 -2051 1797 2731 -851 -3279 -384 3438 2179 -2304 -3060 624 2820 599 -1991 -1351 516 547
1208 547 -349 -89 495 -152 -1135 -344 1744 2193 -253 -2789 -1565 2646 4037 -101 -4523 -2682 2944
1225 2944 4048 -756 -3915 -1170 2367 1509 -1085 -1018 652 617 -284 203 975 91 -1261 -772 1080
1242 1080 1720 48 -2358 -2486 536 3303 1452 -3161 -3639 1274 4143 486 -3637 -1478 2941 2198
1258 2198 -1810 -2153 893 1506 -679 -1160 613 912 -963 -1910 -328 1680 1923 31 -2291 -2032 1392
1275 1392 3547 839 -2684 -1405 2233 1599 -1841 -1473 2087 1866 -1919 -2244 1513 2336 -1231 -2310
1291 -2310 1232 3224 393 -2570 -1494 1410 2404 1253 -924 -2107 -566 1903 1237 -1796 -1569 2017
1307 2017 2207 -2313 -3590 1335 4138 103 -3447 -498 2909 565 -2812 -922 2437 1512 -1394
1322a394l31J271K21K50Q59l02j385k01N48l53N84K675N8m770k333N076M720m084
1340A109o223K515O861o41o815j585N140L155k006k290k61l67K23K404J674j946
1356I47k562K23J179L87Q67O23k269k361K721M083k660o126J618Q050J304p887
1372a863m302N184N084j924l221O25Q91j400k00J847K78j373L43Q83j510j364
1388b022K035J958j741j275K254N19l981j243N360L157n076m526L607M538k964
1403F00m437K588M917j114m654r80K318J781R94O8k474k616J762L640q34l435
1419a876R24L425j288m047Q71L972o79l163J814L654l023n767K154P578R47o493
1435i97l487L121L169l12j084p05r58O68K357n39l810l54M940K161m247l145K532
$$ plain form
1322 -1394 -1725 -454 -233 17 876 574 -811 -1012 -464 -817 -233 2442 2500 -2270 -4603 473 5193 1109
1340 1109 -5114 -2599 4262 3621 -3194 -4779 361 3516 1510 -780 -1041 -1408 -1185 1219 2893 947
1356 947 -1615 -1392 -213 174 1041 1664 -605 -2966 -245 3838 1178 -4948 -3330 4720 6024 -1863
1372 -1863 -6165 -981 4103 2179 -1042 -417 474 -926 -1126 721 999 -374 -31 852 -658 -2022
1388 -2022 13 1971 230 -1045 1209 1728 -2253 -3496 1864 5021 -55 -4581 -974 3564 600
1403 600 -3837 -1249 3668 2554 -2100 -3080 -762 1019 2013 2081 -393 -3009 -1247 2393 1559 -1876
1419 -1876 -952 2473 1185 -2862 -1991 1981 1302 -1861 -47 3607 584 -5183 -3029 4549 5496 -997
1435 -997 -4484 -1363 1806 1494 410 -295 -1253 -585 1772 1233 -2577 -2931 2009 4170 -77 -3222 -690
1452f90J984j968mL692l04n680j734N441L440l611l240K139K057j978j445J743
1468a58J300o71O6J95k156j357L174L006k614l473J986K953k684l317L337M657
1484D244k387n251O98M137j9k619R59K355j416k818P73K227j76p03P47k63j893
1501a405J83K169m05k050J580L279k219n296Q51O359J481n093k399L146J425k607
1517a001l52L070M76l159j049K248P22j428P1J333k93r47N55n6j867N41L844P19
1535C427m792k813L797L533k384k861K113K149k667k488K544L031j477k545P98
1550f35J523q18j022P89P08k20M32K1k301j397L103L449k161m362P26L662k00
1567A297k819Q95K914j184l424O88L509j78l113j77K825O46k384j419R48J447
$$ plain form
1452 -690 1294 -674 -678 3014 2710 -2970 -4704 737 4177 566 -2674 -535 1522 -456 -1901 -158
1468 -158 1142 471 537 732 -1424 -2781 393 3399 785 -2688 -702 2251 -433 -3750 -413 4244
1484 4244 1857 -3394 -2696 1441 1422 -1197 -238 2117 701 -2117 -1344 883 707 4 751 488 -1405
1501 -1405 -1222 947 542 -1508 72 3351 1132 -4164 -3313 3046 4527 -566 -2965 181 1606 -1001
1517 -1001 -1353 1717 2193 -966 -2015 233 955 -473 -402 931 638 -309 246 190 -1677 -1136 2708 3427
1535 3427 -1365 -4178 -381 3152 768 -2093 20 2169 -498 -2986 -442 2589 1112 -1433 -635
1550 -635 888 70 -952 -163 545 325 757 778 -1523 -2920 183 3632 1471 -2891 -2165 1497 1297
1567 1297 -1522 -627 2287 1103 -2321 -1633 1876 1698 -1415 -1592 1233 1879 -505 -1924 -976 471
1583D71J004J1j885k033J172L227l2k995l58K803R3l285m52L719J373l318k043
1600b528K311J778j757j257J690J238j372j286O62Q70j08m0J70n17k89O78n2j387
1618a196K65K643L93l537j982L301L320k045l596Q52L212ok564m90J655P38n54
1635D09l39k34o68J4J210P31o13p81m15l83P11K028M56k871k211K528L581j257
1653A896m231k22L879J612k829k376J173K034J62q64l96j89j19M25N77kk93k02
1671C5m22j66Q66Q13r94j509P77K110l34k677n21K894J525k296k296J306K440
1688A551k66k027n04J443R43o79j291k26J075J146n18j555l88J427R32r69r35
1705h41P85P18q33o44J124R03j399j435J243K197o07k684p35K460K015j178k644
$$ plain form
1583 471 1475 1486 -399 -2432 -1260 1967 1935 -1060 -1418 1385 1478 -1807 -2259 1460 2833 -485 -2528
1600 -2528 -217 1561 -196 -1453 237 1475 103 -1183 -521 349 241 201 371 -146 -435 243 191 -1196
1618 -1196 -931 1712 2105 -1432 -3414 -113 3207 1162 -2434 -1582 1630 1624 -940 -1430 225 963 409
1635 409 70 -164 -832 -818 392 1123 510 -271 -686 -1069 -358 1670 2126 -745 -2956 -428 3153 1896
1653 1896 -2335 -2557 1322 2934 105 -2271 -1098 936 1098 234 -162 -351 -470 -45 532 530 237 35
1671 35 -387 -553 313 1126 132 -1377 -600 1510 1176 -1501 -2022 872 2397 101 -2195 -889 1551
1688 1551 1285 -742 -1246 197 1140 461 -830 -1056 19 1165 647 -908 -1296 131 1063 94 -841
1705 -841 -56 662 -171 -815 309 1212 -187 -1622 -379 1818 1211 -1473 -2208 252 2267 1089 -1555
1722a555o13K180K040p51k410p08J874J540q50j716J31J273Q1q54J41P38m81j171
1740a111N03J766J59k028j131J556K045m67k151q00J548J646n89j841m38J479
1756A46J093r38j344L87J375o0j278j97J304N20j271r02J112J290o28j512p9J439
1774D57O11j024j041N44J125m4j163l01J138P52j029j156O94J669j59j890o69
1791a486J738J426j096j915K18J833O16j406j035P38J156k60j009RR50J28r49
1808c44l93J078Q43r74j481M71J876L19j811j230J240J778l73j795m01J448Q53
1825A104r24r49N06R61l13j074R6J230K51j265r47J017J559l27j876o17J613J443
1843A488p89j808p7J547P75j007r64M89P84k44o02K32O31l17j008J76J358N16
$$ plain form
1722 -1555 -2168 12 2052 1301 -1109 -1817 57 1597 747 -969 -838 435 516 -338 -197 541 60 -1111
1740 -1111 -608 1158 1317 -711 -1842 -286 1759 1292 -859 -1659 -111 1535 946 -895 -1333 146
1756 146 1239 301 -1043 -656 719 659 -619 -816 488 1008 -263 -1165 -53 1237 609 -903 -982 457
1774 457 1068 44 -997 -453 672 628 -535 -836 302 1054 25 -1131 -437 1232 1073 -817 -1486
1791 -1486 252 1678 582 -1333 -1115 718 1334 -72 -1107 -369 787 527 -482 -473 477 605 -344
1808 -344 -737 341 1184 210 -1271 -800 1076 1395 -416 -1646 -406 1372 999 -796 -1197 251 1104
1825 1104 180 -769 -263 698 385 -689 -593 637 888 -377 -1324 -307 1252 925 -951 -1568 45 1488
1843 1488 699 -1109 -1186 361 1136 129 -835 -346 438 194 -408 -176 455 138 -870 -694 664 1180
1861A180j445j273Q86J902J82j963j261J309J937k58j942p42J499J271q23j429
1877i70K42J329R3j083l35J055M56r44o97Q36J049n48j284K4J228N13j030q28
1895h94O13J078k58j214k72J302R19j023j538L85J892M31j731j203J265J615n57
1912H10j712k28J459P06r10p67L14N43j44j92K96K76m32o43J37J015N73r65j402
1931a266L40J905O33j879j798J280K615r3k692j142J877J863o31j609k64P95L76
1948C10j61l0Q7k43k97Q0M58K51l21p66m9J141P62j107j688N47K329M62k266j403
1968a904J606J804q83j763L31J693mj408n87R50Q94j51p73m62L28O69K6o05j69
1987d08P93K34j035o12J067J055j012j260J013J398r33j913N81K416L30k278j244
$$ plain form
1861 1180 -265 -1538 -652 1250 1432 -531 -1792 -483 1454 1196 -746 -1488 11 1282 459 -970
1877 -970 -728 601 694 -389 -724 331 787 -157 -854 -18 1031 483 -801 -777 451 964 -66 -894
1895 -894 -281 797 539 -675 -947 355 1274 251 -1287 -902 990 1421 -310 -1513 -248 1367 810
1912 810 -902 -1130 329 1035 125 -642 -328 215 71 -121 175 451 19 -624 -487 528 1101 136 -1266
1931 -1266 -926 979 1612 -267 -2065 -785 1830 1737 -955 -2097 -220 1643 1012 -597 -861 -66 310
1948 310 149 119 206 -37 -334 -254 204 455 134 -632 -681 460 1222 115 -1573 -1026 1303 1765 -501 -1904
1968 -1904 -298 1506 623 -1140 -809 884 880 -528 -1115 -165 729 578 -195 -657 -329 340 366 -239 -408
1987 -408 385 619 -416 -1028 39 1094 82 -1178 -165 1233 300 -1613 -1032 1384 1714 -564 -1808
2004a808J346J586k38j127n52M74P76J53q12p69P24J258k78j447j37J181J25r27
2022d72K99J357m72k194j34K489J240j995j809J033J681k69j283j69Q25N40j32
2039E35p35p50L48J386L92j258q24R26O39j046n61J574J029j773j731J237K036
2056A424n82j804L31J548k26j440j49J161N05l85m42k76j51M10N18m00m55P29
2074C16N99j303j407J344K396o23k583k43K148M47j685l31J658M83j634q13J056
2091a75Q01m63l08K76q6l11J27Nl18N12J129m60k001k79K128J001j666j038J352
2110B26Q20j647r81J826J504j331j673O14J227l09p82L36N84m2k32l19o81J16
2128g44J489R20j578j759Q83J791m62j392P09J376j052j811Q84K050l76j911K00
$$ plain form
2004 -1808 -462 1124 886 -241 -793 -319 457 610 -202 -971 -247 1011 733 -714 -851 330 455 -472
2022 -472 -173 1184 712 -1482 -1616 873 2113 118 -1691 -658 1023 754 -529 -698 127 667 535
2039 535 -200 -950 -602 784 1176 -82 -906 20 659 -387 -948 626 1655 -118 -1849 -612 1424
2056 1424 842 -962 -631 917 691 -749 -898 263 768 383 -59 -335 -486 -76 442 42 -413 316
2074 316 915 -388 -1795 -451 1945 1322 -1261 -1504 644 1091 -594 -925 733 1216 -418 -1231 -175
2091 -175 626 163 -145 131 45 -266 -139 -134 -452 60 1189 729 -1272 -1551 577 1578 -88 -1126 226
2110 226 1046 -601 -1582 244 1748 417 -1256 -642 585 276 -506 -170 414 372 140 -179 -860 -744
2128 -744 745 1665 87 -1672 -789 1002 540 -852 -143 1233 181 -1630 -746 1304 928 -983 -783
2145g83J711n1j756l98J371J019k66q03r09l93J158J537m46j864j56J671J44j616
2163h30q0J909L33j944o48J607N10j435k95J732N75j860j129J164J297j60o36
2180A10k21k33oO24J78q08o2J293K56k028r73K062J788j400j982Q23J533o73j328
2199a047P81J358m83j255J62P39k61l85N79N47n33o34l0PK46J101L66j682j440
2218a864J390K193p50k386L12K346J17k213p54J767J003q56o85L46j06n60M37
2235b63J043q5q99l88K52J83L62M98n55j033M03J520k97j992j24K355R10k095
2253b05j648J292J688n39j118L51O35m88n94M44N38j14j30j7l50k68N90M54n88
2272f7m12P46M70j173p93J343J350j055j643O83J581m36j560J97J624K50j362
$$ plain form
2145 -783 928 877 -879 -1277 94 1113 847 44 -865 -1258 -100 1437 991 -873 -1029 642 786 -830
2163 -830 -910 999 1332 -612 -1260 347 857 -578 -873 859 1434 -426 -1555 -391 906 746 110
2180 110 -111 -344 -350 274 452 -356 -418 875 1131 -897 -1870 192 1980 580 -1402 -579 954 281 -1047
2199 -1047 -266 1092 609 -646 -484 255 -6 -391 188 735 202 -432 -462 -455 -209 892 1258 -424 -1864
2218 -1864 -474 1719 969 -1417 -1105 1241 1358 -855 -1609 158 1161 305 -380 -34 -140 -700 -263
2235 -263 780 695 -204 -592 -340 -157 205 703 148 -885 -482 1038 741 -1251 -1375 980 1890 -205
2253 -205 -1853 -561 1127 588 -530 -179 456 -32 -626 -182 356 242 112 95 -255 -523 67 521 -67
2272 -67 -479 267 737 -436 -1229 114 1464 409 -1234 -551 1030 594 -966 -769 855 1105 -257
2289b57p23O01P39J69k41n01l02L74N95k88o56L98Q38m53j109L13J291k39j283
2308g34K27J453j57j726l47J744J024j175j289L59R93J60m30k95l3K63L35k22
2326A50o20J01Q47J01q82k45Q49K45j004l12J271O36j273j115Q54J377k94j168
2344d82r1P74J71m16k16J76K45O5j68m10J2O45J41o93l29Q20N39r60q99Q89J288
2365A101m76j528J0J329L29r38n34O67N24l34n48P7M53J84k31l45nM38J84n25
2385a68l88N93O88n33r69J88J140J42j072l63R42N24q26o20O48P82l32q68j01
2404e93P59M31l70o77m6O61M96m72q05J64Q92J86p84m20O04M77n26m00M95N10
2424E82n46p24M26R29r1r81l76Q01P77l76r56k13Q60P37m37j054j51J014N91o22
$$ plain form
2289 -257 -980 -379 360 529 288 -213 -515 -141 454 166 -490 -92 746 293 -816 -503 788 549 -734
2308 -734 -507 946 789 -937 -1284 460 1484 309 -980 -621 372 532 102 -193 -226 37 372 150
2326 150 -470 -369 478 579 -303 -548 301 546 -458 -770 501 1137 -136 -1251 -397 980 686 -482
2344 -482 -573 201 372 -44 -260 -84 161 226 58 -352 -340 305 446 -247 -576 244 783 -177 -1076 -187 1101
2365 1101 625 -903 -893 436 765 -173 -707 -40 484 150 -398 -321 132 316 85 -260 -265 173 357 -168
2385 -168 -556 37 725 192 -777 -589 551 693 -379 -742 200 724 -102 -722 -74 708 376 -492 -593
2404 -593 166 597 227 -450 -496 165 661 189 -616 -452 440 626 -158 -578 26 503 -23 -423 72 582
2424 582 36 -688 -262 667 576 -405 -781 20 797 421 -535 -748 112 849 412 -642 -793 221 812 190
2444A90p83K40O99o8m97Q4M22j43n52J13P27J29q06n09O65Q14k31r45l14P78Q01
2465H14m08r81j44R28N35o50q35L96Q82m6q25k77P10M87n12n31K43N35p1m61l0
2486b41M28P0l89k15L16M51k63o31M3Q19K78p46p43N14J007o1j094m36Q44Q59
2506H10m20j016k9Q32M11m71n53J55M78ql02J9K09Nl72m9N33K64n73o50M13R65
2528F51M8j018o24P68J012k63j039l14Q32O37m17p20Q7N73J62m41k42L36K46k51
2548B3l02K10M11j32n48l0O16L05n34o32L43P63l1p93k85O77N95m72p52K09P69
2569D10P9p05l47N44N67k95o32oN98K47m21m62K04N92m0n44j56N07K53m22l86
2590d15M15M78k98o91R8Q49J72p58n27M99P68j67p20k36O15L95l06n07KN10J89
$$ plain form
2444 190 -593 -353 346 278 -219 -135 287 144 -408 -295 432 561 -245 -754 -89 725 494 -451 -765 13 814
2465 814 406 -575 -719 209 744 94 -741 -345 537 491 -334 -611 99 586 74 -457 -214 321 250 -211 -241
2486 -241 187 257 -132 -347 -31 420 157 -474 -431 388 666 -80 -823 -309 698 637 -457 -893 -49 810
2506 810 390 -626 -655 177 588 117 -436 -281 197 189 -113 -94 115 120 -252 -301 232 496 -77 -727 -314 651
2528 651 699 -319 -943 -175 837 574 -465 -779 53 690 273 -447 -360 213 375 -66 -308 28 274 23
2548 23 -279 -69 342 210 -338 -368 248 553 19 -613 -270 493 462 -331 -616 61 656 184 -568 -359 410
2569 410 489 -216 -563 -19 548 253 -379 -385 213 460 39 -423 -219 373 333 -211 -367 140 393 -29 -415
2590 -415 0 478 180 -511 -413 436 608 -150 -677 -178 590 423 -297 -533 82 477 171 -336 -334 176 365
2611C65m10k73K95L52k72m84K31O76rq43l11P40O97o04p47J82P52R6o08l10M46
2632c9L96j72m16m4K93J89j85k59K11L24j63n80PP62L50p74o59N13R23k54r00
2653d77r1Q03L69o35m62L02M64m6k76j19J77Q9j25j17Q6L36N2n53k92N07N82k86
2675B88p94R7Q33J03r21k72Q54N60o22p33L11O64l0m80j28K91K47j50l04j31L26
2696IM28j36n90j50N41K59m40k59N53K79o87m79O86P39n19q41K50Q96j10p91j90
2717e52O30M95k20n75l41K56O60K37n17o29L22O11j97n34K21N77k17o74J31P35
2737D19j66p67J24R17P5r68m78P31P32j74n75k80J66L37K04k19m21J85N63j16
2757B89p90j16R35L73p81m55N54L68n39l66P00N15o49o99L83O49j07m49%L16j2
$$ plain form
2611 365 -45 -318 -23 329 57 -427 -196 480 471 -372 -683 57 754 150 -597 -415 337 433 -175 -485 -39
2632 -39 357 185 -231 -275 18 207 22 -237 -26 298 135 -445 -438 324 674 -100 -759 -246 677 423 -477
2653 -477 -568 235 604 -31 -493 -191 273 227 -49 -168 9 98 -27 -144 -58 278 330 -223 -515 -8 574 288
2675 288 -506 -409 424 527 -394 -666 188 748 126 -607 -296 368 338 -142 -270 21 268 118 -186 -317 9
2696 9 437 301 -289 -439 102 361 -79 -338 215 494 -193 -672 14 753 234 -607 -357 539 429 -362 -552
2717 -552 78 573 353 -222 -563 -307 353 590 73 -556 -234 377 180 -354 -133 444 227 -447 -316 419
2737 419 253 -514 -390 527 602 -366 -844 -113 619 445 -130 -410 -244 93 297 78 -343 -158 405 289
2757 289 -501 -617 318 691 -90 -545 9 377 -162 -528 172 687 38 -661 -278 371 264 -185 -185 131 119
2778A19j89j64L2K01N19r2q63l69Q19P95o18q74M70Q64l64r71K25R39N6p09j49
2799c23M25k6l61J51N28k8n18j96J37J87L45J02m76m81M03O95l44r06L25J099
2819G38j3j164m74R84O55n97m62M27J59m63k03N63L19l08l30J6N9N3J99nk68k8
2841a43M88p6p68j67J042N61r12q66N76Q37l90o82M13O93m15p53R1O71J47k75
2861G2j48J8q3K9J79r4j42L40K24n16o06N40Q55l18q50K33P48k28r26J82J116
2882F25Q2r47m31O19L40k37j51J64J7j44pm1o1J90M04k22o25PO99Q4p06l3Q49
2905D75J05j023m47R44P64n78p12K30N02k21k63J71L24j27j96k8r5M8L11J05l58
2926f9j83L88J39o19k08Q16O47q12r39L97J015o5q41OO02L5n76m9L81J48j52n5
$$ plain form
2778 119 -70 -234 -202 -1 518 426 -437 -806 13 808 190 -684 -214 650 286 -685 -460 479 535 -174 -323
2799 -323 102 76 -285 -134 394 366 -152 -348 -211 -24 321 423 -53 -534 -131 564 220 -686 -361 738
2819 738 725 -439 -913 71 726 129 -333 94 253 -210 -413 150 469 161 -169 -153 -94 -41 158 153 -115 -143
2841 -143 345 269 -499 -666 376 937 25 -841 -265 572 182 -500 -87 606 191 -562 -471 200 347 72
2861 72 -76 -58 -141 -112 67 -27 -169 171 395 -121 -727 -187 668 350 -500 -267 481 253 -673 -491 625
2882 625 707 -240 -671 -52 288 51 -100 64 81 -63 -70 -111 -172 18 422 200 -425 -418 281 365 -341 -374 475
2905 475 580 -443 -890 54 818 240 -472 -242 260 39 -224 -53 271 144 -52 -80 -175 -127 184 289 -69
2926 -69 -252 136 275 -344 -552 264 911 99 -840 -443 572 507 -334 -328 274 309 -267 -316 65 213 61 6
2948Fmj28M4J52k4j43K44J75m47n22N51Q46l11r11p3Q87J59q01j96P31L91o30
2970dm75K71M20m1j71l2LNN3k3j84J19L64j00m98r3N94J90n59j88N95J95o57m19
2994f35O37O71l91p91J11O20J05l97j81J45K28Q9k43k65J3M82K50m56m01K95L86
3015B72k56l10L15L98l69n58K80O99j21p24l0O47J97m91l87K75M56N9l38l36K6
3036b96L85L02k99m11J17M70r2m82N4N22L9n28j44N55J65m95k55M75L63l82m67
3057d04J25N09R4k98k49N7K78J16k34k91K13M25n2n41j76N63L35m33m44L09M46
3078C48j88m66J42L99Ql90q5L20J43k39j80J49K14L9l20k12J89M71Kn94k36N24
3100C8M63l38n76J23N66Q2n18j94M20K19k73k16J93J96j22k56N0K92Q7k58k86
$$ plain form
2948 6 2 -126 -82 70 46 -97 147 322 -125 -647 -96 750 439 -472 -545 342 501 -300 -496 235 626 -4
2970 -4 -479 -208 212 171 0 -32 -29 -24 29 6 -178 -59 305 205 -293 -386 208 398 -161 -349 246 441 -216 -635
2994 -635 2 673 282 -509 -398 222 327 -70 -251 -106 122 211 -32 -297 -284 198 448 -8 -409 -114 272
3015 272 16 -294 21 419 50 -508 -228 471 350 -374 -404 243 440 -51 -438 -163 293 352 14 -322 -296
3036 -296 89 391 92 -319 -202 268 176 -306 -252 270 309 -219 -363 192 357 -138 -393 82 445 63 -404
3057 -404 -279 230 324 26 -223 -166 112 228 -6 -297 -84 341 289 -252 -428 135 470 37 -407 -98 348
3078 348 160 -306 -164 235 243 -147 -232 88 231 -8 -188 -39 175 214 -106 -318 -129 342 344 -250 -486 38
3100 38 501 163 -413 -290 276 358 -160 -354 66 285 12 -204 -11 185 63 -193 -143 149 236 -22 -308
3121c08J30M04R0m10k94L30M49j57m88p8N03J90m11l32L08L64j97l27L0L66M1
3142B03l38r7K44K48j46l31j0L16J93k75l16J50M07Qm10j88L99K73k68m03J74
3163a67M41p5m22p3M04K05l16l08J70L65K5l54j62K33L03j53l59L6L87J03l92
3184a09k24K97L72j88m10L8M25J13l80k91L07L33j24l51k3L17J20k30j82J61K25
3205A96o0l06PK92J29k99k98L01L93j43m79j17M82L19l31m40J27M46P0l77j73
3226b61K20K57j00k74M1K30N2k63r0K31K00k49k70J44L81J6m15k29L73L63j83
3247A74n05J6M86J65l72l14K26L76r7k86p1K52J39j85j98J36K34j7l28k4K64J92
3269B63k62l00K11L67o8m56k3M01J99l89l14K03M29J5m42j33L28K67j73l36JK99
$$ plain form
3121 -308 -178 226 316 -94 -388 -58 391 234 -254 -332 171 361 -50 -382 -74 290 93 -234 -204 162 203
3142 203 -135 -232 12 260 114 -217 -227 89 282 7 -309 -159 248 256 -154 -342 57 330 62 -341 -167
3163 -167 274 199 -223 -296 108 313 -3 -311 -141 224 249 -105 -267 -34 269 116 -243 -207 180 283 -109
3184 -109 -333 -36 336 148 -262 -224 201 314 -66 -357 -50 283 159 -192 -215 102 222 -8 -190 -29 196
3205 196 136 -170 -163 129 258 -41 -339 -38 355 212 -267 -384 98 417 86 -354 -227 219 289 -88 -261
3226 -261 -41 216 116 -158 -117 113 165 -98 -188 43 243 -6 -276 -132 249 265 -150 -379 -6 357 174
3247 174 -331 -315 171 336 -36 -350 -124 252 155 -131 -202 50 189 4 -194 -58 176 159 -169 -193 71 263
3269 263 1 -299 -88 279 211 -245 -268 133 332 -57 -371 -168 261 276 -166 -299 29 296 123 -213 -212 87
3291H7J77k26k77J37K88o2k48k0K61O5k75j19K87K16k59l19J52M27K1m60k20L51
3313a6L92j70m22q5L35K94k07l18J1L11Q5k20j77J60K54j66k67J11L03o1l56l0
3335b39M22J29l71l16K77M11o3l74j35K82K33j69k67K6K39J67k57k44J11L53m2
3356A73l35q6L31J79l10k46K86L32k25l39R0L31J1k94p9K40J58j61k70N3K58J19
3378B16j61k94O6L11J38l40k39K81L52k16m26O1M85Nl45j18K89J14k59j42K45
3399B3K07j25l15PK15J88j39j74l9J86K19k37l28J43M63Jm89j49L89K15k88k06
3421b33K52K40k56l05J69L84p4k89r2J93J43j07j26l3J95J51j21l38j0L91K12
3442C46l39l34K60L20j95l66K12M43j56m64qM02J23k90j03J54J57r6j91MJ21J86
$$ plain form
3291 87 264 38 -239 -102 186 124 -124 -144 117 182 -93 -212 75 291 32 -287 -135 292 313 -147 -367 -16
3313 -16 376 206 -216 -301 34 328 121 -197 -186 125 210 -10 -187 -27 227 61 -206 -95 208 147 -209 -239
3335 -239 183 312 -59 -375 -98 313 250 -124 -259 23 256 87 -180 -154 85 252 -5 -249 -138 215 173
3356 173 -162 -248 83 262 -48 -294 -8 324 99 -240 -150 181 192 -102 -181 59 217 56 -214 -161 97 216
3378 216 55 -239 -173 138 276 -64 -303 -22 330 114 -312 -251 234 239 -106 -224 65 179 -80 -222 23
3399 23 230 105 -210 -203 12 200 61 -113 -152 34 253 16 -312 -169 294 295 -194 -343 46 261 -27 -233
3421 -233 19 259 3 -302 -133 251 177 -112 -204 -11 132 25 -101 -134 61 212 91 -247 -257 134 346
3442 346 7 -327 -67 253 58 -308 -96 347 191 -273 -281 121 244 -46 -149 5 162 66 -125 -121 0 186
3464A86j6k71j74K44K66j54l01J28L80j02m54m4N38J68m27k64K61K57k27j70J68
3485hK28j17k46PJ06J05L7r9j32N3K06o5l20L4M72J37n58l23L88N10k51m11J23
3508a24L63j29l48P9K92O7k12j06M8N6j1J9QNP6kl04r7M25L55l80m77J62N18p4
3533B09m62RM75O2m60j40K67K70j94j23Q5L9r1j7O9J0P0N5k07j80J35L65l1m19
3557b04mM14O4n03j62N21L35m32l93K37L18q1k20N5J73l3j34q0N9Q9J66k8k61
3580a04j17K44J56k38r9K66J68l70l20L48M67k07m80R4M06j6l67p6L10K06j73
3601I8k31k2J05J38Q2r1k24Q2J83j19j56J07L64j59m44P5M18L0m67j3M32R3l81
3624a00k58K79L35r2k21o2M5O4N4n2n5mJ74o3k66J2L85P8l91j31K89K25l68j82
$$ plain form
3464 186 170 -101 -275 -31 235 81 -220 -92 288 186 -268 -312 226 394 -33 -297 -36 221 -6 -176 -8
3485 -8 220 103 -143 -136 -30 75 112 13 -119 -66 140 75 -245 -211 261 398 -160 -483 -95 415 164 -247 -124
3508 -124 239 110 -238 -159 133 200 -12 -118 -70 -14 -25 -6 2 7 83 81 -223 -320 105 460 80 -397 -235 283 209
3533 209 -253 -244 231 293 -167 -307 -40 230 36 -87 -2 37 -54 -71 -2 8 78 133 -74 -254 -119 246 215 -204
3557 -204 -208 206 270 -233 -395 126 461 29 -364 -127 191 110 -110 -55 118 85 -49 -129 -70 19 185 157 -104
3580 -104 -221 23 179 -59 -158 108 276 -94 -414 -66 401 194 -286 -192 214 198 -169 -245 65 271 98
3601 98 -133 -155 -50 88 170 79 -145 -63 120 1 -155 -48 316 157 -287 -212 206 236 -231 -244 188 281 -100
3624 -100 -358 -79 256 164 -57 -119 -74 -10 44 -8 -63 -67 107 44 -222 -210 175 253 -138 -269 20 245 -123 -305
3648c05L45L15k67m04J26L34K2k29k3R9L8o7j00K6P0J88l0k77j10K87K05k02k60
$$ plain form
3648 -305 40 355 88 -316 -190 144 166 -63 -86 13 51 -16 -116 -90 -20 168 138 -139 -249 38 243 41 -219
$$ [...]
8191B5
##END NTUPLES=NMR FID
##END=
