##TITLE=1H_Pr 4687-bl
 CDCl3,8 sc, 
 12.03.2021
##JCAMPDX= 6.0         $$ Bruker NMR JCAMP-DX V2.0
##DATA TYPE= NMR FID
##DATA CLASS= NTUPLES
##ORIGIN= UXNMR, Bruker Analytische Messtechnik GmbH
##OWNER= root
$$ XWIN-NMR		Version 3.5
$$ Fri Mar 12 12:32:50 2021 Russian Standard Time (UT+4h)  she@DPX200
##.OBSERVE FREQUENCY= 200.131506
##.OBSERVE NUCLEUS= ^1H
##.DELAY= (6, 6)
##.ACQUISITION MODE= SIMULTANEOUS
##.ACQUISITION SCHEME= undefined
##.AVERAGES= 8
##.DIGITISER RES= 18
##SPECTROMETER/DATA SYSTEM= spect
##.PULSE SEQUENCE= zg30
##.SOLVENT NAME= CDCl3
##.SHIFT REFERENCE= (INTERNAL, CDCl3, 0, 15.7039)
##AUDIT TRAIL= $$ (NUMBER, WHEN, WHO, WHERE, WHAT)
$$ ##TITLE= Audit trail, XWIN-NMR		Version 3.5
$$ ##JCAMPDX= 5.01
$$ ##ORIGIN= Bruker BioSpin GmbH
$$ ##OWNER= she
$$ F:/spectra/data/she/nmr/H-F/1/audita.txt
$$ ##AUDIT TRAIL=  $$ (NUMBER, WHEN, WHO, WHERE, WHAT)
(   1,<2021-03-12 12:31:57.79 +0400>,<she>,<DPX200>,
      <created by zg, POWCHK disabled, PULCHK disabled
       configuration hash MD5:
       00 E9 B6 7A A2 85 ED C7 34 08 36 98 17 FE 4E 26
       data hash MD5: 16K
       08 C0 61 55 C1 A5 65 C7 21 F0 C2 7E A2 60 DE FF>)
$$ ##END=
$$ 
$$ hash MD5
$$ 9E 06 AA BA A6 3C 1F F1 85 57 61 9C 61 E2 94 08
##$RELAX= 
##$RELAX= 
##$RELAX= 
##$RELAX= 
##$RELAX= 
##$RELAX= 
$$ Bruker specific parameters
$$ --------------------------
##$DU= <F:/spectra>
##$EXPNO= 1
##$NAME= <H-F>
##$PROCNO= 1
##$TYPE= <nmr>
##$USER= <she>
##$AMP= (0..31)
100 100 100 100 100 100 100 100 100 100 100 100 100 100 100 100 100 100 
100 100 100 100 100 100 100 100 100 100 100 100 100 100 
##$AQSEQ= 0
##$AQ_mod= 1
##$AUNM= <au_zg>
##$AUTOPOS= <>
##$BF1= 200.13
##$BF2= 200.13
##$BF3= 200.13
##$BF4= 200.13
##$BF5= 200.13
##$BF6= 200.13
##$BF7= 200.13
##$BF8= 200.13
##$BYTORDA= 1
##$CFDGTYP= 0
##$CFRGTYP= 5
##$CHEMSTR= <none>
##$CNST= (0..31)
1 1 145 1 1 1 1 1 1 1 1 1 1 1 1 1 1 1 1 1 1 1 1 1 1 1 1 1 1 1 1 1 
##$CPDPRG= <>
##$CPDPRG1= <>
##$CPDPRG2= <>
##$CPDPRG3= <>
##$CPDPRG4= <mlev>
##$CPDPRG5= <mlev>
##$CPDPRG6= <mlev>
##$CPDPRG7= <mlev>
##$CPDPRG8= <mlev>
##$CPDPRGB= <>
##$CPDPRGT= <>
##$D= (0..31)
0 1.2 0 0 0 0 0 0 0 0.06 0 0.03 0 0 0 0 0.0002 0 0 0 0 0 0 0 0 0 0 0 0 
0 0 0 
##$DATE= 1615537917
##$DBL= (0..7)
120 120 120 120 120 120 120 120 
##$DBP= (0..7)
150 150 150 150 150 150 150 150 
##$DBP07= 0
##$DBPNAM0= <>
##$DBPNAM1= <>
##$DBPNAM2= <>
##$DBPNAM3= <>
##$DBPNAM4= <>
##$DBPNAM5= <>
##$DBPNAM6= <>
##$DBPNAM7= <>
##$DBPOAL= (0..7)
0.5 0.5 0.5 0.5 0.5 0.5 0.5 0.5 
##$DBPOFFS= (0..7)
0 0 0 0 0 0 0 0 
##$DE= 6
##$DECBNUC= <off>
##$DECIM= 32
##$DECNUC= <off>
##$DECSTAT= 4
##$DIGMOD= 1
##$DIGTYP= 9
##$DL= (0..7)
0 120 120 120 120 120 120 120 
##$DP= (0..7)
150 150 150 150 150 150 150 150 
##$DP07= 0
##$DPNAME0= <>
##$DPNAME1= <>
##$DPNAME2= <>
##$DPNAME3= <>
##$DPNAME4= <>
##$DPNAME5= <>
##$DPNAME6= <>
##$DPNAME7= <>
##$DPOAL= (0..7)
0.5 0.5 0.5 0.5 0.5 0.5 0.5 0.5 
##$DPOFFS= (0..7)
0 0 0 0 0 0 0 0 
##$DQDMODE= 0
##$DR= 18
##$DS= 0
##$DSLIST= <SSSSSSSSSSSSSSS>
$$ [...]
##$SUBNAM2= <"">
##$SUBNAM3= <"">
##$SUBNAM4= <"">
##$SUBNAM5= <"">
##$SUBNAM6= <"">
##$SUBNAM7= <"">
##$SUBNAM8= <"">
##$SUBNAM9= <"">
##$SW= 16.9725357007746
##$SWIBOX= (0..15)
0 0 2 0 0 0 0 0 0 0 0 0 0 0 0 0 
##$SW_h= 3396.73913043478
##$TD= 16384
##$TD0= 1
##$TE= 0
##$TE2= 300
##$TE3= 300
##$TEG= 300
##$TL= (0..7)
0 120 120 120 120 120 120 120 
##$TP= (0..7)
150 150 150 150 150 150 150 150 
##$TP07= 0
##$TPNAME0= <>
##$TPNAME1= <>
##$TPNAME2= <>
##$TPNAME3= <>
##$TPNAME4= <>
##$TPNAME5= <>
##$TPNAME6= <>
##$TPNAME7= <>
##$TPOAL= (0..7)
0.5 0.5 0.5 0.5 0.5 0.5 0.5 0.5 
##$TPOFFS= (0..7)
0 0 0 0 0 0 0 0 
##$TUNHIN= 0
##$TUNHOUT= 0
##$TUNXOUT= 0
##$USERA1= <user>
##$USERA2= <user>
##$USERA3= <user>
##$USERA4= <user>
##$USERA5= <user>
##$V9= 5
##$VALIST= <valist>
##$VCLIST= <CCCCCCCCCCCCCCC>
##$VD= 0
##$VDLIST= <DDDDDDDDDDDDDDD>
##$VPLIST= <PPPPPPPPPPPPPPP>
##$VTLIST= <TTTTTTTTTTTTTTT>
##$WBST= 1024
##$WBSW= 4
##$XGAIN= (0..3)
0 0 0 0 
##$XL= 0
##$YL= 0
##$YMAX_a= 293795
##$YMIN_a= -290489
##$ZGOPTNS= <>
##$ZL1= 120
##$ZL2= 120
##$ZL3= 120
##$ZL4= 120
##$ABSF1= 10
##$ABSF2= 0
##$ABSG= 5
##$ABSL= 3
##$ALPHA= 0
##$AQORDER= 0
##$ASSFAC= 0
##$ASSFACI= 0
##$ASSFACX= 0
##$ASSWID= 0
##$AUNMP= <proc_1d>
##$AZFE= 0.1
##$AZFW= 0.1
##$BCFW= 1
##$BC_mod= 2
##$BYTORDP= 1
##$COROFFS= 0
##$CY= 11.3945322036743
##$DATMOD= 1
##$DC= 2
##$DFILT= <>
##$DTYPP= 0
##$F1P= 15.9154993809931
##$F2P= -4.1035820241983
##$FCOR= 0.5
##$FTSIZE= 0
##$FT_mod= 4
##$GAMMA= 1
##$GB= 0.15
##$INTBC= 1
##$INTSCL= 1
##$ISEN= 128
##$LB= 0.24
##$LEV0= 0
##$LPBIN= 0
##$MAXI= 10000
##$MC2= 0
##$MEAN= 0
##$ME_mod= 0
##$MI= 1.114404
##$NCOEF= 0
##$NC_proc= 0
##$NLEV= 6
##$NOISF1= 3.799351
##$NOISF2= 2.8
##$NSP= 1
##$NTH_PI= 0
##$NZP= 0
##$OFFSET= 15.70392
##$PC= 1
##$PHC0= -11116.55
##$PHC1= 8.20094
##$PH_mod= 1
##$PKNL= yes
##$PPARMOD= 0
##$PSCAL= 0
##$PSIGN= 0
##$REVERSE= no
##$SF= 200.130013532006
##$SI= 16384
##$SIGF1= 3
##$SIGF2= 2
##$SINO= 400
##$SIOLD= 16384
##$SREGLST= <1H.CDCl3>
##$SSB= 0
##$STSI= 0
##$STSR= 0
##$SW_p= 3612.71676300578
##$SYMM= 0
##$S_DEV= 0
##$TDeff= 0
##$TDoff= 0
##$TI= <>
##$TILT= no
##$TM1= 0
##$TM2= 0
##$TOPLEV= 0
##$USERP1= <user>
##$USERP2= <user>
##$USERP3= <user>
##$USERP4= <user>
##$USERP5= <user>
##$WDW= 1
##$XDIM= 8192
##$YMAX_p= 0
##$YMIN_p= 0
$$ End of Bruker specific parameters
$$ ---------------------------------
##NTUPLES= NMR FID
##VAR_NAME=  TIME,          FID/REAL,        FID/IMAG
##SYMBOL=    X,             R,               I
##VAR_TYPE=  INDEPENDENT,   DEPENDENT,       DEPENDENT
##VAR_FORM=  AFFN,          ASDF,            ASDF
##VAR_DIM=   8192,          8192,            8192
##UNITS=     SECONDS,       ARBITRARY UNITS, ARBITRARY UNITS
##FACTOR=    0.0002944,     1,               1
##FIRST=     0,             0,               0
##LAST=      2.4114304,     0,               0
##MIN=       0,             -290489,         0
##MAX=       2.4114304,     293795,          0
$$ Real data points
##PAGE= N=1
##DATA TABLE= (X++(R..R)), XYDATA
0 0 0 0 0 0 0 0 0 0 0 0 0 8 -8 8 -8 16 -16 24 -24 32 -40 44 -53 64 -72 85 -96 112 -128 147 -169 193 -218
33 -218 245 -276 311 -349 391 -435 485 -539 600 -664 734 -811 896 -987 1087 -1199 1321
50 1321 -1455 1602 -1767 1952 -2159 2392 -2660 2970 -3333 3762 -4288 4937 -5765 6868 -8398
65 -8398 10683 -14434 21620 -40100 181361 283943 -290489 -25240 187201 -113852 -76437
76 -76437 125231 -3018 -51016 -39106 35669 119890 -62529 -132599 156011 109146 -121163
87 -121163 41268 97240 -108171 -6562 119738 -4595 -57543 -31560 -3708 60599 -37345
98 -37345 -80369 63116 11791 -62823 57332 11408 -75039 21610 38016 21167 18304 -80524
110 -80524 -20166 77145 -44539 -40904 61684 -56631 -68743 71328 -10382 -70047 24933
121 24933 -2331 -3991 56034 -50217 -49807 76412 -13533 -29076 82937 -45785 -89143 83516
133 83516 17370 -71572 36359 -5177 -48780 53589 8522 -56167 17250 19623 6194 36668
145 36668 -15913 -27377 24201 10859 19465 27269 -45838 -21585 59228 -6843 -36272 29573
157 29573 -6239 -22014 47174 9659 -43846 5233 25497 24258 17232 -24960 -7867 22643
169 22643 -2676 13650 15744 -40267 -3434 35937 -18195 -14635 8460 -20637 11342 35622
181 35622 -28181 -24862 19706 -346 4215 18286 -20346 -19845 10997 -797 1380 -4755 -31824
194 -31824 5622 21842 -28726 -15342 12767 -21087 -844 30148 -15569 -27292 4802 7294
206 7294 8190 1194 -18673 -609 5692 -10529 9207 2799 -27492 5044 26877 -11073 -11906 3718
220 3718 -5088 13878 21424 -8902 -8907 6845 3819 15627 11296 -14122 -2898 13960 8403 4624
234 4624 -8521 -11015 19799 17070 -9061 2142 -1556 -11033 23996 26231 -20033 -14379 14678
247 14678 8599 4059 -1464 -10456 -2296 6117 6756 1677 -20567 -15282 22546 12300 -16663 -7583
261 -7583 -3914 -6905 13559 8935 -20395 -12206 4945 4439 1040 -11263 -17766 2168 9534 -2955
275 -2955 -6948 -15431 -10171 14032 9027 -10494 -9263 -7040 165 15613 289 -15761 -2853 4524
289 4524 4475 5829 -7317 -13405 5576 11933 4364 -2323 -11272 -3403 15632 12055 -3983 -2659 -3083
304 -3083 3661 17058 5528 -10742 -3038 8206 10709 8032 -7206 -9200 6193 11884 9831 -464
318 -464 -13085 -3559 16231 10888 -2306 -6311 -6617 5858 14850 416 -14137 -5185 5579 8096
332 8096 4604 -11362 -14881 2528 13037 3807 -9523 -14891 -2329 10619 4181 -5627 -11311 -8593
346 -8593 6560 10751 -7684 -15999 -5464 4557 7374 -1100 -13377 -10997 3441 8868 1565 -6916
360 -6916 -11666 -1392 10923 5431 -8816 -8507 642 7226 6235 -3335 -7328 -3809 5569 12468 1953
375 1953 -11403 -4003 8854 8814 3859 -3380 -4244 2864 8746 8365 -215 -7495 -519 13348 9379
390 9379 -4754 -5207 2740 4390 6764 7406 -6074 -8822 6389 11557 2572 -6305 -5784 3849 7446
405 7446 801 -1939 -5904 -5706 6876 9381 -6170 -13385 -1727 6760 2525 -3134 -7072 -8819 491
420 491 8137 -1762 -10114 -7603 41 5899 671 -10433 -9004 127 4416 2367 -5765 -10391 -3826
435 -3826 7436 4838 -7100 -5275 -185 -692 6527 4981 -12458 -5444 12672 4617 -4486 -1104
449 -1104 -671 592 7036 6315 -2223 -5393 1044 10438 8256 -5664 -6321 9868 7432 -4628 5632
464 5632 4988 -9970 3057 17878 -1356 -11772 2363 9392 3264 -3123 141 1882 -2686 -441
478 -441 9192 2332 -14444 -2804 17270 812 -17389 3287 7855 -10175 507 10647 -9004
491 -9004 -13273 6256 9431 -4607 -11539 -2158 5925 -818 -5136 80 -1718 -9204 1949 11914
505 11914 -7861 -17400 6109 9673 -7523 -2774 167 -6898 1236 7234 -1687 -7238 -3772 2887
519 2887 8117 253 -8680 -3544 6602 5136 -957 -387 -3677 -2531 9100 6787 -5746 -3475 1950
534 1950 4286 8792 -849 -7806 3678 8731 1830 1223 770 -4758 2261 12592 2743 -8929 -301
549 -301 5553 4132 5432 -3600 -5868 4529 4193 1054 2991 -6691 -6507 9944 5738 -6519 -4716
564 -4716 -1384 247 4712 371 -7980 -4200 345 882 2472 -2485 -12765 -1780 10883 -2797
578 -2797 -9988 -1114 -2324 -2786 4258 280 -9396 -8064 4387 8399 -4929 -9084 -636 1979 2250
593 2250 1892 -2702 -5917 -1408 7002 7631 -6005 -8443 5113 7365 1889 457 -2223 -3359 5375
608 5375 10142 565 -5777 -240 5370 7052 4546 -4765 -3261 6477 5348 3755 259 -6989 966
623 966 10795 1775 -2524 -1067 -3585 4183 9044 -2770 -7919 38 4174 2641 458 -4077 -5720
638 -5720 596 5745 616 -5444 -6643 -959 5357 969 -5746 -5338 -2442 1620 3429 -3768 -6236
653 -6236 -3238 -467 4983 292 -9696 -4028 4751 1337 -1182 -2279 -5143 -1553 3940 4019 -3227 -7629
669 -7629 92 7028 2355 -4140 -1963 194 739 5046 3620 -6228 -3828 6803 5655 223 -2591
684 -2591 -1939 3567 5650 1696 262 -2232 -1219 7885 5596 -3962 -2814 2749 3623 3784 949 -3199
700 -3199 -1004 3597 5183 947 -3830 -2630 3280 4401 -251 -2465 -2686 -375 4151 1791 -4166
715 -4166 -3730 -220 1247 2818 -2136 -6607 -1004 2767 316 -2031 -3751 -4011 879 2650 -1144 -4879
731 -4879 -4228 828 3009 -903 -4444 -2753 -814 1527 2142 -2880 -5492 -360 4081 1212 -1885 -3656
747 -3656 -1070 3134 2723 -462 -2560 -1811 2165 5261 460 -3434 -630 2797 3939 2344 -1125 -2464
763 -2464 2155 5414 2667 -1171 -2296 1283 4960 3881 -487 -1994 -106 4016 4782 -225 -2688
778 -2688 -633 2680 3805 1514 -3147 -2886 2489 3918 663 -3317 -2990 30 3209 1509 -3098 -4165
794 -4165 -946 2145 1619 -2288 -4548 -2560 1333 1917 -1231 -5218 -3350 1075 1908 -856 -3677 -3927
810 -3927 -612 2731 867 -3700 -4433 -672 2943 2004 -2340 -3970 -926 2259 2992 8 -3738 -2456
826 -2456 2911 4850 165 -3465 -2088 2477 4618 2318 -2194 -2826 1684 4791 3828 -916 -3153 161
842 161 5054 4479 -794 -2681 -201 4232 4265 797 -2431 -1562 1936 5209 2604 -3697 -3412 2838 4953
859 4953 574 -2602 -2134 -948 2767 3151 -1538 -4861 -1450 2931 3375 -2319 -5738 -1132 2042 974
875 974 -632 -2526 -4568 -1324 3751 1484 -5468 -5116 1298 1877 -483 -1781 -3758 -2254 1545 2270
891 2270 -787 -4316 -3513 2598 4146 -1460 -4065 -1328 1432 1414 2487 -580 -4937 352 5848 1714
907 1714 -1904 -1752 -546 4254 4235 -1626 -1415 425 1538 5013 2675 -3987 -1621 4751 4153 781
923 781 -491 -1765 421 5873 2645 -3029 -1054 806 1787 4709 -446 -5657 542 4208 1183 -1055
939 -1055 -2912 -2332 1191 3286 -364 -4215 -2464 823 1630 785 -3444 -5339 1365 3041 -1838 -2066
955 -2066 -2077 -3026 1167 2702 -3087 -4687 -1040 1427 592 -692 -3314 -2964 2332 1483 -1827 -463 -2432
972 -2432 -2154 4743 2070 -4940 -160 1721 191 2602 220 -3048 263 2997 1766 1177 -1455 -1914
988 -1914 2744 4832 -511 -2165 1645 484 1557 4322 -738 -3412 2610 4111 1173 -218 -2326
1003 -2326 537 3220 1810 -147 -2164 -1005 2015 2849 660 -2689 -2466 3078 2465 -1603 -1344 -1640
1019 -1640 -987 2968 1271 -3504 -2852 482 1937 401 -2448 -3346 -940 2398 510 -2793 -2558 -1970
1035 -1970 960 2843 -2269 -4283 -126 413 1119 911 -4168 -2898 2034 1482 -707 -1346 -2304 71
1051 71 2979 1107 -1753 -1861 532 1826 2191 -244 -2314 123 2693 1660 623 -666 -1528 2229
1067 2229 3641 680 -794 -922 1487 3217 1529 -393 -871 4 3098 3086 -729 -1574 -70 2298
1083 2298 2875 -49 -2317 -532 1390 2288 888 -2143 -2399 540 2993 674 -2686 -2234 -441 1808
1099 1808 1466 -2030 -3565 -906 1248 1802 -1204 -4608 -1786 1460 1092 -772 -3239 -3446 851 2530
1115 2530 -717 -3130 -2898 -190 2531 613 -2964 -3350 232 2264 1337 -1326 -3083 -683 3217 1973
1131 1973 -759 -1909 -1146 2493 3420 98 -1686 -539 1390 3152 1693 -1775 -509 1307 2516
1146 2516 2526 -599 -2048 763 2938 2149 285 -1370 -439 2102 2627 452 -1745 -634 988 2382
1162 2382 978 -1536 -1812 260 1900 1429 -975 -2679 -368 1473 923 -549 -2911 -2402 1305 1561
1178 1561 -1009 -2294 -2516 -506 2015 -152 -2943 -2583 -363 1299 1154 -2091 -3404 -637 1753 934
1194 934 -1617 -2785 -1501 1796 1720 -849 -2152 -1473 1233 2623 112 -2462 -858 1347 2273 1337
1210 1337 -1421 -1267 1168 2842 1150 -606 -1531 328 2900 1927 -516 -1109 509 2061 2554 342
1226 342 -1555 71 1386 2031 759 -1155 -732 1159 1703 659 -409 -1295 592 1973 927 -898
1242 -898 -999 -347 686 1204 -927 -1516 -787 438 768 -85 -1720 -1631 136 617 -52 -1481 -2157 -738
1260 -738 677 105 -1454 -1742 -1413 699 947 -1521 -1946 -751 383 1145 302 -2148 -1258 919 1354
1277 1354 226 -1045 -1532 392 2018 505 -986 -1467 722 1842 1488 -401 -1352 409 2113 2033
1293 2033 -154 -1362 135 2167 1831 408 -905 -272 1677 2252 495 -695 -540 1105 2359 734
1309 734 -1570 -747 1152 1498 1013 -852 -1283 193 1595 579 -924 -1640 -315 1106 463 -980 -1735
1326 -1735 -806 497 660 -375 -1728 -1545 1 652 -326 -1455 -1553 -522 639 -41 -1030 -1858 -798
1343 -798 495 579 -606 -1536 -1291 895 995 -444 -917 -1324 266 1327 470 -1248 -1138 513 1411 1256
1361 1256 -526 -1355 -10 2111 1610 -108 -551 -432 1387 2474 722 -1698 5 1731 1725 842 -908
1378 -908 -867 1000 2311 990 -584 -1078 284 1994 1695 -849 -1986 389 1759 600 -175 -1699
1394 -1699 -944 1621 1271 -866 -1547 -1090 865 1627 -360 -1987 -1302 590 713 -13 -1317 -2141 -622
1411 -622 1239 95 -1782 -1497 -1032 144 999 -965 -1900 -570 46 469 134 -1547 -1355 486 867
1428 867 399 -968 -619 -152 524 1495 -402 -1232 155 819 1146 744 -992 -789 1595 1566 814 -589
1446 -589 -403 658 1667 1386 -364 -811 525 1813 970 249 -1151 -265 1971 1260 -153 -677 -518
1463 -518 860 2011 -222 -1329 -796 663 1437 312 -1073 -1346 151 1184 13 -1415 -1330 -592 929
1480 929 839 -1771 -1711 -399 88 438 -634 -1791 -900 525 268 -325 -1779 -960 116 621 -176 -1253
1498 -1253 -1003 170 355 80 -682 -1243 -60 1352 199 -92 -423 -521 839 897 -245 -435 -161 981
1516 981 1143 244 66 -195 643 1353 646 179 84 108 1175 1555 -7 14 226 634 1620 284 -653 16
1536 16 641 1016 399 -605 -488 77 946 300 -943 -850 237 535 670 -598 -1403 -290 352 78 -671
1555 -671 -1519 -712 793 89 -637 -1291 -857 430 424 -489 -1244 -1419 -19 734 -451 -1033 -860 -87 989
1574 989 -166 -888 -903 -106 920 391 -675 -835 209 738 600 -427 -586 -358 899 781 241 -775
1592 -775 -124 759 931 793 -569 -254 991 1043 598 169 -348 392 1271 806 87 -277 98 1086 949 145
1612 145 -323 -542 909 560 362 -437 -752 22 798 102 -504 -770 -250 594 559 -681 -1193 -699 253 364
1632 364 -748 -1234 -963 72 491 -341 -1203 -1188 -61 659 -53 -1246 -1342 -171 715 187 -985 -1365 -112
1651 -112 964 593 -462 -1041 -455 959 862 -304 -1171 -383 840 916 845 -899 -454 600 1272 583 -473
1670 -473 -402 416 1512 905 -229 -600 423 1153 1128 52 -475 -140 1031 1014 3 -604 -272 583 1183
1689 1183 129 -704 -616 192 940 556 -662 -796 -127 690 500 -393 -1134 -451 319 489 -438 -904 -840 -83
1709 -83 547 -237 -912 -1009 -160 326 266 -770 -1370 -330 293 450 -631 -1509 -656 510 520 -447 -946 -917
1729 -917 519 418 -143 -723 -601 412 1055 527 -520 -385 475 1120 707 -179 -563 233 1144 770 5
1748 5 -463 -4 963 1023 10 -390 -138 722 1119 452 -551 -245 871 844 376 -58 -511 373 623 251
1768 251 -397 -572 -194 582 573 -139 -325 -146 385 397 -347 -837 -731 0 166 -207 -873 -654 -213 479 -73
1789 -73 -530 -690 -477 245 196 -676 -693 -340 137 401 -272 -859 -564 127 427 77 -590 -469 314 460 42
1810 42 -367 -518 45 691 622 108 -352 30 603 718 68 -331 100 950 956 242 -215 -33 693 756 252 -13
1832 -13 -279 529 786 385 -118 -342 413 638 140 -353 -420 13 631 449 -181 -690 -8 355 459 -188 -563
1853 -563 -518 125 336 -432 -779 -580 -54 104 9 -755 -644 49 274 -3 -516 -798 -513 102 354 -600 -731
1874 -731 -381 262 265 -95 -854 -281 287 344 248 -498 -508 341 672 399 -118 -454 144 1075 754 -344 -292 -83
1896 -83 832 606 78 -231 -237 1071 1020 46 -301 121 341 979 457 -392 -239 676 1012 717 -357 -513 196
1917 196 868 507 -397 -811 -100 355 619 -159 -1002 -110 359 355 -43 -731 -525 161 320 98 -572 -1007 -293
1938 -293 258 186 -690 -901 -215 213 343 -197 -810 -533 366 420 -304 -497 -566 144 549 -18 -557 -405 205
1959 205 704 314 -405 -556 201 741 353 -108 -194 106 375 1038 -185 -577 205 548 826 409 -354 -332
1979 -332 768 844 454 -74 -285 409 658 531 -212 -633 344 708 533 19 -456 -220 800 570 -133 -293
1999 -293 -793 499 526 -219 -712 -736 -55 621 -136 -494 -628 -447 624 8 -557 -654 -751 404 209 -514
2019 -514 -940 -450 -15 404 -182 -767 -345 53 418 -11 -592 -516 -221 356 636 -518 -323 107 441 373
2039 373 144 -438 -56 566 400 397 -379 -144 509 531 566 -29 -142 410 792 486 136 -399 191 702 532
2060 532 -163 -363 170 571 439 -210 -345 -320 481 442 -181 -320 -192 64 594 173 -324 -380 -33 356 260
2081 260 -541 -517 -22 -15 75 -443 -458 -305 115 254 -359 -539 -333 -25 134 -169 -342 -374 43 277 2 -263
2103 -263 -333 18 334 -86 -196 -236 -145 317 395 -114 -213 -122 375 483 103 -115 -161 365 693 259 31 43 557
2126 557 720 113 -177 -96 107 669 560 228 -81 165 471 492 -149 -44 8 347 574 -112 -455 -161 147
2147 147 179 161 -214 -716 -15 397 78 -366 -589 -1 508 136 -630 -846 -374 239 123 -417 -711 -494 97
2168 97 311 -306 -682 -354 -70 131 -8 -744 -412 59 431 189 -258 -576 -60 159 220 -142 -384 145 364
2189 364 338 -146 -95 -227 447 387 126 -384 125 842 639 382 123 -322 540 584 688 -5 -269 130 367
2210 367 518 -57 -233 -114 290 629 86 -447 -375 288 358 124 -302 -375 -231 425 307 -563 -434 -218 125
2231 125 2 -213 -655 -518 65 315 -200 -771 -338 -197 235 -122 -873 -535 -36 517 -181 -464 -625 -25
2251 -25 207 146 -203 -461 -46 313 368 -146 -405 4 501 297 30 -291 -110 261 384 214 -90 -107 471
2272 471 505 364 -95 47 332 483 271 152 101 33 688 645 -181 -21 128 330 469 24 -206 -229 23 256
2294 256 -82 -170 -114 -168 363 189 -147 -377 -91 59 134 -373 -510 -353 -92 165 -205 -563 -362 -49 180
2315 180 108 -424 -587 -82 159 88 -183 -741 -287 -64 231 -294 -582 -402 243 335 -302 -341 -65 139 442
2336 442 154 -359 -365 241 591 152 5 -17 139 467 307 -151 -74 118 479 362 35 -58 157 490 206 91
2358 91 -460 252 333 443 46 -187 19 155 81 62 -200 -173 72 191 131 22 -393 111 250 -231 -236 -421 -363
2381 -363 63 64 -62 -461 -663 3 142 -106 -106 -481 -230 131 -171 -449 -432 -215 -174 78 -318 -155 -443 429
2403 429 213 -225 -189 -253 117 585 101 -272 -140 -113 692 350 -378 -124 385 250 238 -6 -56 123 270 587
2425 587 74 -335 -42 445 375 -77 -148 7 489 360 -37 -6 -73 350 449 136 -290 -119 132 550 185 -238
2447 -238 -196 -280 409 309 -236 -296 125 53 179 -404 -262 45 -47 -166 -63 -206 -97 -1 2 -51 -329 -410 -138
2470 -138 92 -43 -159 -323 -363 -48 55 -52 -472 -38 -64 197 277 -376 -426 138 226 340 -76 -477 81 353
2492 353 309 9 -232 82 483 274 106 -176 -246 402 481 140 30 -208 148 204 331 54 73 92 368 326
2514 326 18 -329 2 304 133 27 -146 -46 350 536 -132 -427 -159 35 76 83 -571 -307 -77 227 -87
2535 -87 -400 -587 68 -156 142 -197 -477 100 148 -13 -361 -301 -349 225 64 -46 -320 -265 249 35 28 -234
2557 -234 -222 -133 72 59 -241 -110 8 152 326 -90 -26 47 286 425 329 -74 189 218 471 203 -450 -9
2579 -9 221 589 301 134 -237 133 398 356 -56 -355 -116 329 600 -42 -262 -249 169 334 249 -134 -335 145
2601 145 321 -140 -433 -327 -46 259 224 -219 -263 -130 -38 -14 -141 -513 -33 202 -81 -331 -505 32 209
2622 209 286 -332 -254 -141 260 107 -131 -271 -30 79 134 143 -236 -25 -52 211 36 -185 -38 111 289 438
2644 438 39 -25 -270 120 360 35 -77 19 434 252 416 154 -188 242 390 241 -80 74 70 452 156
2665 156 122 98 29 264 36 129 -231 -244 -103 352 135 -257 -396 18 202 -13 -516 -346 -260 217 37 -241
2687 -241 -528 -202 78 323 -250 -446 -370 -29 54 -186 -495 -178 121 248 138 -282 -629 66 298 -210 -250
2708 -250 -278 146 225 155 -412 -163 95 393 429 275 -33 -132 335 215 -21 -216 -28 331 169 313 -59 112
2730 112 -25 322 240 -36 178 -2 198 81 -81 201 -157 213 214 83 123 -29 256 220 161 -131 -145 -158 72
2753 72 -9 -242 -195 103 -10 96 35 -285 -179 26 36 -12 -444 -354 15 130 13 -161 -430 -167 331 -83
2775 -83 -402 -503 -76 -42 20 -395 -306 -414 13 189 -409 -78 -156 201 256 73 -322 -60 93 342 217 -68
2797 -68 -47 213 353 322 -55 141 242 286 453 55 -90 123 413 243 103 -74 3 273 431 46 -134 -10
2819 -10 189 316 -55 -118 -300 255 110 2 -29 -278 125 -81 237 -189 -109 -299 -80 134 -171 -262 -412 -224
2841 -224 77 67 -309 -341 -460 203 -84 -411 -363 -311 174 211 -208 -177 41 -12 224 -218 -661 -222 62 269
2863 269 -41 -413 130 63 242 138 -214 -243 196 366 169 -1 -202 137 517 131 -8 -209 45 530 150
2884 150 182 -140 113 289 369 42 111 -8 190 435 22 -67 81 -101 305 112 -194 -99 -318 -48 124 -136
2906 -136 -261 -115 107 211 -249 -278 47 -57 57 -173 -279 -108 -111 -109 -199 -198 -347 81 -18 -54 -392 -589 63
2929 63 47 -2 -90 -353 -214 162 285 -24 -104 -305 -211 212 95 -184 -224 36 458 77 107 -310 174 209 403
2952 403 -181 95 144 244 237 -27 77 106 294 240 32 27 -27 184 128 200 -127 -217 154 174 169 -468 23 -24 102
2977 102 213 104 0 47 377 30 -237 -271 -82 82 228 -47 -218 -98 -51 160 -277 -74 -526 53 59 -238
2999 -238 -267 -418 48 56 -76 -325 -122 -357 -230 -54 -17 -43 -212 194 269 127 -294 -237 105 -12 217 -8
3021 -8 -12 -81 338 265 257 -260 2 174 244 172 -91 -225 395 483 265 -279 143 283 472 410 -443 -146 -109 400
3045 400 117 -89 -163 87 194 92 -23 -213 -36 8 237 6 -179 -216 -16 125 -124 -286 -533 11 176
3066 176 -213 -294 -402 -44 2 10 -350 -214 -58 37 149 -2 -281 -175 -27 -12 113 -140 -342 -87 -18 196
3088 196 21 -20 -96 -21 -52 -51 21 65 286 239 -179 -112 36 124 174 137 -153 73 411 78 171 -34 -49 291 473
3113 473 110 -32 -181 41 179 150 -177 -8 299 53 173 -72 -251 69 128 127 166 -102 -46 267 -43 200
3135 200 -114 -302 -23 -38 -105 30 -497 -149 -4 113 -140 -163 -133 36 133 -109 -496 -216 3 165 -159 -170
3157 -170 -173 -138 -92 137 61 -113 -203 -99 -219 -192 -87 27 123 120 -36 -221 254 212 212 122 25 208 360 206 -102
3182 -102 178 -61 278 260 165 231 132 143 177 115 -124 -114 -130 86 -61 -50 -90 -59 312 25 56 229 -205 -104
3206 -104 197 69 -196 -216 -147 -110 93 -204 -206 -269 -157 24 -276 -118 -447 -130 52 37 -308 -164 145 70 29
3229 29 -237 -75 95 -45 22 238 -126 -114 -15 25 -167 -33 -75 247 276 12 -98 184 309 216 138 48 142 -61
3253 -61 28 -77 -1 40 164 181 -28 -186 45 7 295 307 173 -39 -96 305 2 -69 -38 -272 5 67 137 -93
3277 -93 -46 -109 149 -103 -100 31 66 165 -84 -138 -51 -222 -31 449 -250 -182 -231 -108 -42 -193 -352 -27 -107 -60 -157
3302 -157 -201 -69 75 308 101 -46 -228 114 203 -6 -53 -146 -133 223 158 172 -252 5 308 315 190 -75 -41
3325 -41 178 307 -49 -33 -125 -103 404 302 139 -203 176 -133 270 149 -64 42 201 397 133 -163 -51
3346 -51 87 104 222 35 -26 -258 51 91 -349 20 2 113 72 -16 -190 -180 -109 -171 -95 -144 -270 -129 111 -83
3370 -83 -114 -130 -28 -77 -18 27 -215 -38 70 -396 -389 -40 -26 -8 254 34 16 -38 177 303 34 -132 -117 201
3394 201 120 49 13 -31 163 28 140 103 26 -98 98 391 -129 47 263 180 155 12 123 186 204 165 110 -52
3418 -52 105 100 142 381 -91 167 260 138 43 -107 -152 129 234 71 -210 -5 19 134 -142 -107 -195 -178 190 80
3442 80 158 44 -77 -121 -102 -17 -57 -221 137 -115 -159 -293 -84 -120 -49 149 25 -127 -49 -118 -84 20 -19 -87 -1
3467 -1 134 48 48 65 139 -152 62 37 -38 -32 103 279 194 -118 84 150 146 90 -100 35 194 109 -251 154 -58 240
3493 240 57 24 152 -165 204 69 158 129 36 137 17 -130 -205 -126 40 -67 -64 42 10 98 -229 109 218
3516 218 -249 -240 -149 -106 -69 60 -169 -218 -7 -111 -189 -24 -207 -139 -65 -17 -94 -84 131 -14 60 204 -13 106
3540 106 -194 -6 143 -209 59 268 121 23 92 95 335 8 48 148 -33 188 380 28 -85 -95 222 384
3562 384 -91 -257 107 30 160 206 -25 109 131 -89 205 177 -102 -100 149 -49 -56 -188 184 46 281 119 -145
3585 -145 142 175 -88 132 57 59 97 -11 -158 -129 -256 150 -135 20 -237 118 -39 -171 -127 -19 -197 -260 -44
3608 -44 -187 114 -36 177 52 261 -12 -178 -58 -86 47 128 -286 -68 -48 20 77 356 42 43 11 -121 275
3631 275 -28 3 37 -3 135 148 -119 88 122 -94 -76 81 325 83 209 48 -87 42 55 198 -59 -13 8
3654 8 25 -9 -153 -69 -36 -81 140 -236 52 -228 -13 45 -164 79 -290 -1 51 -35 -155 -261 -17 44 66 -87
3678 -87 -239 -41 96 -138 -55 37 56 155 79 -155 -149 -10 -56 249 27 -175 87 -191 54 -164 -236 116 23 91
3702 91 -15 158 -33 250 166 -8 -98 152 -240 -98 264 72 168 96 -95 301 135 104 -73 140 -23 38
3724 38 41 -166 -159 -232 60 7 29 -48 -136 -44 -58 -496 -81 -104 56 -23 -137 -35 -190 70 -99 -254 -31 41 117
3749 117 -66 -36 -52 28 90 -111 -33 -108 -297 -68 28 131 -202 171 -187 -98 -154 -147 -118 8 -7 -12 -211 -41 86
3774 86 181 105 237 20 84 210 97 79 -119 243 -1 144 260 87 2 50 -154 284 16 -9 113 150 -280
3797 -280 24 -145 202 290 159 107 -316 -4 -80 263 -22 -28 -2 -22 72 -67 -144 -54 -55 -188 -167 54 -15 -10 -116
3822 -116 73 -106 -107 -112 170 105 -361 -3 43 -107 -9 9 -106 44 -260 -117 -37 -137 45 99 83 -24 -307 -145
3846 -145 -113 66 88 -54 -146 123 151 213 -41 -57 -28 224 -45 46 81 22 -9 224 143 -195 -189 -93 107 -98 -25
3871 -25 -138 26 156 -52 -23 212 204 42 264 87 -52 -4 -52 49 -152 -164 -119 -71 -115 -126 -7 120 -124 -15
3895 -15 140 124 -29 -188 -59 -59 -65 -184 -117 -357 138 -51 -293 -224 -81 67 -177 100 -279 36 151 138 -267
3918 -267 101 -142 81 132 -11 -1 196 187 65 -126 -84 -303 -88 240 -47 -30 -373 231 189 90 -134 129 55
3941 55 -28 -48 -181 173 -52 5 108 -149 -141 -61 12 -164 180 -119 -236 -101 15 72 -71 -49 -163 7 -230
3964 -230 12 -13 -35 -24 110 -65 -14 -201 15 5 -23 -95 -25 -111 -198 -162 -94 -223 29 -105 201 -244 -247 -156 85
3989 85 26 -105 -90 -107 162 -203 44 -4 218 127 151 225 -27 119 -45 62 389 44 173 -141 131 45 11
4012 11 -97 -90 128 -66 -118 -148 61 26 238 -96 -261 39 178 67 230 -234 -92 6 128 13 -99 -248
4034 -248 162 -82 -159 -93 104 -42 -63 -247 109 -361 -105 19 -260 165 7 -21 -3 -106 117 -225 -110 197
4056 197 6 -173 -13 58 -54 4 214 -127 -71 14 -36 34 -87 24 60 -33 -39 174 160 41 383 25 -50 383
4080 383 -157 2 27 247 57 -65 139 96 186 143 62 29 -40 241 -30 16 118 43 96 24 -103 -38 194 -35
4104 -35 -112 60 -38 -51 261 20 -54 138 -55 144 139 179 -113 -51 153 -151 -313 -189 -185 -126 -114 101 -171 -235 -74
4129 -74 4 -7 -189 72 0 70 46 128 166 -135 -82 -61 -29 -30 109 182 21 172 80 108 -83 75 53 89 -215 -68
4155 -68 -9 150 254 -100 28 185 100 71 113 -11 166 215 162 -59 220 -103 206 -32 40 131 -206 115 213
4178 213 19 -137 31 72 -41 235 -92 23 57 -65 42 -260 7 -17 170 126 -79 92 -110 -223 35
4199 35 143 5 -24 28 28 19 -87 -42 94 -43 -90 95 -304 -241 183 -11 -90 85 -2 -11 50 -54 -53 73 341 -35
4225 -35 171 -117 80 -8 144 174 -241 369 67 143 -33 117 125 212 200 83 -19 32 20 -33 -24 1 -180 54 -13
4250 -13 205 32 109 -192 1 291 54 -28 -236 52 -180 -169 -41 102 51 139 132 -165 -147 -82 90 17 147 -88
4274 -88 -5 -87 47 57 -3 -57 -3 -13 127 -143 -3 -33 -148 1 -2 111 18 145 -5 -146 -27 -137 -67 75
4298 75 47 181 141 150 35 -88 -126 72 288 239 -69 -165 135 161 195 13 12 149 240 237 -231 120 154 21 117 137
4324 137 -102 -191 -29 232 -122 -227 -166 -226 -59 -63 135 -8 -95 4 333 83 -60 189 -5 322 225 -140 -87
4347 -87 142 -154 -138 -160 -183 -166 -349 -29 -64 -274 -196 -64 24 -60 30 -34 107 -34 -51 -116 -34 150 -24 -41 -46 -4
4373 -4 45 322 58 -120 -106 124 240 66 462 -52 -117 194 -92 -143 50 138 -141 24 245 100 -16 4 158
4396 158 -8 -111 -5 258 -87 63 -19 84 -26 -30 16 22 -177 -31 137 37 -268 -198 -21 -179 -12 -61 20
4419 20 -28 3 29 -119 -131 91 -51 -18 0 -153 5 -32 -272 51 53 -35 -206 107 17 49 111 -81 -264 28 -98
4444 -98 110 -138 -78 114 55 -124 -185 102 92 71 134 -122 -38 100 -59 162 45 -58 258 63 -119 -16 129
4467 129 406 98 79 5 -31 201 215 169 139 -141 112 29 222 -209 -181 -126 -7 85 28 -59 -193 -145 -252 211
4491 211 -118 -267 -2 -136 -67 -25 -238 -130 -131 62 -70 -307 -132 -130 -218 -214 -21 -126 223 -168 132 -108 -3
4514 -3 59 55 -33 -165 203 -51 -39 74 87 -73 67 114 77 -33 231 -35 131 105 89 -29 -53 12 119 -74 -96
4539 -96 -115 107 222 1 -18 11 113 26 19 -253 -72 27 -119 111 89 -94 63 19 -3 -95 -81 -111 52 158 139
4564 139 -140 -123 -107 116 -444 -175 -39 -64 -31 -24 16 -29 -188 -47 -34 -245 -169 -114 -5 -279 -88 -163 -4 52
4588 52 79 -46 42 -34 83 71 -147 138 188 241 83 113 33 217 45 -70 88 15 -169 -94 21 277 42 -67
4612 -67 58 154 -23 -89 1 72 56 41 167 85 -55 -32 87 -185 34 -280 -30 91 49 123 -158 -95 284 83
4636 83 35 -308 150 -97 -154 1 -72 -287 -113 -23 -57 283 -123 80 -52 -25 39 -60 -301 1 -47 192 124 88
4660 88 -207 -141 59 -205 -125 11 -71 -14 88 -94 -29 117 -50 27 -77 20 73 64 -169 99 -177 11 -45 -141
4684 -141 76 18 146 188 151 9 -54 -33 91 104 57 184 -43 224 78 -132 -14 -68 49 -214 84 -64 18
4707 18 107 5 33 -13 -140 26 -139 -21 23 -8 107 -97 -28 -66 -225 -93 -118 32 -79 -221 297 163 55
4730 55 94 -187 42 -39 -39 -97 -243 6 18 -49 44 52 88 44 202 -23 -135 -128 -199 299 67 172 24 -189 113
4755 113 40 43 -67 94 -262 55 -124 -25 105 -56 133 152 108 -88 -19 -57 81 -10 38 82 50 67 -59 -189
4779 -189 16 111 57 18 -187 64 -180 -144 -93 -66 -165 -182 -159 2 -409 -93 -176 -234 -175 -120 -175 -243 23 -55 -71 117
4805 117 -162 -37 18 88 -118 -44 66 147 -35 -111 -37 -97 -6 -7 -73 124 -77 -299 -59 14 -172 -253 -46 4 -125
4830 -125 -74 175 80 -51 -29 -68 305 77 4 -43 -27 -16 32 39 112 61 -211 17 -112 36 72 140 25 212 -160
4855 -160 -36 16 -100 -87 294 -111 -89 73 -118 35 110 -69 -227 -20 63 138 -12 -268 -136 -114 209 -205
4877 -205 -218 28 -301 372 44 -53 -79 54 120 -127 -44 -126 59 -80 -164 -80 -155 183 24 27 108 -10 -119 -44
4901 -44 -46 23 9 50 -99 158 119 34 0 -123 144 -44 70 26 37 98 177 -19 -196 -23 -65 -159 206 158 -47
4926 -47 -83 213 35 44 151 -89 37 -18 42 -126 -2 37 240 -115 -227 -41 47 -54 18 -171 -116 -19 84 -144
4950 -144 -130 -1 -317 -13 -137 247 -91 -122 187 -89 -166 -41 -298 56 -39 -99 -232 -323 -22 86 -238 -51
4972 -51 -102 224 -175 -45 76 28 66 2 133 -75 115 -136 126 269 292 61 -106 392 240 52 -60 -17
4994 -17 30 167 228 -31 -20 194 -62 -188 199 -24 114 -55 169 -31 2 -182 -47 337 126 -16 108 -108
5016 -108 -28 -66 145 -113 -105 72 100 -36 58 -33 126 41 73 24 -284 -19 -95 23 154 49 85 59 -129 29
5040 29 -30 -151 68 -143 -70 -240 -411 169 168 -166 -59 -108 236 7 -204 83 77 -6 30 60 -53 109 -37 70
5064 70 338 -55 -26 196 -7 -145 -76 308 47 -125 -9 173 139 276 176 1 -112 -45 89 -36 21 -49
5086 -49 -12 130 -102 -76 186 -158 -5 -35 -156 47 -2 -9 -188 62 -81 -162 -56 49 -53 13 -147 -55 -133 -242
5110 -242 -49 172 32 156 66 -23 -232 -110 -15 245 65 77 181 -191 50 -142 177 16 -117 26 -2 116
5132 116 55 -23 106 154 -31 -2 -122 201 70 7 -17 -245 -156 3 134 -93 26 -223 22 82 -210 8 184
5155 184 138 142 2 -112 176 40 145 115 32 -23 -355 3 92 210 -28 -164 124 158 -24 -255 -172 -120 -37 98
5179 98 -119 -4 -80 28 66 -79 29 -54 66 81 111 -29 -92 105 -77 -143 -86 -41 13 -28 1 47 -65 -99 51
5204 51 74 -61 99 89 -132 262 190 -122 -23 61 47 -42 108 24 25 40 176 -100 -14 -105 116 -67 133 11 -155
5229 -155 90 193 192 -87 43 206 209 -177 166 -12 -194 -125 -280 -149 -44 -116 70 -34 57 53 35 -99 145
5252 145 179 86 -126 -342 54 -344 -96 -38 -179 -37 -76 -20 -16 -88 145 120 8 -169 -24 87 206 45 124
5275 124 28 -219 -51 -230 71 169 40 -29 107 141 -63 106 62 185 271 141 -138 -56 -70 16 -141 151 248
5298 248 -133 78 -16 -32 -26 203 -282 195 135 -41 -61 206 -59 -124 -67 -183 17 106 -132 -5 -152 -80 -63 -163
5322 -163 34 -37 226 -330 22 -319 14 192 51 -156 -144 137 54 3 -325 -42 26 -203 -67 -213 -90 -74
5344 -74 -190 -108 -153 76 -19 -42 108 91 36 -87 -216 105 -60 136 139 94 235 73 99 294 -29 -124 184 157
5368 157 56 6 11 -2 1 -152 132 157 158 -124 56 -111 69 48 -202 196 203 227 -93 -113 -12 220 -78 -195 -22
5393 -22 13 -11 -34 -186 -27 108 172 -101 -73 -203 -26 -97 -93 -142 197 -70 -35 18 -91 67 63 -17 -28 241 -3
5418 -3 40 -120 -108 -307 21 96 -163 -87 -4 -6 334 115 -3 10 -174 -59 -83 -118 -24 8 63 159 126 30 -85 -107
5444 -107 -42 84 112 -12 35 187 97 168 129 -110 -14 -182 63 -177 -108 -134 -55 3 77 77 163 268 39 52 16 -138
5470 -138 26 192 60 -40 89 3 -128 293 88 -49 -54 -36 24 33 -257 -44 -62 -266 18 -160 -30 -110 -216
5493 -216 -35 -171 -3 100 -182 74 47 8 -68 -94 100 76 -106 329 -59 -126 -60 72 9 79 54 10 72 15
5517 15 14 425 71 -132 132 50 81 -11 95 -123 17 4 -35 -196 -46 15 -90 -169 277 -29 -103 -103 288 61
5541 61 -187 -154 287 79 240 -169 -87 89 55 -248 -205 -90 191 -12 -86 -164 75 63 -89 96 -225 -196 -69
5564 -69 -49 257 -45 -134 -61 -33 -215 -106 49 -233 -2 -76 -70 -273 -34 -147 7 167 -62 68 153 35 -32
5587 -32 -20 -85 -163 -2 -9 48 -118 95 -26 75 145 -125 -29 -26 -112 -25 222 -11 105 108 197 62 -11 0 -97 -72 -42
5614 -42 -45 58 -19 53 -59 165 -64 -216 -91 -90 -48 -30 131 -43 -173 -220 -88 -43 2 75 -165 -207 -31 201 -40
5639 -40 -225 -247 53 -180 149 -82 -85 -62 -84 32 27 115 120 -148 -87 38 -84 38 -114 25 96 18 -34 118 83
5664 83 160 133 341 57 281 215 36 18 80 -47 129 247 18 -233 122 -111 24 -68 -90 -102 247 111 38
5687 38 189 105 -75 307 -80 -186 2 37 -20 93 -41 27 -127 0 -47 3 -221 10 -12 -86 123 128 -54 -102
5711 -102 -40 -290 76 -428 -221 13 186 54 53 39 -15 7 -57 -65 -291 -69 -26 230 213 263 -90 -77 -13 -161 -5
5736 -5 -79 7 250 -41 -50 168 220 220 113 194 275 51 -208 -82 -43 140 31 6 -166 -63 -2 -64 151 -23 70
5761 70 179 135 29 264 24 -138 173 19 42 -12 291 115 -285 35 -321 -50 129 66 165 -109 -261 64
5783 64 112 -151 -198 59 41 112 -163 -167 -140 -83 95 -207 -180 -148 23 -59 51 186 -103 11 -53 237 -175 4
5807 4 -55 10 -17 119 124 109 -20 234 261 36 189 100 114 -265 -15 40 12 -31 116 78 -13 54 122 24 -50 -138 -197
5834 -197 99 72 184 185 263 -67 -198 -19 -194 -59 16 -11 76 -26 95 -47 84 192 -28 -12 -124 91 -45
5857 -45 -4 -150 -245 -78 -259 -284 -151 -13 -28 -119 -262 -64 -106 61 -57 191 -58 -145 -47 -153 -99 -95 -106 -42 132
5882 132 -20 26 72 -147 86 -56 40 85 -121 -38 -20 -139 19 64 22 74 -97 62 23 0 271 224 -31 11
5906 11 -25 226 189 16 -117 106 83 137 3 159 -144 -97 151 -44 145 -1 -31 -39 1 6 -134 37 149 46
5930 46 72 21 -6 28 -41 -13 41 29 -61 71 -85 -96 24 -59 -54 -143 36 -79 70 35 142 48 5 -105 109 56
5956 56 -211 58 -205 47 -174 -102 135 10 219 5 -55 229 -190 -119 136 -133 151 -182 -168 226 -312 94
5978 94 53 -50 -89 1 170 -86 33 55 176 -62 27 -113 -13 21 -60 -68 -245 -29 71 82 14 -67 2 223 163
6003 163 8 -208 -143 -15 -52 -130 -243 -30 -132 69 -89 -266 262 -76 -111 32 3 -47 43 -339 139 -178
6025 -178 45 104 -150 19 60 -29 -196 30 -57 -244 71 -158 -58 195 63 -166 -101 130 51 -169 -19 -122
6047 -122 -133 -175 -205 -85 -112 -83 13 98 82 102 1 17 97 94 -42 189 71 -21 -186 255 63 202 130 83 59 1
6073 1 -126 -242 -152 64 -59 87 86 -18 35 -97 -137 -57 -4 -88 -26 -54 -39 35 87 -94 97 -45 -173 -8 118
6098 118 -173 -23 -186 29 -42 -81 238 174 -41 -5 -245 -194 156 -25 33 139 172 -158 -48 144 -11 -40 104
6121 104 -119 -156 41 -14 -133 118 -148 -76 73 79 195 -67 22 -235 260 -50 -133 -47 36 215 41 -47 -48 202
6145 202 -30 -69 -265 108 100 -83 -85 1 43 -66 -151 39 -79 -140 18 -4 -67 67 -34 -72 56 -88 279 -267
6169 -267 5 -40 -11 31 -64 -48 -147 -274 -219 -183 101 -110 -123 84 -90 -108 -2 -451 -51 65 45 -20 9 91 -30
6194 -30 74 -128 -6 157 -220 -9 6 27 -66 69 126 83 234 -374 15 104 -30 107 -88 154 92 158 52
6217 52 112 32 113 178 11 -96 142 59 -6 52 -28 -39 96 84 39 -42 -107 44 -90 120 -35 80 111 -188 1
6242 1 -111 120 167 65 54 172 -79 14 -25 -22 22 -179 -3 169 -45 -210 39 166 179 -33 42 -163 -85 -107
6266 -107 45 -117 160 6 25 86 393 -181 308 -17 -63 31 -210 -58 -191 80 -31 65 -156 78 -122 46
6288 46 -211 -113 -85 -69 75 131 46 134 92 15 302 167 -79 128 117 154 -15 274 -17 98 -72 -125 -2 -73
6312 -73 -98 68 -154 -114 -118 -91 57 -25 195 -80 -271 236 68 -119 -230 167 75 286 -52 145 -38 1 -187
6335 -187 38 101 -128 -24 -27 -98 374 -50 57 133 -99 -47 -21 30 -277 -5 3 -97 92 109 -41 108 -33 -96
6359 -96 97 30 109 250 252 319 174 158 -37 31 -275 -46 35 -66 51 -31 -136 -114 128 -81 58 41 -13 -202
6383 -202 -184 -79 149 43 108 29 93 40 -13 -66 -95 9 -120 95 -138 -30 174 -91 -83 -36 -60 40 -3 -101 -187
6408 -187 205 -82 -22 2 -155 -126 160 197 -324 -118 4 -168 82 201 114 38 -128 -11 -48 98 -308 26
6430 26 -96 -168 -116 86 102 -15 -148 45 -190 -193 52 201 -27 -133 235 41 -121 55 -10 -205 -57 -52 -392
6453 -392 76 -7 87 66 47 51 -267 178 328 38 -94 201 -80 105 -97 123 -77 268 23 -28 140 -90
6475 -90 119 14 0 -80 -80 194 -68 76 -225 -166 138 19 142 30 -54 75 22 -123 -119 -44 -223 -83 -129 160
6499 160 -104 -161 -120 -12 -2 425 12 -208 89 62 -44 -96 -30 -108 98 91 320 -33 232 200 21 -266 1
6522 1 -120 177 134 99 -82 -92 -286 14 -139 167 50 31 -196 -53 133 30 -243 -74 179 41 -108 -64
6544 -64 19 61 6 3 -62 56 250 -146 -20 0 -17 -21 -9 43 -315 2 62 338 138 60 -34 169 -35 28 -43 73
6570 73 -83 -42 104 207 -271 161 -19 -23 -59 116 -110 -206 220 259 -135 5 73 43 -24 -108 72 143 46 61 -216
6595 -216 -33 61 20 153 -110 84 15 -200 118 373 -104 -258 -110 58 -29 -19 -12 49 -22 -89 116 -21 -57 -82
6619 -82 -30 -49 -65 106 -119 -394 -292 -77 -13 -101 88 -10 -82 65 53 -81 -67 -55 42 44 0 -105 -12 -106 -65 95
6645 95 -232 -115 -30 128 -89 -14 224 151 -76 53 167 175 -62 -72 57 47 35 -22 149 175 -186 -243 195 73
6669 73 107 72 115 48 -47 79 12 -186 6 -147 58 -121 69 -8 -19 -69 -225 63 79 -40 -135 70 109 34 -127
6694 -127 163 129 -32 -111 73 -9 -149 176 -186 -75 40 36 -163 -93 18 35 -48 -8 81 70 -175 102 -83 -204
6718 -204 -140 -145 58 16 -64 142 22 137 -166 -109 146 -50 -70 -192 28 145 24 -487 6 -8 116 -140 -7
6741 -7 48 -147 -61 -100 206 -131 185 -125 -286 -31 148 134 26 -68 -109 -102 -315 -71 -336 260 38 -86 51
6764 51 -28 13 -1 59 -158 -55 125 -72 37 -120 59 -76 -104 -70 71 -58 -63 -18 12 6 31 50 38 -46 -4 192
6790 192 -111 175 -201 -157 137 155 -96 -35 -144 95 63 -156 30 50 -172 208 189 -40 -58 -114 52 181 158
6813 158 -55 -91 83 -27 81 9 -48 -188 -60 -83 -35 13 89 -157 -213 200 -6 -202 9 -45 -136 -309 39
6836 39 -109 -131 -62 136 -84 88 96 61 -86 -186 35 53 5 7 -138 53 282 -207 -83 72 -28 44 195 -10
6860 -10 -37 190 -60 -5 75 -200 66 156 152 1 -107 186 -2 88 184 1 -22 -121 138 143 97 -164 -5 69 -257
6885 -257 54 135 -34 -47 55 97 108 18 -31 192 -13 114 -43 15 92 65 16 211 63 13 45 -323 5 74
6909 74 -198 -57 -190 0 -42 50 167 25 -216 -8 110 -18 -2 -148 72 100 -11 101 194 33 -110 24
6931 24 -2 -100 -237 -107 -219 138 -143 -141 143 -73 131 -153 -98 47 122 -69 -76 -213 122 14 -14 112 3
6954 3 214 -100 63 135 77 -202 -115 178 54 166 52 33 -14 79 -79 114 -114 56 -55 -100 -36 -45 -32 -246
6978 -246 -125 -59 148 -65 70 -336 88 -55 -61 68 43 195 194 -235 258 53 174 106 74 150 -12 48 77 70
7002 70 -65 -130 4 27 26 -178 13 45 32 160 33 -133 -153 255 -109 -108 3 130 -149 -179 -38 -177 84 -75
7026 -75 -11 79 -68 231 -61 -5 82 -69 -97 198 154 151 120 304 -41 -161 42 -102 -161 3 -47 33 -17 91 159
7051 159 -230 -11 46 -1 -116 -71 -156 -131 -109 60 -4 -14 -42 183 14 214 -35 -205 -175 -101 44 -16 17 -268
7075 -268 124 -50 156 -54 23 -25 91 -160 20 153 113 -197 3 96 89 -163 39 -30 -33 -12 84 -68 -79 70
7099 70 161 46 90 228 5 171 -109 -56 59 84 153 41 117 -230 -108 101 -44 -169 24 -149 -166 91 -105
7122 -105 -3 -18 12 144 218 -14 -49 -159 10 -127 160 176 144 -140 -79 -190 287 24 122 -159 -191 -40 -101
7145 -101 139 57 171 -59 -181 -150 50 -53 -253 74 88 55 -22 179 -45 83 86 -83 223 7 -270 42
7167 42 123 -178 -18 -46 -73 -255 -144 -150 113 70 94 -179 -16 -35 67 88 -238 118 -150 122 68 -27 116 -105
7191 -105 -284 -87 -78 -140 -86 -82 97 94 -6 2 27 148 122 -80 136 144 33 83 -85 40 -53 -245 -93 -149 287 31
7217 31 -247 -108 193 -85 21 48 -33 105 -198 -138 4 -1 -67 -54 -41 -272 9 -8 178 94 -202 -151 -112 -46 -136
7242 -136 59 -128 -5 -116 127 -141 -42 57 -231 170 -100 -269 -160 40 35 -9 -28 -91 186 10 -65 87 68
7265 68 28 55 -70 -40 147 52 -118 -126 150 -67 -168 262 -86 123 88 25 -156 184 -183 -205 -58 267 201 45
7289 45 125 -92 144 -128 134 51 -100 -244 -181 -89 91 -22 -125 -129 -200 -42 64 -109 58 -69 123 -22 45
7312 45 -220 41 -70 33 -113 -190 30 118 -13 83 -143 -82 4 -161 -10 3 -36 -66 -54 -206 -109 0 54 -35
7336 -35 20 -87 -123 76 -195 -68 -259 -41 226 -151 -142 -118 135 -46 64 -22 -20 -80 -33 5 -174 -104 28 167
7360 167 41 -261 96 235 170 -9 17 89 -73 123 24 171 -317 -73 61 -33 -51 97 -25 -78 60 97 6
7383 6 -182 185 -20 1 -104 -104 -18 131 43 215 -246 103 95 74 -24 86 -201 -214 -92 -32 -3 -75 33 -66 -280
7408 -280 257 -13 31 -21 55 -277 -31 37 -4 121 -232 -112 -144 127 -47 -5 -156 -123 -17 8 -136 66 -95
7431 -95 -120 -231 9 -230 129 15 -58 -12 -13 95 -28 -38 -89 -91 72 -180 -36 71 86 -155 -28 -76 -279 -49
7455 -49 -2 26 144 97 39 -35 295 50 -157 183 -19 -221 -146 204 -49 28 29 69 -42 88 66 6 -239 118
7479 118 -68 -36 120 13 -123 65 170 30 -8 133 69 -31 -68 77 -73 -7 -85 85 -36 80 -129 -104
7501 -104 245 98 -114 -254 -18 -5 -117 -231 -306 -75 -27 52 116 27 122 -11 70 -89 -217 2 113 -218 -47
7524 -47 -64 -119 85 -57 -52 15 50 -159 12 -141 -35 -11 -115 148 72 54 -29 -170 70 98 11 -27 230 95 30
7549 30 -151 -63 253 71 79 -117 -26 -63 9 120 -104 141 45 -40 -92 -8 138 -6 -32 1 42 -278 7 177 -409
7574 -409 -74 154 43 -48 -96 -193 42 49 -20 -107 2 42 114 1 114 54 97 -143 -72 -207 78 -56 340 -57
7598 -57 -26 -220 -8 -168 -86 179 148 218 -250 -13 -45 -260 -189 315 158 -170 -232 -80 -154 17 -5 152 -224
7621 -224 73 -112 94 129 34 -30 25 -178 -52 -48 -55 37 -54 -34 -19 -71 -147 -29 86 -116 -52 -9 174 84 2 163
7647 163 -19 -396 115 -142 66 16 -21 -54 -235 179 -92 -17 172 97 78 240 24 62 37 -22 -21 -134 46 -126
7671 -126 97 -169 9 -132 45 72 -56 -99 -24 -21 78 -161 71 -4 -5 228 -192 18 83 -10 381 -211 -113 43
7695 43 117 -33 262 82 -323 0 -114 47 -8 -34 -106 46 -217 53 -86 -18 -73 85 -165 200 -31 -154
7717 -154 -77 -159 -28 242 -297 -214 68 -238 -71 118 -21 80 -104 17 138 -190 78 15 -128 -39 153 46
7739 46 196 -61 76 -104 -162 14 62 -9 3 -37 30 106 18 -13 161 -69 168 -1 59 -105 160 19 1 -42
7763 -42 -126 252 86 -45 37 6 106 -154 67 -28 76 -108 -168 25 -128 -74 40 -34 -96 50 77 -276 -35
7786 -35 -56 81 -62 55 129 3 -242 -230 211 -68 -9 9 64 -278 -114 -77 54 -38 -83 95 -109 -115 32 -12
7810 -12 184 31 208 237 -118 37 13 -298 72 111 -105 -6 -20 39 36 26 -95 49 -128 -89 153 31 -90 -149
7834 -149 198 222 14 -77 65 -60 1 10 -22 148 -6 170 -9 87 -254 12 24 -15 -18 134 -139 90 -119 -119
7858 -119 -43 86 180 -129 -5 31 -192 -50 -8 -71 -76 106 134 175 260 155 -45 -57 143 104 -177 -193 1 -55 -237
7883 -237 -297 -94 -70 -136 -163 -134 -55 44 117 -127 87 -156 -200 106 -70 203 -160 -37 13 -7 -89 -43 -191 -145 18
7908 18 39 134 169 -96 -136 206 12 -87 17 27 -12 -99 -32 -29 79 -212 73 -315 52 144 -172 73 -239 -68
7932 -68 -152 -86 -271 -243 7 -5 16 -126 313 117 7 -54 -113 -215 -159 216 -149 29 -32 -7 73 69 -13 131 36
7957 36 98 -65 -15 207 168 -51 -163 132 -141 6 128 -159 -67 187 -169 19 120 -295 -43 135 -65 -35
7979 -35 -40 236 26 -1 195 -23 -131 -107 -138 -134 -49 -8 96 166 -153 22 167 -157 -43 36 47 -43 -3 -113 223
8004 223 -130 -31 -229 -110 97 -50 -273 -68 71 -195 40 -39 64 199 58 76 -42 -52 -135 137 -46 -68
8026 -68 -8 -9 277 -81 -14 -71 108 -133 -226 36 -92 -7 -160 -108 -142 90 -72 96 -62 147 164 -89 91 -54
8050 -54 -77 -98 -67 135 61 -60 -29 -82 35 -58 -89 18 32 -45 -52 48 -209 -67 -19 -313 -155 16 114 -70 45
8075 45 -43 8 -9 124 35 -10 -31 -36 -17 52 187 1 -53 102 115 63 -44 -70 39 -24 -172 20 -99 165 -25
8100 -25 -80 -9 -342 -15 121 -117 61 148 3 -22 -96 109 63 -79 167 81 101 -139 24 -188 30 -40 -213
8123 -213 -195 19 -39 -49 19 234 20 -9 -31 113 6 99 -69 -38 98 -248 6 -12 107 80 -56 -18 269 16
8147 16 117 -88 -31 177 218 -48 -134 92 69 -23 223 -62 90 -187 73 -72 -9 142 42 54 -137 36 -311
8170 -311 -43 -166 -121 11 -187 221 25 -71 96 8 -79 -27 -82 -221 -314 82 36 -123 -16 41 -192
8191a92
$$ Imaginary data points
##PAGE= N=2
##DATA TABLE= (X++(I..I)), XYDATA
0 0 0 0 0 0 0 0 0 0 0 0 0 8 -8 8 -9 16 -16 24 -25 32 -40 48 -57 71 -80 96 -112 129 -148 171 -195 224 -254
33 -254 289 -326 366 -413 463 -519 579 -645 717 -796 882 -976 1081 -1191 1315 -1449 1595
50 1595 -1759 1939 -2135 2353 -2597 2873 -3186 3541 -3953 4434 -5006 5699 -6561 7662 -9126
65 -9126 11182 -14287 19584 -30990 111391 -206222 -148937 293795 -52293 -105625 135255
76 135255 31026 -101457 -13255 14288 67945 -63043 -148162 96115 123566 -158098 -39230
87 -39230 112515 -79190 -44669 134788 -550 -84987 -6446 20239 42425 -16958 -91245
98 -91245 38651 34213 -88882 7282 23052 -88963 2462 56351 -9928 -5248 -49407 -21707
110 -21707 95558 -1680 -57303 64474 -5062 -71860 69505 26506 -82834 18201 29712
121 29712 -26962 28758 -25679 -62144 74222 29436 -51516 63404 2717 -84596 82534
132 82534 68617 -77568 21057 39697 -48370 34681 28616 -64431 5746 38991 -11055 11267
144 11267 -11553 -34742 29246 27903 3048 18057 -27212 -22878 61562 11854 -50088 20740
156 20740 13883 -32279 24709 10369 -55949 -4368 32600 4329 -4393 -28698 -16912 27641
168 27641 4521 -4479 13186 -28862 -12685 40482 -12696 -31856 11040 -10060 -6046 24113
180 24113 -29211 -39559 21855 8345 -11054 9275 -15417 -21791 19037 10687 -4734 1750 -16956
193 -16956 4377 29048 -19838 -22285 21309 -4903 -9054 26950 -10318 -30701 13498 20019 5373
206 5373 3347 -10331 2936 19816 -534 6865 12583 -15492 4797 31982 -7730 -19723 10214
219 10214 4202 7229 16560 -11124 -14577 11623 9764 7810 8743 -13415 -4701 17641 6463 -4020
233 -4020 -7761 -9280 13314 14023 -18835 -11378 1479 -9862 10931 16848 -26488 -23907 16870 9489
247 9489 -6591 -6000 -10870 -2242 7060 1096 -5971 -16890 -12991 19019 11220 -25088 -14436 3369
261 3369 -2356 7482 7035 -20314 -11915 13462 7866 -1633 -7269 -9671 7944 15695 -2999 -8535
275 -8535 -6131 -1691 16656 11262 -12584 -8886 3679 6483 15004 3316 -14278 2052 14359
288 14359 7313 4025 -2704 -7489 10157 16630 1065 -5272 -6774 901 16151 9952 -9527 -6830
302 -6830 1823 4535 12704 2614 -13545 -3227 10826 7413 147 -9499 -10242 7174 10026 211
316 211 -8388 -14280 -3781 13735 5852 -12492 -11002 -4619 4324 9681 -4470 -17668 -4972 8513
330 8513 4301 -2854 -13092 -12716 5228 12585 -1773 -14273 -12097 1347 12117 2244 -9818 -8991
344 -8991 -2272 9200 10123 -7196 -13916 1884 11332 7447 -2364 -10713 -4337 9801 12071 155
358 155 -7204 -5570 4763 14406 6138 -8062 -5079 7665 10866 5887 -3173 -5087 2448 9364 10740
373 10740 -220 -11080 -1840 12691 8413 -1225 -5192 -3704 4323 7925 3580 -4546 -7738 171
387 171 10896 5010 -10257 -8463 3163 4566 621 -19 -8652 -10465 5021 8741 -3787 -11392
401 -11392 -6711 3314 5333 -4020 -7255 -5537 -3967 5020 5675 -9127 -14203 353 8866 990
415 990 -6944 -6889 -4314 2960 8313 -2328 -10387 -3106 5038 7316 871 -8194 -4464 6944 8069
430 8069 2347 -4354 -5561 2752 10603 6611 -5975 -4066 5587 4576 5799 5064 -7706 -3626 15803
445 15803 7383 -6927 -1074 3618 2812 6048 4483 -3938 -4609 2876 9205 4477 -7334 -7355 8002
460 8002 7824 -7704 -1338 4637 -8764 -1391 14127 -3619 -16444 1109 9109 -789 -7603 -3392
474 -3392 327 -2926 -2732 4174 -141 -13595 -4448 14368 956 -19427 -802 11831 -8649 -4947
488 -4947 9277 -6744 -13536 7447 10651 -6686 -11047 75 8642 628 -5733 -94 1604 -4285
502 -4285 1968 11320 -4956 -14580 8116 15276 -6359 -5755 4885 -1776 2515 8744 -642 -6335
516 -6335 419 6573 7732 294 -7372 -432 9458 6617 -2696 -1688 288 258 8556 6303 -7104
531 -7104 -4318 5249 4580 4745 -1697 -8771 3069 9103 -638 -4026 -447 -3324 405 8949 -655
546 -655 -12229 -2547 6824 560 -908 -5074 -8234 2914 4217 -4166 -2505 -5731 -7488 7485 4576
561 4576 -10684 -7058 686 1109 1928 -1408 -8393 -3656 3430 1554 -256 -2955 -8630 -573 12292
576 12292 -892 -11132 981 3943 -318 4655 2114 -6615 -2792 8300 9784 -3228 -7812 4028
590 4028 7500 3588 1958 -1435 -2176 3335 8405 6362 -4746 -6970 7448 10111 3 -2139 -959
605 -959 -896 5075 7958 -2116 -7813 174 6271 4081 -346 -6066 -4910 5923 4455 -2399 -3417
620 -3417 -6503 -924 8612 -821 -8398 -2300 -2509 1265 5291 -5325 -10714 32 4466 -306 -3211
635 -3211 -5473 -4764 1408 4837 -1415 -7237 -4829 970 5395 213 -6777 -4164 1210 3222 3249 -3110
651 -3110 -5641 339 3300 4555 1117 -7605 -2090 8652 3674 -2071 -925 -1293 1907 6135 3857
666 3857 -2216 -4688 3200 9002 2668 -4519 -934 3458 2656 3854 2456 -4602 -2842 8157 6015
681 6015 -2597 -3381 -648 3692 4709 -579 -2624 -1677 -794 5557 3932 -6605 -4811 3151 3155 -216
697 -216 -2063 -4489 -2079 2879 2124 -2497 -5964 -2809 2294 2600 -3186 -5097 -2487 -7 2340 10
713 10 -5638 -4228 1183 1303 746 -2869 -6051 -65 4243 184 -3200 -2495 -1445 2376 3458 -1240
729 -1240 -3855 -1647 3506 4046 -785 -3696 -329 3163 3051 2573 -1393 -3112 2256 6432 2156 -1979
745 -1979 -862 1358 4999 3308 -650 -1666 541 4030 4768 229 -3856 378 4385 3618 404 -2155
761 -2155 -2147 2346 4535 462 -3105 -2575 1326 3573 1087 -3205 -3923 -103 2607 2051 -3300 -5004 -1208
778 -1208 2089 1416 -1892 -4613 -3720 1886 2468 -2286 -4606 -3325 561 2180 42 -4582 -3746 232
794 232 2429 559 -3123 -3901 -971 2836 2245 -1848 -4150 -1134 3336 3237 -740 -2632 -1359 1760
810 1760 4458 1418 -2762 -2228 2405 4987 2235 -1891 -2295 2020 4669 3272 -274 -2489 7 4645
826 4645 4979 -144 -3277 -40 3726 4365 897 -2815 -2107 2657 4625 1747 -2966 -3386 812 4456
842 4456 2257 -3224 -3851 -95 3531 2131 -2441 -4172 -1741 1875 2620 -647 -5566 -3926 2608 3307
858 3307 -1966 -4930 -2149 19 1730 1210 -3561 -5312 -1007 3212 1659 -3326 -5564 -344 3083
873 3083 525 -1802 -2414 -2368 523 4216 1315 -4886 -3642 3704 3925 -820 -1226 -1533 -41 3410 3132
890 3132 -574 -2886 -549 4242 4820 -1113 -3211 935 3937 2441 1330 4 -2920 1654 6654
905 6654 1780 -3338 -796 1399 3984 3408 -2724 -2657 1444 2138 2783 844 -4621 -2566 4644 3072
921 3072 -2199 -2921 -1646 -62 3740 822 -5701 -2720 1403 863 846 -2013 -6524 -290 3943 -797
937 -797 -3357 -3075 -1903 1365 1813 -2030 -4726 -1938 2065 1573 -993 -3136 -3950 1840 4274 -1914
953 -1914 -3002 -319 -471 1924 3297 -2128 -3387 1562 3754 1059 -575 -1287 -534 3471 3208 -1680
969 -1680 -276 766 -145 4370 3229 -4318 -153 4482 983 1518 580 -2242 911 3932 1403 -166
985 -166 -987 -890 2900 3548 -1131 -3563 1592 1682 0 2114 -1385 -4086 1758 3858 -1357 -2451 -2251
1002 -2251 -48 2263 245 -2413 -2751 -1138 1512 1296 -1587 -3800 -2480 2492 2054 -3533 -2972 -887
1018 -887 -486 1811 396 -4275 -2748 1669 1881 -329 -2675 -2309 463 2738 883 -2712 -1669 563
1034 563 1845 2804 -1210 -3590 1408 3084 677 957 -2019 -1422 3990 3013 -1125 -848 -181 1473 3780
1051 3780 960 -1578 -739 1958 2906 1706 -375 -1890 983 3516 1318 -689 -518 -831 1826 3048
1067 3048 -776 -1894 -596 1337 2222 62 -2059 -1204 -142 1480 1341 -2557 -2733 -101 1415 1160
1083 1160 -1844 -3255 -1097 1266 975 -1084 -3418 -2725 810 1908 -596 -3560 -2326 520 1458 361
1099 361 -2760 -3339 -26 2062 971 -1251 -3575 -612 3065 1254 -1056 -2061 -1393 2159 3431 -535
1115 -535 -2491 -711 1998 3420 923 -2017 -1517 2307 3522 1493 -1009 -1831 1128 4037 2432 -1185
1131 -1185 -1374 230 2849 3266 -581 -1974 151 2012 2551 842 -2474 -1086 2142 2035 755 -1399
1147 -1399 -2282 555 2290 336 -1707 -1932 -915 1183 1271 -1374 -2807 -1342 902 838 -354 -2936
1163 -2936 -2067 105 1473 -185 -2344 -2785 -605 1653 -195 -1668 -2648 -1483 1401 1578 -1770 -2538
1179 -2538 -1360 1075 2368 -450 -2585 -1530 1473 2047 885 -1407 -2224 1224 2952 1540 -1181
1194 -1181 -1558 624 2994 2282 -1103 -1380 443 2337 2967 238 -2110 131 2767 2409 759 -1441
1210 -1441 -1116 2189 2603 112 -1257 -932 698 2739 1178 -1833 -1162 524 1650 1022 -830 -2082
1226 -2082 -309 1203 815 -807 -2085 -1191 716 787 -1095 -1731 -1721 -392 1249 -311 -2047 -1628 -291
1243 -291 377 391 -1459 -2171 -498 286 385 -716 -1895 -1310 748 946 -685 -1297 -1466 233 1342 400
1261 400 -1295 -724 143 1648 1577 -829 -1102 639 1657 1003 39 -1099 -349 2167 1693 409 -626
1278 -626 -508 1539 2505 779 -1313 -16 1249 2222 913 -790 -1139 908 2176 1186 -1060 -1432 536
1295 536 2063 787 -988 -1271 -474 1464 1536 -980 -2069 -601 811 1018 -672 -2363 -1158 723
1311 723 694 -447 -1706 -1680 -28 1050 -170 -1877 -1821 -191 801 86 -1391 -1781 -520 791 403 -735
1329 -735 -1707 -1054 1018 940 -441 -1249 -429 662 1058 340 -525 -1119 408 1472 828 -318 -747 0
1347 0 1631 1703 -221 -690 -37 1088 1855 865 -1005 -505 1399 1703 855 -497 -941 750 2281 1386
1365 1386 -987 -1190 297 1308 1676 -46 -1991 -528 1720 1014 -245 -1560 -1303 916 1689 -333
1381 -333 -2048 -1378 596 1075 200 -1798 -2371 181 1519 -445 -1391 -1790 -1098 1211 759 -1542 -2016
1398 -2016 -703 607 1160 -737 -2272 -1063 706 1009 -380 -1223 -1198 213 1757 423 -1554 -1005
1414 -1005 553 913 1322 -735 -1196 707 1473 957 329 -693 -512 1665 1601 501 -566 102 1109
1431 1109 1400 1344 -13 -1151 958 1693 628 229 -565 -348 1666 1286 4 -759 -559 711 1447 623
1449 623 -1300 -1159 396 1552 -55 -1047 -1351 -551 1580 479 -1539 -1213 -997 310 1022 -1196 -2319
1466 -2319 -603 356 808 -603 -1944 -1332 280 886 -475 -1546 -1363 50 653 575 -1702 -1674 553
1483 553 669 198 -406 -1420 40 1764 637 -488 -833 -97 1327 1085 130 -624 -181 1265 1369 285
1501 285 -112 -113 792 1970 547 -321 228 248 1035 1166 -34 -327 369 823 1148 -27 -354 -189 236 1171
1521 1171 349 -758 -172 -192 557 453 -803 -837 43 245 596 -239 -1483 -44 146 36 -420 -1206 -1006
1540 -1006 237 398 -182 -1436 -1046 95 180 -97 -1061 -1475 183 736 -147 -945 -1051 -425 940 407
1558 407 -871 -749 -324 1081 759 -501 -744 -142 969 1096 -228 -962 231 820 1208 391 -665 86
1576 86 767 1313 819 -627 -543 752 1246 931 -295 -463 637 1088 794 66 -554 229 1070 719 278
1595 278 -535 -270 1170 735 -123 -593 -508 156 733 -7 -638 -675 -183 537 226 -677 -1010 -714 174 128 -793
1616 -793 -970 -630 32 512 -239 -1258 -918 -15 710 -217 -835 -992 -212 756 458 -902 -1181 -224 371
1635 371 696 -489 -1127 -391 900 977 129 -820 -389 879 1087 329 -584 -746 575 1358 926 -561 -643
1654 -643 316 1428 954 -481 -680 299 1273 1163 227 -692 -99 1184 1344 158 -869 -366 792 1131
1672 1131 232 -760 -453 -15 977 448 -703 -814 -216 839 345 -835 -1130 -409 132 515 -540 -1201
1690 -1201 -565 67 248 -173 -1108 -971 -20 481 -34 -872 -937 -168 480 156 -723 -961 -540 269 410 -400
1710 -400 -934 -751 446 765 207 -673 -640 736 982 352 -262 -628 336 1235 720 -8 -349 22 934 1082
1730 1082 -5 -543 -61 789 1034 451 -683 -314 786 1196 633 -513 -506 357 1236 365 -581 -513 119
1749 119 904 741 -497 -941 32 554 524 -423 -1036 -307 288 592 -331 -564 -853 55 414 -92 -1035 -1032 -318
1770 -318 214 206 -813 -930 -214 282 53 -557 -941 -286 129 346 -280 -694 -452 273 645 79 -434 -358 -35
1791 -35 746 315 -229 -242 454 523 518 19 -400 216 857 533 292 -299 -44 705 1091 447 -347 275 605 691
1813 691 506 -416 -371 488 769 411 -155 -497 195 702 502 -281 -496 -222 394 365 -229 -764 -462 406 221
1834 221 -266 -762 -738 105 397 -192 -1033 -656 -179 307 -99 -610 -668 -126 374 153 -763 -522 -153 85 291
1855 291 -373 -663 -323 153 194 -136 -700 -81 425 469 -28 -220 -414 413 495 393 -350 -341 166 735 654 300
1877 300 -507 3 959 561 274 -276 -60 777 953 156 -295 -201 528 998 483 -589 -288 333 812 325
1897 325 -292 -299 -307 512 566 -179 -529 -168 156 635 -114 -811 -288 216 511 -208 -687 -755 -1 515 165 -791
1919 -791 -728 -125 202 120 -866 -1188 -383 329 215 -348 -652 -720 546 249 -218 -635 -880 334 572 226
1939 226 -485 -589 262 1077 310 -108 -137 -332 1222 880 -242 -291 -14 675 913 96 -264 166 515 583
1959 583 334 -199 -28 350 1075 831 -315 35 280 741 704 -225 -768 255 610 156 -61 -737 -279 576
1979 576 356 -146 -461 -766 245 110 77 -682 -1132 78 410 137 -525 -1085 -480 384 480 -616 -545 -519
1999 -519 185 239 -575 -858 -608 232 492 -362 -693 -517 -203 700 -33 -490 -257 216 548 544 -373 -514 341
2020 341 475 486 -11 -463 -3 451 738 99 -276 -96 405 544 415 -24 -213 705 475 517 107 -298 259
2041 259 552 443 61 -217 5 490 462 -98 -439 -282 335 478 -34 -296 -792 89 215 185 -620 -467 -84
2062 -84 248 -22 -713 -859 -173 94 157 -556 -722 -201 108 253 -187 -801 -415 27 132 -95 -430 -642 -198
2083 -198 292 -39 -358 -482 288 393 284 -163 -223 -134 218 229 -273 -421 -43 311 418 -9 -69 -137 369 744
2105 744 209 130 405 456 496 533 -79 -32 164 618 566 40 -56 51 278 476 39 -103 45 359 228 -177
2127 -177 -426 -243 -115 304 -112 -325 -480 -115 316 -32 -416 -676 -231 215 261 -317 -559 -385 108 182 -264
2148 -264 -419 -469 168 310 -243 -332 -737 20 451 -97 -533 -404 12 358 -74 -545 -436 -17 372 323 -41
2169 -41 -285 162 530 596 153 -268 -60 478 568 211 -388 -39 208 618 309 -166 -421 421 498 156 -27
2190 -27 -320 341 495 356 -57 -546 -88 289 457 70 -331 -476 226 399 57 -533 -121 149 9 11 -372
2211 -372 -545 -236 175 81 -140 -623 -240 178 151 -393 -555 -451 -271 273 52 -563 -578 -191 173 -4 -396
2232 -396 -422 -130 289 168 -364 -567 -76 354 653 169 -518 -290 384 248 233 -262 -188 164 499 334 -292
2253 -292 -151 192 366 515 0 -366 538 464 432 -178 -115 -22 758 378 74 -135 -227 206 286 -18 179 -119
2275 -119 203 266 139 -294 -47 76 384 110 -178 -325 -236 212 -98 -79 -506 -433 124 194 125 -492 -420 -250
2297 -250 162 -21 -527 -360 -320 -14 214 -253 -639 -116 106 142 2 -295 -124 233 301 12 -376 -275 -5
2318 -5 455 288 -256 -409 265 576 63 -146 -230 25 474 529 222 -99 196 437 523 295 -183 119 499 690
2340 690 -2 -171 -40 41 241 227 -297 110 2 160 215 -273 -245 187 274 -11 -65 -632 -12 416 -4 -232
2362 -232 -537 74 -73 39 152 -350 -329 -5 50 -373 -305 -470 -203 249 -93 -281 -544 -239 -112 -4 41
2383 41 -110 -296 125 31 -198 -156 -197 -11 447 253 -306 -174 -50 139 134 0 -125 98 421 215 -18 -18 -81
2406 -81 290 568 -201 -179 -40 500 596 252 -92 -114 458 300 225 -140 -214 245 391 155 -208 -281 158 404
2428 404 124 -130 -108 -201 277 152 -387 -446 -493 195 121 -395 -368 -84 -137 102 7 -575 -526 -37 -35 -116 -395 -432
2452 -432 -46 143 149 -367 -528 -357 -16 63 -302 -188 18 280 182 -215 -357 -69 138 139 176 -92 -289 192
2474 192 312 269 213 -331 196 476 338 123 -39 0 356 342 288 -120 -147 175 591 234 139 -131 271 502
2496 502 276 -63 -263 -222 366 420 -5 -120 -25 197 197 -77 -402 -214 237 386 -60 -407 -380 -147 306 -10
2518 -10 -833 -488 -132 75 -64 -550 -543 -290 91 -100 -151 -446 -206 186 -21 -317 -385 22 215 302 -32 -300
2540 -300 -283 100 451 162 -86 -177 54 502 365 60 3 98 202 279 72 123 34 230 383 268 -64 -98 281
2563 281 356 240 -88 55 214 403 212 113 7 16 294 319 117 -13 -84 210 264 157 -428 -234 4 113
2585 113 93 -267 -451 173 278 -52 -200 -462 -284 -34 -137 -381 -350 -499 -57 146 -364 -622 -254 15 160
2606 160 -344 -471 -492 -61 17 30 -380 -402 -33 181 257 -205 -365 42 187 458 -317 -292 121 356 154 -30
2628 -30 -328 11 382 237 120 -32 113 177 423 259 -298 -39 154 568 320 104 -255 154 382 248 96
2649 96 -19 207 261 299 61 -120 -105 104 -39 -174 -130 -40 -160 87 -111 -151 -485 -213 58 60 -230 -395 -431
2672 -431 -157 48 -261 -330 -145 -57 132 5 -410 -549 -83 -7 114 -245 -10 10 347 125 -455 -92 -18 67
2694 67 398 -443 -286 -76 221 369 85 -176 -316 434 510 320 -31 59 424 296 240 87 45 427 481 219
2716 219 -4 -301 397 267 295 -115 -17 68 87 398 -59 -324 -141 317 153 -69 -497 -248 -61 174 199 -480
2738 -480 -230 -109 -48 217 -214 -396 23 -37 -31 -73 -296 -80 -57 1 -325 -429 -341 -239 -47 -200 -172 -369 -192
2761 -192 285 -102 -156 -449 -46 91 270 -20 -363 -216 150 419 259 114 -63 293 296 279 -189 -201 86 481
2783 481 140 -91 -288 244 322 285 13 -194 34 220 296 78 -379 -31 238 467 285 -220 -215 482 307 299
2805 299 -8 -81 216 154 171 -167 -409 -112 328 -17 -37 -383 -73 -2 142 -177 -533 -180 5 -107 -290 -193
2827 -193 -161 -48 -155 -43 -344 -497 -49 -55 15 -72 -234 -10 135 140 53 -26 -85 119 348 -14 -143 -140 237 330
2851 330 348 14 19 -40 454 153 190 -280 81 215 300 277 -21 99 380 342 486 -156 -208 379 390 88 -231
2874 -231 -84 279 394 327 -120 70 129 356 224 -286 -218 -117 -39 72 -246 -228 -202 1 332 -195 -319 -240
2896 -240 -59 -60 -51 -262 -221 193 103 41 -309 -261 13 111 -178 -114 -224 -84 278 140 -119 -193 -127 -31 -19 -238 -77
2921 -77 -152 228 191 64 223 -60 46 398 182 49 185 73 449 141 28 -151 -120 356 233 135 -6 -14
2943 -14 129 210 47 -186 -17 143 165 282 -365 -112 8 169 503 19 -375 -206 236 23 -3 -345 -36
2964 -36 178 309 184 -460 -286 154 -13 -210 -292 -294 46 71 -75 -252 -525 152 -19 -245 -155 -299 -25 172
2986 172 27 -106 -160 -172 -64 409 -178 -212 -109 6 302 -92 -171 128 -41 80 26 -9 -122 128 210 220 40
3009 40 -79 -6 331 273 127 -73 -42 341 284 61 -115 -232 87 291 298 -139 -139 104 50 80 -117 24 -135 35
3033 35 97 -114 -207 -93 186 227 -75 -364 -290 -239 81 -163 -283 -347 -143 180 -6 -343 -272 -294 127 -6 -242
3056 -242 -502 -53 36 223 47 -302 30 -11 203 -157 14 -176 108 46 -5 -142 -99 258 206 309 -166 -254
3078 -254 -39 301 313 80 130 -52 311 365 -20 -187 33 185 357 153 78 123 -86 361 492 102 -157 -68
3100 -68 27 135 -117 -22 -142 -82 105 -35 -175 -61 -120 -29 -181 -269 131 -105 449 -217 -51 -354 -83 -51 25
3123 25 -50 -136 -375 97 389 -43 -279 -70 -46 -142 -64 -105 -254 17 42 -35 -113 -252 68 112 66 -243 43 29
3147 29 306 61 31 92 151 13 433 126 -220 9 206 242 71 219 117 46 290 204 113 -223 -146 241 260
3170 260 199 44 -47 29 136 183 -107 -161 178 228 323 26 23 -64 249 88 -67 -12 46 -82 94 -116 -297 -340
3194 -340 -65 -107 -35 -218 -187 147 -62 -193 -145 -106 49 -132 105 -526 -274 25 -12 36 -149 -14 -318 142
3216 142 113 -199 -236 -56 113 48 -336 26 -48 250 47 151 19 183 132 150 -163 97 242 -8 223 471
3238 471 -8 36 213 118 55 -195 -65 -1 249 141 -132 -214 -128 225 222 -82 -167 26 -93 84 145 26 -170
3261 -170 -236 -80 -151 -261 -435 -62 327 -129 -156 -55 -46 -71 110 -308 -322 -177 98 -169 -202 -284 -81 42 211
3284 211 33 -281 -188 -325 -121 -15 -98 -59 90 32 261 -70 -49 29 192 150 63 -146 -11 186 113 -76 -162
3307 -162 -44 145 286 18 188 -222 243 376 -8 -47 138 188 207 152 1 -157 47 77 -33 45 83 -141
3329 -141 -37 283 165 238 17 -120 -245 45 113 -194 163 -115 90 -162 -266 -313 -74 228 257 -282 -269 -44
3351 -44 -115 -205 -215 -102 75 -325 39 -183 -269 -20 -178 -103 -2 -372 -302 91 -11 -97 -225 174 12 24 -101
3374 -101 78 -187 80 213 -91 67 -9 165 244 288 75 297 112 141 74 91 6 243 174 -14 -66 -129 -42 87
3398 87 193 -48 64 28 74 68 33 -194 77 108 -30 138 115 -201 33 -31 -76 0 -121 -78 257 -52 -131 -204 -295
3423 -295 -285 -13 -21 -233 -28 -275 18 -178 -67 -298 -205 -137 107 -265 -342 -182 0 -37 -41 103 34 17 -132 -110
3447 -110 58 -72 200 175 287 35 28 -126 140 340 -209 42 -43 76 154 232 -147 157 189 269 18 -38 -139
3470 -139 288 80 98 63 72 303 117 59 -80 -65 -100 167 62 -177 -271 -117 46 -180 164 67 -81 87 43
3493 43 -235 -163 120 -113 -128 -73 -189 -194 -52 9 -85 -298 -129 -150 16 17 -225 -313 118 -228 -125 -33 69 69 -32
3518 -32 -30 -146 -44 140 199 -157 -54 -42 -155 -56 51 114 101 42 123 -8 38 53 -7 85 233 30 -172 -112 -200
3543 -200 26 118 135 69 145 -147 142 -81 76 -255 -92 157 -3 -121 -196 -29 119 68 5 -260 100 -56
3565 -56 226 110 -235 -149 41 135 -174 -21 77 -147 51 -95 -79 -385 -158 168 -159 -246 -114 188 72 19
3587 19 136 -80 -98 -115 -106 -222 -20 35 185 214 114 50 -20 182 74 34 -163 37 14 -55 56 -98 -76 87
3611 87 178 185 271 118 -308 -75 60 196 161 -175 -33 312 156 159 -153 102 80 104 48 -74 -334 249 205 88
3635 88 -94 129 -162 -248 -79 -63 -365 -35 136 -71 -42 -122 24 -161 103 -284 -25 -48 7 56 -148 -278 -225
3658 -225 166 144 -299 -138 -240 -47 -100 -50 17 -179 -54 -25 -31 106 -46 -13 -62 -142 -19 -245 144 -55 153
3681 153 2 147 45 -39 50 -42 -94 267 186 -73 -98 305 -149 311 -6 11 153 -174 15 4 172 271 176
3704 176 91 -98 1 233 -205 0 308 274 37 -192 -247 288 98 -153 -273 -118 -51 -73 160 -152 -189 27
3726 27 64 -54 -178 -28 -37 -63 -98 5 -417 -152 -183 -231 -24 -140 -140 173 282 -201 -17 -186 -70 101 -46
3749 -46 21 23 138 125 -46 -76 128 120 77 402 -113 -46 -4 181 -11 -49 -194 -252 60 -44 -62 -77 17 -119 -42 -116
3775 -116 164 6 -95 220 -54 213 -207 -37 -46 244 46 -209 22 -65 50 -48 -145 -23 178 25 -47 98
3797 98 -284 -15 -55 -45 102 -99 10 -45 -136 -85 -174 -61 26 37 -95 -54 -158 155 107 -65 40 -114 -246 5
3821 5 -106 51 -199 79 55 95 17 -26 -78 180 328 12 -133 -265 94 -92 66 43 14 112 140 346 198 104
3845 104 66 113 77 14 -81 99 81 -174 -158 53 -114 44 82 101 -195 95 128 -93 -159 -83 -105 -60 -140 -195 -172 -215
3871 -215 117 -152 93 -265 -66 25 -36 -98 2 -155 -199 1 -115 145 -102 -199 -18 -29 103 -284 -369 121
3893 121 213 -112 84 -13 118 -171 121 -132 -50 -52 196 -8 -124 209 -251 147 12 115 -44 -25 305 235
3915 235 220 83 -71 125 23 0 248 23 44 93 152 -172 -36 95 58 14 -42 -36 -46 148 -77 -125 -7 229
3939 229 107 -133 230 -46 -172 -44 -20 74 -75 -129 101 -328 -5 211 -169 5 3 26 42 -107 94 -13
3961 -13 -18 39 -157 78 -125 -207 -30 -4 21 156 83 -19 -27 56 -200 103 122 -119 -130 -219 31 104 128 87 38 146
3987 146 132 202 -70 45 -92 166 157 110 -102 -134 170 -27 99 -70 101 165 -13 38 22 -80 -33 123 -216
4010 -216 -40 101 -13 73 -59 -61 -64 -50 -17 -108 30 -254 271 70 -62 42 -58 28 -154 -113 -44 -26 -153 13
4034 13 -75 57 22 -42 -20 184 121 -147 -269 -266 -68 38 163 -142 22 104 -55 -232 -113 -216 67 14 119
4057 119 -17 31 142 70 114 -95 -171 -20 -50 63 47 -171 -41 32 117 89 -114 98 38 140 18 -207 148
4080 148 68 106 38 130 -44 193 -119 44 4 -34 78 168 73 -50 -143 -234 16 -170 74 75 -274 -101 -16 -129
4104 -129 -147 -215 -153 50 -45 8 -105 1 -69 -265 -162 -205 -56 -107 -50 -61 -260 193 77 4 -19 -31 -167 196
4128 196 166 170 218 126 116 86 25 3 5 127 262 241 -191 27 27 -38 72 67 75 54 21 78 163 99 -45 283 -185 194
4156 194 -41 90 11 -122 40 -52 -51 -123 196 217 118 -103 62 -130 25 40 -41 -254 105 -106 131 -78 -111
4179 -111 -55 -161 57 -382 -12 -18 -55 178 -15 -99 21 -171 101 7 -88 -8 -104 -140 111 -59 -297 -14 142
4202 142 -83 141 -151 118 -29 11 -127 -67 -101 111 201 8 37 168 120 123 184 -30 58 77 7 -101 -243 113
4226 113 154 20 152 28 -212 209 -182 119 -87 -151 84 -49 212 -142 -123 -11 119 -47 -52 -36 112 -159
4248 -159 -195 -75 5 -207 -100 133 -210 62 -123 -301 43 3 -187 -66 20 216 66 -65 -202 -66 97
4269 97 164 -165 -186 96 -134 -58 104 -134 -244 22 -107 -73 -165 55 63 3 -48 131 -102 127 20 128 103 -68
4293 -68 92 121 114 8 264 101 188 253 -60 150 25 50 205 -202 178 135 -56 -41 -28 -17 14 -230 45 371
4317 371 17 -49 244 -51 149 72 -98 -130 -43 184 -152 -349 120 -137 -149 -162 71 7 -110 -150 92 -186 -226
4340 -226 21 -35 57 115 -146 -148 -137 202 148 147 -1 -41 223 -219 -51 -4 37 134 -138 175 -29 -65 35 157 -196
4365 -196 47 -218 45 41 -20 10 -33 64 -76 -7 32 138 -35 104 182 -140 -56 67 -266 53 -101 -260 142
4388 142 -123 40 -28 -125 -158 -25 -92 43 -133 -119 5 -94 -126 -212 -351 -275 8 -119 -117 3 -53 -124 -67 37 -79
4413 -79 -44 -35 -2 -138 -119 -195 -211 -7 -64 144 61 36 55 -2 -135 -13 2 139 49 51 -255 -10 212 123 241 14
4439 14 138 -33 -119 -27 -94 8 203 -200 72 -48 -52 153 -33 -46 130 41 7 4 59 -14 107 17 -185 -16 -27
4464 -27 -71 -67 147 34 73 90 60 -12 -107 -188 -120 -24 -201 37 -66 5 -17 -100 2 153 -19 -34 -14 102 133 -75
4490 -75 -29 128 186 -155 93 -118 23 -152 54 195 -85 66 -107 2 -56 -38 -57 105 99 3 108 166 5
4513 5 73 23 -75 222 148 0 51 82 26 145 155 -1 63 166 71 86 76 104 113 8 100 14 -72 60 -27 -208 -77
4540 -77 -21 30 -141 77 -18 62 -210 -43 -64 -72 54 -21 -147 -205 -95 -121 101 -112 -178 -93 -278 -107 -133 49 -54
4565 -54 66 -108 -224 28 17 -135 72 154 -357 40 196 97 112 160 -65 81 192 -71 165 19 103 244
4587 244 68 -96 180 81 218 181 195 -5 -53 237 88 104 250 121 22 92 -29 101 75 78 156 102 164 -22
4611 -22 147 -219 205 202 -185 -87 57 43 -89 -19 -371 51 37 -187 -117 119 -185 4 191 -8 -229 -43 -86
4634 -86 106 53 -19 -94 46 34 -45 -104 -260 19 -67 184 216 -78 -56 33 47 -173 74 93 55 195 71 -180 -179
4659 -179 -26 -19 150 -20 -76 186 63 47 -72 -11 142 69 -158 4 161 122 5 247 235 296 128 24 62
4682 62 256 -174 -125 93 -136 25 -86 29 25 139 185 0 -147 30 -77 -51 -13 -66 5 -75 98 -46 187
4705 187 50 62 31 -16 -54 -242 -152 185 68 -100 -22 -17 24 196 -43 -353 125 93 -65 114 -62 -153 198 10
4729 10 -157 47 -257 -111 121 -136 -58 -132 40 76 32 48 -10 -80 40 167 274 -97 31 266 58 76 245
4752 245 130 56 -155 82 -21 -124 58 53 21 -84 -132 -326 161 225 27 -129 138 -53 65 -128 -210 49
4774 49 -48 -109 -44 -244 -236 -42 221 -18 -274 23 167 -33 -160 -51 -106 62 208 51 10 19 24 -63 2 -241 -166
4799 -166 46 -171 -315 -130 -56 -94 -41 0 -65 -56 -101 2 -119 33 114 50 195 285 143 0 -8 300 229 -20 58
4824 58 -41 135 -61 100 11 -72 122 54 -56 150 -105 -131 -92 -113 75 -20 -81 -97 99 -8 66 -161 -157 -94 -38
4849 -38 -105 -253 -81 -117 -20 -111 -119 7 -25 37 -184 119 25 -145 66 121 -202 107 101 -42 299 58 -87 -102 105
4874 105 129 -31 14 109 -137 -101 -22 23 -63 -120 282 94 105 31 -24 73 189 -9 -14 138 -3 -47 113 48 272
4899 272 -219 -29 -7 4 -235 175 57 -10 6 10 -123 138 -12 -9 11 -126 130 -100 220 -46 65 -68 -251
4922 -251 -57 -297 63 -100 -80 29 -210 -138 -190 21 -276 -126 -192 -30 132 -120 104 -136 -63 -62 -199 -210 -4
4945 -4 -85 -17 211 228 67 -214 -152 101 133 -5 -28 73 -111 91 -40 -65 83 106 -21 106 51 -88 92 188
4969 188 209 -44 -25 128 190 201 -101 -66 95 151 -69 -34 133 72 -48 13 70 19 -71 94 167 1 -80 118 34
4994 34 -10 77 -55 95 -130 79 -214 -70 -87 -167 -11 -89 -16 192 243 62 -185 -199 -12 -159 -184 -307 76
5017 76 -271 93 -121 148 -142 -103 -393 -94 -1 -37 -43 74 40 67 -93 -250 -70 -17 3 -19 194 99 136 -32
5041 -32 39 77 -127 161 224 66 237 173 -94 146 208 91 56 -154 -25 56 74 78 73 -44 -39 173 39 -159 -17
5066 -17 -12 148 -1 51 -39 -77 150 -58 60 156 51 139 255 61 -172 -50 75 -188 -106 -81 -304 -52 -225
5089 -225 -155 -164 -161 50 -103 16 -171 110 240 88 -156 31 26 132 -263 92 118 87 193 -87 108 199 -32
5112 -32 132 82 219 267 -8 -8 156 52 48 65 149 -34 20 91 138 134 29 -9 196 85 156 181 155 -60 16 132
5138 132 -5 403 160 87 88 118 -50 50 -20 -195 -89 -115 126 -9 -29 -98 84 -172 -254 -33 -28 76 -155 -184
5162 -184 -137 129 -44 -207 -67 42 148 -125 -200 -82 -219 62 -203 -164 -244 63 -99 27 80 -108 -34 -213
5184 -213 -252 -96 56 67 25 -17 -114 120 141 -119 83 148 190 53 -150 117 67 115 -2 104 -22 -65 65 70
5208 70 255 72 -77 250 146 -79 88 -30 -116 -160 -240 277 25 95 -69 149 -12 15 -165 74 144 -38
5230 -38 -73 -53 -157 -156 -128 -110 -252 -89 62 102 100 -272 -10 46 54 161 1 4 -104 196 -62 198 32 -340 21
5255 21 124 53 25 212 -27 95 44 18 159 -61 41 10 -85 60 54 -3 72 112 49 47 -105 165 14 -20 -74 209
5281 209 36 -9 80 -467 125 25 -81 128 192 -211 -107 -85 -10 38 -145 11 75 177 -50 202 -149 -1
5303 -1 -116 85 -242 -76 -52 -75 -161 32 -108 -101 259 -78 -147 45 -123 -90 -158 -88 308 -104 -198 -172 -306 30
5327 30 -113 105 -22 -127 -73 193 134 -89 131 -153 6 7 -39 160 -107 -39 -15 145 91 -98 48 141 -76
5350 -76 -37 149 -80 176 114 -56 -28 1 199 84 34 185 0 37 -83 66 64 55 23 12 15 -10 234 93 123 198
5376 198 -60 50 -161 140 -35 24 -198 -182 -86 96 84 4 -151 61 -80 -122 103 41 -175 -227 -165 -184 -174 -285
5400 -285 -264 28 83 117 76 -87 -28 166 -29 -224 108 116 10 16 221 18 90 -38 -88 -107 -90 91 71 133 -343
5425 -343 -110 247 85 -43 193 38 33 53 143 291 -76 176 181 251 171 -209 37 5 -12 -59 -140 11 206 0
5449 0 -165 -43 -317 -5 24 33 -23 -98 -202 116 -364 113 -228 -71 -132 254 94 -12 -212 -39 47 18 -199
5472 -199 -297 2 -15 97 -109 -70 -92 77 17 -222 17 -86 -8 44 23 190 -74 -48 -9 3 -83 19 130 -2
5496 -2 -4 194 -42 -15 -42 94 -71 201 150 -127 -20 110 -34 229 -149 198 -26 107 55 105 66 55 -71 -26
5520 -26 51 43 81 22 1 11 275 84 -73 -140 26 197 -130 -32 10 -69 -285 -46 7 -4 -169 -244 -42 220 -163
5545 -163 -19 14 -2 -137 -75 117 -64 -136 -62 -238 -79 7 21 199 -32 32 116 -152 -150 -43 -25 18 20 167 44
5570 44 72 -108 131 60 11 -280 -197 42 11 -31 52 -41 93 70 8 75 89 -162 -2 -23 -79 79 278 30 -155
5595 -155 121 52 -94 107 -25 -85 -205 -52 -97 -8 -63 36 -205 155 239 -180 -20 133 -176 168 113 -135 -96
5618 -96 -100 -161 15 118 -112 -10 -31 -123 -94 20 -158 -146 22 359 -72 -50 -219 -57 -46 50 200 1 -130 12
5642 12 135 -38 85 -49 -21 -20 -24 15 -64 180 -50 276 -131 108 38 135 -119 144 -67 -23 34 275 -16 19
5666 19 -221 189 44 17 38 -67 -131 52 -168 -154 172 142 68 17 29 -147 -219 -169 -52 123 -159 -256 78 -153
5690 -153 -67 -291 -108 107 -184 -102 112 15 -56 322 178 -98 194 -111 -68 16 25 -68 -72 62 -126 17 -72 283
5714 283 -10 -41 -95 -62 15 135 -180 207 293 100 68 71 52 -101 87 -188 185 94 161 -21 9 -188 249 -109
5738 -109 -55 -182 -4 -36 -68 67 7 154 171 -134 -47 -37 41 -37 -140 -33 189 -158 -51 -57 -143 -210 32 110 -180
5763 -180 -254 -132 -166 -115 68 107 -145 -34 -74 -18 -198 159 -13 -272 -145 -197 -65 -104 0 -1 -32 -15 17 74 -133
5788 -133 -48 210 -28 -129 -90 106 -116 -7 152 116 -151 -60 196 -188 130 81 219 65 194 -342 -9 41
5810 41 60 8 94 99 -56 166 43 -36 -197 137 -141 -74 -22 89 -151 -102 -74 14 -289 57 104 -93 66 73 -62
5835 -62 -124 -150 -183 -198 50 -31 -199 5 -71 -52 -30 114 155 -146 -69 -190 213 -2 -24 6 80 -35 -194 -81 -29
5860 -29 70 -11 -17 29 1 61 -78 17 -61 187 224 30 51 429 1 32 81 -6 178 82 65 24 -98 -119 -99 -34 263
5887 263 80 13 -179 -16 131 131 66 146 -8 231 -170 47 19 88 -45 -98 -107 -152 -68 214 114 -60 -96 -166 -54
5912 -54 99 12 65 -175 -241 -72 -20 244 19 91 -206 38 -198 22 59 61 -78 73 88 -135 -180 87 -207 29
5936 29 26 21 -139 -36 -8 -76 172 -25 -112 -244 -7 85 -25 13 -69 226 -200 -61 32 -85 -173 101 280 -267
5960 -267 37 48 -121 -116 238 -91 -220 -189 -209 -16 68 196 21 2 174 60 -220 -178 144 75 -29 -66 201
5983 201 40 22 -44 58 290 -287 82 107 22 7 -16 2 -263 -19 -97 -167 -155 19 47 -207 37 243 130 -52
6007 -52 -37 -135 63 15 -35 -63 -235 -115 -236 41 34 116 29 -128 129 -94 178 -353 21 195 216 -9 -96 -86
6031 -86 -36 249 -33 26 34 132 -183 82 -58 -54 64 -38 101 -43 91 54 26 9 -45 -96 -73 201 -72 112 -71
6056 -71 180 -100 -83 0 328 74 -26 -89 135 -3 182 -19 12 0 -56 -62 -11 -108 -171 69 -81 -32 -51 22 74
6081 74 -214 -46 -202 -77 120 72 161 -25 118 172 -39 44 95 -45 47 47 215 -14 -55 18 81 -163 -68 -89 -319
6106 -319 -48 165 -53 59 -205 143 236 -13 -44 -51 182 -123 -66 -79 19 172 29 34 -82 6 -81 105 32 -63
6130 -63 -49 36 -40 -34 21 -79 -114 -71 -91 -145 50 22 123 -103 -44 -142 40 -67 -198 -81 92 -94 -115 60 158
6155 158 -115 -32 -220 95 -184 -6 -174 -23 -6 -5 -5 -25 202 -116 -84 31 -92 113 101 -112 -117 97 135 289
6179 289 237 105 25 -13 -36 103 -137 98 17 163 -103 61 72 81 90 13 -38 -41 -147 -145 -100 132 84 -179 -140 185
6205 185 -294 -27 -85 66 -52 144 193 -85 202 -47 45 54 -61 65 78 136 250 -55 102 -198 -194 -101 -189 113
6229 113 8 68 36 -198 128 159 -106 93 -93 278 -152 176 -13 -187 89 245 -62 7 -250 29 294
6250 294 104 75 -30 -225 -141 46 -115 -24 -36 -327 -96 254 -7 119 12 223 0 -140 1 58 -78 196
6272 196 20 -136 165 92 -1 -316 -79 229 11 -38 -25 -202 25 119 45 -63 -75 -133 -141 -60 -45 198 9 21
6296 21 33 96 101 -91 52 -384 -172 412 -73 -10 -141 -213 83 -102 144 -43 97 74 -106 34 -7 56 -22 -12
6320 -12 -241 85 -173 216 77 -124 17 63 110 -4 -98 45 -71 227 305 10 136 112 76 135 -232 -103 -251
6343 -251 -82 -5 166 -197 -150 251 36 64 128 327 -122 -80 336 -42 -14 198 177 6 -34 -22 143 195 -47
6366 -47 -23 10 112 113 54 272 -21 48 -18 16 207 35 2 110 -38 -110 294 24 -6 57 -37 -204 -96 70 27
6391 27 -55 -57 24 233 -143 -46 14 80 -194 64 27 82 -69 -290 -50 -12 113 225 121 -25 54 65 8 97 108
6416 108 75 78 234 70 -12 59 -75 173 -83 8 60 79 -50 -4 -53 -177 4 -281 106 301 -148 -120 133 -23
6440 -23 -231 33 -15 73 -5 -241 5 51 -83 -232 -229 -194 158 227 21 159 -130 -199 -37 -25 115 -85 13 -20
6464 -20 -210 57 208 37 -319 -79 122 108 362 10 28 15 68 -18 -203 -50 150 -198 105 -47 -82 -139 265
6487 265 -221 30 18 105 -38 19 -49 -25 54 -29 289 -114 189 20 342 14 -46 99 -111 40 -139 307 104
6510 104 -115 16 142 -11 -30 92 -130 154 -36 65 -82 -234 -16 -193 -1 -101 -87 25 -212 -138 -85
6531 -85 -61 -45 29 115 -92 186 61 37 135 141 -139 71 -249 -128 20 117 90 -207 61 56 103 62 157 -68 55
6556 55 7 -42 -64 79 -176 95 3 45 204 -147 -17 81 110 19 -6 14 -104 12 232 43 109 124 55 74 118
6581 118 -60 60 -94 -122 129 72 -98 164 -97 188 -14 168 148 111 22 -66 12 10 115 78 2 10 -173 -83 22
6606 22 43 -65 -298 79 80 133 92 89 -84 -102 254 127 -155 39 105 -3 154 -81 76 183 202 132 -79 20
6630 20 106 121 87 -35 13 189 -3 46 52 -203 -19 167 -85 -87 115 66 20 -37 -197 -166 292 35 55 -94 175
6655 175 -36 18 -31 -48 233 -107 72 -14 123 -207 -138 -46 209 -231 -78 -32 -189 -83 112 48 -4 225 174
6678 174 86 51 -68 -32 -83 -140 -130 -170 120 -68 -37 -94 -8 -51 47 86 70 -68 2 236 144 -13 276 -31 -25 49
6704 49 -97 72 -31 -190 -102 124 44 -7 -46 -45 -104 -172 -274 -121 101 30 274 94 213 130 -92 148 -22 300
6728 300 116 108 -24 -25 -194 292 45 -41 -47 122 118 -121 249 149 -51 -175 75 -28 -185 -76 -305 -125 -83
6751 -83 -77 -25 155 -39 227 121 -174 -198 -32 31 82 25 348 -143 218 -78 31 68 -38 39 -23 -138 100 19
6775 19 -98 -128 8 -148 13 -85 -51 -57 109 142 7 -29 -105 201 8 -22 -179 -143 -87 152 -412 105 80 15 -162
6800 -162 -251 -5 -267 -29 71 -14 126 -252 -20 11 50 -30 34 -113 25 96 -53 -198 -28 58 -306 99 19
6823 19 -28 118 188 -29 -52 -26 -72 99 59 -289 118 -7 -221 -30 -233 -159 77 -58 -54 127 149 -45 131 -43
6847 -43 90 50 -73 23 -187 90 186 89 -59 201 54 28 144 147 -183 -171 -44 59 -42 -1 150 25 -12 138
6871 138 52 -40 52 10 35 -64 -174 41 32 -42 -222 -215 -17 -129 -234 -5 33 -116 -18 -91 -213 -5 75 -68 69
6896 69 40 214 -144 35 56 -4 -83 -1 -109 105 -120 77 113 -42 129 -101 -119 299 -179 -33 -45 11 -123
6919 -123 78 76 -89 -79 -3 -147 33 1 -137 -133 29 -1 71 119 -19 223 -25 -44 -47 -78 291 -1 86 -24 -29 -94
6945 -94 -123 38 71 193 -225 64 36 230 -100 284 -204 -278 14 159 -50 -149 -40 20 84 -204 -235 17 38
6968 38 113 115 -7 -52 127 32 151 101 -67 108 290 92 -41 -195 -4 -33 -93 39 -33 220 -152 -126 -104 219
6992 219 -18 0 96 187 -18 21 58 81 -16 82 -91 146 -3 15 95 -67 -150 8 -23 1 38 -66 69 -104 225
7017 225 -307 -30 228 -39 180 -81 47 43 -70 -44 308 -97 -56 93 -40 -228 -220 21 -213 -207 -103 202 -19
7040 -19 102 -135 63 9 102 -47 -137 -96 169 -3 -26 158 101 -138 10 -30 -125 71 216 71 118 -135 86
7063 86 29 311 188 130 -147 -141 -65 -187 152 33 -68 -76 -23 -76 230 -104 29 222 73 -35 -145 134 165 11
7087 11 -176 5 60 55 30 -53 230 -81 -95 61 94 28 152 -47 288 -10 -250 145 -17 20 38 42 12 121 -40
7112 -40 182 224 -22 140 211 -212 196 -27 -82 104 -235 -102 110 186 -232 -113 59 -182 -251 194 57 100
7134 100 -372 114 282 134 -60 -78 -3 -94 129 -35 49 58 -5 -6 -30 -164 -165 -139 -8 42 -70 -75 62 -79 76
7159 76 62 -101 5 245 -88 -13 -163 -24 -59 299 -131 -162 -35 172 103 139 75 32 124 36 -175 112 -223 -155
7183 -155 -81 175 -39 44 24 -92 214 81 219 -74 138 -25 193 196 69 -56 109 22 24 201 132 168 20
7206 20 65 127 22 -88 27 24 -47 170 12 75 5 -51 -7 121 174 -8 -100 108 -71 120 -199 -10 6 -154
7230 -154 -145 -138 -120 1 -230 9 131 -31 -4 43 -210 -39 -94 74 -47 66 88 -169 -311 -158 -156 -56 103 -47
7254 -47 -43 234 -52 31 -31 47 -64 -202 -131 48 -125 -160 -260 9 7 -205 -23 90 -17 65 151 154 4 46 110
7279 110 -79 -167 164 7 -29 68 -15 104 -175 178 -98 -86 20 -159 -17 -53 -172 139 -4 203 283 145
7301 145 -42 179 -185 -71 30 -22 182 -81 228 -70 -28 89 183 -46 165 212 13 210 80 -35 233
7322 233 78 87 -98 175 118 -146 -182 69 -75 -71 -17 30 87 -181 2 -76 -9 95 -39 -149 -69 143 155 -86
7346 -86 182 -186 -54 57 122 -14 48 138 73 77 -255 -37 24 -167 157 -3 71 186 59 -105 -97 73 -243 218
7370 218 62 21 -41 45 -43 169 -145 -118 -127 354 -60 -38 120 -28 -54 1 -202 -100 -268 -114 -50 -106 146 69
7394 69 273 137 194 125 -188 -128 41 -4 231 66 82 117 99 24 -53 69 -116 -34 -60 69 0 74 -95 -76 98
7419 98 9 4 156 -80 -201 166 -16 42 -44 -41 79 4 55 -73 -27 11 -136 266 60 -35 -119 -237 -98 -87 49
7444 49 197 -161 176 311 148 90 -2 201 202 125 -205 71 117 -160 15 -63 195 -105 4 -116 -1 117 140
7467 140 -35 -53 16 -14 236 157 -294 -126 83 73 150 -53 -61 115 -133 -57 -192 -65 -20 -108 30 -98 -55 83
7491 83 -111 -6 -140 118 96 22 171 -115 334 35 -65 -98 197 -94 -57 -110 -14 37 154 -17 -77 -60 110
7514 110 -28 66 -61 30 -166 -82 -1 -73 169 59 -107 153 -110 -198 109 156 -62 -79 5 182 7 90 -63
7537 -63 -51 -218 -42 164 -24 2 -177 -91 -15 -46 -195 -41 155 -185 -152 66 -408 189 45 -45 68 64 96 109
7561 109 -20 76 -91 -263 -207 163 -5 -80 39 148 -8 -56 -217 15 -6 93 20 -63 47 181 25 8 -105
7584 -105 38 29 -153 12 -8 70 93 -142 -179 -11 168 -7 -41 131 7 109 236 50 -57 48 -177 -105 -104
7607 -104 -78 -83 192 -14 126 -45 69 -8 35 -82 -29 65 47 -23 29 164 1 203 63 -162 -176 130 -107 27
7631 27 -30 -320 10 115 -269 -37 59 98 35 -152 16 -68 10 108 2 368 -57 -68 -135 -125 -194 80 -101 -115
7655 -115 -248 -80 91 -218 69 37 69 -70 131 -9 -79 -12 -284 -62 95 -106 -58 -84 50 140 -71 96
7677 96 5 111 29 147 13 248 -239 177 -114 -61 90 43 85 -154 -162 109 -139 -46 -159 -29 -142 57 -103
7700 -103 283 106 -60 152 53 -34 -233 -120 -256 -11 34 -79 -219 110 -98 172 -81 67 -9 202 -124
7721 -124 -126 27 -87 79 38 109 -20 -43 75 134 141 49 55 -172 -7 68 -40 -169 23 28 -74 -101 -76 146 167 -36
7747 -36 -235 41 2 -35 -33 -1 -49 99 166 -103 31 -127 -192 85 -162 -193 12 16 -35 152 146 153 -54 -33 266 -36
7773 -36 -100 -15 75 -215 110 -129 33 209 124 157 -47 136 148 -9 -110 95 209 173 35 -146 146 261 -63
7796 -63 210 -208 -369 -38 -56 -8 153 -169 245 174 3 -70 -61 -38 -72 8 111 -152 180 -3 138 108 -47 40
7820 40 -17 39 -80 116 -67 -29 -4 -176 103 -52 76 -143 74 -44 -130 -73 16 -19 70 -9 -11 -79 -64 81 73 119
7846 119 190 -356 -74 -13 19 -30 55 73 -40 207 164 -296 -69 -88 -11 -5 -133 -6 -67 211 210 36 -35 80 -33
7871 -33 153 38 274 213 139 105 -47 24 -174 -95 48 61 -12 -157 -59 -99 85 165 9 67 21 -97 -79 -91 -105
7896 -105 -76 80 208 109 47 -180 25 -62 87 48 84 71 -201 -40 -37 151 -188 176 38 -197 -55 -30 -83 47
7920 47 247 -32 -307 -104 200 132 -46 -121 -20 -180 245 -19 -73 -120 70 -131 -43 168 -185 83 -18 61
7942 61 -16 -35 56 -11 -97 -62 74 -213 -95 -100 -241 -39 -2 -178 -31 -62 197 6 -164 90 55 -93 29 -86
7966 -86 -110 68 -66 123 125 -99 -135 82 210 168 -181 7 223 -22 -147 117 30 -95 129 -69 160 91 156
7989 156 -160 0 -143 -10 156 65 -119 -32 190 -143 109 -137 103 254 77 5 1 133 -152 -88 -59 -52 67
8012 67 -47 -168 121 0 147 187 79 186 -57 79 74 -199 -31 85 -92 -225 27 -53 3 -183 -201 159
8034 159 -76 -253 -153 57 -91 -42 246 7 -130 55 2 120 -10 23 -48 -19 1 -117 75 -157 73 145
8056 145 182 131 -120 220 -77 84 386 -20 82 -140 -169 -149 49 302 -78 43 -212 -143 58 -135 -106 83
8078 83 111 -148 -17 107 4 111 168 45 128 2 -201 -172 -276 9 -29 -79 -318 222 14 -95 -163 -98 42
8101 42 131 -78 2 -198 -85 82 -242 191 -89 35 -51 -6 56 26 58 -48 136 -22 72 -193 271 43 -140
8124 -140 -127 -84 -40 -67 -185 -81 -203 61 68 -18 126 -14 310 -209 23 193 77 83 -2 -8 27 -90 119 -40
8148 -40 -1 -9 -148 37 144 8 -101 -29 54 -25 163 215 -37 -195 -202 -12 47 161 256 148 -177 -38 -34 221 -14
8173 -14 24 204 220 -242 1 -43 -165 18 -172 -3 -113 72 -160 65 -166 230 -47 115
8191A15
##END NTUPLES=NMR FID
##END=
