##TITLE=1H_Pr 4687-Py
 CDCl3, 8 sc, 
 23.3.2020
##JCAMPDX= 6.0         $$ Bruker NMR JCAMP-DX V2.0
##DATA TYPE= NMR FID
##DATA CLASS= NTUPLES
##ORIGIN= UXNMR, Bruker Analytische Messtechnik GmbH
##OWNER= root
$$ XWIN-NMR		Version 3.5
$$ Mon Mar 23 14:49:46 2020 Russian Standard Time (UT+4h)  she@DPX200
##.OBSERVE FREQUENCY= 200.1315
##.OBSERVE NUCLEUS= ^1H
##.DELAY= (6, 6)
##.ACQUISITION MODE= SIMULTANEOUS
##.ACQUISITION SCHEME= undefined
##.AVERAGES= 8
##.DIGITISER RES= 18
##SPECTROMETER/DATA SYSTEM= spect
##.PULSE SEQUENCE= zg30
##.SOLVENT NAME= CDCl3
##.SHIFT REFERENCE= (INTERNAL, CDCl3, 0, 15.7039)
##AUDIT TRAIL= $$ (NUMBER, WHEN, WHO, WHERE, WHAT)
$$ ##TITLE= Audit trail, XWIN-NMR		Version 3.5
$$ ##JCAMPDX= 5.01
$$ ##ORIGIN= Bruker BioSpin GmbH
$$ ##OWNER= she
$$ F:/spectra/data/she/nmr/H-F/1/audita.txt
$$ ##AUDIT TRAIL=  $$ (NUMBER, WHEN, WHO, WHERE, WHAT)
(   1,<2020-03-23 14:48:39.96 +0400>,<she>,<DPX200>,
      <created by zg, POWCHK disabled, PULCHK disabled
       configuration hash MD5:
       00 E9 B6 7A A2 85 ED C7 34 08 36 98 17 FE 4E 26
       data hash MD5: 16K
       85 A1 45 2D FC 7A 09 C4 C2 B2 6A B5 7D 63 23 66>)
$$ ##END=
$$ 
$$ hash MD5
$$ 4F FA 37 89 81 2A 58 D5 9C 16 9A 96 8F 0B E8 DD
##$RELAX= 
##$RELAX= 
##$RELAX= 
##$RELAX= 
##$RELAX= 
##$RELAX= 
$$ Bruker specific parameters
$$ --------------------------
##$DU= <F:/spectra>
##$EXPNO= 1
##$NAME= <H-F>
##$PROCNO= 1
##$TYPE= <nmr>
##$USER= <she>
##$AMP= (0..31)
100 100 100 100 100 100 100 100 100 100 100 100 100 100 100 100 100 100 
100 100 100 100 100 100 100 100 100 100 100 100 100 100 
##$AQSEQ= 0
##$AQ_mod= 1
##$AUNM= <au_zg>
##$AUTOPOS= <>
##$BF1= 200.13
##$BF2= 200.13
##$BF3= 200.13
##$BF4= 200.13
##$BF5= 200.13
##$BF6= 200.13
##$BF7= 200.13
##$BF8= 200.13
##$BYTORDA= 1
##$CFDGTYP= 0
##$CFRGTYP= 5
##$CHEMSTR= <none>
##$CNST= (0..31)
1 1 145 1 1 1 1 1 1 1 1 1 1 1 1 1 1 1 1 1 1 1 1 1 1 1 1 1 1 1 1 1 
##$CPDPRG= <>
##$CPDPRG1= <>
##$CPDPRG2= <>
##$CPDPRG3= <>
##$CPDPRG4= <mlev>
##$CPDPRG5= <mlev>
##$CPDPRG6= <mlev>
##$CPDPRG7= <mlev>
##$CPDPRG8= <mlev>
##$CPDPRGB= <>
##$CPDPRGT= <>
##$D= (0..31)
0 1.2 0 0 0 0 0 0 0 0.06 0 0.03 0 0 0 0 0.0002 0 0 0 0 0 0 0 0 0 0 0 0 
0 0 0 
##$DATE= 1584960519
##$DBL= (0..7)
120 120 120 120 120 120 120 120 
##$DBP= (0..7)
150 150 150 150 150 150 150 150 
##$DBP07= 0
##$DBPNAM0= <>
##$DBPNAM1= <>
##$DBPNAM2= <>
##$DBPNAM3= <>
##$DBPNAM4= <>
##$DBPNAM5= <>
##$DBPNAM6= <>
##$DBPNAM7= <>
##$DBPOAL= (0..7)
0.5 0.5 0.5 0.5 0.5 0.5 0.5 0.5 
##$DBPOFFS= (0..7)
0 0 0 0 0 0 0 0 
##$DE= 6
##$DECBNUC= <off>
##$DECIM= 24
##$DECNUC= <off>
##$DECSTAT= 4
##$DIGMOD= 1
##$DIGTYP= 9
##$DL= (0..7)
0 120 120 120 120 120 120 120 
##$DP= (0..7)
150 150 150 150 150 150 150 150 
##$DP07= 0
##$DPNAME0= <>
##$DPNAME1= <>
##$DPNAME2= <>
##$DPNAME3= <>
##$DPNAME4= <>
##$DPNAME5= <>
##$DPNAME6= <>
##$DPNAME7= <>
##$DPOAL= (0..7)
0.5 0.5 0.5 0.5 0.5 0.5 0.5 0.5 
##$DPOFFS= (0..7)
0 0 0 0 0 0 0 0 
##$DQDMODE= 0
##$DR= 18
##$DS= 0
##$DSLIST= <SSSSSSSSSSSSSSS>
$$ [...]
##$SUBNAM2= <"">
##$SUBNAM3= <"">
##$SUBNAM4= <"">
##$SUBNAM5= <"">
##$SUBNAM6= <"">
##$SUBNAM7= <"">
##$SUBNAM8= <"">
##$SUBNAM9= <"">
##$SW= 24.9337058887773
##$SWIBOX= (0..15)
0 0 2 0 0 0 0 0 0 0 0 0 0 0 0 0 
##$SW_h= 4990.01996007984
##$TD= 16384
##$TD0= 1
##$TE= 0
##$TE2= 300
##$TE3= 300
##$TEG= 300
##$TL= (0..7)
0 120 120 120 120 120 120 120 
##$TP= (0..7)
150 150 150 150 150 150 150 150 
##$TP07= 0
##$TPNAME0= <>
##$TPNAME1= <>
##$TPNAME2= <>
##$TPNAME3= <>
##$TPNAME4= <>
##$TPNAME5= <>
##$TPNAME6= <>
##$TPNAME7= <>
##$TPOAL= (0..7)
0.5 0.5 0.5 0.5 0.5 0.5 0.5 0.5 
##$TPOFFS= (0..7)
0 0 0 0 0 0 0 0 
##$TUNHIN= 0
##$TUNHOUT= 0
##$TUNXOUT= 0
##$USERA1= <user>
##$USERA2= <user>
##$USERA3= <user>
##$USERA4= <user>
##$USERA5= <user>
##$V9= 5
##$VALIST= <valist>
##$VCLIST= <CCCCCCCCCCCCCCC>
##$VD= 0
##$VDLIST= <DDDDDDDDDDDDDDD>
##$VPLIST= <PPPPPPPPPPPPPPP>
##$VTLIST= <TTTTTTTTTTTTTTT>
##$WBST= 1024
##$WBSW= 4
##$XGAIN= (0..3)
0 0 0 0 
##$XL= 0
##$YL= 0
##$YMAX_a= 202189
##$YMIN_a= -128634
##$ZGOPTNS= <>
##$ZL1= 120
##$ZL2= 120
##$ZL3= 120
##$ZL4= 120
##$ABSF1= 10
##$ABSF2= 0
##$ABSG= 5
##$ABSL= 3
##$ALPHA= 0
##$AQORDER= 0
##$ASSFAC= 0
##$ASSFACI= 0
##$ASSFACX= 0
##$ASSWID= 0
##$AUNMP= <proc_1d>
##$AZFE= 0.1
##$AZFW= 0.1
##$BCFW= 1
##$BC_mod= 2
##$BYTORDP= 1
##$COROFFS= 0
##$CY= 11.3945322036743
##$DATMOD= 1
##$DC= 2
##$DFILT= <>
##$DTYPP= 0
##$F1P= 16.9975609425685
##$F2P= -3.02152046262296
##$FCOR= 0.5
##$FTSIZE= 0
##$FT_mod= 4
##$GAMMA= 1
##$GB= 0.15
##$INTBC= 1
##$INTSCL= 1
##$ISEN= 128
##$LB= 0.24
##$LEV0= 0
##$LPBIN= 0
##$MAXI= 10000
##$MC2= 0
##$MEAN= 0
##$ME_mod= 0
##$MI= 1.114404
##$NCOEF= 0
##$NC_proc= 0
##$NLEV= 6
##$NOISF1= 3.799351
##$NOISF2= 2.8
##$NSP= 1
##$NTH_PI= 0
##$NZP= 0
##$OFFSET= 15.70392
##$PC= 1
##$PHC0= -9791.431
##$PHC1= 20.40082
##$PH_mod= 1
##$PKNL= yes
##$PPARMOD= 0
##$PSCAL= 0
##$PSIGN= 0
##$REVERSE= no
##$SF= 200.130013532006
##$SI= 16384
##$SIGF1= 3
##$SIGF2= 2
##$SINO= 400
##$SIOLD= 16384
##$SREGLST= <1H.CDCl3>
##$SSB= 0
##$STSI= 0
##$STSR= 0
##$SW_p= 3612.71676300578
##$SYMM= 0
##$S_DEV= 0
##$TDeff= 0
##$TDoff= 0
##$TI= <>
##$TILT= no
##$TM1= 0
##$TM2= 0
##$TOPLEV= 0
##$USERP1= <user>
##$USERP2= <user>
##$USERP3= <user>
##$USERP4= <user>
##$USERP5= <user>
##$WDW= 1
##$XDIM= 8192
##$YMAX_p= 0
##$YMIN_p= 0
$$ End of Bruker specific parameters
$$ ---------------------------------
##NTUPLES= NMR FID
##VAR_NAME=  TIME,          FID/REAL,        FID/IMAG
##SYMBOL=    X,             R,               I
##VAR_TYPE=  INDEPENDENT,   DEPENDENT,       DEPENDENT
##VAR_FORM=  AFFN,          ASDF,            ASDF
##VAR_DIM=   8192,          8192,            8192
##UNITS=     SECONDS,       ARBITRARY UNITS, ARBITRARY UNITS
##FACTOR=    0.0002004,     1,               1
##FIRST=     0,             0,               0
##LAST=      1.6414764,     0,               0
##MIN=       0,             -128634,         0
##MAX=       1.6414764,     202189,          0
$$ Real data points
##PAGE= N=1
##DATA TABLE= (X++(R..R)), XYDATA
$$ [...]
1990G64j622r47R99J497Q12o98j606q18J527J416j9j353j208L01Q47Q92n23j153
2008h92l73Q51N85M7k57r69K28M74Q38l57p2l59kL97P32k64o66j62P33L60o0j21
2030F91n60M74J14J59p48k06M00K00k63m24k27P62O49n19j060j54P09P50l02k90
2050A55n41N9O22N81K05l80p75j41Q73J162k5q94j343j59J691J000p79j874o48
2069a211J194Q02N5p91j122P5R84N77l71o13k62J17K93Q44K2q74o55K32R36Q77
2089A109k73q16r03O94J199L7j133p25J06Q51M92n45o27j41R0L67p8k46N9m26
2109i09o1J3N63J46Mo05l0M02M74j31j26J42O3m8m27K21J012N39j182r97K46J186
2131D95M30o83j639P1R59R71m20q35p34J79J191M83j7q03n61L59Q98M28M40j025
$$ plain form
1990 764 -858 -1805 -806 691 1503 805 -801 -1619 -92 1324 1305 -48 -1256 -955 -108 784 261 -892
2008 -892 -1265 -414 171 218 -39 -1008 -780 -306 532 175 103 -256 -258 139 871 607 -59 -221 512 872 812 691
2030 691 131 605 719 878 130 -76 324 524 261 -163 -390 372 1021 502 -558 -712 -3 747 445 155
2050 155 -386 -327 295 876 1081 701 -74 -215 658 1820 1795 901 -442 -601 1090 2090 1311 -563 -1211
2069 -1211 -17 785 840 49 -1073 -998 -14 563 192 -421 -683 -566 -273 571 593 -281 -936 -704 232 1109
2089 1109 836 20 -883 -189 1010 1047 -86 -811 -705 146 638 93 -534 -675 -585 -218 -296 -542 -483 -909
2109 -909 -970 -957 -394 -248 -244 -849 -879 -477 -3 -134 -260 -118 -55 -103 -530 -309 703 1242 60 -937 -691 495
2131 495 925 242 -1397 -1326 -367 604 184 -651 -1385 -1206 -15 468 451 -352 -913 -554 344 772 1212 187
2151A87q80M25J608O8o40r95k64J393R18o90j305j29J33R20N06l09j110J68J88
2170A92K73m8l46l30K34J00R8L14K59o06l00L52R43j2l89n58J91M42K20j24l0
2191H75l95R8j71j76L35M73k14n36n78l32R30Q35q31j107N58M91K12l95o3p03
2211f94P27Q6M54K7l27n72p3O35O88k38p28m94K30N47M92q67p45J28K86N06M1
2232A09n82n27J1N71J2K46m86l14K60K57L40K70p32N3j70M80M71M01o36o99k84
2253i49J137L62k06q62k83L74N80J6l37j52j17k36O0M87J86l29m80Q4P34M81j7
2274E33j049J5J54R46k78m92K15k05N86P1o1j09n1n15J89J66O15l14l53m72J49
2295b60L08O66l77o05j3J41N30K51l68j14m32L61L01M86k18j97l31l23N86L07
$$ plain form
2151 187 -693 -268 1340 1408 768 -227 -491 902 1820 1130 -175 -304 -171 749 1255 946 -164 4 192
2170 192 465 417 71 -259 -25 75 173 487 746 140 -160 192 1135 1123 734 176 367 809 1029 905 875
2191 875 480 578 407 231 566 1039 825 289 -289 -621 309 1144 313 -794 -236 255 467 72 9 -694
2211 -694 33 119 573 600 273 -299 -372 263 951 713 -15 -509 -279 268 760 -107 -852 -724 -438 68 109
2232 109 -473 -1000 -989 -418 -406 -160 -646 -960 -700 -443 -103 167 -565 -512 -682 -202 269 670 34 -665 -949
2253 -949 188 550 344 -518 -801 -427 153 169 -168 -320 -437 -673 -613 -126 60 -269 -749 -665 69 550 533
2274 533 -516 -501 -347 599 321 -171 44 -161 425 496 435 326 275 -240 -51 115 730 416 63 -409 -260
2295 -260 48 714 337 -268 -281 -140 390 641 273 159 -273 88 389 875 657 460 129 -194 392 699
2315F99O1m31o92J64Q18M47n50q43r3M47O72j90m37q19M76KN49p7m17j54k41N23
2337h6O42J44q98r86K31J280N85o26j085p5N50P23J07r62l31J45M45j25Q5k38
2357d75k64k4L79L19k3k88n01K38J61N41k79l62j09J82K06L2m55M93%M4o39j20
2379i44N18M41q0m57k44J59O35R9n42n04j43P73P53n07m57m03J21N60N55k60o32
2400e59l44L38O50O46n64n44m10O76Q88J22o65j344L69J032Q53n03j425L3P04
2419d7O29K39q62k72j41J36O16K65m80l22j05N23Q25n29k85l53J55N24M35n89
2439C62K4j02N2J96K6m53K09L47k41n12k55O30n6L06r06r5M24L33K0k12m96K51
2461a48N1J89L03n73M7K1M15R9k7n70n7m83J099L23l10q83l22K93J073R6q54o79
$$ plain form
2315 699 760 329 -363 -199 619 1066 516 -327 -420 27 699 509 72 -747 -271 -269 280 203 -214 -368 -609 -86
2337 -86 556 700 -198 -1184 -953 327 912 286 -799 -874 -324 399 506 -456 -787 -642 -197 -322 -237 -475
2357 -475 -739 -763 -384 -65 -88 -376 -877 -639 -478 63 -216 -578 -687 -505 -299 -267 -722 -229 -229 -185 -824 -944
2379 -944 -426 15 -65 -522 -766 -607 28 127 -415 -919 -1062 -289 464 -43 -500 -903 -782 -222 333 73 -559
2400 -559 -903 -565 85 731 167 -377 -787 -111 777 899 234 -1110 -741 291 1144 641 -784 -751 -47
2419 -47 582 821 -41 -313 -454 -318 298 563 83 -239 -344 179 1004 475 190 -163 -8 516 951 362
2439 362 386 284 336 532 558 105 314 661 420 -92 -347 283 227 533 -373 -468 -44 289 309 97 -399 -148
2461 -148 -97 92 395 -178 -131 -110 305 404 377 -193 -250 -733 366 689 379 -504 -826 -533 540 636 -218 -897
2483h97k5J200j58P2p91l06K04N21o9J80l47k00j30J16O71K13q54RJ40N25K96
2504C70m20l42m85Q71l7j48k3n38J58O08j31l80J87j98o6K22J36j94K83K72p26
2525e81L8N45O8j83j6NK20J78J8m03J14J45M5j56L16J71m12k90Q8M04L0L51q30
2548a35j68J83M07K05o8n83j85M22N83j71o0n23O7J16L30M24j76k66n00L52M60
2569G14M81p24p45k54J002J93m82k02l89K02N28M35r74k20K55L8k9M16J1l83j82
2590c09J01L14N66n77j06m02L10P14k98k92j96k65M35N15m36l22k36K78J19q9
2610a76J83l11l06j7k75N22K57k66l90K57J05L53K53m68l69j2M63K54L9l77k14
2631d95M25l05N8K79J53l91n11K45L78J89m40k47q9N59L50k67j56l42O5K86pK07
$$ plain form
2483 -897 -922 278 120 192 -599 -905 -701 -180 -249 -69 -416 -616 -746 -630 41 254 -600 -591 -451 74 370
2504 370 -50 -392 -877 -6 -43 -191 -214 -752 -594 14 -117 -497 -310 -508 -574 -352 -216 -410 -127 145 -581
2525 -581 -543 2 70 -113 -129 -124 96 274 292 -111 3 148 193 37 353 524 112 -178 -90 314 344 695 -135
2548 -135 -303 -120 287 492 424 -159 -344 78 661 490 430 -93 -26 90 420 844 668 402 -98 254 714
2569 714 1195 471 -274 -528 474 667 185 -17 -406 -204 324 759 -215 -435 -180 -142 -171 245 256 -127 -309
2590 -309 -208 106 672 95 -11 -413 -103 611 313 21 -175 -440 -5 510 74 -248 -484 -206 -87 -176
2610 -176 7 -304 -610 -627 -902 -380 -123 -389 -779 -522 -417 -64 189 -279 -648 -660 -197 57 96 -281 -495
2631 -495 -70 -375 -317 -38 115 -276 -787 -542 -164 25 -415 -662 -751 -192 158 -109 -265 -607 -542 -256 -263 -56
2653e6K28m35o0o7N31L39o80k41j37N46N88p4n13r02P93P53m3j52o15o5M04J7
2675A59K41k02j37k54L70P6J07j53l94j61K97M42K95m31l90j13O84M06m99l46
2695ck93O81L06l45l15K94r8n7k36P4K80K83m41j33j77L35K80q9m61M27k27M3
2717A28J97j56J4k08R5jj8L05k84l53P9M01L98k43q74j36O28N78j73o01m96J0
2739g10N70N26j39m53n47J62O84J07Q1m90k34j23N08N28n24m06m73N49Q41m63
2759fl92k99K20L39J20j29k16j02lK96n1K66m90K90m0l44L15J93k04m3k75L69
2781a86K32k06K03j00K15k69j49J62K61K20l9n87R1M80K2n24l23o2N29P15l28
2802C57m98m94O82L65j37k90p03J8M76L58PK64o78l6N27L06k4m04l32K05K80N93
$$ plain form
2653 -56 172 -263 -323 -390 141 480 -200 -441 -578 -32 556 482 -31 -933 -140 613 570 418 -197 -262 142 159
2675 159 400 198 61 -193 177 253 360 207 -187 -348 -51 391 686 255 -135 -248 436 842 343 -3
2695 -3 -296 385 691 346 31 325 227 170 -66 8 288 571 130 -3 -180 155 435 346 -115 312 85 128
2717 128 325 169 183 -25 70 69 51 356 72 -281 -202 199 597 354 -520 -656 -28 550 377 -224 -720 -710
2739 -710 -140 386 247 -206 -753 -591 93 200 281 -209 -443 -566 -58 470 -54 -460 -933 -384 457 -6
2759 -6 -398 -697 -477 -138 -18 -147 -363 -465 -468 -172 -223 43 -447 -157 -197 -541 -226 -33 -237 -280 -555 -186
2781 -186 46 -160 43 -57 158 -111 -260 -98 163 383 344 -243 -152 328 350 -174 -497 -559 -30 685 357
2802 357 -141 -635 47 412 275 -15 -718 -700 -224 134 141 405 -273 -309 218 524 500 96 -236 -31 249 842
2824H42k93n11l28J47Q15R0n58n41l18Q06L86l22m22q4K04K25j41J56l16k94J66
2845b91J93L90k66r1j63P9O4K87N0k24k59j53O12j76j34k67N1Q8j51M51j72Ll01
2868c80K4l54M69M63p44k69K22N2M62L1j48r1j11L34k23J26k76K26n18K38N85
2889A18qj83j24n39K70M82j02n20K24oK89Q0k46l46l7J62Q7L25p7O2j57j75L63
2912e8J95k69N7j70j77O72L22m27p26J26J11O16O6o75j50J49K89N0J27o6k11l
2934a52J30M3K87J03n36J85j68N09j7m56l2J51M66O3l41J6n7K6J64j86K71j20
2956C49o4K90o76M65P6j22n74o3P08j95k36L07n09M56J53k96L7ko1J26K46m91
2978g6M98J72r62J27j0N35R4m3p42j95P76rQ5q06L0K74K95J12l5m31j73n1P13
$$ plain form
2824 842 549 38 -290 -143 672 762 204 -337 -655 151 537 215 -207 -291 -87 138 -3 153 -163 -457 -291
2845 -291 -98 292 26 -65 -228 -149 -85 202 252 28 -231 -384 228 52 -82 -349 -298 -210 -361 90 -82 -79 -380
2868 -380 -356 -710 -241 222 -522 -791 -569 -517 -55 -24 -172 -263 -374 -40 -263 -137 -413 -187 -705 -467 118
2889 118 110 -73 -197 -736 -466 16 -86 -606 -382 -388 -99 -19 -265 -611 -648 -486 -399 -74 -151 -89 -246 -421 -58
2912 -58 137 -132 -75 -245 -422 250 572 145 -581 -455 -344 272 338 -337 -487 -338 -49 1 128 62 -149 -152
2934 -152 -22 21 308 411 -125 60 -108 401 384 -72 -104 47 513 576 235 251 194 220 384 198 469 349
2956 349 285 575 -101 364 440 318 -256 -319 389 194 -42 265 -244 212 365 69 106 104 43 169 415 -76
2978 -76 422 594 -368 -241 -251 284 378 335 -407 -602 174 165 250 -556 -526 -252 43 155 120 -311 -484 -535 178
3001A78N3k13l04k83J08M48N81l97p91J94M29K35j26l05j30J78L50K1m57j21j8
3022c70N68O3n57j46M48j06r2J0r6L45l56K1k33M89J64l78J83o3k57O91m48j8
3044a38J28j62K39j95K52K74k01n6m01J40K52n9J8j29k20K14O2Q6n3n02L34K77
3066A60M6k0l1j70n5j51Q34m7k05l54p7L04M16o0p88J26K71N25k74l3m12J01L41
3089D47R6j67m02j04J21K03J15k03Q2m37J08L11K64r3n69m9J98K05L56l84J51
3110B49l38J33K11m73K92o2m6K9M4j93N40l81k87k79M97O6J04p9l22O7M00o0l10
3133a98P9j27J79j15o6M61l68Q8l39L38J99k26j14L8j67K61L17l02k73p8J30J88
3155i5K95j12o80L07K52j54K64j99k47l0J32K34K75m6o40K07K90J54J34l97m63
$$ plain form
3001 178 231 18 -286 -569 -461 -13 568 171 -620 -426 3 238 112 -193 -323 -145 205 226 -231 -352 -370
3022 -370 198 261 -296 -442 6 -100 -192 -182 -278 67 -289 -268 -501 -12 152 -226 -43 -106 -363 328 -120 -138
3044 -138 -10 -172 67 -128 124 398 197 141 -260 -120 132 73 91 -38 -258 -44 18 104 51 -451 -117 160
3066 160 206 186 155 -15 -70 -221 613 566 361 7 -70 234 650 590 -198 -72 199 724 450 417 5 106 447
3089 447 543 376 -26 -130 -9 194 309 106 188 -249 -141 170 434 341 -228 -277 -79 126 482 98 249
3110 249 -89 44 255 -218 74 12 -34 -5 39 -154 386 5 -282 -561 -64 2 106 27 -295 -228 172 112 -198
3133 -198 -119 -246 -67 -182 -248 213 -155 -67 -406 -68 131 -95 -209 -171 -338 -77 240 -62 -335 -413 -283 -95
3155 -95 200 88 -592 -285 -33 -187 77 -122 -369 -399 -267 -33 242 196 -444 -237 53 207 341 -56 -519
3176e19K45N92j1j26l54N6M90K7k10r4k10L18k84L12k92L94n5n68J66M35P8j61
3198B29m4m1K0J36r4N4j00r2J45M1j16K58l87K29j48l04N50Q9r8n58L3J31K46
3221A79r3j64L8K09K09k50L4m3J35j84Q6J22K42j51m47l63Q22J07k08n10m2J38
3243a34K67J57m29o7l7L51L1j81K12k19k31M65l61K34Km0m15M19n0l1M9k99J8
3266b89M92k7k46j45r8Q6K36j24p5q0j25L11k51J01j67M0O8k12O64K35j77l24
3288a07K04m68L94J46k45P7k4l3Qj71M03j62Jl99J20J48J80K81o88o6L75N1K65
3311B90o64J78J68J64M3%k07L11j56j23P8K1Lj37P4J42J99n4j49l37K3L78M9j22
3335A72k90j49M59j33J14k69L84j74J36J42m58J17q0K56j68M26j78q5k80k9M60
$$ plain form
3176 -519 -274 318 307 181 -173 -117 373 400 190 96 -114 204 -80 232 -60 334 279 -289 -123 312 390 229
3198 229 185 144 164 300 206 260 160 68 213 254 138 396 9 238 90 -214 336 425 327 -231 -198 -67 179
3221 179 86 -78 -40 169 378 128 162 119 254 70 156 278 520 369 -78 -441 381 488 280 -230 -272 -134
3243 -134 133 290 -139 -206 -243 108 139 -42 170 -49 -280 185 -176 58 60 20 -395 24 -26 -57 -8 -307 -289
3266 -289 203 176 -70 -215 -313 -227 9 -115 -190 -270 -395 -84 -335 -234 -401 -361 -293 -505 159 394 217 -107
3288 -107 97 -371 23 169 -76 1 -23 -56 -48 -219 184 22 23 -376 -256 -108 72 353 -335 -401 -26 25 290
3311 290 -374 -196 -28 136 179 179 -28 283 127 4 82 103 106 -31 43 185 384 330 181 -156 -133 245 294 172
3335 172 -118 -267 192 59 173 -96 288 114 250 392 -66 51 -29 227 59 485 307 222 -58 -87 373
3356C73J11j90n61p6M96M6J02m83N7j8L06k04j04l6J6L09l82j49L43k3l3k28J90
3379a38L50k08K01k34K50k55L89l54J5l22M57k24K8j1j97K92n55M49j43o7K76
3400an61P4m6N63J35l19j27k90M24K38j21m0j18p3J42K00N1q7L0j27K61j21J92
3423B79m05n4J14K62K87o08L9k12K61K50j76m75K45R0p6P0J88j38l4J55J39q8
3445A13L16n40R0J30J23j4K40l30J03l31L24M5N2m3k66q2l6M42l76l1K84j34j41
3468f2k04N53K9l35n9J09K43K63l01l32K50j4Q3j28J33q1r1l2J16K89j96l1k10
3491ho7R1K13l55j78L7J67o6M32o70L08Q7k14K84J34k74J3j28L32j85M53k82m09
3514b85K70k3K20r9j55l02L39J37Rk25k1j39J98kJ3l41K24J44j64K23k28K06j72
$$ plain form
3356 373 484 294 -267 -343 153 199 301 -182 -125 -143 163 -41 -145 -181 -165 144 -238 -387 -44 -67 -100 -328 -138
3379 -138 212 4 205 -29 221 -34 355 1 16 -306 151 -73 -45 -56 -253 39 -516 -67 -210 -277 -1
3400 -1 -562 -488 -534 29 164 -155 -282 -572 -148 90 -31 -71 -189 -262 -120 80 131 44 74 -53 208 87 279
3423 279 -126 -180 -66 196 483 -125 -86 -298 -37 213 37 -438 -193 -103 -179 -109 79 -59 -93 62 201 113
3445 113 429 -111 -21 109 232 218 458 128 231 -100 224 269 321 278 12 -70 -106 336 -40 -71 213 79 -62
3468 -62 -266 287 316 -19 -78 31 274 537 236 -96 154 140 223 95 228 147 56 24 140 429 233 202 -8
3491 -8 -75 16 229 -126 -304 -267 -100 -166 266 -404 -96 -9 -223 61 195 -79 -66 -194 138 -47 406 124 -285
3514 -285 -15 -38 182 83 -72 -374 -35 102 111 -114 -135 -274 -76 -78 -65 -406 -182 -38 -202 21 -207 -1 -173
3537a73q8N9K99p2j63o1j31P1K84L3J90Mj76R9m6j36j03J90L4k42R9K56k12k65
3561b50l4j61O89Pr2j24r6K30K02n54J6M01k99L04N7l18J54l7j18l8K79K35m25
3584B8n2O2K41K38j76k35k24K22K9J24j4k31j63l6O57k97q5mj17J06J66J25j17
3607B47m9J10p7L8M7p2j97K22k63J38K30k98O0j34m0P4Q3l39K51k8KP6K2l7j41
3632g5j37J21J67J11n80K85k38L79J30l3p9p8o3N6k3j02N06m55l00j9L34K33k16
3655g6k25j04L20J17m7k19k95J91J52qL42Q0n20K97J46k30L34j08m00K09K94m5
3677B05K2L6o23L07j6j05L71j81n8q7J99N5k00k76L25J41m53L08N6L1k43L05j8
3700A01J4j16j05J13K46m05m0M65k84K49j97j52J96l40L82L2j9k66J68K13j90
$$ plain form
3537 -173 -261 -202 97 25 -138 -199 -330 -259 25 58 248 252 76 175 129 -7 -110 80 114 -128 -29 227 15 -250
3561 -250 -284 -445 244 251 159 35 -61 169 371 -183 -167 234 -65 239 296 -22 132 95 -23 -61 218 453 28
3584 28 -24 38 279 517 341 106 -118 104 133 257 243 12 -151 -187 470 173 88 84 -33 73 239 364 247
3607 247 198 308 231 269 316 244 47 269 6 144 374 76 136 2 -38 36 119 -220 31 3 5 81 103 66 -75
3632 -75 -212 -91 76 187 -393 -108 -346 33 163 130 51 -27 -90 -34 -57 -159 347 -108 -408 -427 -93 140 -76
3655 -76 -301 -405 -85 32 -15 -234 -529 -338 -186 -194 148 228 -292 5 151 -79 255 147 -253 -44 250 205
3677 205 227 263 -360 -53 -69 -174 197 16 -42 -129 70 125 -75 -351 -26 115 -338 -30 26 57 -186 119 101
3700 101 115 -1 -106 7 253 -152 -192 273 -11 238 41 -111 85 -255 127 159 140 -126 42 255 65
3721F5j63l2J75L76P4j93l85N0M37l14K6k17j04L21K38k32l8J76k07L5J22J62
3743C72j97l90L05Qr5J76J05k90J25j82L21l18K3r1J75Qj35K72j16J93m76M06
3765A99l35N39k88r1L6R0J2l90MJ3J28M32l42r8l34N26j38j26k5J08j13nJ04j80
3789b74J07N68n39n5j12K88K42n71R1j2K40P9m01M94L6j78M2m65N44j01O6j7k11
3812a39J18K33m95M36j09M5m3J19m73J88j25N13m72r8M6K14J28k17M37j46j19
3833D1j81K79j91K81p6M1k10q6M95K5l99P2J02k15N68k63m48J2J98j17L61k07
3855H2J57K4k83j18L46M7k99J38q8J65K55j43m05L2K50L60l91l0j08j58M41j65
3877A09j72K81j31J78l33k62O12p1k33k12J82p9j4L91k44Q6oL4k90J33M8j49n7
$$ plain form
3721 65 -98 -130 45 421 495 302 -83 -33 404 90 116 -101 -205 116 354 122 84 260 53 88 210 372
3743 372 175 -215 90 98 3 179 284 -6 119 -63 258 -60 -37 -128 47 55 -80 192 76 269 -207 199
3765 199 -136 403 115 24 60 150 162 -228 -224 -211 -83 349 7 -91 -425 101 -37 -163 -188 -80 -193 -198 -94 -274
3789 -274 -167 401 -138 -193 -305 -17 225 -346 -255 -267 -27 52 -349 145 181 3 45 -420 124 23 89 72 -139
3812 -139 -21 212 -283 153 44 89 46 165 -308 -120 -245 268 -204 -302 -256 -42 86 -131 306 160 41
3833 41 -140 139 -52 229 153 194 -16 -102 393 418 19 91 193 -22 546 283 -165 -153 45 -72 289 82
3855 82 239 263 -20 -138 208 255 -44 94 6 171 426 283 -122 -90 160 520 129 99 -9 -167 274 109
3877 109 -63 218 87 265 -68 -330 282 211 -22 -234 -52 -131 -145 246 2 88 82 116 -174 -41 7 -142 -199
3900a99J4K06j10N1pK24m64N58k29K9k23J66l60O63k52j84Jj28K93L6l60l7Q0
3923b32J69J19n5N2j71j19P9N4J53j65P7m38J61M13j16k35J64K07j99K6n2j10
3945b18K03J91j62K2j35k1R9k23M92l4r8K03k12j42K11l02J0L77m42j0K50m5K85
3968B99r2j94K47m43L55j11J10m9l59L04J65L9k64Kl52N92J59j32Q3n79L94r7
3990G7Q4r7K37l90R0j34J36q2j13o2L49k0K72l57j00PJ4K36kJ3k53J93j27J64
4014A35j70J79k53J70m2j79L19J00k48N1RK45j91l11k87J00L65M42o92j8N3J80
4036d3P2p3l5k99L38k97M03j18J77l25K24Mk6J27j56k27JJ20J17j1K85k73j71
4059a86K51k31j96K6K66j82J07j1P2n8j8J31m03K66Q2o7P6L2R5J51l46M5o5O5
$$ plain form
3900 -199 -185 21 -89 -38 -45 179 -285 273 44 73 -150 16 -344 319 67 -117 -116 -244 49 85 -275 -312 -232
3923 -232 -63 56 1 53 -118 -237 -158 -104 49 -116 -39 -477 -316 97 -19 -254 -90 117 -82 -56 -108 -218
3945 -218 -15 176 14 36 -99 -120 -21 -244 248 214 116 319 107 -35 176 -126 -116 261 -181 -191 59 14 299
3968 299 207 13 260 -183 172 61 171 122 -237 67 232 271 7 9 -343 249 408 276 359 -220 174 77
3990 77 161 64 301 -89 1 -133 3 -79 -192 -254 95 75 347 -10 -110 -103 -89 147 145 158 -95 98 -29 135
4014 135 -35 144 -109 61 19 -160 159 259 11 62 71 316 125 -186 -473 -373 -8 434 -258 -276 -223 -43
4036 -43 29 -44 -79 -378 -40 -337 66 -52 125 -200 24 28 2 129 -27 -254 -253 -133 -16 -27 258 -15 -186
4059 -186 65 -166 -362 -336 -70 -252 -145 -156 -84 -142 -160 -29 -432 -166 -84 -151 -75 -43 52 203 -143 -98 -163 -98
4083i8M08l59J05K88Q9l19m5j22N03j29L3n48M02M7o2l86O5l1K6N09l03p1kK35
4107B35l51J88J08K1m17L67K83J08l13q2j22O4l6l8J81Q2n53J83n1O1K09k44J73
4130E6k3l05n4M62m7k65r7K84m3M83o61n1M41L1j58J43j17o1LJ41k52L36k50K66
4154B62m01r9L40K30j74k44J51j84J88J8j98j23L40k46K26j22J10k45K14O7j88
4175g8J81k11j20K99N9j20L29m72O2j85M94J82m15j27Q4J7Nj24l7j09M63m7j70
4198d0j36k11K06L3J8L23j96k06L48j80L5J40p7N2J6O8K1j6l74N62k17j22M9J14
4222B10r9K5P5m61M70j71J17m95P9j7K11J55n0k38P8K54K41k35N5J86j88m3N0
4245B09l03L56l68L25Q7o3P7q0k04l62L96k16K98k20j45N8P3J27ok72P9m9J67
$$ plain form
4083 -98 310 -49 56 344 433 114 69 -53 450 321 354 -194 208 255 193 -193 -128 -159 -133 376 73 2 0 235
4107 235 -116 72 180 201 -216 151 434 542 229 147 25 89 53 15 196 278 -275 -92 -143 -82 127 -117 56
4130 56 33 -272 -326 136 89 -176 -273 11 -32 451 -210 -261 180 211 53 196 79 18 21 162 -90 246 -4 262
4154 262 -139 -238 102 332 158 -86 65 -119 69 87 -111 -234 106 -140 86 -36 74 -171 43 110 -78
4175 -78 103 -108 -228 71 130 10 339 -133 -71 -256 238 420 5 -122 -38 -21 -16 -140 -177 -286 177 130 -40
4198 -40 -176 -387 -181 -148 -130 193 -3 -209 139 -41 -6 134 57 109 125 193 214 198 -176 386 169 47 96 210
4222 210 111 136 211 -250 220 49 166 -329 -250 -267 -56 99 49 -189 -111 143 384 149 204 390 202 159 209
4245 209 -94 262 -106 219 306 243 320 240 36 -326 70 -146 152 -68 -213 -155 -82 45 39 -233 -154 -203 -36
4268c6K60j82k73L21k83L30N0P7k80k38L57J2J46l4j36P9p4j40L13l54J75R9n2
4291A37K4n36L12j00lJ22J65j13k01L53j61k73J25L55l83K89k93p9L82l27L48
4312A43N0k62O0mJ50j41q0r3n6p6L40k50jJ16n9K97l94L31k51K53k33L38qk19
4336d9k73M15j98k7N9R4k59J4K77J1p2J01j49J00p5K28l61K65PPL5r0J35l80K45
4361F0j09J0K84m8l24lO2L00k65J50Q8k09j05L24k15L1r3Q5K19l8lJ27j03qk72
4386e5R1p3P6R6k38O8K01j98L47l16K04j9J22L9m85o9M55k85J32k0J13l86O32
4409D32n70J82j00J8k89J96R8J45O2j84P3K6m1j3o4Q7m0n54N15j50k0M02k30q3
4433a02p2N0q6J13K61m68K72J64o6l14J34M2L51l01j47J02p9K36k52M35j53l05
$$ plain form
4268 -36 224 42 -231 90 -193 137 187 264 -16 -254 103 115 261 227 91 170 96 -44 269 -85 90 189 137
4291 137 161 -375 -63 -163 -166 -44 121 8 -193 160 -1 -274 -149 206 -177 112 -181 -260 122 -205 143
4312 143 193 -69 -9 -13 137 -4 -84 -177 -233 -309 31 -219 -220 -104 -163 134 -260 71 -180 73 -160 178 170 -49
4336 -49 -322 93 -105 -132 -73 21 -238 -224 53 64 -8 93 -56 44 -31 197 -164 101 108 115 150 60 195 -185 60
4361 60 -49 -39 245 197 -127 -130 -68 232 -33 117 205 -4 -109 215 0 31 -62 23 242 204 201 328 225 217 -55
4386 -55 36 -37 39 135 -103 -35 166 -32 315 -1 203 184 306 345 -140 -209 246 -39 93 73 186 -200 432
4409 432 -138 44 -56 -38 -327 -131 -33 112 174 -10 63 89 48 35 -29 58 18 -536 -21 -171 -191 211 -19 -102
4433 -102 -174 -124 -210 -97 164 -304 -32 132 66 -248 -114 -72 279 -22 -169 -67 -146 90 -162 273 120 -185
4455a85O4J32j01J38k39L21O9R0k47k85L99j16k13J61J34r1k87K06L0J13l64L97
4477A26Knk72j89L79K92k18o0O1l75J13J93N0j68Q2j06J11O3j03J40Q6j04J63
4500B61j49o3j13J02k82J80K72j67L4j14J72J8m24M06l35M18J5J11l81j43l4L37
4522A21J05l34R1J74k00k9J40q2j4M5q9n4K05L2j05J3j78j1J11j29k0K12j82J7
4546a61K60j38j9j24J94j80K02L24j79j02m06K62J57o7j11K4M5J32n6j45j32J65
4568e5J0p0K36j28O8k05l2J82M29n14k38M06j23j69K71J62o2l23L7R7N1m4k24
4591b38J77j99M13j93%M4k9k46L42Q4l5k0j74j3J28R5k77J13L31l93K37k30j2
4614i5K16k24J22j5K67j21m1j19K66n94L54j32O4j71N10l51K60k50J78j19J88
$$ plain form
4455 -185 -121 11 -90 48 -191 130 199 289 42 -243 156 40 -173 -12 122 31 -256 -50 -20 93 -271 126
4477 126 128 123 -149 -338 41 333 115 55 116 -259 -146 47 97 -71 11 -95 16 79 -24 116 202 98 261
4500 261 112 49 -64 38 -244 -64 208 41 75 -39 133 151 -273 133 -202 216 231 342 -39 -182 -216 121
4522 121 226 -108 -17 157 -43 -72 68 -14 -28 17 -72 -126 79 111 6 19 -159 -170 -59 -188 -208 4 -178 -161
4546 -161 99 -39 -58 -182 12 -168 34 358 179 77 -329 -67 90 23 -88 -64 -19 113 57 -88 -220 -55
4568 -55 -45 -115 121 -7 61 -144 -176 6 435 -79 -317 89 -34 -203 68 230 168 -155 -118 -21 30 -14 -238
4591 -238 -61 -260 153 -40 -40 4 -25 -271 71 155 120 100 -74 -87 41 136 -141 -28 303 -90 147 -83 -95
4614 -95 121 -103 19 4 271 150 109 -10 256 -338 16 -116 -52 -223 287 -64 196 -54 124 5 193
4635A93j58jO1L2L2k50J40L69l57J72k69O5K60j73P0j53m6L01l73K26j71j69J88
4658a1J01k13J01K10l27k00O46l49j89M96l34P6L07r9j43k81oP4M12r0j12j50
4680h1L5K49n54N06k60P7Q3j40L51q5l17R4MJ98k10K13nm08l0K19j4k36L43k21
4704a89r9M71j54n8N1j74K52j11J34j00j6j31q7J81J91m04J10J71m02K50L86m6
4726B26k63k52K37L28k78J29l02J11k5R5j25J47P3j86M82k20k7j80K12n0j02P7
4748A07k18J76K44l88M4J41p3l36L40p0R3k4j41O8j94J92J34L51m81J76Q8j14
4770A15j29K43k00j26o8K88J6Qo3j60L78k36k95K65J48l5j74k92J40L13k70N3
4792h1K74l79J68k43Q9k6J60o9J7J55L33k76l01o2K6j27M00R8k50K27j97K76j57
$$ plain form
4635 193 35 34 95 127 159 -91 49 418 61 233 -36 29 289 116 186 33 -13 288 -85 141 -30 -199 -11
4658 -11 90 -123 -22 188 -139 -339 307 -42 -231 265 -69 7 314 215 72 -209 -215 -141 271 181 69 -81
4680 -81 -46 203 -351 155 -105 -28 55 -85 266 181 -136 -42 -38 160 -50 163 158 -250 -280 -61 -75 -311 32 -189
4704 -189 -288 183 29 -29 22 -152 100 -11 123 23 7 -124 -211 -30 161 -243 -133 38 -364 -114 272 226
4726 226 -37 -289 -52 276 -2 127 -175 -64 -89 6 -119 28 101 -85 397 177 150 -30 182 132 30 107
4748 107 -111 65 309 -79 -35 106 33 -303 37 -33 60 36 -105 -37 -231 -39 95 446 -35 141 229 115
4770 115 -14 229 29 -97 -165 123 139 147 84 -76 302 66 -229 36 184 149 -25 -317 -177 136 -134 -81
4792 -81 193 -186 -18 -261 -172 -198 -38 -107 -90 65 398 122 -179 -241 -215 -342 58 156 -94 133 -64 212 55
4815E5l78P0J85j41L25n13M44R9k23J46j12j5r2K38k82K6J37k20J55J38o6O6j59
4838a17J24RL7Kq3Q6j37K08k47J13J34j84Q0j50j83J06J99J69j80m39K28N3K88
4861A16j37k66K11J09j22P5M44j75k54k7K43Pj41J11j72Qq6K4J24k14J52j16J21
4884C5K55l44n4L48J01k11j63J77j52Q6k22J68Q4K76m48J31J5n9K10j13j2k63
4906a55K23K4L6l79n3L90j13N6k29L53P9o23M45j03J04pj27K11l17J0J96j26R9
4929fK55l93K39l40L30k27M22k14J0J07n51L42k28M1L34k40K86j51K02k30j63
4950a75O4j43L96j92J26k76M5J25M1K54m07k7R6J31q1Jk30L30J40o01J77K81l15
4973b40K38L44k41m72K36J14j74K18k8k20J74m9K40l90P3K25j08j44J59J25J9
$$ plain form
4815 55 -323 -253 -68 -209 116 -397 47 146 -77 69 -43 -58 -150 88 -194 -168 -31 -251 -96 42 -24 42 -117
4838 -117 7 16 53 55 -28 58 -79 129 -118 -5 129 -55 25 -125 -308 -202 -3 166 -14 -453 -225 -172 116
4861 116 -21 -287 -76 33 -89 -14 430 255 1 -26 217 224 83 194 22 30 -56 -32 92 -122 30 -86 35
4884 35 290 -54 -108 240 341 130 -33 144 -8 78 -144 24 108 384 -64 67 82 23 233 120 108 -155
4906 -155 68 92 128 -251 -304 86 -27 29 -200 153 232 -391 54 -49 55 48 -79 132 -185 -175 21 -105 -6
4929 -6 249 -144 95 -245 85 -142 280 66 76 183 -368 -26 -254 -213 121 -119 167 16 218 -12 -175
4950 -175 -111 -254 142 -50 76 -200 -155 -30 11 265 -142 -169 -73 58 -23 -22 -252 78 218 -383 -206 75 -240
4973 -240 -2 342 101 -371 -135 -21 -195 23 -5 -225 -51 -100 140 -250 -177 48 -60 -204 -45 80 99
4994I9l62N25r8jR1l06J64K25k05k57l1J09j45L52k72J24J75j46Q9k25K17K0o1
5017H1m41J89J54j50R9O0P1J20Lj77Lj48K02J17Lj92p0J47k6k9j49R0R5k00j6
5042a64J79j29oJ05j89o8l2M86m83M50Q5m5j58j91M9J98r8J43k25J18N2j64lk25
5066c15N78k15K43m65j97L88J05j44j00O3m5K52n2o7j82J59oK6j39J84k20L9J67
5089E7J06j60J16m02K81r0k9K52j73p7J02k6q9J25J28j81j98L26k66J03J40J42
5111A87k71k48J83R8j45K12J77m63J63Q5J00j06K58l57L29k60M0K28l56l7J67
5132a6k17L05o6l5J49j50J32M0j91pJ19o8K25P3j74j83K8j00OJ78j81R4L6j19
5156a22L48m87M25n00K51J1P4K2J05k08J3J37J41j43J9j33O5L17k42l28M17o7
$$ plain form
4994 99 -263 262 164 163 254 -52 112 337 132 -125 -156 -47 -192 160 -112 12 187 41 130 -95 122 142 81
5017 81 -360 -171 -17 -167 -68 -8 63 183 186 9 12 -136 66 183 186 -6 -76 71 45 16 -133 -43 52 -148 -164
5042 -164 15 -114 -120 -15 -204 -272 -304 182 -301 149 234 189 31 -160 -111 87 -11 132 -93 25 77 -87 -90 -315
5066 -315 263 48 291 -174 -371 17 122 -22 -122 -59 -104 148 96 29 -153 6 0 26 -113 71 -149 -110 57
5089 57 163 3 119 -283 -2 -92 -121 131 -42 -119 -17 -43 -132 -7 121 -60 -258 68 -198 -95 45 187
5111 187 -84 -332 -149 -51 -196 16 193 -270 -107 -22 78 -28 230 -127 202 -58 -18 210 -146 -183 -16
5132 -16 -233 72 6 -29 120 -30 102 142 -49 -56 63 -5 220 293 119 -64 -36 -136 -130 48 -133 -39 -3 -122
5156 -122 226 -261 164 -336 -85 -74 0 22 127 -81 -68 69 210 67 86 -47 18 335 93 -235 182 115
5178A15k69j76L61J08O0l34K40ok88j00K87j00K09k95K16J11k64J57l78O6K87
5199Gk66OM14j43p0M7J12j04j27k06K99j80J73m16N89j87l10J55K17m06N14k34
5221a16J70N8m2m0K4k16P6L17k27j95L24O1k22R4l75N23l25j01K7L1K43R2l61
5244a80N3l6K02L62l99QK3Q8j18L4m4OJ82j18j50K57k25J78j20k53M76j69Or3
5268c0l2j39L85l67k5L05r3K76k88l52L21l0N8J76k02J25k64K71j24K0k22J49
5290h2J52P2q9j71M52l99K06k89J25j07Pj7M46l65J93M6j85j07O6K9J05r9J36
5313A25j23j20K18l6K73l93K88r3k15L03j57Q8N1k00j49L33m1j24N0k22K69l92
5335b67N48l42J01k95L37J93n02K07j03Q8K02o7j58J07k02N02l36L8k70L41p9
$$ plain form
5178 115 -154 -330 31 139 199 -135 105 99 -189 -289 -2 -102 107 -188 28 139 -125 32 -346 -280 7
5199 7 -259 -253 161 18 -52 -5 107 3 -124 -330 -31 -211 -38 -454 135 -52 -362 -207 10 -396 118 -116
5221 -116 54 112 70 30 54 -162 -86 231 4 -191 133 194 -28 66 -309 214 -111 -212 -185 -154 89 181 -180
5244 -180 -127 -163 39 401 2 10 33 121 3 37 -7 -1 181 63 -87 170 -55 123 3 -250 226 57 63 -30
5268 -30 -62 -201 184 -183 -208 97 4 280 -8 -360 -39 -69 -11 165 -37 88 -176 95 -29 -9 -231 -82
5290 -82 70 142 53 -118 334 -65 141 -148 -23 -130 -123 -140 306 -59 134 180 -5 -112 -46 -17 88 -11 125
5313 125 2 -118 100 64 337 -56 232 139 -76 227 70 158 209 9 -140 193 152 28 78 -144 125 -267
5335 -267 281 -61 40 -255 82 275 -227 -20 -123 -35 167 100 -58 49 -153 349 13 51 -219 122 43
5356D3qK63m58K86J02m16O2K69k42K40n06L19p4J83n0j45k9L34j71q6k06N8L44
5379A12r4jo7M0o0J49m9j96L3L26Lj62K02l78QL46r9Pk28QNK27K52j68k77L2J53
5406A24m97N03l0k14J46k37L69L7l62P4J55qk56J54j2Q9Nl19L3KJ50r8L28J43
5430B79p01N29j11P0m94J84K72k09K67p2k68K09R2J55l92M5L27J3k11K12k18j31
5452a53j6L44l27K19mp3j38O1J45l69J94O0P2K0Kj59K39k55p7L12m6K6j26j58
5476b07J19J52p9m4j54K88j2k66N1J45j26l4K98j26l30L88j05O7r8j07L61l49
5498a68J90K20k3o3k97M39l16K36j75N0j16o8K9J14j5j0j31J4N4J1J1j56R6P8
5522Dn3R4J57m33J98K12k20J58p5N9Jj16J93j76K47j99j72Q9J60k91J34K35j92
$$ plain form
5356 43 35 298 -160 126 228 -188 -126 143 -99 141 -365 -46 -120 63 13 -132 -161 173 2 -84 -290 -232 112
5379 112 18 17 -50 -10 -70 79 30 -166 -133 193 196 34 236 -142 -134 212 113 120 -108 -100 -95 132 384 216 -61 -29 124
5406 124 -373 130 100 -114 32 -205 164 201 -161 -87 68 60 -196 -42 -54 35 40 -279 -246 -244 -94 -192 136 279
5430 279 -422 107 -4 66 -428 -244 28 -181 86 14 -254 -45 47 202 -190 -145 182 195 -16 196 -22 -153
5452 -153 -169 175 -152 67 63 -10 -148 -87 58 -311 -117 -57 15 35 37 -122 117 -138 -215 97 51 77 -49 -207
5476 -207 -88 64 -15 -59 -213 75 63 -203 -152 -7 -133 -167 131 5 -325 63 -42 25 -73 -180 181 -168
5498 -168 22 242 219 156 -141 298 -18 218 43 93 -23 -91 -62 52 37 27 -104 -90 -36 -25 -14 -170 -74 4
5522 4 -49 45 202 -231 -33 179 -41 117 42 101 102 -14 179 3 250 51 -121 -32 128 -163 -29 206 14
5545A4L05j14n7K47o89L48j06J96l48J43J34J55j06j58k43K79K73k06K10j03r9
5566G5K73j65k92O2nq3L8J06K19k47J06p4qKK18k23M5k81K62j11jp1j45M46k48
5591a02K84j59p4k20K39j96O9Q3J73k02J93m94M91j89o7L79k78J45m6k62J7L7
5613a79j5J45p7l1J37O2m4j7p9J35Jk35J91n5J60m5o9j25J46R0J07l05j83J33
5637a52n3K02P7l4j19R6M68o12Q5M5L2Q3j08J03L5m0r3k03J62j22K04O4p0qk75
5662b33J88j6j41R1N22n40k2K5J97j07r1J54K31q1J6m38L11R7j80J81j42m9J80
5685A53j91J3J58k88J92q5L37k00k10l1K45j09J22j92j0J53k48K08n0N5J63K09
5707C94n02J31j48k2P3L0L61l66n8r3N0J79O3j00O2k81J99j97J62M14n14L60n7
$$ plain form
5545 14 319 205 148 395 -294 54 -52 144 -204 -61 73 228 122 -36 -279 0 273 67 277 174 75
5566 75 348 183 -109 -47 -52 -135 -97 9 228 -19 87 13 5 7 225 2 47 -234 28 -83 -84 -155 -300 146 -102
5591 -102 182 23 -51 -271 -32 -228 -159 -76 97 -105 88 -406 85 -104 -171 208 -70 75 29 -233 -216 -179
5613 -179 -194 -49 -126 -157 -20 42 -2 -19 -98 37 38 -197 -6 -61 99 54 -15 -140 6 96 203 -102 -285 -152
5637 -152 -205 -3 74 40 -79 17 485 -127 -42 3 35 118 10 113 148 108 15 -188 -26 -148 56 120 50 42 -233
5662 -233 -45 -61 -202 -111 411 -129 -151 -126 71 -36 -127 27 258 177 193 -245 66 163 -17 164 22 -27 153
5685 153 -38 -25 133 -155 37 -48 289 89 -121 -152 93 -16 106 -86 -96 57 -191 17 -33 22 185 394
5707 394 -108 23 -125 -147 -74 -44 317 -49 -107 -200 -150 29 92 -8 54 -227 -28 -225 -63 351 -163 197 140
5730A40l7J44k24j27K33k26K04n6R0k34l0j10L81j83J22j23k22q5K00M59l77Q5
5752B4K4oj34J80k19j41J24J16o6jN8J95j6k98J19l6M42k1j82J62m55K15k68J03
5776h1K56j89j2J51l4j49J42p8Q6j34%O1o7K9K12k42K3J07R2j74r1J19R4j55Q
5801b6p1J16j80J62pj67M08k05J45k94K42j66K9N2m0R6j24L05j52j09J36j01J7
5824F6j6J2K7N0j85j15L65l79j8N3J86m0O3n0k2k26M47m31L24l46M6K08J08k71
5848a44kJ12J46J64l50J9j33K4J45l0j35N2Q1j20L98k60N2N3P1j01l1j85p3K72
5872B5k73O1N5K61j77L05j94R3k48K52q3j5K23k64j2O5K10m94N3J34K22m01K34
5895C2L10j15l68q2L74m00O2N2Q6J28j18O4k15J67O5N1k3j83k72L88j34J39N1
$$ plain form
5730 140 103 247 23 -104 129 -97 107 51 141 -93 -123 -233 148 -35 87 -36 -258 -343 -143 316 -61 24
5752 24 48 42 -92 88 -131 -272 -148 -32 -98 -99 -41 154 138 -160 -41 -77 365 344 162 324 -131 84 -184 -81
5776 -81 175 -14 -26 125 91 -58 84 6 92 -42 -42 19 -48 -19 193 -49 -26 81 173 -1 -92 27 121 -34 -26
5801 -26 -97 19 -161 1 -6 -173 235 30 175 -119 123 -43 -14 38 -2 94 -30 275 123 14 150 49 66
5824 66 50 62 89 139 -46 -161 204 -175 -193 -140 46 6 69 19 -3 -229 218 -213 111 -235 -189 19 127 -144
5848 -144 -146 -34 112 276 -74 -55 -188 -164 -19 -49 -184 -132 -51 -171 227 -33 19 72 143 42 11 -174 -247 25
5872 25 -248 -187 -132 129 -48 257 63 156 -92 160 77 62 285 21 9 74 284 -210 -157 -23 199 -202 32
5895 32 342 227 -141 -223 151 -249 -187 -135 -49 79 -39 25 -190 -23 42 93 70 -113 -385 3 -131 8 59
5918E9n9j45N4K35j47J11L1l8j37J23J02j05J16j89M9J27j52j40L22l27K97q9
5940I8j44J07j40J46l53J16J02K4k08M46k03o6r6L00l56M21j72rj24R7r3J59L23
5963C75k50J43m43K03Q4k05O6P7J70k47J27k45K31R9J2k20K16j07n0k55J29L90
5985C00l27%j97J32K34k27L12j75k58N1J06P4L7r1O3k00K17k80L22r5rj51rK18
6009D7l07J32Q0J38j26K06J0j52K58l29k7j4J60J67q9j73K6p4J8j12O3k8R0o8
6033a04K18j16r3K14k86L98l3K4k86J67K3p9J2R4k92J29J66L6m2l74K23J92N7
6056B48l42p0jK93N7j28m9q8J66j62O6NK4%k3m5j25L68J2j75n3j61j20K24K20
6081A41j29j68J12J23k19K35j37k95K04n9m8K25k7j77K88j26P3j0J16nk87o1r3
$$ plain form
5918 59 0 -145 -91 144 -3 108 139 101 -36 87 189 84 200 11 60 187 35 -105 217 -110 187 98
5940 98 -46 61 -79 67 -286 -170 -68 -44 -252 194 -9 -75 -171 129 -227 194 22 13 -111 -14 -107 52 375
5963 375 125 268 -175 28 112 -93 -27 50 220 -27 100 -145 86 185 197 -23 193 86 36 -219 -90 300
5985 300 -27 -27 -224 -92 142 -85 227 52 -206 -155 -49 25 62 -29 34 -166 51 -229 93 -2 -11 -162 -171 47
6009 47 -260 -128 -48 90 -36 170 180 28 286 -43 -70 -84 76 243 154 -19 7 -67 -49 -161 -98 -126 -36 -104
6033 -104 114 -2 -95 119 -167 231 198 222 -64 103 126 47 59 153 -139 -10 156 192 150 -224 -1 191 248
6056 248 -94 -164 -165 128 185 57 8 -80 86 -76 -10 -5 19 19 -4 -49 -174 194 206 31 -22 -183 -303 -79 141
6081 141 12 -156 -44 79 -140 95 -42 -337 -133 -192 -240 -15 -42 -219 69 -57 16 6 122 117 -170 -231 -324
6104c24O0L43p8R0l96M34j04M35l63j74J10j41RJ85l6l8l33L43j53J05k17K36
6126gJ9o4o5J86J10l8m76M90j74j67L28j74j12J60k35K52l31L48l19J55Q6N6l1
6149cn5p3J70k13K53k02J11m7J88k26R4l06L55K23m73N01k39N9J81m41L24k89
6171a08L19l21J73K25l28P2r8Q4k57J32M96m08j13L87k70n3K4J43l6j42K10j66
6193c5k88L96n6j12J16K15k8m27K58j08K84m80N69k98j34L21k18J43nJ98m76Q9
6215g6K63j13j79q5R6k75L42J90j65J25K6j74j23N8O4j68M3J38J85L6k92k09K54
6238c9L35n73M53m33M44q2r8pJ30l74L5n2K50K21k34j73n7J34l0n8L33k49j85
6261c09K31j1Q1J32j41r1N2J16O6l45Q8Jo3L39ml02J54J3M2l7J59j78j18rK01
$$ plain form
6104 -324 -264 79 1 91 -305 129 25 460 97 -77 33 -108 -99 86 50 12 -321 22 -131 -26 -243 -7
6126 -7 12 -52 -117 69 179 141 -335 155 -19 -186 142 -32 -144 16 -219 33 -298 50 -269 -114 -28 28 -3
6149 -3 -58 -131 39 -174 79 -123 -12 -59 129 -97 -3 -309 46 269 -204 297 58 117 298 -143 181 -108
6171 -108 211 -110 63 288 -40 32 -66 18 -239 -107 389 -19 -132 255 -15 -68 -44 99 63 -79 131 -35
6193 -35 -323 73 17 -95 21 236 208 -219 39 -69 215 -265 304 6 -128 193 -25 118 113 311 -165 -76
6215 -76 187 74 -105 -190 -94 -369 -27 163 -2 123 149 -25 -148 -90 -26 -194 -151 -13 172 208 -84 -293 -39
6238 -39 296 -277 176 -257 187 105 7 0 130 -244 -209 -261 -11 210 -24 -197 -254 -120 -150 -208 125 -124 -309
6261 -309 -78 -89 -8 124 -17 -108 -56 60 126 -219 -131 -130 -193 146 142 -160 -6 7 49 12 171 -7 -125 -134 67
6286F7j86J35k24L67k56j0J81L05l39K03l40L86k93k20J21J43j3m13M94L2k67
6307a27J60qj18P4n8P1j6J14j32j62J06J41J15l05J1J09L79l08j12P9J70m13L73
6330A43J0k96K88j36k09J84O0j55k3M8j11kJ80k15Q3K15j30k8l1J21Q1J28Qp3
6354A40r4Q0m17J96J36k5K52j28j30j30L35l2l16J55j85J72O5j30J7o4K2K09N5
6377A83m35L58M7o0j38j09N73p08L53N0k27M0k01P0J18P6J11Q4p6q1j43J42j39
6400a12J08j16k78K18L66l9k21Q8J42J05k7L7k50J70j32J86k45l4K85j59k72J05
6422g5Oj9K73j84q5rK61j38J16k55K9K27j97j4q3L56l29K36O2n81K59K30J16Q2
6446B84k42k40J92m9j6Rr9J89J31k63K12k07o7K22M2r2l5P0jJ37n6r4j95j25N88
$$ plain form
6286 67 -119 16 -208 159 -97 -107 74 379 40 243 -97 289 -4 -224 -103 40 27 -386 108 140 -127
6307 -127 33 25 -93 -19 -77 -6 -22 92 -40 -202 -96 45 160 -145 -134 -25 354 46 -66 13 183 -230 143
6330 143 153 -143 145 9 -200 -16 44 -111 -134 -86 -197 -199 -19 -234 -151 64 -66 -94 -125 -4 77 205 213 140
6354 140 46 126 -291 -95 41 16 268 140 10 -120 215 183 -133 22 -163 9 74 -56 -39 -103 -81 128 183
6377 183 -252 106 153 93 -45 -154 419 -289 64 114 -113 -73 -274 -204 -86 -10 101 185 109 28 -115 27 -112
6400 -112 -4 -120 -398 -180 186 147 -74 14 156 261 234 271 21 191 59 245 0 -34 251 92 -180 -75
6422 -75 -69 -88 185 1 -84 -93 168 30 146 -109 -80 147 -50 -64 -147 209 -120 116 178 -403 -144 86 202 284
6446 284 42 -198 -6 -55 -71 -62 -161 28 159 -104 108 -99 -166 56 98 6 -29 41 40 177 121 27 -168 -293 295
6471B95k37L36l86p1p1J64J42l62K65J47k81R9rP3k24M9J18j03K12k77M9r5J78
6494A1J38k93n0K43m4J25j09j77K52r6k0J18p0j66k5J77k09K99j16QL3j71k0o
6518a68N5j67J08J83J15j91K8N4J06l1k68J14L3q4n4J46j38LJ31L6Q1o6j48L01
6542A79k04J56j13J03k10j17J05L53j5m09J67Pp5N9nK61m01j00Q7L49k76k4J84
6565F1l39M41j88K20l27L84k31m40L36k5q9L38K4J48j56k14J75k29j89J42K78
6586A20l46J70n1M11j72l99K44J46q9J79k14LO6P5l1Q7k50M0J2N5J85k14J51j56
6610B2Rj20P3m5J76R7k32K05j90M5J79J2l47L83K1n65K73j5K25r0q8K68k38j14
6634e6J41l56L81Q4k31j01M48j86q5j96J59p5R1P8k98M54k00j81K23j82l2J14
$$ plain form
6471 295 58 394 8 -63 -134 30 172 -190 75 222 -59 40 31 104 -120 -71 47 -56 156 -121 -72 -167 11
6494 11 149 -144 -194 49 5 130 21 -156 96 0 -20 98 28 -138 -163 14 -195 104 -12 -4 29 -142 -162 -168
6518 -168 -113 -280 -172 11 126 -65 -37 17 123 92 -176 -62 -29 -113 -167 -21 -159 -156 -25 11 92 26 -122 179
6542 179 -25 131 18 121 -89 -206 -101 252 237 -172 -5 2 -73 -14 -19 242 -159 -259 -172 177 -99 -123 61
6565 61 -278 163 -25 195 -132 252 21 -419 -83 -108 -197 141 165 313 157 -57 118 -111 -300 -158 120
6586 120 -226 -56 -107 304 132 -267 -23 123 34 213 -1 2 68 143 112 199 -51 -11 1 56 241 27 178 22
6610 22 31 -89 -16 -61 115 212 -20 185 -5 40 219 231 -116 267 288 -277 -4 -19 206 116 28 296 58 -56
6634 -56 85 -271 110 194 -37 -138 310 124 39 -157 2 -73 18 96 -202 252 52 -129 94 -88 -120 -6
6656fJ38j57J03k75K99j60R9%l51J42L59j87L6m0j91K89j90qK44m68J90j12K98
6679E2k46L43k95L17k48k6J13l9Q8J69l36K96k61K68J14m31J86P8j06k57M12j73
6701A8K4j05n5K36J26k79K69l02J48J19P3k70L49m50K05l21K32Q5J11l57j05J06
6723a43P4j0j73j84L58L65l74P3k2k10j5K30k28L49Oj62j49k56L18L12k11j27
6745a79K06J08j08j90K44p4m7k64J99l8J64j12r0N42j10j92j23O3j43j18K95j14
6767h1pL01j91j05J57l35L13j16J95j75J83j20q2j0J50O0M2rj15q3P1k37K09M6
6791F1Q0m67L14l5J05K21k49O3k3j26j04L74q9l4j50J36k35K32Op0j07K22m05
6814b80L28Qm7K56n44K26k20R2J85J33j90O78m92n5n7J79j17j36J64N0l09J20
$$ plain form
6656 -6 132 -25 78 -197 102 -58 41 41 -310 -168 191 4 40 0 -191 98 -92 -100 144 -324 -134 -246 52
6679 52 -194 149 -146 171 -77 -103 10 -29 59 228 -108 188 -73 195 309 -122 64 142 36 -221 191 18
6701 18 42 -63 -118 118 244 -35 234 -68 80 199 272 2 351 -99 106 -215 17 102 213 -144 -249 -143
6723 -143 -69 -79 -252 -436 -78 287 -87 -14 -36 -246 -261 -31 -259 90 96 -66 -215 -471 -153 159 -52 -179
6745 -179 27 135 27 -163 81 7 -40 -304 -105 -143 21 -91 -181 361 251 59 -64 -1 -144 -262 33 -81
6767 -81 -88 213 22 -83 74 -261 52 -64 131 -44 139 19 -63 -73 77 137 179 170 55 -28 43 -194 15 61
6791 61 141 -326 -12 -47 58 279 30 93 70 -56 -160 214 125 91 -59 77 -158 74 80 10 -97 125 -280
6814 -280 48 56 9 265 -279 -53 -273 -181 4 137 -53 625 133 78 21 200 83 -53 111 161 -148 -28
6836b8K18P8k22m9LJ08K7j92k19K92p3L83k7k92j70J31J06l23K44j90J83Nj06
6859a13J16K6j98K98j76J27K7j3j38j4P1M2j52P9J64p1k3j72K90k06O7k02K1K02
6883E2rk18Q2k3J92O9k38K58J20l77J14P5K26k05q6L8K5j22J96j50k14J55J2j43
6907a71k1K55p0K0j14k49L1N83k16M0k64Q2J42J33j87j37j2J39J67j41M9j94J48
6930A3j39P1k8J02R3J15n7m73K73j31K67J16l41Q9J23j29J54j85M4q3J32Q0o4
6953D2j02m3j03K39N4N9k74M4j7L33k83j71J76k05L59l48M61l95J10K02j69J77
6975A46m71L03n9K45Q6m40L48j82J36k12J25J51l55M6J14m3R6j78jJ16Q0l69M73
6998A55j18Mj23M40k90n9L9j21J57r3L9K32Nm12K6J19j54K89j44J52j2m8j18N6
$$ plain form
6836 -28 190 268 46 -3 0 108 135 -57 -276 16 -57 326 299 7 -163 -32 74 -249 -5 -195 -12 -7 -113
6859 -113 3 29 -169 129 -47 80 107 94 -44 -58 13 55 -97 -18 146 75 52 -120 170 -36 31 -171 -150 52
6883 52 43 -175 -93 -116 76 145 -93 165 285 -92 22 97 323 118 32 70 95 -27 169 19 -195 -40 -28 -171
6907 -171 -192 63 -7 13 -101 -350 -319 264 48 88 -176 -94 48 181 -6 -143 -155 -16 151 10 59 -135 13
6930 13 -126 -55 -83 19 112 227 170 -303 -30 -161 106 222 -119 -30 93 -36 118 -67 -23 -106 26 106 42
6953 42 -60 -103 -206 33 87 146 -128 -84 -101 232 -51 -222 -46 -251 108 -240 221 -174 -64 138 -31 146
6975 146 -325 -22 -81 164 250 -190 158 -24 112 -100 25 176 -179 -133 -19 -62 34 -144 -145 -29 51 -318 155
6998 155 37 41 -82 358 68 9 48 -73 84 -9 30 262 267 -145 -119 0 -154 135 -9 143 131 83 -35 21
7022B1K75m44K57q8j32J55J41n5m3j06J2k04m1K13K51r2J6r3Q5l11J29J1J23N0
7046A30J87k78N03l39k44K99j05l50N52j65q4j64rM02m36j07K69j07K39k22Q7
7067E8J8j14k65N11k49r5M28k51K45j35j77J20j07o4o9K96k18L05k03r4J29m07
7089c38O1J14Q3O8R7j47R5k11K23Q1m3j05J78j81J56Kl49K41j75Q6N2O8rk09L09
7114A47l28J40n8J29j14n7K43m73K71l02N92lj67j92O7R7l78M32%k12J17L5j57
7137a71J18K69j86N3k13K16N6J49n21l5K68j53K26J09j0l41J41%Pk43M39l25M44
7160B97k75j30j98L01q5o8p8K08j56J01K39k20J33j29J9J60o6j31L32j98Q8l18
7182a74M12m87m6R1L48k47M13l21K15k59o1L97j66k20M00l95N8R6J48q8m7R2n2
$$ plain form
7022 21 296 -148 109 21 -111 44 185 130 87 -19 -7 -211 -252 -39 212 120 136 43 128 -183 -54 -43 80 130
7046 130 317 39 542 203 -41 258 153 -197 355 190 106 -58 -67 335 -101 -208 61 -46 193 -29 58
7067 58 76 -38 -303 208 -41 -136 292 41 286 151 -26 94 -13 -77 -146 150 -68 237 34 -60 69 -338
7089 -338 -277 -163 -80 -12 85 -62 33 -178 45 126 83 -22 156 -25 131 133 -216 25 -150 -64 -12 56 47 -162 147
7114 147 -181 -41 -99 30 -84 -141 102 -371 -100 -402 190 187 20 -172 -105 -8 -386 46 46 -166 -49 -14 -171
7137 -171 -53 216 30 83 -130 86 142 291 -230 -265 3 -150 76 185 175 -166 -25 -25 -18 -261 178 -147 297
7160 297 22 -108 -306 -5 -90 -158 -236 -28 -184 -83 156 -64 69 -60 -41 119 53 -78 254 56 144 -174
7182 -174 238 -249 -295 -204 144 -103 310 -11 204 -55 -116 281 115 -105 295 -100 -42 54 202 114 67 159 107
7205A07Kk05J41N6K69m11q0m3K60r3N9q8P8j56R3P7o5O5P0j8l16L81k95k9l3j2
7231a86K65o1j46R6j15K1J20j61J90k72K44P8j6n2k4l90L16L9J23j73m8K91p4
7254F5J0l03J65l5J81L3J40l49J08J81k57J02M7n4LJ80l38R1q8K96l06L68j47
7277I3K08k93l3r3Q4J33j06J74J4L4m30K45j04K17j74j19J38J27L4j03l08P1L51
7300A60k62K60l9k9j33L66l53M03m04J04K00k79P3k11J40oJ15k18j40L34j49L62
7322B94k02r3J55k88K79n0Q6l00K4j53M51k24jq9K52l72L02k50J52J73P3n5j01
7345F3O2l57L59j41L5J3j62K71k94L8R2R5j97j6l3R3J09j82M7M08M4k09l56N99
7369C81m84r3J67k16K78m09O30n21K53J2l47J94R4m8j44J56P0R3j84J09K92k90
$$ plain form
7205 107 109 -96 45 101 370 -41 -121 -164 96 3 62 -26 52 -104 -11 66 1 66 136 118 -198 183 -112 -141 -174 -186
7231 -186 79 18 -128 -32 -147 -126 -6 -167 23 -249 -5 73 57 5 -19 -409 -93 -54 69 -104 -152 139 65
7254 65 75 -228 -63 -98 83 116 256 -93 15 196 -61 41 88 34 37 217 -121 -30 -118 178 -128 240 93
7277 93 301 8 -25 -118 -34 99 -7 167 181 215 -215 30 -74 143 -31 -150 -12 115 149 46 -262 -191 160
7300 160 -102 158 119 90 -43 323 -30 373 -31 73 273 -6 67 -144 -4 -10 105 -113 -253 81 -68 294
7322 294 92 -1 154 -134 145 95 181 -119 -95 -248 203 -21 -22 -111 141 -231 71 -179 -27 146 219 164 63
7345 63 125 -232 127 -14 21 34 -128 143 -151 -113 -21 74 -123 -139 -172 -79 30 -152 -105 303 347 138 -218 381
7369 381 -103 -196 -29 -245 33 -376 254 -267 -14 -2 -349 -155 -61 -109 -253 -97 -27 66 -118 -9 283 -7
7391gL8m52N21k93K77j0k2J3k08J49K58m83K58J27k75n0j4k75N41o0k80K72j81
7414a56J06P0P4k26K20p1l5J05P2k33J96j97P9r4J28j13P9P0P2l07R8K77J77l06
7438H5l56L09J08j28j65K17j24J62J14k71J85J81k94j16Q6k31K67j26rJ10j05
7459a01q8J80k06J14j06L09q9K2L3j4n9k1P4n4j3L7q0o5p7L14j4k7M3N3j48K61
7485B78l81J39J29k79J72j83J77J9K1m10L82l52k6J00M22l57J2K14n3Op3K08j50
7508A5j20J68J4J51k05J00m0k08k42J68J03J94j61m1Q5m3J72K7l17Q1J81R8j42
7531C8n6M8K28j47j13O7j01J54q9q4MO1Q2j57jn5L72j63k77N14l34j30K74l71
7555b36M50j71k40L5K08n4Q8jk2K55l00Rj79L5K77q7K4j87L35m95O0JK77K91l94
$$ plain form
7391 -7 31 -421 100 -193 84 74 52 65 -143 6 264 -219 39 166 -109 -159 -173 -448 93 33 -247 25 -156
7414 -156 -50 20 94 -132 88 17 -18 87 159 -74 122 -75 4 -90 38 -75 4 74 146 -161 -63 214 391 85
7438 85 -271 38 146 18 -147 70 -54 108 222 -49 136 317 23 -93 -7 -238 29 -97 -106 4 -101
7459 -101 -189 -9 -215 -101 -207 102 13 35 68 54 -5 -26 48 -6 -19 18 -62 -127 -204 110 96 69 112 165 17 278
7485 278 -103 36 165 -114 58 -125 52 71 92 -318 64 -288 -314 -214 208 -149 -137 77 24 30 -43 165 15
7508 15 -105 63 77 228 23 123 83 -125 -367 -199 -96 98 -63 -104 -19 -62 110 137 -180 -99 82 180 38
7531 38 -18 30 258 111 -2 65 -36 118 29 -55 -51 10 92 -65 -66 -121 251 88 -189 325 -9 -139 135 -236
7555 -236 214 43 -197 -162 46 -8 80 79 57 312 12 21 -158 -123 154 67 91 -96 239 -256 -196 -195 82 373 -21
7580b1J93k37K49k46j43M01k97J54p0K43k19j9J26l18L60k75N51l43n5J60k34
7601d0J11K4k18J70l12J43K34k06J43J11j74K5j36J01j34J60J37k21J56j55n9
7622a40O9j22L16j43k79L17m4j45L15j56O2k25N4J33j25n6K13o7%K9n3R3R4l2
7646A08m5L3r6L53l47j47J46K1P8j69K11k36P3P7k51M70k45j50j53M51N2j87j24
7669g7K43n3k58L3K13m00K10K6q8J78j10J39k64M90l49J71m2j90J05l8L1J00l1
7692C9j97P0J13L6oj93l0R8K29m46M21j88K10k34l8r9K95j12J16R2o7o5Nl3j35
7717a19J59j16L06k41J53l00l8K59j15j83J58L3%K03j64n0%J55k19L6J27l14K13
7740e7R1k77J48M94m35j10J15K35k75J18p9q6Q3j22M74m37J9P2J9m6K17l91L80
$$ plain form
7580 -21 172 -65 184 -62 -205 196 -101 53 -17 226 7 -12 114 -204 156 -119 432 89 34 194 -40
7601 -40 71 95 -123 47 -265 -122 112 -94 49 160 -14 11 -125 -24 -158 2 139 -82 74 -81 -140
7622 -140 -71 -193 123 -20 -299 18 -26 -171 144 -12 50 -175 -121 12 -113 -169 44 -23 -23 6 -47 46 140 108
7646 108 63 96 0 353 6 -141 5 26 104 -65 146 -90 -17 60 -191 279 34 -116 -269 182 234 47 -77
7669 -77 166 113 -145 -112 101 -299 -89 -63 -151 27 -83 56 -208 282 -67 104 62 -128 -23 -61 -30 70 39
7692 39 -158 -88 25 61 55 -138 -168 -70 159 -287 134 -54 156 -78 -116 -215 80 -32 84 176 109 44 49 16 -119
7717 -119 40 -76 230 -11 142 -158 -196 63 -52 -235 -77 -44 -44 159 -5 -55 -55 100 -119 -83 44 -270 -57
7740 -57 34 -243 -95 399 -36 -146 -31 204 -71 47 -32 -118 -35 -157 317 -120 -101 -29 -10 -56 161 -230 150
7763A50k80M0K22q4n9P8o4K03k00j64L15k62K1k18P1J06J33q3M46j69j6j9j30
7786C7K61m19J76j54p1M44k12N8J42j68J10k25RP3j18N57n66J20p6K20k49J7J74
7809A40m01K92q4K32O2o24K73K96r5p5J16j15K03J66k53k5qq5m9N0N1m3n9j6N9
7834HN6n6o6K17P5k66R6J37j68m6J45j76J75R7j09k20n2L86j39j84K9k12K41K13
7858A81j47J24k95J15l0rP6j45q0R0Q5o4J00K05p1j42J96r1m0OK50l61j02m4J39
7883e4k37Q6O9K51k73m9K15l7K8K12k86M8K67k80M5o5M53o18J62J12Oq3j5L2J1
7908@j60K72n3j95P4J72J24l63qJ8N0j21L65j22m7P2j62p7J75k93N77o41M60q9
7932B8l7L2k77K62J02j03L16k29k10R1k35K02k4J16j15J50Lj92M7L24k80J94M8
$$ plain form
7763 150 -130 -90 132 48 -11 67 3 206 6 -158 157 -105 -84 -302 -231 -125 8 -75 371 202 186 167 37
7786 37 298 -121 55 -99 -170 274 62 120 262 94 204 -21 -12 61 -57 500 -66 54 -22 198 -51 -34 140
7809 140 -261 31 -53 179 241 -383 -110 186 91 16 132 17 220 386 133 108 100 15 -34 16 67 24 -35 -51 8
7834 8 64 8 -58 159 234 -32 64 201 33 -13 132 -44 131 228 119 -101 -153 233 94 -90 -61 -273 -32 181
7858 181 34 158 -137 -22 -52 -61 15 -130 -210 -120 -35 -99 1 206 135 -7 189 98 58 64 314 -47 -149 -193 -54
7883 -54 -291 -205 -136 115 -158 -207 8 -29 -1 211 -75 -27 240 -40 5 -60 393 -225 -63 49 55 -28 -43 -11 0
7908 0 -160 112 59 -136 -62 110 234 -129 -137 -119 -69 -190 175 53 6 78 -84 -161 14 -279 298 -343 117 28
7932 28 -9 23 -254 8 110 7 323 94 -116 -25 -260 -58 -82 34 -81 69 72 -120 -73 251 -29 165 213
7955B13l0j14O4p9j06r8J37J19R1j93k65L49p5j08l5Q2lJ13k99J76J91l7o2j07
7979g6K29K38n10j05K43Rr8P5j14j62l0l3M05l55M03j77n0N3J53r0J58j53j09
8002i6j45L51k55J57O4j5r2q0J52p2J75J45l61K41j06l00K77j11K23j63j3J11
8024H7J77m91K14Q4j57P4k37L07j75k7r2L92j38Q0p3l05P3K74p2l55M36K3l3o2
8048DJ72j06q1j70M58k79J44l9k7l33L41m22L20k90N10j30l85M21m8J48q0n7N3
8071A24k48J96J06m70K86p5r9J40M8J22k04N9n9Q0k15N9O62n91m6K0K01p8oj22
8095a10J6j5j42L92j20j17M36l23J56n16J69P4R5r4j45J62K04j33K5j75Rr8M2
8118b08L78M1k18L7l3l31K53K73k96j4K9L6o0J73j59J18j86L29k41mL93m78L46
$$ plain form
7955 213 183 69 133 54 -52 -150 -13 106 197 4 -261 88 13 -95 -130 -48 -51 62 -237 -61 130 93 31 -76
7979 -76 153 391 -119 -224 19 28 -70 5 -109 -271 -301 -334 71 -284 119 -58 -108 -55 98 8 166 13 -96
8002 -96 -241 110 -145 12 76 61 -31 -111 41 -31 144 289 -72 169 63 -237 40 -71 152 -11 -24 87
8024 87 264 -227 -13 71 -86 -12 -249 58 -117 -144 -236 156 18 98 25 -280 -207 67 -5 -360 76 99 66 4
8048 4 176 70 -11 -181 277 -2 142 103 76 -257 84 -338 -18 -308 202 72 -313 108 60 208 128 71 124
8071 124 -124 72 178 -292 -6 -81 -180 -40 8 130 -74 -15 -74 6 -209 -150 512 -79 -125 -105 96 18 12 -110
8095 -110 -94 -109 -251 141 21 -96 340 17 173 -343 -174 -100 -5 -99 -244 -82 122 -11 14 -161 -152 -250 -208
8118 -208 170 211 -7 30 -3 -334 -81 192 -104 -118 -89 -53 -113 60 -99 19 -167 162 -79 -83 310 -168 178
8141A78j22R4k30J29Q3l30L38j39K6Q4k17J18j95L8K8L95ll92K59k60L0l8j20
8164b46J76O02o56K41J67l97J86j4k89O0K60pJ25o4l06K38R3k31O1k1J04k0L61
8187D23n48J04K73j79
$$ plain form
8141 178 56 150 -80 49 132 -198 140 1 27 111 -106 12 -183 -145 -117 278 275 -117 142 -118 -88 -126 -246
8164 -246 -70 532 -124 117 284 -113 73 59 -230 -170 90 83 208 144 -162 76 169 -62 -1 -22 82 62 423
8187 423 -125 -21 252 73
8191G3
$$ Imaginary data points
##PAGE= N=2
##DATA TABLE= (X++(I..I)), XYDATA
0@%%%%%%%qJ6j6J6j6K4l2M0m8N6o7P5q8J05j24J47j71J95k22K53k90L30l73M21
31B23m72N30n94O60p35Q20r12J012j120J240j374J521j683J865k069K297k558
48a349K857l201L606m092M683n420O377p673R531j2443J7705l0192J12305J09495
62B02189k10230j16318N7308J56310K7453q3585q7640R780M4210L0884m673j2804
74A2884k8703j6084J6648M0382m37m6823l3253L8868O1302n507p7247l8059O5177
87a0852R0975n282q7062m8939N1711P9007J4104n2034m5900j511K4160J9893P564
100C5834j1832l3145k5089J6344L5446J734l2822j5658K3439K1152j9611l1975
112c6183O515L7058J4358k5858k7592l65J7658K0969J8071M96k7406l1630R656
$$ plain form
0 0 0 0 0 0 0 0 0 -8 8 -8 8 -8 16 -16 24 -24 32 -35 40 -48 57 -67 80 -91 104 -118 135 -155 175 -198 223
31 223 -249 281 -313 347 -388 432 -480 532 -588 652 -722 799 -884 981 -1088 1209 -1349
48 -1349 1508 -1693 1913 -2179 2504 -2916 3461 -4212 5319 -7124 10581 -19611 92694 202189
62 202189 -8041 -124359 -67051 89259 116712 33127 -54513 -44733 -523 30361 25688 12884
74 12884 -15819 -31903 -15255 25127 24690 -22133 -55386 -16518 44784 39277 -37970 -76029 -10852
87 -10852 80123 74841 -12221 -61160 -9449 69558 83662 31628 -14272 -15783 8377 28270 35834
100 35834 24002 -9143 -34232 -17888 17558 19292 -13530 -29188 -5749 15403 -4208 -36183
112 -36183 -29668 7390 21748 -4110 -31702 -32067 -14409 6560 24631 25127 -2279 -33909 -24253
125b4253N5156M2560k8668p2939k8389N1422O1836p885o1752l7365K1076L3856
137D655J113j7699r16P796j1357j6394J2409K8639K117k4703r643J5654Q823j3679
151a3185n339K5113K1335k1433l6736R560M9433K1440l5687l7059J1175L6293
163B4910N125l0635k0626J5629J9673j2506k8933n352K3270J8814o532k1493j2492
176c1148O676K0022J8463L686j9632k9305k801L6239L7781r778m3446j8806K7828
189d221L4236J137k1405p215R782K085j0554j406J2196N024j4607j7293m397O766
203i872Q929M751k844j2850j4413J509K3155K2089o202k9562j5296J8907K8953
216A7254N152j9953j7363O013J6907M129p760j543P198J421o739k559M709J886
$$ plain form
125 -24253 30903 73463 44795 -28144 -56533 -5111 56725 48840 -12912 -50277 -29201 4655
137 4655 5768 -11931 -12847 -5051 -16408 -32802 -20393 8246 10363 -14340 -23983 -8329 494 -13185
151 -13185 -18524 6589 27924 6491 -30245 -20685 28748 50188 14501 -22558 -11383 24910
163 24910 30035 -600 -21226 -5597 14076 1570 -27363 -32715 -9445 9369 2837 -18656 -31148
176 -31148 -24472 -4450 14013 17699 -1933 -31238 -34039 2200 39981 30203 -13243 -32049 -4221
189 -4221 30015 31152 9747 2532 12314 14399 3845 2439 14635 19659 5052 -12241 -16638 -9872
203 -9872 -943 3808 964 -11886 -26299 -24790 -1635 20454 14252 -15310 -30606 -11699 17254
216 17254 22406 2453 -14910 -8897 8010 12139 4379 2836 10034 11455 4716 2157 6866 8752
230H752l893k668K312k344j2815r809J0234J6988j906k0308j1113J0300J5837
243d33N778l873n749n853k817O219J4323Q436j1499j9175l902J6560J5805l77
257A3443j2528q767J092N679L386K718L592l834j5941j1790R116J9677M300j7662
271g519j8628J655J6590J1214k227o224l506j977L452J1410Q421p475j4422n46
285i782J3890R276q090j3139J155J3407N646j0606j0468M638J2332L571q823j2039
299i032j780Q465O998k921q150m951K05M297M987K698k007j718J119K027J120
314A357q6L570O377l82j1588r309Q516J7275L934j4998j4599J587J4819J1084
328A7557j861j2391j0970o07J1157J3054j230j7086j5341M991J7900P790r347
$$ plain form
230 8752 4859 2191 4503 2159 -10656 -20465 -10231 6757 4851 -15457 -26570 -16270 -433
243 -433 5345 1472 -4277 -10130 -12947 -6728 7595 16031 4532 -14643 -18545 -1985 13820 13443
257 13443 915 -7852 -6760 -1081 2305 5023 8615 4781 -11160 -22950 -13834 5843 10143 -7519
271 -7519 -26147 -24492 -7902 3312 1085 -5139 -8645 -10622 -7170 4240 12661 5186 -9236 -9782
285 -9782 4108 13384 5294 -7845 -6690 6717 12363 1757 -8711 -4073 8259 11830 3007 -9032
299 -9032 -10812 -2347 4651 1730 -6420 -11371 -11166 -6869 -1882 816 -1191 -2909 -1790 237 1357
314 1357 1271 4841 11218 10836 -752 -10061 -1545 15730 19664 4666 -9933 -8346 6473 17557
328 17557 15696 3305 -7665 -8272 2885 15939 14709 -2377 -17718 -12727 5173 12963 3616
341C616j3749j852J1109J0119l056p596p46O264K235l342l151J280K997r02l041
356A85M44J648j770k688L026N278j167o827j133N442L375m362o097O55N469L20
372A798o356l367M138N566J98l933m225N62P248O520k969r685o037M821J0704
387D983M987p678j4005m228J0175J3558K039j0850j2832R09J3222J0460l694j1549
401d503o696K027Q581P402l323j1340o770O565J2477L452q998r540L455J0714
415C503L737o250m459J513K437j12r19l42J30j43p81J43J766J801j257j239J079
432F07J817J081j166j902o14P60o97j713J679L506j485n926j641N456O225K91
448F278n747m428K009N941L029j694n381m392K005O912M392m049p421j179N933
$$ plain form
341 3616 -10133 -11985 -876 9243 6187 -1409 -2155 4109 6344 3002 -149 1131 4128 3226 185
356 185 629 2277 507 -2181 845 6123 4956 -1871 -3004 2438 5813 1451 -4646 -3991 1478 1798
372 1798 -4558 -7925 -3787 1779 1977 -1956 -6181 -5619 1629 8149 5180 -4505 -10542 -5721 4983
387 4983 9970 2292 -11713 -15941 -5766 7792 9831 -1019 -13851 -12942 280 10740 7046 -4503
401 -4503 -11199 -9172 -591 6811 3488 -7852 -14622 -8057 4420 7872 -1126 -10666 -7211 3503
415 3503 7240 990 -3469 -1956 481 369 -550 -892 -762 -905 -1686 -1543 223 2024 767 -472 607
432 607 2424 3505 2339 437 -177 583 -114 -1827 -148 3358 1873 -4053 -5694 -238 5987 6278
448 6278 531 -3897 -1888 4053 7082 5388 7 -4385 -2380 4532 8924 4875 -2546 -3725 2208
463B208O652K113m650o915k135N739O838J223p381q864r79Q479O334l240q552
478c130m810L899Q602L561n625q099n89P204M820j332n528l059R76K298K215J498
494B901%l224k632K662N298J171l986j878N48J228J12j052j097m61q29k024J46
511c117K227R17j078k923j895J935N101K174m394n996O42M710L617n75m131l407
527f193J547M661L284r63m234k967K760O565K371n135o104j373L689N853J754
542E515o155q750o67P853Q535j569r123o115M573R273L162m926o470j267M058
557b073N740J557l584m438l73K916L777K469p79l536k887J014M368K940k290n554
573g33k414K841K440j520j843J94K68j288J7J722J810m97k075r00K246L592M19
$$ plain form
463 2208 8860 10973 6323 -592 -2727 3012 9850 11073 3692 -5172 -6151 2328 8662 5422 -3130
478 -3130 -7940 -4041 4561 8122 2497 -5602 -6191 1013 5833 4501 -1027 -4086 -3110 -812 1403 2901
494 2901 2901 -323 -2955 -293 5005 6176 2190 312 860 2088 2200 1148 51 -410 -1239 -3263 -3117
511 -3117 -890 27 -1051 -3974 -5869 -3934 1167 3341 -1053 -7049 -6407 -1697 1920 1345 -2786 -6193
527 -6193 -4646 15 3299 2336 -1898 -4865 -2105 4460 6831 1696 -4408 -5781 -2092 3761 5515
542 5515 -640 -9390 -10057 -2204 6331 4762 -4361 -10476 -5903 3370 6532 1606 -4864 -6131 -2073
557 -2073 3667 5224 1640 -2798 -3171 -255 3522 5991 5212 1676 -1211 -197 4171 7111 4821 -733
573 -733 -3147 -306 2134 614 -1229 -1035 -767 -2055 -2038 -316 1494 997 -1078 -1978 268 3860 4279
590D279l273l156J157M810L036k764m486j68M795K338k010j821l32P13n55k16
606B347jk01k297l613n14M370K430l122n505j847M555N907J185n409m889J825
622d779M899J966j080p42j298k043o34L549N370M81p229n663L788J0070K010q231
638D34q241M86O802N019l045p265l363K040L430J943M2k240l282j696L703O264
654A031K310n938p922J780J1161N670p696r940j27R846P194l090q914l521N238
669b918O064O89m267m235r62K179K704J45k245k804k187J701N485J794n045m660
685h562K373P395K837m948n368K770P658J432o531m333M684O984L42o939m889
700e095K582Q088K882o133p052l62N415M362j193n645m484N28M011M628L77n609
$$ plain form
590 4279 1006 -2150 -993 3817 6853 4089 -397 -565 4230 6568 4558 2737 2405 3118 2563 2347
606 2347 2346 2145 -152 -3765 -4279 91 2521 -601 -6106 -7953 -3398 2509 3694 -1715 -6604 -4779
622 -4779 120 2086 1006 264 -1034 -3077 -3711 -162 5208 5689 -1540 -7203 -3415 6655 8665 434
638 434 -7807 -7321 -519 4500 1455 -5810 -9173 -7133 -3703 -1760 -1718 -3958 -7240 -8936 -5233 1031
654 1031 3341 -2597 -10519 -8739 2422 8092 396 -9544 -9671 175 7369 4279 -4635 -8156 -2918
669 -2918 3146 3835 -432 -4667 -5629 -3450 -746 -601 -2846 -5650 -7837 -6136 -651 1143 -3902 -8562
685 -8562 -6189 1206 4043 -905 -6273 -3503 4155 5587 -944 -5277 -593 6391 6733 -206 -5095
700 -5095 -2513 5575 8457 2324 -4728 -5090 325 4687 3494 -2151 -6635 -6107 -2096 2532 2909 -2700
716b700p465J215J1655Q140n646j2309l561J0348J2435j76j1929q457M514J0915
730F979N194n607r427k957O009P933N13o385n978j825M173O109R35o940q105L39
746i040Q364N835l690q841l053P560P877j069p102l165M227O087J067m416m079
761c438J631M275J195k434k408O05J173O16j741j451M19R42L66q00j641k801M01
778e091L553K349l383n380L5N460N056j694n671k877M536O592J577m413n053p29
794e133N375M596k94m473l275m19K827L045R43l130l688j160L157K948J11l655
810b225l077Q48L047J662n07j594j806l06L427L620j15l063k083J817M381J824
826E850k045l827r01K893K876L76l329l704M44L985K266j650l952j966N29L267
$$ plain form
716 -2700 -10165 -8950 2705 10845 5199 -7110 -10671 -323 12112 11936 7 -8450 -3936 6979
730 6979 12173 6566 -2861 -5818 191 8124 8637 2252 -3726 -5551 -1378 4731 5666 -1274 -9379 -9040
746 -9040 -676 5159 1469 -7372 -10425 -2865 5012 3943 -3159 -6324 -2097 3990 5057 641 -3438
761 -3438 -1807 2468 3663 1229 -1179 -574 599 1215 -526 -1977 -1558 -616 -250 -1050 -2691 -5492 -5091
778 -5091 -1538 811 -2572 -7952 -7917 -2457 2599 905 -4766 -7643 -3107 3485 5062 649 -4404 -5133
794 -5133 242 4838 4544 71 -3204 -3623 -796 2249 3192 62 -3626 -4786 -1629 1319 1430 -2225
810 -2225 -5302 -4454 -1407 255 -252 -1846 -3652 -3958 -531 3089 2974 -89 -2172 -355 4026 5850
826 5850 3805 -22 -923 1970 4846 5222 1893 -1811 -1367 2618 4884 3234 -718 -2684 -2155 1112
842A112K263l94m010l059O73L761L352p25l975j835J625L558K260l72k467j744
858B3J180K525R00q01p37j395j224N20J446J837j038l533k123J805L019L04k011
875F97j268j065m13J093J515P13j239k262r99K409L587j66l756k085K353L858
891B972J224l626l881J381M678J633l814l894K34K554J710K3j900k313p00J576
907b143K430J636k501m271l33M009L177o08k977k718K1L126L325l6k008k534j029
924c434J295L016K378j097l402l263N48M758L230k196n382k000L000M164J120
939B735l375l417M6L761K718j550l096m46K093J848n94j791M92J525j19n23j89
956A18N57L26j84J006L10j132j116j84J790J062q73j980j8J574L0j454K82Q57
$$ plain form
842 1112 3375 2981 -1029 -4088 -3415 346 3698 2973 -1002 -2837 -1212 2346 4606 4234 1767 23
858 23 1203 3728 4628 3827 3090 1695 471 991 2437 4274 3236 -297 -2420 -615 2404 2708 697
875 697 -571 -1636 -2049 -956 559 1272 33 -2229 -3228 -819 2768 2602 -1154 -3239 -886 2972
891 2972 4196 570 -3311 -1930 2748 4381 567 -3327 -3093 -539 1171 1194 -706 -3019 -3719 -2143
907 -2143 287 1923 -578 -4849 -5182 -1173 2004 1396 -1581 -4299 -4278 -1152 2173 2137 129 -2405 -3434
924 -3434 -2139 877 3255 2158 -1244 -4507 -3959 799 4029 1833 -3549 -5549 -2549 1615 2735
939 2735 -640 -4057 -4011 -250 2468 918 -2178 -2624 -531 1317 723 -1068 -576 949 830 307 118
956 118 675 1001 817 1823 2133 1001 -115 -299 1491 2553 1680 -300 -318 1256 1286 -168 114 971
974I71J629k21l071k263K623N089R56n140m651R04N374L780j780n453l317K351
990b219N153L514j645o134m170L387O658K399l758o084k093L730N817R35m222
1005A268m540J41M259L494j925m824j094L615K826j686l620j465K326L054L23
1020B152l753k703J248M136R16k262k628LK631J544l24k019r81M99J559R18o77
1037B59k162o33K431J915j822l292j77M006L046k239o269k125M831N657K59n528
1053a843n527P03O607N121k305o234l101K851N539K560k323m637j849K383M524
1068B469J716k718m242j357L838L482m18l104j998N85K424R68j444j852K07J711
1084B67O95j059j908M27J672J329p18j086M37Q35j07K10J148P0l58j85p92J42
$$ plain form
974 971 2600 2379 -692 -2955 -332 4757 5713 573 -4078 -3174 2200 5980 4200 -1253 -4570 -2219
990 -2219 2934 6448 4803 -1331 -5501 -2114 4544 6943 3185 -2899 -4992 -1262 4555 5490 1268
1005 1268 -3272 -3131 1128 4622 2697 -2127 -3221 394 3220 1534 -2086 -3551 -1225 1829 2152
1020 2152 -1601 -4304 -3056 1080 1996 -266 -2894 -2891 -260 1284 960 -1059 -2040 -1541 18 936 259
1037 259 -1903 -2536 -105 1810 -12 -3304 -3481 525 3571 1332 -4937 -7062 -2231 3426 3685 -1843
1053 -1843 -7370 -6667 -60 5061 2756 -3478 -6579 -3728 1811 4371 2048 -2589 -4438 -2055 2469
1068 2469 4185 1467 -2775 -4132 -294 3188 2770 -334 -2332 -1747 677 1645 201 -1651 -1444 267
1084 267 962 -97 -2005 -1578 94 1423 705 -381 56 891 784 994 2142 2212 1854 1669 877 1019
1102A019J384M63q99r61q16P5O32R66j55q87j193q73M07K700Q69k401l192l84
1120c246L790K749l47l256k411J224L182J721j98j629k017m19K111K248L8j824
1136A716k205j083J305K788O27l017k900N27K114K153j309k942j142J638K015
1151B85O1j162j026q16J168J790O08j535j291M66J411J666kk460j047N38K494
1168A148J429j454l566j406K507K525j68k522j451M84P57R76l26k73l70m14k01
1185b325K13R98R45k11q17q15M93K202J370j346j789k64J376J462Q16n87k003
1202b82k085R47K254K242j541l743j901K473L632J48l008k666P62L167K309j838
1218H70k959m97K685K449J80k141j560O15J997J215J0q45j643q03J936K010j80
$$ plain form
1102 1019 2403 2866 1967 1006 190 265 897 1863 1708 821 -372 -1245 -838 1862 2731 330 -2862 -3246
1120 -3246 544 3293 2946 -310 -2721 -1497 1685 3406 3208 1579 -438 -857 1254 3502 3540 1716
1136 1716 -489 -1572 -267 2521 3148 131 -2769 -2242 -128 2025 716 -2226 -3368 -1730 285
1151 285 346 -816 -1842 -2658 -1490 300 908 -627 -1918 -1452 -41 1625 1623 -837 -1884 -1346 1148
1168 1148 2577 1123 -2443 -3849 -1342 1183 1015 -1507 -2958 -2474 -1717 -741 -1067 -1340 -1710 -2124 -2325
1185 -2325 -2112 -1114 -169 -380 -1197 -2012 -1519 683 2053 707 -1082 -1346 30 1492 2308 1721 -282
1202 -282 -2367 -1420 834 3076 1535 -2208 -4109 -1636 1996 2144 -864 -3530 -2768 399 2708 870
1218 870 -2089 -2586 99 2548 2728 587 -973 -358 1639 2854 2864 2019 376 -427 1509 3519 3339
1235C339k868j449P08K063N21j394k257l42J508J141j75o13m97O1l1K60J54J498
1253A627P13j810j611J007K672P76j189k491n01J620K056m09j565j157k76J015
1269D77R72k85j450j180k99M16J416P84j402k427j89K457K079p31k403q63J832
1286g96K072l82j604m29J445K7l48q2O83k0q53j136P7J737Q71k008k233L15J903
1305g61J171j012j785r54R47J408J68L41l08j694p9J800K213K28k683j875J374
1322a501L549J552k420l421n9K513K602j71k851k353L98K733J359j359j978r60
1338b367P78J968J093j444j761r55J505K433Q50j793k147K31K620J516o46j269
1354F12p68P63J170L27r62l92N50N12n11j198jP04J144j004j628j20J269P40m76
$$ plain form
1235 3339 471 -978 -270 1793 2314 920 -1337 -1679 -171 970 795 182 -315 -254 -285 -25 129 1627
1253 1627 2340 530 -1081 -74 2598 3374 2185 -306 -807 813 2869 2460 895 -262 -538 477
1269 477 1449 1164 -286 -1466 -1765 -1349 67 851 -551 -2978 -3167 -710 1369 638 -1765 -2628 -796
1286 -796 1276 894 -710 -1139 306 333 -15 -97 586 566 -287 -1423 -1346 391 1262 -746 -2979 -2664 -761
1305 -761 410 -602 -2387 -3341 -2394 -986 -818 -477 -785 -2479 -2558 -758 1455 1683 -1000 -2875 -1501
1322 -1501 2048 3600 1180 -2241 -2300 213 2815 2644 -207 -2560 -2162 571 1930 571 -1407 -2367
1338 -2367 -1589 379 1472 28 -1733 -2688 -1183 1250 2100 307 -1840 -1609 1011 2527 1881 612
1354 612 -156 607 1777 2104 1142 750 1300 1812 1301 103 102 806 1950 946 -682 -802 467 1207 731
1373G31p23r06m88J849J252J62j778j591N04K437J982j394k847r92K257K379N81
1390C415k505k746O20K996J426j863k387j182J262K495J067j848l159j117K367
1405a159L501M85l492l818J423L973J747j659l082q46J722K473R79j804k049o14
1421b220J421K021Q15j918k118n2J632J612q32j868n03L99J583o61j226l8J277
1438f76O58r73r18o1J669R15r73j412L6J079Q17R7k84j198n10K035J216o51j505
1457f39j551J029J891R90j272k288k96J553K182N5k106k199J305K526J255j640
1473G95k499j106K492K612L45k484k004M03K085K099l05j651j681j60J807J525
1489B273L11j564k329j1K675J385j031k182n30J381J252l53j021m7L28J38q53
$$ plain form
1373 731 8 -898 -1386 463 1715 1877 99 -1492 -988 1449 3431 2037 -810 -1802 455 2834 3415
1390 3415 910 -1836 -1216 1780 3206 1343 -1044 -2226 -964 1531 2598 750 -2409 -3526 -1159
1405 -1159 2342 2827 -665 -4483 -3060 913 2660 1001 -2081 -2927 -1205 1268 2247 443 -1606 -2220
1421 -2220 -799 1222 2037 119 -1999 -2051 -419 1193 361 -1507 -2010 -1611 -28 -689 -1915 -1953 -676
1438 -676 -18 -991 -1909 -1970 -301 614 -359 -1771 -1735 -656 161 258 -26 -1224 -1734 301 1517 866 -639
1457 -639 -2190 -1161 730 1720 448 -1840 -2136 -583 1599 1654 -452 -2651 -1346 1180 2435 795
1473 795 -1704 -2810 -318 2294 2639 155 -1849 -1446 639 2738 2433 782 -899 -1059 748 2273
1489 2273 2584 1020 -1309 -1320 1355 2740 1709 -473 -1003 378 1630 1277 256 209 537 675 -178
1506a78O45J196n68p90o79K01J295N59r80j167P17Q15K02q81k5l3R9p1k38N02
1526F21K6q10p33R72J238k04j668q99N76J570N92j041j594k14J103J047J78j011
1544b51q40j47J005Q98j97q41m37n86J45J152P54m64j188j370O73J771R72q73
1562A76j845p27R01J350J012r82j314n13R62P10M96o0q68j063O4J972J186j121
1580C36k292k22J573K033p77j831q61J125J472m73l26k49o50P89M13N67q31l31
1598e35n19Q15Q73N12q74r57l42R94J475j82j133q16J73J056K86l00p0j87k05
1617F4o7N69O19k24n77p80O61K57Q41N2r23j262K74J695P27l88j527k22M99O44
1637I32L99k09o74m86o50P98J287J82j516j412N85J368J254j072j580p63J254
$$ plain form
1506 -178 467 1663 1095 305 -374 -173 1122 1681 701 -466 251 1066 1268 387 362 329 428 357 119 621
1526 621 647 -163 -896 76 1314 1110 -558 -1457 -881 689 1281 240 -1354 -1568 -465 582 760 -251
1544 -251 -1091 -1238 -233 665 468 -373 -810 -1396 -1251 -99 655 191 -997 -2367 -1694 77 1049 176
1562 176 -1669 -2396 -1495 -145 867 -115 -1429 -1942 -980 -270 226 166 -702 -1765 -1701 271 1457 336
1580 336 -1956 -2178 -605 1428 651 -1180 -2041 -916 556 83 -243 -492 -1142 -353 60 627 -204 -535
1598 -535 -1054 -239 634 1146 272 -685 -1027 -33 1442 1260 127 -689 -516 540 826 526 456 269 64
1617 64 -3 566 1185 961 384 -396 265 522 1363 1415 492 -770 -496 1199 1926 1538 11 -211 288 932
1637 932 1331 1122 448 -38 -688 110 1397 1579 63 -1349 -764 604 1858 786 -794 -1557 -303
1654c03K040l35j814q63L42J262Q96o90n97m53m61Q11J078L23j286j707R17J505
1672F65N35q07j550q26J245J755K4j608j564L47J012J260j2j240q73N10M70L17
1690c40L50m13o75J32K75O21m73L6n83K03N68O5K21pn05J25j13j15K20K63J67
1711B2m15j385K16J679O49n53j946N0J127J863j01k030o06P18J479L33l71j003
1729b74p44P56J701L25m84j638p76R54K158L40j942j564l08K040J593o36k316
1746h15r30J778J567k9j102j386l65J447J263J66j040q10j66J086P29J82p97p37
1764D1K77M35N14J21n08p98p2J074j95o48R7k25K41k01j82j47N18N9o34n30M5
1785g18J033R92q32j243k90Q96J454k63j068n20L2J055N03n5p75p48l13P45J219
$$ plain form
1654 -303 1737 1402 -412 -1275 -933 329 1225 535 -62 -515 -976 -165 913 1236 -50 -1757 -840 665
1672 665 1200 393 -1157 -1983 -738 1017 1041 -567 -2131 -1784 -772 488 476 -764 -1637 -1127 -657 -340
1690 -340 10 -403 -1078 -946 -671 -50 -523 -487 -1070 -867 -299 -234 -13 -20 -525 -400 -513 -628 -408 -145 22
1711 22 -393 -1778 -1562 117 766 213 -1733 -1683 -556 1307 1206 -824 -1430 -712 767 1100 729 -274
1729 -274 -1018 -262 1439 1764 1280 -358 -1134 -180 1978 2318 376 -1188 -1496 544 2137 1501 -815
1746 -815 -1745 33 1600 1571 469 -917 -1282 165 1428 1594 554 -256 -422 664 1393 1575 778 41
1764 41 318 753 1267 1388 880 82 10 1084 889 241 338 113 354 153 -29 -176 342 401 -233 -763 -718
1785 -718 315 1307 475 -768 -1058 -162 1292 1029 -39 -559 -527 528 1031 976 201 -547 -860 -115 1104
1804A104l07j751j252Q11K040N02j378j608o70J382J503L86j955j121O27J397
1820b90Q73m35j367l64P87Q73Q15o65r86o54M45J729K27q06j484j72J291N66J70
1839E53j208p97M22N63O21l76j007J20N98M78o23J20M33p6m14n11R40N15O00p16
1859B35o19K25N57P72o8o94o77j76Q13P22m6m70q53m64P31O98N85j383j093K45
1879i60J565O45p19j645J67J136J220k20q86l53o8P32R03k49n62m51J25M08K14
1898A002M15q38k16l83O31N41l28j236o47P98R18k04l51p05k01L86N14K81l0p8
1918B69p31l96O84Q59K68q07p29j50J192O36P9j479r16Q53J197K55o05r36o82
1937a139M83N94n4k0p92n61K21R70J22k41o34K69K88M53J65q73l73P81Q09j27
$$ plain form
1804 1104 797 -954 -2206 -1395 645 1147 -231 -1839 -2509 -1127 376 762 -1193 -2314 -1687 -290
1820 -290 583 148 -1219 -1583 -796 77 892 227 -759 -1413 -968 761 988 182 -1302 -1474 -183 383 553
1839 553 -655 -1452 -1030 -467 154 -222 -1229 -1109 -511 -33 -656 -536 -103 -179 -593 -1104 -164 351 951 235
1859 235 -384 -159 398 1170 1102 408 -269 -445 368 1090 1044 574 -279 -743 -12 686 1271 -112 -1205 -960
1879 -960 605 1250 531 -1114 -947 189 1409 1189 303 -50 -118 614 1517 1268 706 255 380 788 1002
1898 1002 1417 579 363 -20 611 1152 824 -412 -1059 -261 657 453 102 -603 -804 -418 96 377 347 269
1918 269 -462 -858 -174 685 953 146 -583 -733 459 1095 1174 -305 -1221 -368 829 1084 479 -457 -1139
1937 -1139 -656 -62 -116 -136 -928 -1489 -1268 -298 -176 -417 -1051 -782 -494 -41 124 -749 -1122 -341 468 341
1957C41n12k48NO04J4l19j51L95n6l72k68L48L64k22k35r17O8R51M95n70p32j14
1979a131M62J100J69l54j125l6Q36J112O84r23j397j45J020J801k95j287j418
1996i27M88J534P47p17j307j059Q88J084O22r17j281L85L00J219k96p35o00J98
2014c74Q97N14J8q34J18K38M01K02l78l88R3N44J38K2j004p3J44R51o17k99l65
2035e2L06N2l20k65J45N92K35p32r18L26J142M93o19l10n05L13P14J46j64o39
2055f0m34J52P97R13o00j258q10M52J485Q05j580j347o46J796J291o59j489l9
2073a231q2R84P26m57o90o1K12P22M39m99n80r3K13R66L95q78p15n50J178R55
2093I54n35j053l72L23R83J81j008l19K93J65N4P2l6j75l1J82l0N91L99m48m42
$$ plain form
1957 341 -171 -419 -414 190 204 -115 -266 129 73 -299 -567 -219 145 -77 -312 -1229 -1161 -210 285 -285 -1017 -1131
1979 -1131 -669 431 600 246 -879 -915 -79 1033 1717 794 -603 -748 272 2073 1778 491 -927
1996 -927 -439 1095 1842 1125 -182 -1241 -353 731 1353 436 -845 -460 -160 1059 763 28 -572 -374
2014 -374 523 1037 1055 221 339 577 978 1180 802 414 507 1051 1189 1211 207 134 278 1229 612 313 -52
2035 -52 254 306 -14 -279 -134 458 693 -39 -957 -631 511 1004 385 75 -430 -117 597 743 579 -60
2055 -60 -494 -342 455 1368 768 -490 -1300 -848 637 1442 -138 -1485 -2131 -335 956 297 -1192 -1231
2073 -1231 -1313 -329 397 -60 -750 -811 -599 123 562 63 -517 -610 -397 569 964 86 -629 -1179 -1 954
2093 954 419 -634 -1006 -683 300 481 -527 -846 -553 -388 -334 -262 -298 -473 -504 -322 -352 239 638 190 -252
2114b52j64P90J65j76n4k10L52j17k54k0Q92k10r40q44J034R17K4j160j128P52
2134f03R91N60l77q73l00N26J002r1j67q94J87K86R20L87q01q18k80P47J059k71
2154A190j210r04O52J217O07j021j309j42J234M98J09r07r70N83O50N68m61l39
2172D5l29L14M07j24O3k0l44j99K77N58J11r25l10Q03p3J2k74j98P7j39j00m1
2194d09J56O62m30n77o77P89P53o5o47m01J25J370l50n37l11L98k27P1O68j29
2214B32l42n68Q0P72Q31p38j055L9L89Q28j25o64n96J46O47O40m87m08j11L26
2234a64J96M92q1p95j59N37L93L87k78n10o3J87J04N46K17j106k65J07J064J09
2254I18n77o99j1M43P05k96k26L5m5l9M72N3j01q7m20J82N37O46p37o26Q6N11
$$ plain form
2114 -252 -416 374 539 363 309 99 451 334 80 60 952 742 -198 -1042 -8 909 933 -227 -1355 -603
2134 -603 388 948 571 -302 -602 -76 926 835 668 -226 -39 247 1167 1554 753 -65 -345 402 1461 1190
2154 1190 -20 -924 -272 945 1552 531 -778 -920 314 812 921 14 -956 -373 277 845 384 45
2172 45 -284 30 437 313 376 356 12 -187 90 648 759 -166 -476 327 254 266 -8 -206 -129 -268 -368 -409
2194 -409 -253 409 -21 -598 -1275 -486 267 202 -445 -846 -721 649 299 -238 -549 -151 -378 -307 361 232
2214 232 -110 -678 -598 174 1005 267 -788 -749 -360 468 343 -321 -917 -771 -124 516 29 -379 -490 -164
2234 -164 32 524 443 -352 -511 26 419 806 528 18 -45 142 246 792 1009 -97 -362 -255 809 918
2254 918 341 -358 -369 74 779 483 257 292 247 208 680 733 632 545 125 307 844 1490 753 127 213 724
2276G24O51j68o49m74L41N58r9l65j99L2k08j65L42M33r0o53k13N00K46j68j1
2297C65k92J74J42K6k9K25m40j13M73J5J63j84n62j37K09N01J94m76n36n65O79
2318a68N83Q2n80o90K33O31M89l12r66m62P65N89k25M6l97k63L06O58L23l98n96
2339c52p32M54J084M74j155j201L56J193L71l19p25j19K42O27j54k33l96J45p1
2358e11J23L65j41l10j9J40N03L93n70j21p7K39M03m17j65N16l6Q3o75J16K93
2379A32K67j74m25L3K06L07L55p30m38K12Q81M25o52m39j77N46N70J83p94l90
2399a02j1P51L36O9n08q17L45N97Q22m52j138n84M45J035J51p43j021K04P84O64
2419H27k39o59k86J05P55Kj44n9m11p4O04J94l69l06n68O30O49On68l98J94L81
$$ plain form
2276 724 1375 1207 558 84 425 983 884 519 320 352 144 -21 321 754 664 11 -202 298 544 376 365
2297 365 73 247 389 415 386 611 171 58 531 546 709 525 -37 -174 35 536 730 254 -282 -847 -168
2318 -168 415 497 -83 -773 -540 91 580 268 -698 -1160 -395 194 -31 15 -382 -645 -339 319 642 244 -352
2339 -352 -1084 -630 454 928 -227 -1428 -1072 121 492 173 -552 -671 -429 198 44 -189 -585 -440 -511
2358 -511 -388 -23 -164 -474 -493 -353 150 543 -27 -148 -225 14 417 0 -165 351 315 398 -277 -161 132
2379 132 399 225 -200 -167 39 346 701 -29 -467 -255 626 1051 399 -40 -217 329 899 1082 288 -102
2399 -102 -113 638 974 1043 535 -282 63 660 1482 1030 -108 -692 -247 788 939 196 -825 -621 163 827
2419 827 588 -71 -357 -252 503 505 361 302 -109 -183 421 615 246 -60 -628 2 651 657 89 -309 -115 266
2441B66m90J01j46l17N24o0k73m02P30K17m73m00R0P5Q87m20j95m60L95M06P7
2462A32n42o2k04L22O77l27l19R9n21N13N69l04k83p28J07O90M81J67j044o33
2482a210P42N89L37n94o71q6P37O26k26m88l8m07N30O19N2m30Q5l85J01L77K00
2503D60m57n55J29O80K93k85j81l42M52j5j09Lk17K33r9R5J58J08k01j70J01N2
2525A33N17J62n42k71J19N23l1j08l80m5J07J35K45l37N1m17J57K33M7K67j8q91
2547c44J01K90O54J19n69m60M0P65J92k41n17j05J31K34J43n9k80m28l10Q83M91
2568G30l82p19m40M70O65J46k93p93J1K71N11P3n89n6K16K77l49N24n34k42l8
2589e41L40K95Q5k96l27j61L79N02j90n94l80J26M87K59n2n19J27L45j1L4m83
$$ plain form
2441 266 -224 -123 -269 -586 -62 -122 -395 -797 -67 150 -323 -723 -633 -558 329 -91 -286 -746 -351 55 132
2462 132 -410 -472 -676 -354 323 -4 -323 -224 -745 -232 337 33 -250 -978 -871 -181 300 467 -577 -1210
2482 -1210 -468 121 458 -136 -807 -893 -156 470 244 -244 -282 -689 -159 460 512 82 167 -218 -117 260 460
2503 460 3 -552 -423 257 550 265 84 -258 194 179 70 73 -144 89 -10 85 243 351 150 -20 81 133
2525 133 650 812 270 -1 118 641 610 502 122 77 184 319 564 227 278 -139 18 251 298 565 547 -344
2547 -344 -243 47 701 820 251 -209 -169 596 788 547 30 -75 56 290 433 374 94 -334 -644 239 730
2568 730 348 -371 -811 -341 324 470 177 -616 -605 -334 177 250 -339 -395 -179 98 -251 273 -261 -503 -541
2589 -541 -201 94 179 -117 -444 -605 -226 276 86 -508 -888 -762 -275 -16 -68 -587 -460 -115 -126 -92 -575
2610e75L11J27k89l56P31J78o9m80P3L20M51k81l88J52j02J7L99j2m75K27j10
2631a51J77l4L71l61j95q3K35L06J17j02p96n1Q90L40l52l34l09N60J88j71Q1
2652C26j06j34M3R3K11M43p01k55l0M88L56j94j140K74M10O79q4n79p01M00N06
2673C05M70k63n48q6J03M60j98M49m50l88j89P75o5J64o36l17J29R23j50m92m35
2694d39M51J52J35n03k35M50L7k36o3K47j16P5r8J75l72J80M73n17j46P1L0K40
2716iL1j99j25O5j39M23L4m7k03o03J81Q97J97l72j096J09P03K04K2o55l38N06
2738d14M51L12o87k76J46L03J80M46j48l99n58N98L27M54o24n20n9N58R00o84
2758C06o99k79P45K30J18m37m40K07L81K18n23o7K25j6K30K59j46N5j69o3J44
$$ plain form
2610 -575 -264 -137 -426 -782 -51 127 58 -422 -349 -29 422 141 -247 -95 -197 -180 219 207 -268 -41 -151
2631 -151 26 -8 363 2 -193 -276 -41 265 382 280 -516 -567 323 663 311 -23 -332 228 416 245 326
2652 326 220 86 129 222 433 876 175 -80 -110 378 734 540 -600 -326 84 763 679 100 -601 -201 305
2673 305 775 512 -36 -122 -19 441 243 692 242 -146 -335 440 375 539 -97 -414 -285 638 488 -4 -439
2694 -439 12 164 299 -204 -439 11 48 -188 -251 -4 -120 -45 -143 32 -340 -160 313 -204 -350 -279 -249 -9
2716 -9 22 -177 -302 -237 -376 47 81 34 -169 -772 -591 306 503 131 -965 -856 -153 51 73 -582 -920 -414
2738 -414 37 349 -338 -614 -468 -165 15 461 313 -86 -644 -46 281 735 111 -409 -468 90 990 306
2758 306 -393 -672 73 303 421 -16 -456 -249 132 350 -173 -240 -15 -31 199 458 312 367 198 135 279
2779B79q6L48j89p4J84p7rl81L28J37Q1k53j74J40J48L0k26l78J18M55L34l32
2801D03n78J41M99K95k73k57m33K99K85J19n5n65L30k21M15J92l19n64j02K78
2821a11K50M50k40p89j85L69O89k26o34p1j1O97k02j87k76L77p2K49n5j1k05j21
2843c15j69L56j63K90r6k51K10l5R7l7l34J87J62r1k73m0J5j58K66J35J21j42
2865b65R7k53J38j04N09j85m9m67K40K57K6l5l74K09L14J87k12l45L00j52L7j22
2887b49K74L15n97m9J65K95R4k07l42k18L83M51j60m75m9J38L92l5L86l79J64
2908B97j94k70N59k4L0qk08l44N79k3l54m93K13K94K66J21p80j06L15N70m05M1
2930G6J58l21k33K46L90j66j11j5Lj58P41l41k90k54N31L7K02n82j12L01k59J48
$$ plain form
2779 279 193 541 352 278 462 385 376 -5 323 460 541 288 114 254 402 432 206 -172 -54 401 735 403
2801 403 -175 -34 465 760 487 230 -203 96 381 500 445 -120 210 -11 404 596 277 -287 -389 -111
2821 -111 139 589 349 -440 -625 -256 433 207 -427 -498 -509 188 -14 -201 -477 -100 -172 77 22 11 -194 -315
2843 -315 -484 -128 -291 -1 -97 -348 -138 -173 -76 -113 -447 -260 -98 -189 -462 -502 -487 -645 -379 -244 -123 -265
2865 -265 -168 -421 -283 -387 122 -63 -112 -579 -339 -82 -56 -91 -465 -256 58 245 33 -312 -12 -164 -127 -249
2887 -249 25 340 -257 -306 -141 154 248 41 -301 -519 -136 315 155 -320 -369 -231 161 126 512 133 297
2908 297 103 -167 392 368 398 390 182 -162 417 394 40 -453 -240 54 320 441 -339 -445 -130 440 35 76
2930 76 234 -87 -320 -74 316 150 39 24 27 -131 610 269 -21 -275 256 293 495 -87 -199 102 -157 -9
2952ij71J36k48J83n38L40J20P8Nk64j09K80N50n31k12k3M06l04L13p7j40k04
2974d19j56K33L54J66n86j92m9L84M80k55n60k77L80L50K76m10n45L01P4Q23o22
2995b50q8j1MJ52O3o4j00r4R6P7L76lk09l46j64O45K01l82j97l56L88M37j4p74
3019f13R8L71L22j59q0K95n03K12J03k37M71J9k35m12M34L59N8l22k20K85p3K43
3041D16k99k43K04J39j33j98J44J10m6m34J03L26M02k89k82l21M40J83o1L63n38
3062a4%K04J68J86j42k12l99K05L14L2j29j61o0j73L76K39l60k50j15Q2N23j5
3084B99m53l57M64K87j95j56j61k5K05K98j13l61j46L89L06r8J52m18m54J06L05
3105a26O7J95m17l9q3J90J72n55L22O7J81l93K20Nj39K92k11l0l95Q48l56k35
$$ plain form
2952 -9 -180 -44 -292 -109 -647 -307 -187 -109 -104 -368 -477 -197 353 -178 -390 -413 -7 -311 2 -75 -215 -419
2974 -419 -575 -342 12 178 -408 -600 -649 -265 215 -40 -600 -877 -497 -147 129 -281 -826 -525 -451 372 -250
2995 -250 -338 -349 -345 -193 -130 -194 -294 -388 -292 -215 161 158 -51 -397 -561 84 285 -97 -294 -650 -262 175 161 -613
3019 -613 -515 -144 178 19 -61 234 -269 -57 46 -191 280 299 64 -348 86 445 503 181 -39 246 173 416
3041 416 117 -126 78 217 84 -114 30 140 94 -340 -237 89 491 202 -80 -401 39 222 161 524 -14
3062 -14 -14 190 358 544 402 190 -209 -4 310 342 213 52 -8 -181 195 434 74 -176 -291 -209 314 299
3084 299 -154 -511 -47 240 45 -111 -272 -297 -92 206 93 -268 -414 -25 281 183 335 -83 -537 -431 -126
3105 -126 -59 136 -281 -320 -403 -213 -41 -596 -274 -207 -26 -419 -199 -194 -333 -41 -252 -282 -677 171 -185 -420
3127d20M84j65J18J02q4k86o8l7K94P6L99l10m45K32J2J69L07m50j42j50M90K39
3149C65k48l40K2J58O63n72j22j18K04K82p7P5m36L74n81L29J95on6n10N33K99
3171D33q5p3n47J23K03N29p5n70j99L11K54m2l55K42j72o3M01l25N29l38j85j5
3193a9J13M50j50k36l55K08k45L43Q3k62K18k13R6j25j58N76k34k45k35M63o9
3214DJ87k66l60J2M54K39l15m7j71K45K54p1j69j6J63m16rK93Q3k57j57j56M16
3237f0L21m50l42k43N24M22m03o2Q2j90Q87n50J6l37K66P4N3Q9l02nK5j17M9O88
3261D35j61n46J22J7j8K17m41K6j38K89J46j53O8K66k66MK14j08K48l0p2J06j47
3284G8M26k56q9jj55J24K75k39o7J52J27j13r7j93L61l30J90Kq7M08l15j50k28
$$ plain form
3127 -420 64 -101 17 119 35 -251 -319 -356 -62 14 413 103 -342 -110 -98 71 378 -72 -214 -364 126 365
3149 365 117 -223 -201 -43 620 48 -74 -192 12 294 217 292 -144 230 -351 -22 173 167 111 -399 134 433
3171 433 348 275 -272 -149 54 583 508 -62 -261 50 304 262 -93 149 -23 -86 315 -10 519 181 -4 -19
3193 -19 94 544 394 158 -197 11 -234 109 192 -70 148 -65 31 -94 -252 324 90 -155 -390 73 4
3214 4 191 -75 -435 -423 31 270 -45 -92 -263 -18 236 165 -4 -20 143 -273 -282 11 94 -163 -320 -476 -60
3237 -60 261 -189 -531 -774 -250 172 -231 -293 -211 -401 486 -64 -48 -385 -119 -45 8 97 -205 -210 -185 -302 -253 435
3261 435 274 -272 -150 -133 -151 66 -375 -349 -487 -198 -52 -205 -137 129 -137 -133 81 -27 221 191 119 225 78
3284 78 504 248 159 158 3 127 402 163 96 248 375 262 165 -28 333 3 193 195 108 516 201 51 -177
3307a77P82l32j9l74R9l8M60q5j26L3K71j31k58K89k55J29l85OJ55K25J15l28
3329E6m58P08j19j6l80J24k17L97l9P2q1k54L31K2j8j84R7l8k30J33J44n9%l00
3353c09L00K10k18r2j86Q8J04j20Q5k37N9J78K21k83N9J53l19J7J53k5j8K77l36
3376b39j59K15J75O5j21k75K4K39k41J01J76k44L9K15L2k33J53M7l34k3J6L11
3398f1r2Ml35M08K85k98l11j00J53M24O36p69j30L32l95O27k23J26l67rk61M32
3420G6J53J20n02k51J90N36o5j16k84L4J91k2M2l08J47K2K71j01JR2N3j32R7j5
3444B29k9L3l51K10M6Kl0n2k27R7K75j16k33J30Jl6r1J62qK99m63k0J39J3M50
3469D30l72J0j53l2L97j26R2m41j2N0L93l18N5m20L01j65M06j42J4k05k96L99
$$ plain form
3307 -177 605 273 254 -120 -21 -59 401 316 190 223 494 363 105 394 139 268 -117 -111 44 269 384 56
3329 56 -402 306 187 171 -209 -85 -302 95 56 128 47 -207 124 146 128 -56 41 3 -227 -94 50 -9 -9 -309
3353 -309 -9 201 -17 -109 -295 -207 -103 -223 -138 -375 -316 -138 83 -200 -141 12 -307 -290 -137 -162 -180 97 -239
3376 -239 -398 -183 -8 57 -64 -339 -315 -76 -317 -216 -40 -284 -245 -30 2 -231 -78 -31 -365 -388 -372 -61
3398 -61 -153 -149 -484 -76 209 -89 -400 -500 -347 77 713 -56 -186 146 -249 378 155 281 -86 -95 -356 76
3420 76 229 349 -153 -404 -214 322 257 141 -143 -109 82 60 102 -206 -59 -37 234 133 134 226 279 147 244 229
3444 229 200 233 -118 92 138 140 110 58 -169 -72 203 87 -146 -16 -15 -51 -142 20 12 311 -152 -172 -33 -20 430
3469 430 58 68 -85 -117 280 154 246 -195 -207 -157 236 -82 -27 -447 -146 -311 95 -47 -33 -238 -534 -135
3491a35J82lj83m97M86O1J60J76m73K7J71J08k24k1J79k98J40L65j69k04J9J5
3513a18J25Q5r1j64q8K1N0L21k04k28n3k1L98J08k05p9j17J87J33k03K70L6m40
3536b77L63j75R8L6L8k57K78J57k18J83k71J59j46P6Q1k3k25J07J80k52K89j41
3558F0L41k36m03L19J61L5m04j36K35J77J90j67j15N1J21K10j24k47P8L2k17J99
3580A60R5oJ28m96M8L3N11k74n07J07L03PJ06l53j72K52K99j30N1j57K3J02j04
3603B6j09J79J20k63m3qL45L3m26J51l54L09lq1k43L0J44j38N0J74o8k6J48j05
3627a58J7K97l54J12J37o3K96n21N1l34L53JK97l72P4K43j39j65N7K69n6N6m70
3650c72K33K15j44K2j76J04Q2p4JJ82l93N12M2P8l46Q3j56r3P25l98K16r7m72
$$ plain form
3491 -135 47 44 -139 -636 -150 -89 71 247 -226 -199 -28 80 -144 -165 14 -284 -144 221 52 -152 -133 -118
3513 -118 7 92 1 -163 -251 -230 -180 141 -63 -291 -344 -365 33 141 -64 -143 -260 -73 60 -143 127 163 -277
3536 -277 86 -89 9 45 83 -174 104 261 43 226 -45 114 -32 44 125 102 -123 -16 164 -88 201 60
3558 60 401 165 -238 81 242 277 -127 -263 -28 149 339 172 57 108 229 439 315 68 146 178 -39 160
3580 160 255 249 377 -119 -71 -38 473 199 -308 -201 102 109 215 -138 -310 -58 241 111 162 5 28 130 26
3603 26 -83 96 216 -47 -90 -98 247 280 -146 5 -349 -40 -43 -124 -367 -337 -193 -331 -281 -107 -175 -201 -53 -158
3627 -158 -141 156 -198 -86 51 -12 284 -237 -186 -520 -167 -166 131 -241 -167 76 -63 -228 -171 98 42 98 -372
3650 -372 -139 76 -68 -46 -222 -118 -36 -110 -109 73 -320 192 234 312 -34 49 -107 -200 525 127 343 246 -226
3673b26K29J80N2M8k54k41J55M45j56n91J08Q4J76L89J1m06O8l16P64l1l73J60
3695B75k30J17m91P43J9k76N7j46J02qR8m01j43K43L35j34nq4J06O8l89k66N09
3718I9j8J09l66o7M31j9k67K23k97j00Q8L57l48n2L34m0J19j78m0p6j26J61k01
3741b74O3L24l26O9j53M32j65k56L4O0M17k63k65MJ67n4M3q6J8m3M20j17L00m31
3765h2Lj61j55N36j47j52J33j4k07j60N07k67j59J11J5K90j81J85J04k75L38j51
3787A11k46J32o7J64j38r3P2L66k02k56K24P6k0L2l12R4j98K43K51l84L61L7n91
3810c44K53K78n5K13k21p1J67j81K54j35k57J94J89Q1j70M2l22L11j65O3j27K32
3832B29l33K18R3J29m58K61j12m1K97j29j07m03L17L66j87k44k2k3J60J20r7L4
$$ plain form
3673 -226 3 183 235 283 29 -212 -57 388 232 -359 -251 -167 9 398 409 3 71 -245 519 488 115 275
3695 275 45 162 -329 414 433 157 214 68 170 162 260 -141 -284 -41 294 160 155 71 177 245 -144 -410 99
3718 99 81 190 -176 -243 188 169 -98 125 -172 -272 -184 173 -175 -227 107 67 186 8 -32 -108 -234 -73 -274
3741 -274 -211 113 -213 -144 -297 135 -30 -286 -252 -192 225 -38 -303 -299 -132 -186 -143 -229 -211 -254 166 49 349 -82
3765 -82 -79 -240 -395 141 -6 -158 -25 -39 -246 -406 101 -166 -325 -214 -199 91 -90 95 199 -76 262 111
3787 111 -135 -3 -70 94 -44 -137 -65 301 99 -157 67 143 123 155 -157 -63 -261 -18 233 -151 210 247 -344
3810 -344 -91 187 132 345 124 53 220 39 293 158 -99 95 284 365 195 237 -85 226 61 124 -3 229
3832 229 -104 114 207 336 -122 139 27 -14 283 154 47 -356 -39 327 140 -104 -126 -149 11 131 34 68
3854F8j89Q4k77M2J85M5J51j85no2J16L11j48l45J52N7K10l94K50j20o5L49l71
3877a41J39l3K5p8l37K86R6l69M60j10j5nm49J52J56J64j72K39k41L63l39QJ13
3900h8j19L46j95m3j86O0J31k0j32J2J06K07J45k94o1J1K00k05j15nL0K00j26
3923a41J74k19M64l24J50l29L55j07R8Q4l87M11j21j45K00l52K68K94k30k72P6
3944e3J08r9R4j31J64R1j33O4l38K83j30R8j68K13j44L55J16m52K24k60P0JN6
3967B9j50K00K10m19M8K39l97J20j17J91J37J97n8l05r2L93l60K23J90k48m2J4
3989Ckj10j3J46J67p1k94L55k46j30R8o2L33m77J1L9J66q6J30j84P9L78o2l18
4013a50J10k41N45l63NL1r4J73r4m7j84L9Q0j86K25j04M71j92j96l3m5J67J71
$$ plain form
3854 68 -121 -37 -314 -272 -87 -42 109 -76 -81 -143 -27 284 136 -209 -57 0 210 -184 66 -54 -119 230 -141
3877 -141 -2 -35 -10 -88 -425 -139 -43 -412 48 -62 -77 -82 -531 -379 -223 -59 -231 8 -233 130 -209 -201 -88
3900 -88 -207 139 -56 -99 -285 -225 -94 -114 -246 -234 -128 79 224 -70 -131 -120 80 -125 -240 -245 -215 -15 -141
3923 -141 33 -186 278 -46 104 -225 130 23 121 205 -182 229 108 -37 163 -189 79 373 143 -129 -53
3944 -53 55 -44 50 -81 83 174 41 105 -233 50 -80 18 -150 63 -81 274 390 -62 162 -98 -28 -27 29
3967 29 -121 79 289 -130 -82 157 -240 -120 -237 -46 91 288 230 -75 -167 226 -134 89 279 31 -11 3
3989 3 1 -109 -122 24 191 120 -174 181 -65 -195 -97 -159 174 -303 -292 -253 -87 -173 -43 -227 -148 230 168 -150
4013 -150 -40 -281 264 -99 -94 -63 -157 16 -78 -125 -309 -270 -190 -376 -151 -255 216 24 -172 -205 -250 -83 88
4036H8k54k6lO4p2J78j50K56L38n06M7N1P0P1j36oN5O1j66p0M14n44J22N59l26
4061A15Jm6l5k70J53K62m7L1j50j52L25l0K63m29K05j05m8K36l56r7L07K37k53
4084A17J37r3j88k75N18o2pO2k53JJ4J01j80K62q7l11M01M3l07J08P5k32M08j89
4108F3m2O6N2L3k70M61l60m4j4k9m0L23K16l73r3J01M9j35J47k85L16k35L5Q6
4132B8J62k42r4q0J94j37J76k54Q5j50N62j92l50L9L19l50K56K14j62k63q7J37
4154a89j5R9R2O9l10K16j84L33j56O4m70L01mK9J51nkj0J40k65K96l10J90k44
4178a84K79j14j90J60P1j62L71j79J1J94m0k71L68p9l24k4j76O64O2o02J75k62
4200b52L31j09K03n6J59l2j93rQ1l9m42M94l8o2L54k23j56rK77k43j4K21l06R3
$$ plain form
4036 88 -166 -192 -195 -131 -203 -25 -175 81 419 -87 -40 11 81 152 16 10 65 126 -40 -110 304 -240 -118 441 115
4061 115 116 70 35 -235 -82 180 133 164 14 -138 187 157 420 -9 196 91 43 279 -77 -174 133 370 117
4084 117 254 161 -27 -302 216 154 147 209 -44 -43 -29 72 -108 154 67 -244 157 200 -107 1 76 -156 252 63
4108 63 21 87 139 172 -98 363 3 -41 -55 -84 -124 199 415 42 -51 50 99 -36 111 -174 142 -93 -58 28
4132 28 190 -52 -146 -226 -32 -169 7 -247 -162 -312 250 58 -292 -253 66 -284 -28 186 24 -239 -326 -189
4154 -189 -204 -105 -13 56 -254 -38 -222 111 -45 19 -451 -150 -154 -125 26 21 19 9 149 -116 180 -130 60 -184
4178 -184 95 -19 -209 -49 22 -140 231 52 63 257 217 -54 314 235 -89 -113 -289 375 437 -165 10 -252
4200 -252 79 -30 173 117 276 244 51 42 123 84 -358 136 98 36 390 167 11 2 279 36 22 243 -63 30
4224C0j52K59N1m2j04k79K25m5L64o2k28K01k2r7j8j15M8J37j42J39n5n5r9j25
4248a86Q7M4M2J88l56J72j40L4J95N3l30K14J6J83k52k07J63q2K84K54n29l2p4
4271b59M28j3l39JJ10R1j08k37J00Q9j1k2q2K55l98J51M9J85J00j28j61P7R2J27
4295I7n2M2j37K84m36J89L0K18m07J21J07J5j13j15L69l54J77j25N7J54j97J48
4317G2po2l46M11r4J23p4k61K10K11k47r3l7L08p7J5p3L41o4k13j50K09J04k36
4341c0j40J70j46K66j19J46l67o2M29o6J5P9j10J19J95n29R7J67l54L08k2n0J19
4364A15n2r9L05p4k39K13J08l47L5m7K87j24k83m3K24k15J24J57J25j74P2j03
4386c5KQ9j63K35J8n46N56J6k37O8r7K31J36l26o2M7N9MN9l8k30j25L62N4j9m5
$$ plain form
4224 30 -122 137 188 146 42 -237 -12 -57 307 245 17 218 196 99 81 -34 14 151 9 148 93 38 -61 -186
4248 -186 -99 -55 -13 175 -181 -9 -149 -115 80 133 -197 17 33 216 -36 -243 -80 -162 122 376 -153 -185 -259
4271 -259 169 156 -183 -182 -72 19 -89 -326 -226 -137 -148 -170 -252 3 -395 -244 -195 -10 90 -38 -199 -122 -30 97
4295 97 45 87 -50 234 -202 -13 17 235 -172 -51 56 71 -42 -157 212 -142 35 -90 -33 121 -76 72
4317 72 65 3 -343 68 -26 97 23 -238 -28 183 -64 -157 -194 114 37 52 -21 320 256 43 -107 102 206 -30
4341 -30 -170 0 -146 120 1 147 -220 -282 147 81 96 175 65 184 379 -150 -53 114 -240 68 46 -4 115
4364 115 63 -36 269 195 -44 169 277 -70 -35 -82 205 81 -202 -245 -21 -236 -112 45 170 -4 68 -35
4386 -35 -33 56 -107 128 146 -400 156 172 -65 3 -94 137 273 -53 -115 -68 -9 -5 54 16 -214 -339 23 77 58 13
4412A3j0p1JR2L1k48R8j68M53k05j79j28J80K25j52L2r0J1k33M24L5k02K18j07
4436B0j50J3J17L9J08l69l5J10K01J6K80m34l7J65K77l14k97J25J28K8K84l10
4458c5L60k30p2J22j46K53k30l7J87J81l84j26J92j4J06j63M3m5J15P4m56O39
4480C34j06l45L01l52J16J40j37K37l51K56j93J0J30k32L22j84K25k59p9K09R3
4501A35j77r3rpO3J40m2J88L5n78O27m16r8K26j56J13q2N7j0l48L83K78l54k0
4525a45oj75L67k14J52J4j72J55k72K52q4j40L19j19M23m58R1l9k4J57K7r2J10
4548A27j95q0P9J42Pk08q5Q8K69N5p5l54L2J14k3n4j94K09N1J73j3j08Q6m2M5
4573D6N3l2n2L2r4n1K78K57k86l1l19K19J39L2l42n3J89J55j8m84N48r3j86P1
$$ plain form
4412 13 3 -68 -67 25 56 -192 -94 -262 191 -14 -193 -321 -141 84 -68 -36 -126 -115 -348 76 111 -91 127 20
4436 20 -130 -117 0 39 147 -222 -257 -147 54 70 350 -84 -121 44 321 7 -290 -165 -37 -9 275 -35
4458 -35 325 95 23 145 -1 252 22 -15 172 353 -31 -157 35 21 127 -36 7 -38 77 151 -305 334
4480 334 228 -117 184 -168 -52 88 -49 188 -163 93 -100 -90 40 -192 130 -54 171 -88 -167 42 135
4501 135 -42 -135 -144 -151 -88 52 10 198 233 -345 282 -134 -232 -6 -162 -49 -131 -74 -84 -432 -49 229 -125 -145
4525 -145 -151 -326 41 -173 -21 -7 -179 -24 -296 -44 -128 -268 51 -68 355 -103 -12 -51 -75 82 109 17 127
4548 127 -68 -148 -69 73 80 -128 -213 -125 144 199 124 -230 -198 -84 -107 -161 -355 -146 -95 78 65 -43 43 1 46
4573 46 99 67 15 47 -47 -98 180 437 151 120 -199 20 159 191 -151 -204 -15 140 122 -362 186 93 -93 -22
4597b2Jo2L84k13L5j64K59J83l99J54k91J30L5K24j97r2M41j80q9k34J14K18j53
4620H2j68j36J87J45k49K6k99L92R3k76k5J73N9J60l13R4q7L98m55P0K98o1k86
4643a78K6l30L84Q7K40l02j60M96m07L9J67m4j54J29j17J50k07K68k57J78k14
4664b06K62j02L32m20QnL50k8m12J02K00j42J38k26K12k29J41J13j16J62k19M61
4686C76m43K29j31N8j10j56K3M0K51k1Nl20K54j20J03k2k1J66J5k09J26j2p4j88
4710a81J41j74K58n4m3j6Q8m2K9o7o7J61QP7k29r6K54J60l44J99J7l08K14j22
4734a37n3J42R1j4o4J98j82o9O6J34O7J72l30K53m49K54Lj0q7j73K74k8l05m1
4758b88l1J12L59l04M13l49M50l83J1j06J67J42j71K3k23J66J90k69K08j46j5
$$ plain form
4597 -22 -21 -83 301 88 123 -41 218 401 2 156 -135 -5 30 254 57 -35 406 226 137 -97 17 235 82
4620 82 -86 -222 -35 110 -139 -113 -412 -20 73 -203 -228 -55 4 164 -149 -55 -142 256 -199 -129 169 108 -178
4643 -178 -152 -482 -98 -11 229 -73 -233 263 -144 -105 62 18 -136 -7 -124 26 -181 87 -170 8 -206
4664 -206 56 -46 286 -134 -126 -131 219 191 -221 -119 81 -61 77 -149 63 -166 -25 88 -28 134 -85 376
4686 376 -67 162 31 89 -21 -177 -154 -114 137 116 121 -199 55 -65 38 16 -5 161 176 -33 93 81 7 -181
4710 -181 -40 -214 44 -10 -53 -69 19 -23 6 -61 -128 33 41 118 -111 -207 47 207 -137 62 79 -229 -15 -137
4734 -137 -190 -48 43 29 -35 163 -19 -88 -22 112 179 351 21 274 -175 79 82 72 -15 -188 86 58 -247 -288
4758 -288 -319 -207 152 -152 261 -88 362 -21 -10 -116 51 193 22 45 -178 -12 178 -91 117 -29 -44
4779d4J20k93L02j89m1P4j27k3r4M70r7k21N37o81J4J55j59L61j79k17L34j64
4801a62J21K55k49k90OR0K65o5j06J46J76k82J9j42L3k04O79j08l43K76j30ll9
4824e7m9K45p3J71k03R1j60q6J17r4J90J53r8j09o0n6J99k44L70l43LJ32K1L73
4848D33o79K23N0j49J56N1P2m49L45J36r1P2J00j91j06R2J8J2n3Q2mJ12p1j56
4872EK34k72j2j92M77p%l25J94k07K79J37k40r4j98L09J5K15m91L42q4j79p2R2
4896g4Nj2j2M6m0p8j69K16k8K53j73P2p2J03j87m5L90k39K59j89J97j30J25k12
4920Fn2p1k10K91N0J82l35l11K79J55q7j22L45j46O7o1K71o43M88k90l6K94m25
4943c61K27L19p2j19o5K83m98K24o2J26m3P4k7j19J78l1J46m22K71M8J44o0n9
$$ plain form
4779 -44 76 -217 85 -104 -145 -71 -198 -221 -315 155 58 -163 374 -307 -293 -138 -297 64 -115 -332 2 -162
4801 -162 -41 214 -35 -325 -319 -229 36 -29 -135 11 187 -95 -76 -218 -185 -389 290 182 -161 115 -15 -18 -57
4824 -57 -106 139 66 237 34 125 -35 -121 -4 -98 92 245 147 38 -22 -78 121 -123 247 -96 -93 39 60 433
4848 433 -246 -23 27 -122 34 85 157 -292 53 189 98 170 270 79 -27 65 83 95 42 124 120 232 161 5
4872 5 239 -33 -45 -237 240 233 233 -92 102 -105 174 311 71 -23 -221 88 103 318 -173 169 85 -94 -166 -74
4896 -74 -69 -81 -93 -47 -87 -165 -334 -118 -146 107 -66 6 -66 37 -150 -195 195 -44 215 26 223 93 218 6
4920 6 -46 -117 -327 -36 14 196 -139 -450 -171 -16 -103 -225 120 -26 41 -20 251 -392 96 -194 -230 64 -361
4943 -361 -134 185 113 -6 -71 212 -286 -62 -124 2 -41 33 6 -113 65 34 180 -242 29 77 221 161 102
4966A02R4j55N7k10J82j60J26J73j22J67j89l65N20j76q6N1L70j99m09N78l66
4987a7R6l14RK3L46l10N22k88K31j24N4l06L0L34l40K00j19O5l22K02J05K58n37
5010b02K95J74j51k04N1pm9M5j7O5J04K6m8k7l10K42K72l19Q9J42k20L03m62R7
5034a11K77j55N5j70Q4K00k60k1j70L13o5J63q9j68%K81l66M4j94M65k12L96k08
5057H9k46O4L60k35J6L46o15J85l1K86n13m9L61M8j2R8n46N65l69K3J92l15K87
5080a1K3j26K92j44j21N9j44J84m46M29J94j73K8j44j3K32o0q4J85k92K22M9O6
5103B05J7l59N76m40J33R6m4o5l13J62J73j84o8j51L40o0p5J70Jj33q2n1O5J46
5127E9K9J15n2m5j10J40m1j59n1K98n3J21j26r8K47k85M25j98k34K59l33K00q4
$$ plain form
4966 102 196 41 98 -112 70 -90 36 209 87 254 65 -300 220 44 -42 9 379 180 -229 349 -17
4987 -17 79 -235 -226 -203 143 -167 355 67 298 174 228 -78 -48 286 -54 146 27 92 -230 -28 77 335 -202
5010 -202 93 267 116 -88 -37 -44 -93 -48 -65 0 104 130 82 55 -255 -13 259 -60 29 171 -49 254 -208 -111
5034 -111 166 11 66 -104 -20 180 -80 -101 -271 42 -23 140 51 -117 -117 164 -202 -158 -352 113 -99 297 89
5057 89 -157 -93 267 32 48 394 -221 -36 -67 219 -294 -343 18 66 54 152 -394 171 -198 -175 17 -298 -11
5080 -11 12 -114 178 34 -87 -28 -172 12 -434 -5 189 16 44 -100 -113 119 59 -25 160 -132 90 139 205
5103 205 222 -137 439 -1 132 228 184 119 -194 -32 141 -43 -111 -262 78 18 -57 113 114 -19 -101 -152 -87 59
5127 59 88 203 151 106 -4 136 95 -64 -115 183 130 251 125 27 274 -11 414 216 -18 241 -92 108 24
5150B4J44j71j39j05n8K06K31l02Q7j38J50n5q8K47MJ17l47O3J23K78k52P9j02
5173dk36K82R2N7k33n7J15k29j21K62j38K72j94K30k59q0K13K04j25M5o0k24%
5196a88J53R8J02m7l36k9K35J48l41Q4Q1j55J46k6N5K2J98l66P5N2j60K80P9O
5220A66l66N5K0k92L10J72j87J56j24L92j95O9j14j28Q0J3n5J32P3k51K5J02j08
5243e5K69P0o8q9m00J25M90l65j40K40j42M9J10k43p0J95M7N6l86M24k94K56j6
5266F3k2J61k81k6J95k57K74k46P8R0j49L53m6m7k40o2K95q1mQ7k69J00n1j8K83
5291A80m44M08l76j32M29o0p3J02k7K7j77J3k8O8Q0R5j72O1J83l09M6K5J00j1
5315Hj74m2J50l5o3j36L36j48n6J58r1l1K9L59l04K6Q3p3P9lL1Mm87N57k09j36
$$ plain form
5150 24 168 -3 -142 -247 -305 -99 132 -170 -83 -221 -71 -126 -214 33 37 154 -193 -130 -7 271 19 98 -4
5173 -4 -240 42 134 191 -42 -99 16 -213 -334 -72 -210 62 -132 98 -161 -241 -28 176 51 96 36 -188 -188
5196 -188 -35 63 165 118 -218 -247 -12 136 -205 -121 -40 -195 -49 -75 -20 2 200 -166 -91 -39 -199 81 160 166
5220 166 -200 -145 -125 -417 -107 65 -122 34 -90 302 107 176 62 -66 14 27 -28 104 177 -74 -49 53 -55
5243 -55 214 284 216 127 -273 -148 342 -23 -163 77 -65 -16 94 -149 -219 -24 23 79 -307 117 -177 79 63
5266 63 41 202 -79 -105 90 -167 107 -139 -61 29 -120 233 187 140 -100 -162 133 52 48 135 -134 -34 -85 -103 180
5291 180 -264 144 -232 -364 65 5 -68 34 7 34 -143 -130 -158 -90 -10 85 -87 -26 157 -152 -106 -81 19 8
5315 8 -166 -208 -58 -93 -156 -292 44 -104 -160 -2 -93 -124 -95 264 -40 -14 69 -4 75 72 103 107 -380 177 -32 -168
5341a68J97L0k26K89J25l53K05J2J96j51l30M19n65L40m5K15m49K80J03k02J02
5362B4qK62j69K1J9j31P0k52K11j28ok06N07j79J99J35k06k80n0N1K34J28o77
5385d31M48J4M10n67L49l48M09k22k24L1J36K50m1l88L20l16K44Q9j85n6K70j73
5407A9k10j5J10j20L05j03j56J37k31J58j59m7K02J80k11J09k9L2j68J75K57j6
5429B19k47k7l1J40j14K54j76q5Nj27J26N5j82K28k07M6j32L21K37j28n9k68k49
5452d01L92L0L3k36J53J11o1M6l12O13j38q4M7k27p7k30J92l8J68K8m9R0k03J45
5476hJ51l58K79j13K93j28l49J68n9Q1K72l97K32P4o7j32l2J06O4l04J44L00M1
5499B58k76k0J57L32l64j69k5k74L39q2P2q5R3N5J63l32j3O1lj6k9K48r2R2R2
$$ plain form
5341 -168 29 59 -167 122 247 -106 99 111 307 156 -174 245 -320 20 -25 190 -259 21 124 -78 24
5362 24 16 278 109 130 149 18 88 -164 47 -81 -87 -293 214 35 234 369 163 -117 -167 -116 118 246 -431
5385 -431 17 31 441 -126 223 -125 284 62 -162 -131 5 255 214 -174 146 -170 74 163 -22 -78 192 19
5407 19 -191 -206 -96 -216 89 -14 -170 -33 -264 -106 -265 -312 -110 70 -141 -32 -61 -29 -197 -22 235 219
5429 219 -28 -55 -86 54 -60 194 18 -67 -62 -189 -63 -8 -190 38 -169 -123 -255 66 303 175 116 -152 -401
5452 -401 -9 21 54 -182 -29 82 21 67 -245 368 230 146 193 -34 -111 -341 -149 -187 -19 9 -40 50 -153 -8
5476 -8 143 -215 64 -49 244 116 -233 -65 -124 -43 229 -168 64 138 71 -61 -93 13 77 -227 -83 217 258
5499 258 -18 -38 119 451 87 -82 -107 -381 -42 -124 -52 -137 -44 11 174 -158 -171 -110 -113 -129 -158 90 -2 90 182
5524A82q6p6Mk56J66J54J9q2L08j06j62k55J98q9M3K05j80l5j3K17j79J43k55
5547a35M30l06J88m23J80K05k04K26J30l22k2k66J19L40j46k37J83N18m20n7L62
5568C43l85r1K29J60q1r8K47k58N0k33R0K22l41j36K34L7j72L5M18m34qJ10K02
5591A40l52J45j89L93j21R7k76K81j00j80M33k55J05k54J88k10K05J0j95J99j84
5612a20K89o2L5m71M64k36pK2P6J58J74j80n0j29l3K56n0N7j30J24j21j8kj6j01
5637g1N1J92J3k76j47K10J13Q2j77J67j32l58K43K70j44J3K85j58l87L62l20n0
$$ plain form
5524 182 96 20 24 -232 -66 88 107 25 333 227 65 -190 8 -81 -38 167 -13 -48 -61 156 -23 120 -135
5547 -135 295 -11 177 -246 -66 139 -65 161 291 -31 -53 -319 -200 140 -6 -243 -60 458 38 -19 343
5568 343 -42 -133 96 256 175 77 324 66 116 -117 -27 195 -146 -282 -48 -11 -183 -148 270 -164 -172 -62 140
5591 140 -212 -67 -256 137 16 113 -163 118 18 -162 271 16 121 -133 55 -155 50 60 -135 64 -120
5612 -120 169 107 142 -329 135 -101 -108 -86 -10 148 322 142 92 -37 -70 186 136 193 63 187 66 48 46 30 -71
5637 -71 -20 172 185 -91 -238 -28 85 167 -10 157 25 -333 -90 180 36 49 334 176 -211 151 -169 -219
$$ [...]
8191B26
##END NTUPLES=NMR FID
##END=
