##TITLE=1H_Pr 4687-G
 CDcl3, 8 sc, 
 26.10.2020
##JCAMPDX= 6.0         $$ Bruker NMR JCAMP-DX V2.0
##DATA TYPE= NMR FID
##DATA CLASS= NTUPLES
##ORIGIN= UXNMR, Bruker Analytische Messtechnik GmbH
##OWNER= root
$$ XWIN-NMR		Version 3.5
$$ Mon Oct 26 11:20:51 2020 Russian Standard Time (UT+4h)  she@DPX200
##.OBSERVE FREQUENCY= 200.1315066352
##.OBSERVE NUCLEUS= ^1H
##.DELAY= (6, 6)
##.ACQUISITION MODE= SIMULTANEOUS
##.ACQUISITION SCHEME= undefined
##.AVERAGES= 8
##.DIGITISER RES= 18
##SPECTROMETER/DATA SYSTEM= spect
##.PULSE SEQUENCE= zg30
##.SOLVENT NAME= CDCl3
##.SHIFT REFERENCE= (INTERNAL, CDCl3, 0, 15.7039)
##AUDIT TRAIL= $$ (NUMBER, WHEN, WHO, WHERE, WHAT)
$$ ##TITLE= Audit trail, XWIN-NMR		Version 3.5
$$ ##JCAMPDX= 5.01
$$ ##ORIGIN= Bruker BioSpin GmbH
$$ ##OWNER= she
$$ F:/spectra/data/she/nmr/H-F/1/audita.txt
$$ ##AUDIT TRAIL=  $$ (NUMBER, WHEN, WHO, WHERE, WHAT)
(   1,<2020-10-26 11:19:41.90 +0400>,<she>,<DPX200>,
      <created by zg, POWCHK disabled, PULCHK disabled
       configuration hash MD5:
       00 E9 B6 7A A2 85 ED C7 34 08 36 98 17 FE 4E 26
       data hash MD5: 16K
       9D 72 B1 27 48 47 9E 25 A4 4F 9F BB A8 89 3C 33>)
$$ ##END=
$$ 
$$ hash MD5
$$ 7E 68 E9 87 7F 9D E9 95 1C 73 5C 76 8E 0F 75 8F
##$RELAX= 
##$RELAX= 
##$RELAX= 
##$RELAX= 
##$RELAX= 
##$RELAX= 
$$ Bruker specific parameters
$$ --------------------------
##$DU= <F:/spectra>
##$EXPNO= 1
##$NAME= <H-F>
##$PROCNO= 1
##$TYPE= <nmr>
##$USER= <she>
##$AMP= (0..31)
100 100 100 100 100 100 100 100 100 100 100 100 100 100 100 100 100 100 
100 100 100 100 100 100 100 100 100 100 100 100 100 100 
##$AQSEQ= 0
##$AQ_mod= 1
##$AUNM= <au_zg>
##$AUTOPOS= <>
##$BF1= 200.13
##$BF2= 200.13
##$BF3= 200.13
##$BF4= 200.13
##$BF5= 200.13
##$BF6= 200.13
##$BF7= 200.13
##$BF8= 200.13
##$BYTORDA= 1
##$CFDGTYP= 0
##$CFRGTYP= 5
##$CHEMSTR= <none>
##$CNST= (0..31)
1 1 145 1 1 1 1 1 1 1 1 1 1 1 1 1 1 1 1 1 1 1 1 1 1 1 1 1 1 1 1 1 
##$CPDPRG= <>
##$CPDPRG1= <>
##$CPDPRG2= <>
##$CPDPRG3= <>
##$CPDPRG4= <mlev>
##$CPDPRG5= <mlev>
##$CPDPRG6= <mlev>
##$CPDPRG7= <mlev>
##$CPDPRG8= <mlev>
##$CPDPRGB= <>
##$CPDPRGT= <>
##$D= (0..31)
0 1.2 0 0 0 0 0 0 0 0.06 0 0.03 0 0 0 0 0.0002 0 0 0 0 0 0 0 0 0 0 0 0 
0 0 0 
##$DATE= 1603696781
##$DBL= (0..7)
120 120 120 120 120 120 120 120 
##$DBP= (0..7)
150 150 150 150 150 150 150 150 
##$DBP07= 0
##$DBPNAM0= <>
##$DBPNAM1= <>
##$DBPNAM2= <>
##$DBPNAM3= <>
##$DBPNAM4= <>
##$DBPNAM5= <>
##$DBPNAM6= <>
##$DBPNAM7= <>
##$DBPOAL= (0..7)
0.5 0.5 0.5 0.5 0.5 0.5 0.5 0.5 
##$DBPOFFS= (0..7)
0 0 0 0 0 0 0 0 
##$DE= 6
##$DECBNUC= <off>
##$DECIM= 32
##$DECNUC= <off>
##$DECSTAT= 4
##$DIGMOD= 1
##$DIGTYP= 9
##$DL= (0..7)
0 120 120 120 120 120 120 120 
##$DP= (0..7)
150 150 150 150 150 150 150 150 
##$DP07= 0
##$DPNAME0= <>
##$DPNAME1= <>
##$DPNAME2= <>
##$DPNAME3= <>
##$DPNAME4= <>
##$DPNAME5= <>
##$DPNAME6= <>
##$DPNAME7= <>
##$DPOAL= (0..7)
0.5 0.5 0.5 0.5 0.5 0.5 0.5 0.5 
##$DPOFFS= (0..7)
0 0 0 0 0 0 0 0 
##$DQDMODE= 0
##$DR= 18
##$DS= 0
##$DSLIST= <SSSSSSSSSSSSSSS>
$$ [...]
##$SUBNAM2= <"">
##$SUBNAM3= <"">
##$SUBNAM4= <"">
##$SUBNAM5= <"">
##$SUBNAM6= <"">
##$SUBNAM7= <"">
##$SUBNAM8= <"">
##$SUBNAM9= <"">
##$SW= 16.880792210976
##$SWIBOX= (0..15)
0 0 2 0 0 0 0 0 0 0 0 0 0 0 0 0 
##$SW_h= 3378.37837837838
##$TD= 16384
##$TD0= 1
##$TE= 0
##$TE2= 300
##$TE3= 300
##$TEG= 300
##$TL= (0..7)
0 120 120 120 120 120 120 120 
##$TP= (0..7)
150 150 150 150 150 150 150 150 
##$TP07= 0
##$TPNAME0= <>
##$TPNAME1= <>
##$TPNAME2= <>
##$TPNAME3= <>
##$TPNAME4= <>
##$TPNAME5= <>
##$TPNAME6= <>
##$TPNAME7= <>
##$TPOAL= (0..7)
0.5 0.5 0.5 0.5 0.5 0.5 0.5 0.5 
##$TPOFFS= (0..7)
0 0 0 0 0 0 0 0 
##$TUNHIN= 0
##$TUNHOUT= 0
##$TUNXOUT= 0
##$USERA1= <user>
##$USERA2= <user>
##$USERA3= <user>
##$USERA4= <user>
##$USERA5= <user>
##$V9= 5
##$VALIST= <valist>
##$VCLIST= <CCCCCCCCCCCCCCC>
##$VD= 0
##$VDLIST= <DDDDDDDDDDDDDDD>
##$VPLIST= <PPPPPPPPPPPPPPP>
##$VTLIST= <TTTTTTTTTTTTTTT>
##$WBST= 1024
##$WBSW= 4
##$XGAIN= (0..3)
0 0 0 0 
##$XL= 0
##$YL= 0
##$YMAX_a= 71406
##$YMIN_a= -78060
##$ZGOPTNS= <>
##$ZL1= 120
##$ZL2= 120
##$ZL3= 120
##$ZL4= 120
##$ABSF1= 10
##$ABSF2= 0
##$ABSG= 5
##$ABSL= 3
##$ALPHA= 0
##$AQORDER= 0
##$ASSFAC= 0
##$ASSFACI= 0
##$ASSFACX= 0
##$ASSWID= 0
##$AUNMP= <proc_1d>
##$AZFE= 0.1
##$AZFW= 0.1
##$BCFW= 1
##$BC_mod= 2
##$BYTORDP= 1
##$COROFFS= 0
##$CY= 11.3945322036743
##$DATMOD= 1
##$DC= 2
##$DFILT= <>
##$DTYPP= 0
##$F1P= 16.9975609425685
##$F2P= -3.02152046262296
##$FCOR= 0.5
##$FTSIZE= 0
##$FT_mod= 4
##$GAMMA= 1
##$GB= 0.15
##$INTBC= 1
##$INTSCL= 1
##$ISEN= 128
##$LB= 0.24
##$LEV0= 0
##$LPBIN= 0
##$MAXI= 10000
##$MC2= 0
##$MEAN= 0
##$ME_mod= 0
##$MI= 1.114404
##$NCOEF= 0
##$NC_proc= 0
##$NLEV= 6
##$NOISF1= 3.799351
##$NOISF2= 2.8
##$NSP= 1
##$NTH_PI= 0
##$NZP= 0
##$OFFSET= 15.70392
##$PC= 1
##$PHC0= -10690.13
##$PHC1= 12.40088
##$PH_mod= 1
##$PKNL= yes
##$PPARMOD= 0
##$PSCAL= 0
##$PSIGN= 0
##$REVERSE= no
##$SF= 200.130013532006
##$SI= 16384
##$SIGF1= 3
##$SIGF2= 2
##$SINO= 400
##$SIOLD= 16384
##$SREGLST= <1H.CDCl3>
##$SSB= 0
##$STSI= 0
##$STSR= 0
##$SW_p= 3612.71676300578
##$SYMM= 0
##$S_DEV= 0
##$TDeff= 0
##$TDoff= 0
##$TI= <>
##$TILT= no
##$TM1= 0
##$TM2= 0
##$TOPLEV= 0
##$USERP1= <user>
##$USERP2= <user>
##$USERP3= <user>
##$USERP4= <user>
##$USERP5= <user>
##$WDW= 1
##$XDIM= 8192
##$YMAX_p= 0
##$YMIN_p= 0
$$ End of Bruker specific parameters
$$ ---------------------------------
##NTUPLES= NMR FID
##VAR_NAME=  TIME,          FID/REAL,        FID/IMAG
##SYMBOL=    X,             R,               I
##VAR_TYPE=  INDEPENDENT,   DEPENDENT,       DEPENDENT
##VAR_FORM=  AFFN,          ASDF,            ASDF
##VAR_DIM=   8192,          8192,            8192
##UNITS=     SECONDS,       ARBITRARY UNITS, ARBITRARY UNITS
##FACTOR=    0.000296,      1,               1
##FIRST=     0,             0,               0
##LAST=      2.424536,      0,               0
##MIN=       0,             -78060,          0
##MAX=       2.424536,      71406,           0
$$ Real data points
##PAGE= N=1
##DATA TABLE= (X++(R..R)), XYDATA
0 0 0 0 0 0 0 0 0 0 0 0 0 0 0 0 0 0 0 0 8 -8 8 -8 8 -8 16 -16 16 -24 24 -30 32 -40 41 -48 56 -64 71 -80 89
39 89 -99 110 -123 137 -151 167 -186 206 -227 250 -274 305 -335 369 -405 448 -494 547 -606 676
59 676 -755 846 -958 1094 -1263 1482 -1778 2191 -2836 3980 -13032 71406 5380 -70436 24615
74 24615 13215 -37238 4672 14681 -12114 -7872 -24072 21980 32708 -38992 -22144 52103
86 52103 -4019 -25574 39079 2509 -25557 24623 25778 -4347 2 -4134 13312 29869 -14636
99 -14636 -7666 18131 -2457 -2833 17585 -6496 -14493 2442 1074 15199 -10493 -30957 14319
112 14319 18653 -27232 -1315 16833 -30373 392 28568 -13912 -18002 8634 -431 8263 7386
125 7386 -22399 7045 12048 -12542 12452 9005 -30845 6383 28897 -22540 -4410 11333 -21166
138 -21166 1217 23252 -21244 -19556 15349 -6426 -4754 4849 -12880 -9845 6547 1172 1443
151 1443 -4266 -18834 13852 15454 -14821 -481 11302 -9731 5153 22851 -9780 -8701 10934
164 10934 11115 5027 -906 -3309 5639 7347 715 9926 -6291 -10705 14926 9547 -10997 -1157
178 -1157 2707 -8699 11453 5169 -15206 -2710 6293 201 3088 -995 -12403 5625 6544 -1134
192 -1134 2395 -6541 -6391 11905 7404 -11926 822 96 -3077 9650 1158 -13194 -1899 6610
206 6610 -3240 3321 -5339 -12826 2838 6891 -5136 -7538 -4065 -4933 5371 -956 -6306 -2952 -6266
221 -6266 1724 10040 -4305 -14862 7222 6900 -3390 2702 319 -5692 2596 11712 1267 -3589
235 -3589 -4504 6578 11467 -2242 -3278 3555 810 246 12027 -2318 -10598 4858 7723 1567
249 1567 -1789 -2993 -2831 7508 3111 -1807 -1509 -4390 3262 8007 571 -7606 794 2032 4234
264 4234 4579 -6113 -4132 4306 4471 -738 1134 -6472 -3438 8331 1721 -5345 -5197 -972 1162
279 1162 3789 -4610 -6597 -2179 -1581 3561 -739 -8744 -6956 5052 1158 -3044 -2451 -6569 -381
294 -381 5002 1949 -5807 -3012 -778 4371 5122 -4484 -3412 745 4565 3602 1263 -5489 -806 6833
310 6833 3148 1511 -3016 -2325 2911 8095 -148 -4095 -533 975 5709 2898 -2125 -4503 2808
325 2808 4762 3721 -472 -5848 2008 5441 3275 -1262 -1830 -2046 4111 6484 -1817 -3035 -2033 2976
341 2976 4394 1663 -5475 -3623 3295 2251 925 -4507 -4318 -1228 3405 708 -3934 -5488 -3622
356 -3622 4944 1005 -4866 -5684 -572 278 1344 170 -6261 -3526 1164 4878 -1115 -5711 -3305 2796
372 2796 3525 -1317 -858 -3831 157 4554 3899 -3313 -4444 1687 3862 4351 -2481 -2740 461 3780
388 3780 3367 724 -2582 -2876 5348 4093 338 -2891 -1020 2473 5529 2697 -4397 -592 2582 4448
404 4448 2292 -457 -2923 105 5663 2827 -396 -4349 -332 4523 4094 -2907 -4274 1116 571 2110
420 2110 607 -2384 -6292 652 6108 -1571 -6825 -3577 3278 150 -939 -2519 -3057 -2286 171 4023
436 4023 -2009 -7578 -3344 7945 1052 -7515 -1256 2017 -2398 -61 5576 -5152 -6541 3634
450 3634 6339 -1098 -6009 -1066 3417 3476 -3048 752 1080 -4032 2271 8553 -1830 -9531 5235
465 5235 7335 -1439 -1647 1659 -721 1167 6081 459 -1340 -2061 2808 6316 1860 -5216 -1057 6763
481 6763 1068 -29 970 -1929 -2316 5401 3598 -4692 -1934 -55 2329 2974 -1227 -6571 97 4571
497 4571 -1628 -1012 -1463 -3821 -1382 5730 -1304 -6453 -1331 540 2046 85 -4146 -5324 3359 1158
513 1158 -2835 758 -3023 -4485 2973 6260 -5814 -5559 2186 2295 366 -1632 -2017 -1623 2335 499
529 499 2158 -900 -6344 1602 8469 -407 -8151 3294 4302 -2036 2178 4077 -4063 -3048 8054
544 8054 3837 -2999 -2804 2411 4602 2014 -1430 -520 2210 -1063 4234 4487 -4463 -4403 6348 5099
560 5099 -4303 -676 421 -943 2283 3512 -3647 -3701 1794 1308 1977 -2095 -4265 -1118 3605 285
576 285 -2842 -1804 -2943 1180 2415 -1228 -5109 -1483 924 611 482 -3780 -3625 364 3589 -1109
592 -1109 -3429 -2197 -578 2266 833 -1601 -3895 298 1867 2019 -533 -4155 -1388 3919 3512 -3450
608 -3450 -990 1133 -184 2419 3162 -1959 -3720 3873 4517 738 -2651 -691 3200 2391 1216 175
624 175 267 -2427 3836 5555 -2221 -4333 2560 4484 -528 620 -823 -1130 805 3755 1177 -3546
640 -3546 -2158 1769 4114 -1476 -2662 -1337 323 1647 589 -1559 -4118 24 1538 1572 -2609 -4261
656 -4261 -594 2040 943 -2880 -2191 -2420 931 1438 -911 -2635 -3293 1172 2485 13 -4645 -1234
672 -1234 1396 844 754 -1446 -2566 -892 3813 1217 -1826 -2510 282 3030 1575 -339 -2071 362
688 362 1377 3804 496 -2596 35 2578 3196 314 -581 -1713 2124 3472 996 -920 -1645 1517
704 1517 2657 2624 -1614 -1517 589 2635 2512 -1371 -1774 -568 2663 1213 134 -2486 -2190 2049 2196
721 2196 -389 -3290 -874 45 1710 248 -2743 -2621 -850 2427 26 -2509 -3770 -10 1470 -87
737 -87 -1360 -3120 -1330 801 2037 -1904 -3007 -1323 805 1707 -1100 -2204 -2052 1233 1805 767
753 767 -1933 -2105 1297 2088 1600 -1779 -1179 125 2965 1919 -1236 -1154 -17 3081 2175 476 -2143
770 -2143 14 2486 2552 959 -1916 5 1752 3359 579 -1183 -1421 1088 3522 695 -1099 -1788
786 -1788 1006 1800 1464 -827 -2358 79 1817 1826 -1877 -2147 -939 1375 1264 -1213 -1844 -2189 873
803 873 1057 144 -3353 -2148 474 1181 15 -2948 -1756 -827 1603 119 -1827 -2829 -1320 2196
819 2196 722 -1411 -3150 -89 1027 1057 -367 -2321 -826 332 2615 -107 -1776 -1763 1802 2908
835 2908 -83 -1064 -800 1147 1616 2543 -839 -1691 1051 2701 2232 -756 -989 125 2767 1797 1
852 1 -470 -703 1730 2641 988 -2546 -224 1728 1895 639 -1748 -1244 536 2706 -2 -1150 -1618
869 -1618 -614 1851 1246 -1246 -3225 36 1114 926 -1257 -2617 -1021 486 1598 -1470 -1939 -2002
885 -2002 -108 1314 186 -2855 -2824 1741 972 -636 -1568 -1384 -1070 1133 1463 -2221 -1751 -522 1763
902 1763 1287 -653 -2756 471 2331 -513 905 -422 -1876 646 4293 138 -2635 846 1317 2091
918 2091 966 -274 -1158 1632 1949 1366 1100 -2439 -238 3724 2339 -2619 -9 1279 334 2011
934 2011 842 -1549 -1583 2496 1538 -45 -1628 -1651 1211 2031 26 -2509 -357 -434 704 1226 -1350
951 -1350 -2983 -797 2616 -563 -1606 -1509 -1039 442 1306 -1192 -3442 121 -142 449 293 -2436 -2830
968 -2830 1460 1992 -1788 -709 -1564 -685 1859 1195 -2969 -1099 1379 -331 2063 73 -2922 -233
984 -233 3656 483 -1181 540 -1130 1572 2544 401 -1415 421 987 2008 2047 -2016 -788 1994
1000 1994 2353 -180 247 -322 -537 2508 1723 -554 -2259 989 1973 1115 -597 -1410 -39 892 1794
1017 1794 -645 -1277 -1469 333 1745 155 -2374 -1581 1648 -31 -169 -870 -2296 -772 1712 528
1033 528 -2743 -963 -1113 663 1113 -1647 -2522 7 859 -769 517 -2012 -1917 1207 1553 -1131 -1590
1050 -1590 -595 -499 2463 -44 -1736 -879 851 1237 870 -112 -1993 1092 2018 1181 -401 -971 78
1067 78 1793 2208 -751 -344 -19 1805 1971 527 -695 -707 1963 1597 1478 -1300 -491 1210 1629 907
1085 907 -921 -891 -270 2268 489 -806 -1471 -477 1547 769 -742 -2181 142 247 802 -339 -2195
1102 -2195 -1329 693 995 -850 -1292 -2157 205 1114 -653 -1325 -1647 -178 394 916 -2007 -1597 -71
1119 -71 606 836 -829 -1702 -1031 1812 498 -438 -1080 -1027 1018 1579 220 -1746 -93 481 1807 1043
1137 1043 -1158 -526 699 1904 676 85 -1349 518 2042 1185 158 -1205 161 1189 2438 -424
1153 -424 -813 172 1244 1920 24 -848 -934 1478 1189 607 -844 -1353 880 1104 612 -1419 -930 -541
1171 -541 1404 588 -1452 -1378 -732 791 389 -497 -2325 -790 699 420 -251 -1982 -1335 41 1242
1188 1242 -833 -1549 -1232 -213 1399 -334 -1445 -1626 395 792 725 -763 -1770 258 989 1014 -772
1205 -772 -801 -726 1504 1509 -479 -606 -664 1375 1259 992 -1338 -390 1135 1208 1440 -766 -463 568 2138
1224 2138 674 -113 -607 79 2115 963 73 -1249 384 996 1413 -120 -1387 8 587 1306 -251
1241 -251 -1036 -1223 691 1288 -247 -647 -1612 80 943 430 -1626 -1245 -218 266 948 -1755 -1670 -819
1259 -819 814 231 -920 -1513 -1400 812 430 -458 -1698 -977 33 972 38 -1565 -641 -87 1150 321
1277 321 -490 -1426 119 1360 622 -77 -1461 257 1084 1242 -317 -719 -290 1044 1996 10 -528 -411
1295 -411 1263 1594 742 -573 -622 1461 1231 944 -399 -715 361 1609 1053 -895 -522 -215 1571 1138
1313 1138 -326 -1216 -131 973 569 263 -1748 -803 495 939 -522 -1273 -767 -105 1135 -144 -1009
1330 -1009 -1819 -29 741 40 -879 -1872 -318 434 386 -1520 -1298 -549 209 906 -807 -1441 -1059 849
1348 849 511 -10 -1290 -1037 582 1050 220 -1171 -240 112 1368 1118 -821 -1041 269 1768 568
1365 568 263 -900 -17 1220 1212 102 -801 369 502 1548 272 -871 -483 1168 1631 -12 -76 -880
1383 -880 641 1429 750 -635 -904 654 539 999 -468 -1308 -155 1375 90 -769 -577 -1487 626
1400 626 999 -448 -1842 -320 322 71 354 -1505 -1516 100 767 -784 -646 -1291 -814 1420 81 -1343
1418 -1343 -1272 -61 79 673 -477 -1616 -127 686 797 -714 -521 -735 761 1233 -119 -605 -571 990
1436 990 862 898 -541 -865 778 1393 987 -610 -2 130 1265 1252 -254 -879 370 1518 506 719
1454 719 -825 -518 1260 1441 -200 -766 4 -141 1571 487 -1114 -662 567 283 291 -8 -2014 295
1472 295 1059 58 -1098 -923 -633 237 1079 -1257 -1272 -652 130 457 -176 -1400 -1267 779 -41 -144 -1179
1491 -1179 -1107 -259 966 211 -1267 -842 -413 785 232 -398 -1128 -241 800 544 -148 -1271 129 557
1509 557 983 200 -1071 -293 681 1491 -88 -62 -539 793 1610 486 -445 -379 585 543 1498 -476 -799
1528 -799 525 1168 833 -63 -276 -526 1496 882 -242 -448 -310 398 932 238 -1615 -163 200 578
1546 578 323 -951 -1107 88 1072 -340 -592 -1385 -643 614 87 -875 -1461 -308 -137 797 -810 -1479
1564 -1479 -456 89 410 -466 -925 -1282 646 586 -270 -822 -970 213 737 420 -1120 -528 -206 900
1582 900 761 -606 -842 -57 1122 589 421 -837 -132 1208 887 314 -690 -29 549 1763 429 -525
1600 -525 -130 498 1402 681 -129 -740 711 696 661 77 -780 175 977 885 -606 -556 -313 634 798 -623
1620 -623 -954 -679 362 436 151 -1421 -724 305 404 55 -1280 -984 -325 747 -140 -943 -990 -589 625
1639 625 311 -557 -1347 -179 346 631 -193 -1208 -511 203 660 -493 -768 -823 448 803 138 -426 -721
1658 -721 495 619 768 -487 -445 525 907 1172 -257 -317 -117 1093 799 223 -209 -3 1063 976 490
1677 490 -676 -50 750 1002 539 -718 -183 110 983 334 -67 -668 -18 1117 195 -270 -956 -178 515
1696 515 756 -445 -910 -550 134 702 -510 -1008 -1049 394 211 -403 -844 -1173 32 372 33 -981 -1034
1715 -1034 -139 438 299 -944 -778 -487 748 124 -575 -911 -195 772 580 55 -841 -105 631 946 148
1734 148 -582 -424 363 1185 29 -214 -437 508 1164 715 -88 -682 765 719 933 -210 -337 76 822
1753 822 1076 -214 -302 -493 882 856 288 -578 -358 585 534 555 -804 -260 113 813 329 -665 -795 -239
1773 -239 707 119 -251 -958 -328 398 88 -512 -1317 -171 -179 547 -366 -1138 -604 74 465 -440 -599 -1102
1793 -1102 -29 544 46 -801 -778 180 203 505 -446 -668 184 576 494 -13 -298 -394 999 786 22 -650
1813 -650 41 632 711 466 -649 -114 519 1330 302 93 -323 217 1182 534 -43 -567 293 559 885 95
1833 95 -800 287 655 985 -184 -258 -584 389 940 -298 -692 -479 273 146 408 -723 -787 92 307 -39
1853 -39 -773 -747 -652 421 163 -793 -744 -437 285 78 -109 -1250 -612 337 315 -486 -906 -394 -168 871 -428
1874 -428 -656 -585 390 420 420 -249 -927 324 613 513 -161 -187 -86 720 1029 -332 -313 185 821 748 579 -391
1896 -391 -379 1059 570 378 -220 -199 296 881 730 -747 94 48 864 601 -148 -805 -7 984 316 107
1916 107 -647 -73 234 813 -261 -858 -340 49 405 -289 -585 -984 333 289 -272 -540 -961 -11 51 295
1936 295 -769 -876 -178 181 133 -605 -834 -494 619 129 -339 -616 -417 202 361 -6 -920 -140 117 541
1956 541 166 -454 -490 154 1062 164 -36 -323 222 844 609 1 -583 640 578 872 150 -417 -316 691
1976 691 1005 1 -70 -411 697 807 318 -368 -483 479 579 497 -555 -566 -185 605 267 -520 -313 -270
1996 -270 590 110 -313 -742 -403 345 100 -107 -1087 -304 7 357 -158 -722 -740 -92 305 -103 -363 -920
2016 -920 66 289 -149 -428 -864 -137 187 424 -631 -383 -487 311 553 -111 -502 -611 804 197 278 -326
2036 -326 -204 517 768 476 -443 -32 132 1034 479 -1 -156 228 1018 630 361 -377 196 743 619 73
2056 73 -434 62 430 776 -125 -289 -448 446 571 125 -92 -627 139 295 314 -486 -627 76 177 314 -534
2077 -534 -577 -361 551 244 -574 -546 -765 65 183 -82 -932 -334 -111 178 80 -787 -487 -153 659 -159 -442
2098 -442 -632 -115 562 -25 25 -629 51 354 474 -135 -406 88 389 597 -51 -180 -390 649 671 226
2118 226 -111 -394 412 864 342 -129 18 397 675 710 -176 -242 154 850 585 158 -558 -177 594 330 241
2139 241 -766 63 209 542 9 -694 -314 -60 558 -299 -578 -816 140 247 20 -402 -969 -49 133 245
2159 245 -426 -715 -522 90 338 -505 -471 -653 295 147 -77 -628 -384 229 -26 288 -761 -449 162 637
2179 637 41 -462 -248 -243 748 434 -3 -403 126 806 437 160 -585 98 412 838 140 -65 17 531 884
2200 884 94 146 -340 487 729 458 59 -518 301 723 581 -430 -219 -100 323 543 -200 -475 -367 427
2220 427 93 127 -572 -516 269 245 -49 -970 -306 -265 211 -166 -506 -727 -248 612 -156 -436 -723 -272 158
2241 158 183 -285 -1004 -76 -11 372 -265 -491 -505 210 566 -139 -209 -507 390 239 166 -322 -259 217 366 528
2263 528 -194 -173 134 873 439 -7 -122 -93 630 571 387 -385 69 515 496 367 -167 -27 136 918 81
2284 81 -151 -72 39 534 236 -263 -474 223 198 301 -297 -489 -285 94 464 -460 -450 -516 242 251 -179 -621
2306 -621 -534 403 6 91 -641 -599 -212 62 -3 -731 -323 -362 323 46 -258 -740 -21 493 134 20 -498 -298
2328 -298 160 379 -160 -212 -91 144 516 329 -243 -443 543 391 183 -15 -393 404 722 511 -264 -299 376
2349 376 654 528 -90 -236 130 721 179 71 -206 -215 467 313 464 -545 -106 171 344 92 -257 -331 -46
2370 -46 608 -70 -198 -566 -246 248 235 -243 -673 -136 -73 123 -434 -533 -494 67 257 -431 -488 -547 38 7 145
2393 145 -725 -731 216 94 112 -312 -395 -109 409 203 -507 -189 -223 495 329 235 -284 162 628 336 463 -352
2415 -352 -4 143 570 166 -6 -207 287 624 310 153 -345 377 562 396 -102 -115 34 345 585 -177
2435 -177 25 39 386 396 -90 -349 -263 576 0 -47 -407 -521 11 335 116 -642 -93 -128 237 203 -530 -492
2457 -492 -138 368 -54 -162 -664 -162 54 352 -269 -556 -242 -175 416 -362 -340 -467 106 424 -41 -194 -633
2478 -633 92 173 175 -540 -215 283 374 202 -187 -164 -122 729 433 -40 -194 -20 489 470 448 -351 -168 451 446
2501 446 282 -175 -64 295 660 108 97 -162 60 577 206 -49 -463 205 255 423 -115 -554 -76 179 219
2522 219 -285 -193 -439 -10 319 110 -382 -585 153 90 -16 -644 -272 -123 102 274 -437 -670 -430 218 -78
2543 -78 -321 -460 -400 335 65 58 -489 -187 135 461 140 -483 -33 10 353 214 -143 -283 576 346 312 -123
2565 -123 -201 220 341 697 -181 40 195 433 593 28 -91 -145 598 403 452 -120 -102 381 448 420 -347 35
2587 35 -117 471 0 -411 -335 -136 400 225 -370 -540 -152 131 129 -25 -710 -219 93 188 -345 -461 -332 -8
2609 -8 321 -244 -338 -370 -32 -69 -10 -384 -533 72 50 124 -319 -347 -284 458 90 -284 -142 -490 454 188 54
2632 54 -294 -67 347 388 283 -233 -119 67 401 234 49 -282 221 754 200 277 -53 316 461 472 -53
2653 -53 -31 99 136 733 95 -141 -221 473 537 122 -232 -73 105 439 138 -345 -110 148 125 319 -574 -432
2675 -432 -93 188 62 -148 -469 -390 388 -154 -84 -478 -299 -12 153 -134 -357 -82 -113 377 1 -468 -221
2696 -221 -107 16 -70 -152 -587 144 284 1 -136 -348 -26 278 285 -297 -90 -267 390 598 114 0 -222
2717 -222 400 -81 559 55 -35 293 548 267 -140 -5 179 636 429 -121 -318 260 407 48 167 -411
2737 -411 178 345 299 84 -104 -145 146 230 -30 -167 -368 133 210 -123 -277 -352 -13 26 96 -487 -247 -92
2759 -92 -241 152 -323 -483 -644 327 54 -160 -451 -58 117 309 -95 -548 -132 -127 235 11 -470 -413 -53
2780 -53 392 14 -56 -239 202 551 325 -105 -323 376 235 483 36 -244 22 376 437 158 10 -124 229
2801 229 381 337 -201 -91 422 146 290 -93 -6 -66 281 251 56 -176 -127 398 276 -9 -656 -47 281 161
2823 161 95 -430 -150 214 150 -210 -356 -191 -132 114 -115 -349 -456 165 -39 -90 -244 -485 -140 89 155 -233
2845 -233 -287 -236 -36 173 -228 -248 -299 77 18 99 -314 -100 241 276 185 -353 -36 115 480 215 -25 -131 131
2868 131 426 89 -17 -191 148 231 400 57 -142 174 224 545 52 -209 -21 408 326 56 26 -521 180
2889 180 301 393 -187 -263 94 -28 245 -464 -215 -138 116 161 -109 -330 -269 227 128 -8 -627 -399 -112 -47
2911 -47 -22 -457 -298 -241 136 -276 -141 -249 1 23 -75 -360 -408 190 88 92 -203 -183 -73 -35 273 -219 -82
2934 -82 -71 247 426 118 -109 -12 594 347 210 -141 -19 55 558 308 -225 120 129 609 261 88 -89 -70
2956 -70 299 239 111 -94 220 -16 196 23 -167 -97 -106 299 77 -216 -373 130 150 -22 -71 -288 -79 73
2978 73 161 -352 -223 -346 -15 237 -258 -180 -313 146 51 -164 -359 -294 -25 41 226 -382 -179 68 161 137 -299
3001 -299 -203 -113 354 147 -34 -241 65 139 137 -52 -321 199 85 504 61 102 -20 148 656 -39 -61 -181
3023 -181 395 323 404 -25 -76 177 389 168 -201 -100 119 231 307 -274 -130 -133 189 230 7 -345 -255 26 118
3046 118 122 -413 23 -171 85 -226 -327 -41 -23 351 -127 -278 -462 -73 129 -203 -206 -512 -56 -15 32 -353
3068 -353 -282 -398 -34 128 -132 -105 -282 148 57 261 -330 -260 63 -96 114 -158 -66 70 412 194 23 -74
3090 -74 -210 446 291 133 -64 115 363 403 184 -169 -14 291 567 1 91 -49 -34 279 132 66 -331 263
3112 263 216 326 120 -246 76 240 138 -320 -54 -274 159 -103 -215 -156 -347 306 -47 24 -476 -209 14
3133 14 42 -187 -214 -107 -290 -21 -68 -378 -413 -233 76 -180 -71 -442 6 229 264 -20 -50 -61 40 244 -165
3156 -165 -247 -183 326 220 154 80 -332 320 293 447 -61 -66 -95 418 481 159 59 67 232 283 139 52 170 262 226
3181 226 281 -325 -73 -49 132 25 -82 18 -37 140 -29 44 -310 53 17 -113 -195 -341 1 -83 193 -209
3203 -209 -348 -152 56 -79 -125 -105 -373 35 27 -89 -259 -349 -21 -55 45 -275 -141 -270 0 107 -221 -122
3225 -122 -332 59 116 -141 -406 -36 -112 220 70 -108 333 41 408 81 58 -47 -30 466 67 142 -244 265
3247 265 328 261 -81 -38 249 275 354 87 21 134 302 248 200 -86 -11 395 283 161 -390 -68 179 226 -24
3270 -24 -364 -180 -149 52 -207 -146 -357 -198 -25 -70 -129 -378 -307 63 7 -125 -406 -75 -175 -104 -165 -135 -369
3293 -369 -111 190 -94 -370 -372 169 30 52 -209 -173 87 178 366 25 -106 47 292 136 9 -137 -209 112
3315 112 290 218 -74 358 276 213 253 -116 -73 67 441 7 29 -157 204 344 199 111 -194 388 196 168 36
3338 36 -57 17 72 379 -116 -98 -192 15 145 109 -26 -159 97 -187 116 -360 -167 -91 -6 100 -211 -83 -252
3361 -252 -126 23 24 -408 -181 -67 -241 -108 -254 -205 -23 267 -48 -172 10 80 270 42 -46 -189 160 334
3383 334 114 75 -66 119 254 334 -194 -16 -58 364 291 -236 146 -150 200 373 170 -99 48 197 282 137
3405 137 -136 100 275 301 193 -85 -64 -141 359 -9 -32 -303 -198 123 146 73 -303 -76 -173 -110 -156 -219 -324
3428 -324 -4 66 -102 -13 -397 -106 -81 -113 -446 -245 -1 -32 152 -279 -389 -190 -27 87 -35 -34 -181 82
3450 82 -16 106 -263 -204 153 124 -1 -264 53 -117 342 -53 -121 62 -34 265 -1 -95 -101 60 281 107 7
3473 7 -153 144 365 456 52 -66 1 136 310 196 220 -29 357 201 134 -30 -214 193 160 159 -12 -100 -207
3496 -207 -43 -186 -155 -121 -184 17 -1 -49 -450 -240 -64 109 -74 -353 -143 -328 72 -210 -298 -429 -8 28
3518 28 -236 -104 -84 138 116 80 -320 -345 -85 48 191 -186 -12 184 85 78 126 -71 21 314 362 264 -73 11
3542 11 69 401 156 -94 137 163 327 68 193 47 30 380 196 211 -180 264 411 307 168 -136 99 158
3564 158 214 18 17 -213 142 -47 26 -102 -281 116 62 182 -98 -61 -154 165 127 -112 -22 -126 127 -118 -65
3587 -65 -270 -208 -23 43 24 -161 -136 -94 9 9 -191 -89 -36 -94 -4 -174 -216 57 0 -21 -43 -74 24 -10 395 122
3613 122 31 140 60 264 79 133 283 178 104 176 -117 -25 227 91 160 -210 39 40 112 211 -26 -121 -109 519
3637 519 107 197 -135 111 103 81 -74 -293 -62 66 112 -268 -51 -181 -183 -6 -336 -33 -312 -72 -138 -84 -242
3660 -242 -153 65 -144 184 159 -183 -118 132 77 -179 -273 -28 -31 -38 77 -219 -127 35 -66 152 -149 11 -42 163
3684 163 -142 -25 -40 -39 300 146 22 -48 -45 125 284 262 -25 76 176 252 273 97 36 266 312 -45 15 -40
3708 -40 6 102 259 -114 -139 56 229 161 -298 -17 -12 88 -120 -127 -62 -135 19 -41 -271 -304 -35 96 -51 10 -149
3733 -149 -171 -139 226 15 -219 -314 -72 30 19 -242 -338 22 30 35 38 -186 -46 -83 -50 -188 93 -16 224 101
3757 101 35 72 -23 55 239 97 32 72 254 218 254 -34 56 164 152 84 81 -46 95 0 343 160 39 162 236
3782 236 484 -90 26 -86 232 248 -198 164 -10 172 154 -131 110 -208 54 85 -59 -210 -112 -109 10 179
3804 179 -174 -126 -362 97 -241 82 -342 -206 -63 65 -71 -469 -99 -188 161 61 -113 -200 -80 169 259
3825 259 84 -124 -87 187 30 122 -39 -183 88 108 -63 75 26 264 242 89 84 -116 -14 65 352 -239 -90
3848 -90 195 -58 217 14 161 29 231 86 167 276 -23 231 -42 251 -19 17 171 163 126 -39 11 89 206
3871 206 -87 -100 -109 71 -158 -127 -66 -280 -103 -34 -89 -188 -163 -192 -148 -17 -274 -225 -170 1 175 -19 -88 -186 81
3896 81 115 -48 -232 -210 -38 324 114 -381 58 28 85 71 -12 -115 24 298 91 120 11 25 40 101 -6 -169
3920 -169 138 227 312 91 298 16 129 153 -174 17 -1 111 193 -25 -108 -109 89 -5 280 -141 -242 -46 148
3943 148 77 19 -100 -157 99 90 29 -199 -247 -244 116 162 -252 -14 13 94 -113 -257 -239 -28 34 -86 -6 -348 3
3968 3 -76 43 -114 -258 -110 -241 44 -202 -104 -88 175 131 -105 55 -188 48 159 73 -71 115 -147 -108 423
3991 423 27 -14 159 304 178 82 -92 -193 210 112 218 -118 90 185 177 -41 63 109 -56 325 144 12
4013 12 -238 9 74 108 30 -110 -38 66 31 -23 -151 -86 -97 236 -267 -81 -176 17 -75 -160 -124 -196 -141 72 -231
4038 -231 -148 -39 -45 50 -125 -145 -168 -93 145 -113 -88 -262 -36 119 74 123 -46 -83 48 337 -58 -53 -54 153 188
4063 188 176 156 -93 38 341 106 -85 69 163 120 176 -41 33 104 26 120 59 116 61 263 131 -42 -209 -13
4087 -13 171 302 12 -434 -97 -114 142 -92 -30 -84 5 124 -216 -188 -352 56 2 35 -117 -202 -162 -126 80 -105
4111 -105 -140 -100 -179 78 -154 -280 -13 151 -218 23 -58 -274 -139 -104 127 -255 -48 -160 -46 17 -12 -238
4133 -238 -104 -38 0 157 -207 42 96 223 71 -85 35 -30 24 -68 135 -101 134 200 207 115 -126 282 -131
4156 -131 20 76 -3 -81 -23 26 -92 87 -218 87 195 27 -4 -199 72 16 5 -191 -157 -46 -299 -196 -113
4179 -113 -62 -149 114 -138 -3 -183 -38 152 -100 184 -162 -178 -320 -170 -3 -229 103 -116 28 96 10 -341
4201 -341 118 -106 -127 49 -57 21 -86 91 -39 -151 121 128 170 87 -178 12 243 11 237 -224 -134 194
4223 194 163 247 -221 200 235 93 51 38 -29 56 108 153 16 -202 95 51 -98 36 -319 -61 45 138 61 -101
4247 -101 -28 47 2 -244 -123 -107 118 34 42 -184 -206 -23 -74 66 -111 48 -234 52 -76 60 -196 -117 11
4270 11 -117 -25 -316 -86 144 143 1 -78 -75 305 236 73 109 1 309 176 53 252 -96 -98 139 174 11 52
4294 52 -35 131 362 -10 -70 135 32 104 28 146 -107 210 77 286 126 -107 -67 136 82 -337 59 -88
4316 -88 84 -47 11 31 -200 11 -125 -135 -300 -360 -6 82 -140 -114 -143 -101 144 -17 -123 -284 -26 -29 -130 56
4340 56 -143 18 -65 -78 -216 -44 -45 54 22 -45 -156 -12 156 -10 58 -185 -112 112 111 55 -40 85 105 176 -21
4365 -21 139 111 129 148 111 -162 -7 49 115 284 145 -188 87 -92 216 -99 -75 108 4 273 94 30 -100
4388 -100 46 128 216 -150 -73 212 148 9 -179 -102 59 -37 -35 -121 6 -282 -133 -196 -126 -264 -107 -91 -24 1 -257
4413 -257 -161 -161 -12 -110 -17 -361 58 20 -172 16 -180 -213 58 -116 27 95 216 0 53 -45 22 141 253 -73
4437 -73 164 156 -104 81 -3 215 155 35 192 68 198 13 -47 8 126 19 188 -76 93 156 4 -22 -151
4460 -151 34 148 59 16 158 -403 -53 1 -20 60 -71 -70 -137 -57 144 -155 96 113 0 -251 -177 59 48 25
4484 25 -176 115 -181 32 -84 7 -30 -105 62 -111 -191 -127 -28 -54 216 88 -159 88 -75 133 99 45 68 16
4508 16 97 -25 -13 -179 39 169 152 79 -222 -29 167 151 177 157 -59 25 232 -142 -102 145 166 -48 216 -19
4532 -19 126 128 68 -22 -112 -312 -50 57 -18 54 -184 -39 -8 -97 31 -95 130 60 39 78 -222 55 -111 83
4556 83 -145 -21 -217 124 -107 -192 -250 -102 -58 157 5 -167 -196 -181 -45 108 -234 -68 -236 -167 107 -20
4578 -20 -104 -34 169 -105 -33 -4 -98 155 -73 158 122 103 85 208 -113 37 143 47 215 -24 -88 -191 119 148
4602 148 150 47 -209 130 9 230 -40 31 4 165 134 86 64 -157 49 30 103 27 -71 -73 -116 95 80 39 -111
4627 -111 126 10 -52 -127 -110 250 -176 82 -154 -74 -10 -41 -62 19 -159 -238 39 -64 2 -213 -39 22 -122 104
4651 104 -97 65 47 54 -136 42 -89 -60 198 -46 -159 -73 325 99 28 -3 -46 -9 284 81 116 -62 -25 99
4675 99 4 -77 -91 112 96 42 195 31 29 -80 151 -52 66 -73 143 152 -91 -61 -135 -73 116 165 182 -61 20
4700 20 142 -181 19 -216 65 57 -90 -141 69 -167 9 -9 -75 -172 -242 112 75 104 -151 32 -39 134 -80 -12
4724 -12 -1 -151 154 154 53 0 12 136 255 23 -168 31 -106 77 86 76 -104 259 160 -54 104 -69 -39 232
4748 232 21 -118 45 101 -75 270 51 -72 85 171 271 -191 90 89 182 67 88 -141 -149 -51 111 -16 -24 21
4772 21 -28 -11 -47 -243 -138 -114 63 -104 -208 -238 4 157 -32 -82 -77 -52 23 247 25 -99 94 -137 -5 -23
4796 -23 -155 -155 -112 148 -112 197 -68 -46 211 207 -73 68 -40 354 165 -67 71 -4 126 -8 62 107 -139
4819 -139 128 241 23 109 122 255 227 28 25 -44 98 111 -92 74 -98 -44 333 -58 -8 -219 103 35 28 -27
4843 -27 -125 73 -60 -103 -134 -134 -158 -93 -119 -32 -143 2 -153 -192 -133 -149 -27 -105 42 -67 -186 166 -235 40 -301
4868 -301 -67 -185 -148 10 130 40 -45 79 61 64 95 10 -251 69 -7 -62 77 -77 62 72 -112 15 -226 -84
4892 -84 95 179 -36 25 38 136 93 -28 179 80 112 56 71 40 83 -40 149 186 -190 -68 30 7 97 -68 -69 -129
4918 -129 -122 9 -73 -46 108 107 -88 235 -122 175 -247 -6 57 45 -112 -73 -67 -40 35 -242 99 7 -77 -212 -12
4943 -12 -190 -26 72 -71 -195 -48 -42 35 -105 -87 -177 176 132 39 -282 67 174 -73 -53 231 88 -88 60
4966 60 86 50 178 166 157 -74 58 0 1 66 102 -35 64 43 112 -74 13 131 -111 -10 -242 92 58 265 25
4991 25 118 21 -90 -44 195 -98 -145 -202 -195 121 99 -322 153 -247 -206 84 81 54 -285 91 -125 -35 -182 -81 -69
5016 -69 -133 162 -86 112 -61 -85 190 -1 -95 -77 -97 69 94 -114 60 63 -105 -39 -30 37 49 241 -117 83 -11
5041 -11 150 81 -4 114 0 116 41 108 100 -67 79 -157 210 -29 23 49 124 4 -132 107 -13 32 -9 135
5065 135 -107 -86 -65 70 69 -60 -55 -68 -81 -26 74 -46 -59 -195 -70 21 -128 -17 19 10 -136 -147 35 -3 149
5090 149 124 -24 -234 -86 94 -112 129 55 -120 -140 138 72 8 -154 14 168 145 -119 19 -35 40 133 -57
5113 -57 -11 31 43 129 153 24 -17 141 220 132 101 63 195 100 235 86 73 95 126 -5 -117 -139 -114 39 -65 -71
5139 -71 -114 127 -156 -142 120 98 -47 123 105 190 -89 -83 -30 -126 23 177 40 91 -96 -217 -166 -247 190 55
5163 55 -59 57 -19 -32 -157 -185 -288 52 -67 -38 0 -32 -69 -173 171 121 1 45 -156 43 166 -109 -120 -3
5187 -3 3 257 104 -66 -57 119 243 52 147 11 54 70 94 232 67 164 27 139 -60 -14 152 10 165 98
5211 98 48 185 96 12 70 -115 -52 -26 57 56 -98 -55 0 -63 -50 -101 -67 205 -62 -207 -77 -131 -119 42 -65 48
5237 48 15 70 1 -42 -171 163 78 -63 53 113 -147 9 282 -106 19 -116 82 -152 -1 -201 -62 -134 53
5260 53 93 -192 46 -107 -5 328 -9 18 -211 -4 -44 152 29 126 151 -8 423 -30 56 -30 110 11 197
5283 197 -28 -69 -64 -33 98 -105 -85 -81 167 118 -16 121 70 4 55 -19 -225 7 111 -56 -149 -140 -72 -103 -31 -74
5309 -74 -57 -98 -42 73 14 -146 -172 -190 87 15 -88 95 -33 -85 -42 45 -154 -280 120 97 -120 -59 -131 -8 -24
5334 -24 -35 -59 -214 140 -16 63 -4 53 74 16 -6 -20 175 -47 117 259 -47 48 93 12 51 -155 52 86 126
5359 126 85 -9 11 64 21 179 -120 44 -30 -72 115 -28 -97 -27 -64 -20 22 -133 -47 -105 103 3 -72 34 -184
5384 -184 111 37 -4 -243 -178 -83 77 -3 -57 63 -67 4 -96 128 -264 -14 2 -199 89 -134 98 83 67
5407 67 90 -22 -99 -1 101 74 49 49 39 106 57 97 -92 90 4 42 179 27 101 68 317 -3 156 -91 -12 162
5433 162 97 -23 25 3 119 132 102 -80 46 143 45 12 -111 -26 120 29 4 -24 5 123 -11 -79 -134 -49 -101 54
5459 54 -144 107 39 -213 114 -92 -105 -59 -38 -173 -107 -144 -111 -35 -53 76 -149 -111 -8 48 8 -100 -26 113 170
5484 170 46 42 117 2 205 108 214 -15 88 12 130 8 18 64 -46 35 161 33 -88 -15 -75 -88 137 -249
5508 -249 71 -48 54 -51 49 65 -88 112 -248 -192 -169 57 -2 58 -242 -187 -44 -31 -101 -55 -112 1 4 198
5532 198 -97 -10 -90 -108 -126 -176 -101 131 -140 -156 149 -80 -28 -137 51 -201 210 -20 -20 288 -55 146 -31
5555 -31 28 70 90 188 -38 151 -43 131 12 116 25 152 92 78 137 -87 -124 195 179 -69 111 -60 279 -97
5579 -97 60 -89 -20 131 99 84 -196 -81 -23 68 -50 -156 -76 -86 149 74 -125 -173 -16 -41 11 55 -90 -30 0
5604 0 58 9 -30 59 20 64 -129 -185 -68 73 -136 -168 -44 -222 3 14 -4 15 129 -17 7 -206 -54 153 -26
5629 -26 102 30 -93 28 -175 -139 -93 -1 -96 -148 89 34 99 22 -96 -14 68 102 -46 19 -78 85 178 96 117 -13
5655 -13 211 65 128 9 48 182 113 -127 -258 2 -30 28 1 -55 162 -58 -118 -44 -141 -39 5 -49 163 -66
5679 -66 -140 -206 -43 -75 93 -166 -13 -49 -139 -111 -141 47 -95 8 -84 60 -14 5 28 -31 -113 -195 -72 11 -36 -71
5705 -71 14 90 -48 31 66 -5 -36 25 160 -74 173 119 -107 -1 89 164 112 49 192 67 36 103 119 70 25 136
5731 136 44 38 -174 83 -68 26 158 -124 1 90 -70 -55 -112 -2 20 35 57 42 104 -59 146 92 -29 -203
5755 -203 -152 54 -163 -18 -147 124 39 -115 -193 -62 42 -138 64 -125 26 -20 -83 -122 -44 24 46 -15 -89 189
5779 189 103 -193 62 46 166 -178 33 108 -70 -267 57 -12 -18 291 -17 59 21 283 71 -145 -79 186 170
5802 170 59 54 -71 29 15 -19 37 33 138 -206 186 -108 -25 37 -151 -4 -52 -50 -160 76 -98 -123 -15 -115
5826 -115 55 -52 -10 -88 15 -22 48 -81 -94 17 -53 -1 44 169 32 -60 -76 70 -26 -78 26 -208 120 -188
5850 -188 52 -203 173 297 -113 107 -154 21 -44 12 155 -111 5 -14 143 -39 -142 197 116 -134 13
5871 13 24 151 40 47 16 -62 110 -47 127 193 -246 114 -52 98 -58 -181 12 59 81 -154 152 -148 -24
5894 -24 -2 30 -135 -84 -48 -205 69 -20 115 -116 151 4 51 -7 -12 5 -48 -216 -115 -49 -152 50 59 -51 -42 -150
5920 -150 -73 -178 -25 7 95 37 -185 160 -142 57 -146 78 71 173 49 -29 45 102 -11 -166 147 -13 -48
5943 -48 67 239 -38 44 53 119 -84 23 13 21 58 -154 45 291 24 82 140 19 68 -37 42 -229 140 239 -98
5968 -98 -205 -132 -88 -136 -36 -227 73 0 -86 51 -149 -70 -213 64 -124 4 -36 -75 -217 -65 87 -53 104
5991 104 -92 151 67 -150 -32 -7 31 3 23 160 23 36 13 0 129 43 -135 104 -1 69 -87 60 227
6014 227 141 246 -7 -48 103 -31 96 15 84 -8 192 10 33 -6 137 48 44 269 -21 -29 4 -63 -58 23 119 82
6040 82 -113 -43 -72 -70 73 173 67 -101 186 111 68 -131 -69 -124 3 -53 -91 54 -66 -132 29 -88 78 -63
6064 -63 -42 19 -185 211 91 -8 -98 186 -101 165 -116 185 -13 57 13 -261 55 -91 -132 7 -171 9 -32
6087 -32 273 -83 -1 41 222 -203 79 49 17 105 70 251 -66 78 33 147 -31 -50 25 95 10 49 121 35 8
6112 8 -185 -182 40 -307 76 -63 221 -136 -31 36 -132 87 -94 103 27 -53 -117 195 -99 208 -110 -244 -13
6135 -13 -61 -112 -40 -66 81 -198 -121 -168 217 34 20 -55 103 49 -74 -120 -147 -77 127 -165 -79 68 57 123 246
6160 246 97 -106 36 205 41 227 -140 -17 212 121 263 -5 38 -212 -9 -202 -55 227 -118 86 51
6181 51 173 86 -2 119 28 147 -59 72 -82 -93 19 98 -115 -7 -17 92 -112 -67 -64 -75 68 -106 115 9
6205 9 172 -206 -161 -64 2 -113 -83 -60 -121 -65 -45 -1 87 -38 6 174 -17 -112 -151 -15 -52 -125 25 142 -26 175
6231 175 49 -142 -181 -10 59 67 -147 100 -20 43 -239 -168 42 17 0 11 138 -38 234 -102 111 115 57 -31
6255 -31 69 159 -40 53 58 74 -97 -65 134 36 47 -175 -222 -101 -39 -40 -141 102 -33 -27 -180 -30 -5 13 -212 -79
6281 -79 -175 31 22 22 -117 -29 9 -34 18 -181 8 117 36 220 -182 -28 85 -243 196 73 16 90 -10 97
6305 97 200 -113 142 179 42 -99 56 161 -43 53 -5 207 -96 180 109 -29 -80 -69 -13 -89 152 146 -121 178
6329 178 25 90 116 187 97 133 -115 31 80 148 -8 -48 -112 -182 73 -6 165 -22 4 150 -176 -130 -208 -232 -86
6354 -86 -128 67 39 103 -6 -24 122 -118 59 -23 -28 8 -22 -98 -98 -51 -41 54 -71 28 -144 -59 -76 98 -83 48
6380 48 121 111 177 -193 135 130 159 53 111 185 -84 188 -78 61 80 -33 45 -119 -32 2 -24 21 88 -56 86
6405 86 68 167 93 -180 -72 -143 -52 -10 45 1 -195 149 20 -124 -280 -170 64 -160 -137 -191 -138 -50 -57 -47 -135 -74
6431 -74 -109 -142 -82 -171 -167 139 -183 2 43 -126 -160 -230 -53 -168 84 84 111 -151 54 77 97 42 -95 212 65
6456 65 -52 138 -23 -35 -23 -39 -76 112 -42 12 -154 94 41 -11 64 61 35 -123 201 173 30 -65 -72 -30 82 70
6482 70 173 -26 -5 22 -55 74 45 -153 39 34 -34 21 -34 6 72 41 -216 204 57 134 159 -8 9 -146 45
6507 45 50 47 77 64 156 119 32 -186 -42 71 -78 -97 -124 168 -76 10 -81 128 -139 71 166 44 47 -8 -115 -139
6533 -139 127 160 225 110 163 -159 208 46 2 348 10 4 31 218 -33 103 -24 -82 76 -38 -83 -15 -33 -39
6557 -39 160 -241 34 14 126 26 -60 57 -136 -92 22 -119 64 4 -137 -12 191 30 -10 -61 -94 89 37
6580 37 94 -184 88 -100 -90 14 -196 69 -112 10 14 -129 -82 168 55 -65 -25 -112 -80 -6 -225 -143 -334 160
6604 160 109 -16 23 205 -108 -23 136 -156 -91 107 -29 119 97 21 -144 78 -9 -94 74 -32 -130 -58 -180
6627 -180 -66 112 74 41 -163 56 -324 140 -82 -85 -67 -42 -109 -149 153 70 -18 36 -242 -127 -183 88 -17 0
6651 0 -181 83 5 -92 -8 126 43 27 85 -86 107 -33 -175 -140 77 -193 4 35 69 -106 -96 88 110 23 130
6676 130 16 275 -49 116 -100 -39 -2 -64 -36 -1 201 -70 106 129 60 165 0 0 -220 43 95 102 127 -55
6700 -55 54 66 1 276 34 140 86 -190 -46 -60 -38 65 -47 71 54 -112 -177 -10 -126 -120 131 -124 -75 -371
6724 -371 -13 71 -21 13 10 -24 -145 18 107 -8 -19 46 22 -68 -60 57 -143 13 65 -246 -60 -170 -278 -92 21
6749 21 126 -105 108 -42 51 134 -175 19 13 111 -42 31 171 -205 -21 -83 87 -106 46 160 86 -175 81
6772 81 158 67 -52 189 174 42 -27 90 -18 91 40 -76 108 57 -273 50 146 89 -74 -36 6 17 -72 -99 -48
6797 -48 -1 88 -76 -171 -60 -3 -23 15 -34 125 -79 -48 -18 -61 181 22 65 79 -15 70 -102 22 74 73 40 236
6823 236 139 139 -9 -175 -50 4 -35 -90 -168 -56 232 95 177 -13 157 48 -135 -234 -77 45 118 152 138 -23
6847 -23 100 104 67 45 -88 -8 90 -49 312 196 139 -64 -8 85 23 101 155 71 -64 -32 -17 239 -196 -41 -95 84
6873 84 151 -173 -30 111 -65 68 75 145 -89 -148 -200 -3 -72 34 -114 -4 24 -33 15 22 56 -43 58 -41 -116 -223
6899 -223 -160 -52 -46 -91 218 132 167 -21 81 135 108 41 -103 -156 26 16 46 143 96 39 -75 -175 -167 14 35 -75
6925 -75 -49 154 115 157 -267 -30 -112 235 168 85 -90 35 30 -60 50 -160 21 -83 86 -156 -119 -75 -86 -4 -69
6950 -69 -83 -14 -121 7 4 -56 23 -119 52 -160 -20 -121 25 118 -47 101 27 153 -48 -74 -68 -5 -253 -147
6974 -147 60 -29 -205 39 95 163 -217 174 -121 -26 -22 -147 -34 111 103 -5 52 2 -27 121 -57 -114 161 109
6998 109 95 -47 74 -4 130 -180 338 -148 -87 -15 -61 -187 93 43 41 41 54 -52 -156 -26 -148 97 164 -101
7022 -101 -92 -37 -113 104 56 -76 -45 -36 -110 -27 -84 -26 3 -180 -74 6 115 -33 74 163 -104 -7 -46 40 -237 68
7048 68 -109 -9 61 39 5 141 -266 79 6 -26 242 12 -65 -148 -14 245 29 115 73 8 136 225 157 -56
7072 -56 136 1 37 -43 93 -199 278 143 86 133 -31 107 -73 -36 -61 -33 -22 -161 103 5 -81 153 -122 -130
7096 -130 195 -186 -103 -207 -133 -219 -48 -2 -86 91 -24 240 12 47 82 -34 -47 37 196 -6 -142 30 65
7119 65 -101 -118 -110 -46 89 -112 141 -173 -82 -8 -56 109 -91 58 33 0 149 267 83 83 68 153 90 -141 79
7144 79 -125 227 42 -33 -91 68 -100 -37 110 5 -56 129 -52 -63 -87 -64 -96 -24 -39 -112 91 13 50 -236 -26
7169 -26 29 -63 -122 -80 -189 43 -104 163 363 -141 -223 -216 100 -77 86 81 -224 135 -151 -93 -44 11 161 42
7193 42 58 -202 -34 -79 19 26 39 -97 -4 153 -66 -104 -116 198 72 40 -19 16 -72 -79 -89 -11 85 -56 98 -25
7219 -25 -26 100 -30 87 -64 12 -123 -37 17 -131 -14 -193 92 -52 86 -63 -131 9 -14 -2 -21 134 -21
7242 -21 -52 24 88 7 -171 57 34 -21 -28 -118 -45 -16 109 -17 -13 114 35 103 105 -200 151 -23 12 234 -119 43
7268 43 -116 -114 -331 146 -67 -124 -36 199 77 -32 113 -26 -103 -19 23 59 9 49 -6 -64 -174 158 188 169 -133
7293 -133 6 84 6 -33 48 92 -81 -84 88 27 82 20 -90 143 -17 -2 76 148 -125 123 -120 -58 21 80 5 -119
7319 -119 5 33 67 -5 -132 -62 124 3 -92 -115 -7 162 -169 -94 -37 22 -133 -45 129 -57 -80 -31 -145 -77
7343 -77 14 -3 288 2 41 225 98 89 -129 16 -164 -113 76 167 136 -11 75 171 3 -59 -103 99 -35 121
7367 121 -119 -2 55 -105 -123 -17 -21 -30 -62 -174 -19 27 115 -125 161 -111 65 -19 -65 28 -31 -10 -24 17 59 -9
7393 -9 -126 45 -61 -55 -201 -4 -146 112 -131 47 -145 -51 29 -76 -50 -240 -125 7 94 -53 -67 -62 68 11
7417 11 30 26 52 106 72 57 -187 -56 -12 66 131 68 157 -77 18 91 92 -161 -103 92 88 -16 -16 98 -51 -65 -37 84
7445 84 27 145 -32 8 64 -92 -48 50 19 -3 20 -41 94 -51 -170 -157 108 -16 -55 -139 134 46 135 -57 97
7470 97 196 114 -71 -42 -7 20 -2 -103 -77 76 -237 -97 -94 -38 -235 -67 -93 -53 154 -168 62 -85 221 -103
7494 -103 125 86 -86 -55 -73 151 -12 -26 -95 23 -48 -58 76 86 -26 84 204 -220 -124 82 -26 257 25
7517 25 -62 30 87 54 180 161 16 -79 -32 58 -254 21 -164 -139 -63 19 -35 38 -71 -151 23 40 205 -138 -7
7542 -7 38 -166 226 -116 -10 16 -46 -174 -120 -47 7 234 239 -135 -82 -32 38 -174 139 -334 -259 -10 84 -69 -71 -77
7568 -77 -103 198 -25 -29 16 -16 15 278 -37 -328 175 22 161 15 -27 113 -150 45 274 146 -7 -27 178
7591 178 -33 13 31 66 -28 31 -50 -20 -108 23 -9 19 -151 107 70 -90 -14 -145 -109 5 -9 -47 193 -68 -130
7616 -130 43 -207 -29 -83 54 46 -79 49 -10 11 41 -194 -29 -111 -241 12 -15 -59 -212 114 -64 -38 -204
7639 -204 20 -26 115 -71 -168 152 -57 -70 -123 20 -200 145 76 76 -53 -147 21 -14 -102 5 138 -59 91
7662 91 -77 225 177 -67 -82 262 -112 143 182 101 47 139 98 66 9 152 -12 -101 -12 65 98 -169 54 17 63
7687 63 142 -29 -33 7 19 -83 -201 147 -27 -11 -90 -50 -169 122 -91 11 -89 -21 19 -120 -93 -34 -24 -44 -120
7712 -120 -9 -218 -111 54 -4 7 149 25 -17 -44 -87 87 -86 -30 63 223 -59 107 -43 -130 68 29 -25
7735 -25 -39 37 73 29 92 -34 30 -43 -97 32 22 -69 12 132 25 -8 -61 -96 -26 -195 40 146 -86 145 253
7760 253 120 -8 34 -53 8 -95 -126 -52 53 -41 -126 83 -90 -10 -145 -230 -1 176 -107 -9 -156 104 183 141
7784 141 67 -7 83 -123 -10 22 -53 93 76 -121 281 -41 43 -12 8 119 39 -72 117 19 -1 149 73 -30
7808 -30 163 -23 -37 32 207 121 8 -126 17 180 -14 6 -40 41 -100 27 -139 38 63 54 -150 184 218 -102
7832 -102 -46 147 -21 -96 -2 143 -8 -50 -86 102 132 11 -178 -77 232 -278 11 49 -105 71 -269 -173 209
7855 209 -34 -91 6 29 96 -15 124 112 151 20 11 117 -85 140 -115 132 -258 94 88 -210 11 123 -34
7878 -34 -216 12 85 -120 33 111 19 176 -28 -102 60 122 51 -126 17 -71 122 68 90 137 -73 -181 -88 -27
7902 -27 -14 121 114 18 132 -110 -149 96 -47 36 16 190 135 82 -62 -74 195 78 102 -111 60 -14 26 -41 154
7927 154 8 -78 230 7 -58 29 205 -92 -111 -92 -7 -197 -23 -216 35 9 52 75 33 -22 29 0 138 0
7951 0 -152 -138 -75 67 -146 -28 66 65 278 -99 -102 98 -221 31 29 -64 -48 -59 -33 -24 -42 69 109 -50 64 156 13
7978 13 -21 32 -207 265 -142 -180 -88 122 230 -180 46 -25 182 -63 87 -80 -53 225 103 -92 -37 71 18
8001 18 -139 -133 37 -119 -8 63 -140 -79 -87 15 135 323 -16 -115 -36 -150 4 19 -34 -36 -6 -147 -40 19 192
8026 192 114 9 64 20 -32 13 -77 -50 -34 92 113 281 120 62 110 81 -4 83 32 -59 44 -157 404 -25 35 -20
8052 -20 39 -48 -117 16 -85 139 -10 23 32 195 105 2 81 -3 42 -105 -155 30 -13 100 84 -118 79 -161 3
8077 3 103 85 50 87 -39 -149 -27 2 -311 -241 67 -21 -42 -123 -67 -58 -149 -37 -134 -254 -10 77 -23 70 -26 121
8103 121 -32 -178 -83 115 89 18 32 -128 -16 -78 72 82 -29 375 1 152 -45 31 233 34 53 -56 87
8126 87 -150 27 -74 -54 -116 50 -30 -87 132 -80 15 -178 -97 -55 -16 35 -12 -15 220 116 -29 -31 74 -51 107
8151 107 -81 -70 -119 -271 -46 115 64 -202 -19 -144 218 -53 177 -25 -7 -8 -77 -114 -194 145 -34 8 79 175
8175 175 -2 -138 40 -111 -47 85 143 59 -32 122 159 50 45 128 -143 -17
8191a7
$$ Imaginary data points
##PAGE= N=2
##DATA TABLE= (X++(I..I)), XYDATA
0 0 0 0 0 0 0 0 0 0 0 0 0 0 0 0 -1 8 -8 8 -8 8 -16 16 -16 24 -24 32 -32 40 -48 54 -61 70 -78 88 -100 111 -126
37 -126 141 -158 175 -195 216 -240 266 -293 323 -355 394 -434 478 -526 581 -639 707 -780 865
56 865 -959 1069 -1199 1350 -1532 1757 -2043 2415 -2926 3674 -4872 7095 -12583 54857 46243
71 46243 -78060 23994 42636 -27271 -1623 31656 -15351 -6979 -8460 12023 27658 -33548
83 -33548 -34118 44798 7104 -45409 21542 11133 -37400 13364 24741 -16076 -12403 3094 5286
96 5286 22805 -12389 -17911 21474 5265 -7549 13846 393 -16365 9080 7838 5802 -4542
109 -4542 -26785 10795 23835 -24740 -16411 20408 -21657 -13961 27250 -14993 -29538 7579 3856
122 3856 -6514 2702 -21045 -3933 18628 -12872 -147 12095 -21856 -1036 36036 -13754
134 -13754 -14896 23073 -6646 -936 27628 -8094 -20148 24616 8712 -8134 9857 -4184
146 -4184 -5933 11689 6611 -4208 -1307 -11779 8403 18979 -17048 -8860 12975 -5084 -4193
159 -4193 18250 -8902 -16070 12776 9809 -739 -4642 -2600 4548 8821 -1117 3074 -626 -10313
173 -10313 13595 11673 -12424 -5700 8314 -4834 3918 7256 -17242 -5443 8744 -1215 -5129
186 -5129 -2744 -12604 -37 7502 -8503 -4335 -6405 -7363 6776 5764 -15267 -4812 6027 -4156
200 -4156 5880 1775 -11644 -1442 12116 -155 -575 1151 -8190 6823 11690 -2651 -6203 2202
214 2202 1947 6193 3711 -6752 204 199 2972 8488 -2123 -13363 6045 12442 -6002 -499 1567
229 1567 -3474 2005 10158 -54 -6959 -949 5604 11171 -3352 -5989 4406 4399 -157 7409 394
244 394 -11689 5892 9754 -1126 -4759 -2364 -1407 4769 2973 -7010 -3211 -3662 1016 4243 -3686
259 -3686 -10590 -2489 3485 -1266 205 -8184 -6649 3661 3369 -4256 -2946 -3458 -4077 8318 1586
274 1586 -7094 -3973 2626 3515 2710 -2142 -6198 2528 2596 3641 733 -6291 -3014 7369 5062 -4723
290 -4723 -828 -2619 1701 6526 1691 -5418 -2388 3828 3756 4824 -4515 -3252 3796 5556 3099 -462
306 -462 -2642 -632 8627 3206 -1044 -1763 -541 4818 6478 -17 -6209 1422 2728 3850 1230 -4437
322 -4437 -4057 1899 4737 -1064 -3133 -6852 693 4550 -674 -4933 -4630 -1621 936 3722 -5230 -5947
338 -5947 -1207 1840 2638 -2330 -5704 -4063 4464 1818 -1474 -4263 -3495 1461 3362 1442 -4867 -2901
354 -2901 -649 5516 2206 -5543 -3317 1750 3493 338 533 -4457 -1413 4295 4463 -727 -5502 282
370 282 4775 4883 -1568 -1198 -267 1621 6095 2921 -2337 -3766 4635 5297 2776 -1883 -2618 2963 4218
387 4218 3078 -1031 -1746 -1969 4866 4196 -2803 -3393 -1313 3021 2886 269 -6182 -2190 3119 1710
403 1710 -479 -4142 -3243 -1348 4382 -42 -4121 -4470 -1059 4148 885 -4305 -5863 1672 1564 -354
419 -354 -630 -3464 -3820 766 6205 -2434 -7057 -2131 4652 1514 -2747 -1758 -2183 498 1068 3496 -1678
436 -1678 -6098 -758 7921 3004 -8076 -324 5216 515 -500 5168 -1811 -5471 6027 7333 -985
451 -985 -5619 1544 5805 4038 -2146 -972 3348 -1671 2394 6910 -1123 -9002 4405 9477 -3463
466 -3463 -3912 1209 771 -714 4118 -875 -4236 -1462 1780 4291 -1233 -6140 -2666 5856 291 -4022
482 -4022 -705 -2259 -2086 2758 2815 -6798 -3506 1558 1161 810 -2980 -5542 -823 5585 -2342 -3387
498 -3387 -651 -2239 -774 4157 -330 -7557 -227 2935 1744 -370 -3657 -3089 3663 4113 -3583 205
514 205 108 -2220 3683 6197 -3888 -5380 5693 4528 337 -1173 137 597 3633 2551 213 668
530 668 -3581 2475 8353 1 -8343 2726 7296 -2461 -181 3040 -2656 -3531 6917 3346 -5988
545 -5988 -3078 2544 3983 -586 -3061 -2362 1791 -573 294 2620 -5257 -5014 4679 4844 -6828 -3552
561 -3552 1731 -1432 616 1070 -3659 -4969 2340 1277 -526 -2546 -4341 30 3342 296 -4649
576 -4649 -1343 -997 1373 2627 -1710 -4047 -585 3505 615 229 -2529 -1883 2380 4152 -12 -3532
592 -3532 432 1716 3186 1180 -1056 -1951 1656 4086 1264 -28 -2772 734 4799 3719 -3066
607 -3066 -1714 3515 1023 1796 1738 -1657 -3346 3859 4779 -1281 -3198 -923 3596 1578 -496 -1375
623 -1375 -562 -1425 1455 4329 -3774 -5213 1728 4250 -2347 -2650 -904 -1909 791 1347 -243 -4814
639 -4814 -2230 1574 2670 -2400 -4509 -384 577 1175 -723 -1936 -3468 216 2560 152 -2099 -3776
655 -3776 1023 2761 1000 -2639 -1791 299 1856 2486 -1197 -1596 -1053 2771 3174 115 -3184 -160
671 -160 4133 1664 774 -939 -852 977 4238 1940 -2453 -850 1427 4122 1376 -900 -1251 1135
687 1135 2519 2114 358 -3443 352 2941 2162 -1090 -1937 -985 1253 3123 -1009 -2321 -1934 1231
703 1231 1759 292 -2578 -2990 864 1238 714 -3026 -2874 -304 1847 234 -2209 -2379 -2500 2129 1552
720 1552 -1868 -3563 -815 1199 552 -218 -3141 -1519 232 2365 171 -2717 -2174 1078 3096 -421
736 -421 -973 -1718 358 2352 2264 -821 -2715 1136 2432 2636 -760 -1260 -95 2366 2822 59 -1018
753 -1018 -1221 2992 2773 801 -1323 -856 1872 2639 1909 -2034 -790 702 2898 1550 -1188 -1566 -420
770 -420 3134 947 -570 -2772 -175 1915 1484 -613 -2869 -979 247 2290 -862 -2552 -1895 471
786 471 1502 -704 -1851 -3291 115 1345 561 -2501 -2850 -115 938 1080 -2350 -1911 -1236 1134 1505
803 1505 -807 -2618 -1698 2136 1383 -184 -2300 -983 1208 1975 1072 -1928 -1071 256 3338 1265
819 1265 -1347 -1536 934 3039 1006 84 -1532 537 2040 2461 206 -1829 -195 2061 3478 -599
835 -599 -1212 62 1678 1825 874 -665 -2226 1523 2369 1062 -1885 -1712 614 1933 1194 -2214 -1116
852 -1116 -672 1106 1253 -718 -3179 -1266 2064 246 -751 -2457 -1379 559 1620 -807 -2930 -1238
868 -1238 -547 1434 132 -2015 -3171 321 1844 -91 -1246 -2534 152 954 1297 -1104 -1920 -273
884 -273 1166 2169 -141 -1856 -1608 2855 1906 -889 -751 -165 898 1570 2178 -1855 -963 1480 2571
901 2571 1882 -929 -1490 896 3842 78 -283 379 -872 999 3598 496 -3871 1073 2292 1315
917 1315 159 -1163 -1161 1023 1964 -671 -4 -1995 -549 2977 979 -3300 -1916 1830 -308 482 -463
934 -463 -2292 -1542 1641 1176 -1971 -2017 -2039 1133 1115 -1392 -3022 -879 728 -390 446 -1846 -2291 -250
952 -250 2837 -184 -2646 -787 -49 1214 950 -512 -2828 985 2084 200 580 -1376 -1152 2123
968 2123 3029 -1614 -909 617 353 2253 1240 -1650 -914 3035 720 1077 810 -2240 474 3746 1168
985 1168 -2272 668 202 1085 2342 -487 -1744 60 2004 683 840 -2324 -1355 2334 1682 -1093
1001 -1093 -1500 176 -1150 1577 729 -1975 -2280 309 1981 -657 -1482 -2064 65 317 557 -1413 -2343
1018 -2343 -481 101 1575 -975 -2653 -1488 1763 471 -1656 -517 -1735 36 1705 686 -2817
1033 -2817 -843 793 818 1511 -1496 -1827 776 2240 -86 -97 -497 -993 2373 2019 -751 -1376 970
1050 970 995 1840 788 -1813 263 1772 1820 191 -1 -1217 1041 2709 363 -577 -865 627 1442
1067 1442 1592 -1352 -1349 465 1081 1269 -1016 -1464 -948 1501 847 -476 -2014 -1156 1042 693 -423 -1826
1085 -1826 -1129 -56 1035 -169 -2234 -1275 -761 1227 180 -1501 -2112 -222 971 8 -551 -2360
1101 -2360 -595 1150 1275 -1399 -1396 -747 393 2005 -701 -1237 -968 1030 1236 905 -1144 -1295 1548
1118 1548 1167 1093 -791 -414 334 2147 1428 -806 -396 -30 2142 1915 64 -1168 66 1603 1169
1135 1169 1065 -1262 -223 1262 1903 189 -864 -735 264 2035 155 -975 -1377 71 959 860 -1005
1152 -1005 -1812 260 589 1042 -1092 -1534 -1074 590 863 -1101 -1291 -1767 589 559 -486 -1679 -1486 306
1170 306 504 449 -2074 -1283 20 938 181 -1114 -1736 -355 1620 286 -416 -1554 -504 867 1340
1187 1340 2 -1380 54 563 2137 273 -1011 -549 1003 1619 337 -279 -1135 1272 1833 1237 -563
1204 -563 -591 696 1614 1972 -996 -423 277 1483 1525 229 -1051 -578 1762 891 333 -1276 -751 901
1222 901 1336 273 -1540 -778 -189 1530 289 -1172 -1347 -137 1061 25 -651 -2263 -393 497 363
1239 363 -898 -1938 -885 246 1095 -1191 -1144 -1229 153 1086 -288 -1461 -1260 594 469 565 -1197 -1479
1257 -1479 407 1088 545 -1043 -750 -724 1719 1009 -477 -760 -294 1369 1112 502 -1541 136 1015 1256
1275 1256 615 -809 -347 865 2005 514 -230 -801 736 1883 817 -202 -873 547 975 1358 -315
1292 -315 -1172 -23 872 1428 -364 -875 -851 1151 787 -203 -1082 -1218 493 886 252 -1809 -841 -46 742
1311 742 290 -1270 -1323 -391 1065 -287 -741 -1635 -848 592 438 -779 -1776 -256 73 1009 -189 -1272
1329 -1272 -866 444 1177 -333 -572 -1360 392 1200 553 -943 -852 722 904 1220 -526 -810 15 1528
1347 1528 1186 -418 -257 -451 1518 1366 286 -859 143 1201 966 1000 -701 -398 655 1628 465
1364 465 -525 -325 -58 1621 643 -704 -1235 345 730 474 -29 -1520 -517 684 1056 -1079 -1025 -581
1382 -581 -115 812 -211 -1505 -1392 608 38 45 -921 -1910 -85 723 109 -1560 -599 -821 295 914 -929
1401 -929 -1806 -233 1011 -273 230 -1339 -903 946 1104 -418 -1092 -104 -240 1613 392 -1281 -566
1418 -566 831 1326 440 240 -1067 444 1647 827 -328 -551 392 803 1887 -295 -872 114 1500
1435 1500 1027 116 -99 -690 1135 1270 438 -1100 -314 392 736 987 -1095 -1283 150 1247 -287 -453
1453 -453 -966 -679 1267 534 -769 -1467 -4 -127 603 -154 -1988 -718 542 501 -748 -490 -1563 -134
1471 -134 1297 -347 -1161 -866 -56 218 960 -1098 -1379 277 547 453 -482 -838 -702 1315 890 -389
1489 -389 -478 -535 675 1179 597 -875 92 775 1225 764 -769 -311 652 1580 402 -127 -573 559 1384
1508 1384 717 274 -748 212 1076 1222 -357 -721 132 386 1289 -226 -907 -500 904 501 395 -705
1526 -705 -1335 540 599 -17 -923 -809 -778 684 741 -1375 -911 -407 270 302 -223 -1618 -784 733 64 -284
1546 -284 -1285 -940 46 973 -387 -1119 -625 -420 861 219 -906 -931 361 479 530 -317 -1292 335 709
1565 709 946 -391 -572 -326 1024 1356 -203 -411 -280 790 1091 773 -584 -103 905 928 922 -650 -203
1584 -203 611 1231 566 -256 -604 -63 1324 598 -202 -793 198 676 839 -142 -1283 18 226 720 -106
1603 -106 -915 -889 366 729 -358 -625 -1103 -159 462 383 -1147 -1154 -176 121 478 -1138 -1204 -463 581 411
1623 411 -423 -1001 -770 525 400 -92 -824 -704 246 812 291 -1012 -363 16 1018 440 -582 -733 243
1642 243 1153 311 92 -714 206 843 938 -107 -442 193 826 1446 -33 -419 -168 789 1096 434 -267 -816
1662 -816 810 686 447 -534 -565 457 861 641 -719 -348 -387 931 541 -436 -737 -420 630 272 111
1681 111 -1166 -588 260 322 -136 -1094 -621 -314 779 -503 -738 -1080 -299 602 123 -701 -1238 68 134
1700 134 449 -769 -1095 -303 317 603 -562 -595 -723 477 633 -2 -595 -567 501 839 623 -795 -323
1719 -323 506 900 757 -454 -508 23 1226 534 33 -476 273 1241 868 237 -664 147 690 1336 206
1738 206 -412 -48 353 1128 63 -440 -850 348 780 309 -397 -935 158 348 509 -875 -725 -219 390
1757 390 261 -642 -991 -773 343 107 -458 -973 -724 300 296 -145 -1209 -667 -87 484 -107 -905 -732 -251
1777 -251 866 76 -491 -969 37 666 254 -202 -1093 -18 553 857 -132 -498 -124 324 1119 -32 -382
1796 -382 -202 731 737 599 -195 -417 835 958 664 -260 54 -82 856 909 -250 -360 -37 919 654 418
1816 418 -864 -176 775 618 202 -655 -458 91 886 -4 -883 -451 71 511 -32 -336 -1156 -137 334
1835 334 264 -587 -872 -192 -133 750 -835 -1106 -507 321 113 -251 -643 -1010 392 275 -193 -943 -549 -102
1855 -102 511 535 -897 -516 3 657 409 -170 -529 -284 1260 353 -236 -494 107 303 792 90 -879 142
1875 142 716 1162 287 -203 -262 587 1232 124 -173 -251 583 604 687 -178 -692 506 657 559 -81 -359 -433
1896 -433 826 458 -424 -561 -437 147 456 374 -1239 -580 131 168 63 -697 -619 -338 757 -315 -568 -724
1916 -724 -214 354 198 -356 -1364 -59 197 354 -329 -863 -520 283 613 -404 -618 -451 189 482 328
1935 328 -557 -685 470 390 411 -303 -270 20 1044 704 -504 40 -52 936 718 297 -473 83 965 748
1955 748 337 -429 4 246 1136 54 -465 4 178 927 326 -35 -646 330 443 280 -209 -546 -150 377
1975 377 646 -513 -703 -468 283 568 -379 -679 -796 478 174 -401 -764 -814 -73 126 69 -962 -449 -212
1995 -212 360 172 -672 -686 -471 524 111 -225 -904 -243 434 263 -210 -940 45 285 685 73 -474 -354
2015 -354 331 816 183 -13 -437 439 749 564 -128 -246 545 547 797 -123 -191 147 851 620 265 -28 -306
2036 -306 851 545 239 -388 96 566 459 561 -582 -275 -31 687 133 -398 -522 -177 668 81 -178
2055 -178 -925 -54 401 75 -280 -924 -451 -15 467 -617 -674 -545 157 78 -311 -708 -951 122 151 85 -553
2076 -553 -745 -85 413 243 -564 -352 -226 340 146 -166 -530 -143 565 84 250 -916 -51 581 692 205
2096 205 -347 180 73 1219 249 -78 -78 225 794 529 184 -403 402 606 765 -69 -282 -112 550 961
2116 961 -258 -81 -283 374 427 133 -474 -518 407 342 436 -767 -395 81 477 -80 -675 -584 -512 340 -271
2137 -271 -327 -710 -163 220 -36 4 -953 -188 -55 166 -229 -923 -614 -79 499 -225 -394 -761 117 451 129
2158 129 -266 -436 34 83 481 -133 -322 48 176 623 -171 -129 -86 830 331 165 -218 -88 642 659 371
2179 371 -340 180 257 860 453 -88 -266 295 958 302 80 -469 145 486 538 -36 -509 127 220 612 -95
2200 -95 -348 -408 147 326 -254 -494 -630 62 131 -78 -719 -802 -46 -3 87 -742 -541 -179 486 163 -636 -346
2222 -346 -467 344 275 -105 -959 -80 179 147 24 -642 -275 146 765 -90 -350 -236 -51 755 93 -44 -639
2243 -639 205 639 424 119 -336 150 308 802 -71 -215 -113 475 651 186 -113 -134 808 427 329 -139 -81
2264 -81 390 569 527 -374 -122 -103 381 370 -280 -434 -226 673 48 -82 -632 -138 143 478 -269 -692 -390
2285 -390 -155 376 -353 -564 -666 138 127 -381 -528 -801 -97 48 124 -621 -663 -151 226 465 -331 -290 -428
2306 -428 526 137 -117 -300 -242 265 339 93 -671 -97 323 548 205 -89 -109 232 945 268 7 -47 60
2327 60 615 294 78 -438 472 431 628 117 -226 49 338 633 -16 -75 -294 308 661 -6 -193 -324 152
2348 152 221 309 -512 -355 -189 427 103 -517 -285 -362 471 86 -108 -675 -453 187 -88 -114 -384 -497 -7
2369 -7 181 -290 -533 -427 36 363 44 -342 -795 165 340 -274 -137 -472 -21 54 561 -253 -406 25 384
2390 384 689 92 -266 -178 731 623 344 -113 -152 506 735 404 -153 224 130 647 607 -319 -197 -29 621
2411 621 278 271 -284 19 367 409 86 -466 16 170 559 49 -287 -379 -165 425 -33 -158 -546 233 188 72
2433 72 -587 -675 134 -70 93 -197 -447 -615 19 75 -349 -456 -800 15 191 84 -899 -262 139 155 6
2454 6 -509 -291 -127 629 -98 -255 -236 45 438 152 55 -424 255 320 310 -99 -551 14 305 679 -12 -32
2476 -32 -28 338 647 113 35 -174 408 373 275 -328 -104 139 428 506 -273 -160 9 539 229 168 -242 -370 374
2499 374 146 118 -648 -201 158 327 -232 -540 -175 -173 423 -119 -492 -578 -230 120 -74 -167 -680 -116 65 -167
2521 -167 -393 -642 -224 96 467 -294 -401 -541 182 339 -105 -446 -329 47 -63 225 -301 -294 103 594 362
2542 362 -248 -197 18 672 270 72 -49 62 474 210 239 -118 136 491 422 157 -64 -185 161 698 184
2563 184 -92 -113 196 528 130 -109 -338 111 312 376 -129 -380 -50 289 219 -186 -4 -500 255 23 -201
2584 -201 -418 -279 140 117 -57 -824 -228 -158 337 56 -446 -423 -115 293 -3 -125 -687 -66 161 52 -191
2605 -191 -377 2 148 446 -129 -228 -118 393 281 36 77 -253 498 479 -66 -170 -187 152 345 432 -226 73
2627 73 93 344 432 36 -143 -24 701 319 78 -320 44 339 506 140 -171 103 58 679 56 -316 -278 158
2649 158 481 85 -226 -253 249 194 68 -113 -501 -65 93 150 -647 -306 -466 -30 146 -490 -245 -551 42
2670 42 -79 29 -509 -359 93 99 -52 -228 -266 -232 418 37 -320 -296 -171 493 141 -50 -312 -23 281 380
2692 380 135 -352 -108 468 697 237 -147 -185 489 577 53 95 -122 257 506 611 15 -17 412 476 485 95
2714 95 -24 -29 386 197 -103 -103 -280 341 265 -92 -297 -81 -92 554 167 -584 -187 57 138 35 -291 -530 -176
2737 -176 153 -5 -428 -527 -8 -50 138 -234 -412 -237 7 425 -329 -331 -462 82 16 -69 -196 -586 144 133
2759 133 93 -255 -225 -23 202 307 -484 140 149 390 225 -8 -281 126 454 368 164 -187 -8 349 510 -24
2781 -24 -123 56 157 680 432 134 -146 253 446 79 18 -297 296 294 311 -204 -324 -218 248 130 -248 -158
2803 -158 -266 310 89 -167 -184 -282 252 191 -22 -564 -295 -364 50 9 -469 -418 -353 204 -162 -173 -565 -78 100
2826 100 111 -266 -734 -50 108 305 51 -248 -347 -113 491 -7 -274 -328 115 227 213 -355 -27 180 249 476
2848 476 -128 -7 63 492 161 14 122 -29 508 309 212 -174 94 359 265 301 -61 -139 105 380 161 69
2870 69 -55 75 332 95 -284 -557 229 71 -8 -116 -628 81 44 302 -192 -297 -262 47 116 -19 -376 -593
2892 -593 26 107 293 -351 -280 -63 64 -40 -426 -160 -419 419 150 -7 -227 -151 189 -123 151 -346 -134
2913 -134 22 337 63 -274 187 39 645 123 2 -141 243 292 139 171 -255 48 161 407 56 -153 197
2934 197 210 558 -10 -71 -56 331 454 -4 -17 -218 257 23 231 -251 -374 -35 225 53 -332 -116 -237
2955 -237 171 -8 -167 -170 -54 84 102 -131 -588 -147 117 -87 -99 -242 -257 -165 370 -291 -70 -482 -68 47
2977 47 43 -187 -286 210 13 213 -296 -198 177 464 223 -178 -311 -44 236 117 117 -133 29 284 342 238 -112
3000 -112 143 150 495 120 -33 63 225 506 17 101 -201 96 265 165 166 -237 -93 40 295 -101 -30 -220
3022 -220 157 455 57 -13 -249 212 177 163 -320 -168 -16 124 11 -535 -151 -232 195 67 -229 -243 -419 180
3044 180 -143 -267 -464 -408 -13 17 -97 -265 -163 -118 242 -44 -55 -266 -20 314 183 -242 -283 78 242 59
3066 59 -95 -179 221 96 448 -45 -17 -44 411 462 60 32 61 359 267 284 -40 -36 285 421 136 -199 20 147
3090 147 424 297 69 -362 -133 238 -38 -21 -366 180 301 47 68 -451 -115 -94 236 -129 -56 -256 -4
3111 -4 208 34 -239 -418 36 -27 57 -356 -238 18 -118 175 -292 -338 -253 80 -52 -191 -281 -405 275 214 124
3134 124 -188 -112 39 149 170 12 167 -14 339 -4 23 -146 104 460 -22 291 -115 141 483 424 -103
3155 -103 -106 15 364 552 -52 101 -109 500 416 120 -353 -211 325 194 126 -365 48 165 256 160 -90 -235
3177 -235 -192 298 -137 -61 -402 -71 150 -71 -70 -416 -16 -211 239 -89 -268 -441 -302 162 -95 -302 -336 62
3199 62 -106 121 -197 -446 -40 92 55 -289 -126 -206 -12 99 -270 -181 6 196 202 75 -235 -225 113 2
3221 2 323 41 41 132 462 491 -125 31 43 444 121 -112 -254 55 204 158 -56 -124 54 25 343 95 -295
3244 -295 14 233 272 -27 -211 -326 50 125 -6 -253 -197 -27 207 311 -126 -237 -187 120 200 -158 -393 -328
3266 -328 -47 159 37 -414 -146 126 110 22 -270 -225 -199 263 -111 -75 -294 -64 168 -122 47 -196 4 188
3288 188 81 -56 -170 73 -6 371 -49 -39 -107 193 265 116 -12 -142 278 256 341 -39 -245 185 475 185
3310 185 -83 50 -60 212 131 199 174 -149 295 -22 228 -289 -8 -27 154 140 -351 -5 87 428 39 -96
3332 -96 -462 177 104 -179 -263 -156 26 -25 -123 -191 -184 -195 -255 -123 -198 -85 -441 -22 100 -113 -161 -137 100 -50
3356 -50 261 -521 -93 -126 243 161 -312 -160 -75 272 -2 83 -140 4 392 82 185 -186 126 -36 529 213
3378 213 -119 -49 138 443 262 82 79 171 178 279 -199 -35 151 201 166 -81 7 35 202 269 -24 -55 -206 33
3402 33 -153 -51 -215 -113 159 32 -48 -140 -298 -148 174 -48 -328 -216 -146 -203 -80 -79 -333 -84 -46 61 -218
3425 -218 -196 25 -148 95 -123 -68 -39 -44 178 102 -174 -74 225 12 300 -2 -111 292 175 118 -130 54
3447 54 -38 54 387 -132 188 241 324 276 147 -23 112 214 327 259 -203 -25 25 202 255 -100 112 37 177
3470 177 -88 42 -275 23 207 -14 -129 -207 -21 9 380 -225 -179 37 324 144 -44 -265 -150 -127 -7
3491 -7 42 -269 27 -134 24 89 -272 -146 -38 39 7 -62 -59 -261 -24 -110 39 -229 -164 133 16 98 -222 73
3515 73 175 418 -61 -11 -61 217 206 143 109 -151 262 267 174 -132 -11 282 241 116 27 234 -73 316 99 25
3539 25 187 -23 476 241 184 -289 -202 -12 337 162 -76 3 -112 360 -24 -148 -180 187 126 86 -24 -292
3561 -292 -61 -178 111 -113 -102 -50 -112 -32 -296 -224 -253 12 -63 -5 -233 -157 163 85 27 -174 -135 -145 271 143
3585 143 -120 -170 -13 245 134 -71 -68 -221 251 239 91 -98 -151 100 234 -27 55 89 -3 296 32 167 56
3608 56 198 292 96 -36 -18 41 99 162 -152 -112 107 322 166 14 -100 -225 229 98 123 -68 -381 27 102
3631 102 -40 -353 -84 -231 105 -136 -140 1 -20 143 -186 -45 -203 -173 274 -43 -110 -246 -203 47 69 -231
3653 -231 -161 -110 -187 170 84 -98 -68 220 51 108 -239 -171 -7 161 331 -97 -272 -59 87 72 91 187 6
3676 6 150 72 171 23 76 237 194 309 -158 182 182 54 16 36 101 46 281 112 56 -67 -6 269 41 -96 -246
3701 -246 -58 -183 153 -26 -217 -442 -110 121 -26 -74 -151 -13 -198 -17 -165 -11 -273 -79 74 -391 -42
3722 -42 -203 -67 34 21 -204 -248 199 -123 85 -203 -22 147 217 -17 -213 -24 -85 364 144 -70 -108 195
3744 195 187 -10 124 31 306 204 154 -111 -51 88 36 217 162 92 75 193 43 55 37 82 162 346 182 18
3768 18 -185 14 139 152 -35 -55 55 120 -50 -166 -74 32 44 136 -152 -398 -17 -31 -38 -179 -295 6 -137
3791 -137 125 -155 -6 -251 -123 91 -46 -223 -329 106 42 188 -86 -37 -81 113 65 -399 -10 47 56 87 112
3814 112 -162 -292 334 61 316 95 74 -42 253 84 80 -86 91 241 302 162 -28 86 249 106 108 -260
3836 -260 210 85 163 63 -12 -41 -16 139 99 -11 -170 175 -26 78 -98 -33 87 159 15 -229 -87 30
3858 30 108 -33 -267 -24 -82 309 -117 93 -273 -68 -184 32 -33 -310 -100 64 230 -161 -187 -130 107 106 71
3881 71 -49 -145 185 -8 -17 -29 -198 -74 51 251 -38 93 -16 167 290 17 208 -63 136 185 175 -4
3903 -4 51 187 -68 312 146 141 -50 360 62 185 -60 -43 108 98 155 -29 287 -55 -181 46 -175 74 -23
3926 -23 219 -117 87 -225 -19 135 -245 -48 -134 210 -64 -30 -235 -96 -2 -74 202 -98 -67 -77 195 -54
3948 -54 -169 28 -307 -37 39 133 96 -172 223 146 81 -195 116 -182 164 -20 -46 -104 -80 353 -96 131 -199
3971 -199 46 127 53 162 27 129 64 312 -57 242 -151 24 -1 66 -18 -129 258 115 28 4 -43 -13 80 47
3995 47 -31 -129 12 217 -74 -60 -147 38 4 26 -109 -289 -181 -175 26 -47 -82 -139 37 102 -226 -116 -107 -276 130
4020 130 36 26 -322 -9 -97 13 -172 -67 -44 72 238 -125 -7 -216 255 203 89 -179 -221 91 57 189
4042 189 -66 -180 28 35 183 -35 41 31 73 229 -36 -54 198 255 129 -16 -94 85 286 144 62 53 113 -6
4066 -6 262 87 159 -111 202 71 45 -87 -267 149 82 36 -206 141 -226 203 272 -203 -222 -13 -143 -58 -61 -316
4090 -316 64 -125 -48 -9 -343 -136 -307 31 -122 -321 -98 -79 7 -47 152 -121 -67 18 105 -34 -184 -11 -69
4113 -69 317 44 207 33 62 116 -126 2 -144 213 225 21 7 -17 188 60 254 -188 87 42 135 225 88
4136 88 -15 96 213 -49 27 -60 58 240 25 -56 -210 103 -33 -66 111 -117 -25 17 157 31 -12 -235 63
4159 63 7 -57 -245 -136 -148 -19 128 159 -46 -135 129 -191 149 -283 -188 59 67 -86 -257 -61 44 12 -35 -179
4183 -179 -68 -89 63 136 102 -169 25 243 102 -135 -81 -84 -10 98 90 -37 275 178 159 -204 203 37 68 251
4207 251 221 -42 20 47 41 390 -90 -147 -194 161 -22 -79 -57 -74 247 159 162 -20 -10 0 -78 102 -106 96 -6
4232 -6 75 -244 -62 -4 -266 60 164 -91 -141 207 8 35 -35 -85 -158 222 31 -181 -97 -89 -31 206 -108 -53 -132
4257 -132 119 119 -114 80 14 75 13 215 -51 173 167 217 -8 99 194 77 292 253 -21 -46 4 77 204 128 -107
4282 -107 50 158 331 82 -64 -80 156 126 -95 164 -156 88 112 59 99 -145 142 48 123 -47 -214 -139 -33
4305 -33 -54 -111 -81 -130 29 -55 -118 -188 94 -186 -31 -203 -203 -284 17 -33 127 -86 13 -110 -38 -156 66 13 -278
4330 -278 -195 4 190 -215 101 50 25 -227 76 -17 86 -5 90 -91 -108 -98 111 49 68 58 -56 267 104 -126
4354 -126 -28 -7 302 143 13 -154 30 366 101 76 -39 29 24 122 -57 -86 -115 21 146 78 -17 91 92 201
4378 201 -29 72 -247 -2 -212 153 -344 -128 -257 131 108 -149 -83 -229 73 -36 -51 -22 1 74 -149 -157 -253
4401 -253 -185 -3 166 -109 -217 -101 -122 294 -40 -203 -55 -135 21 84 -148 -191 115 112 -48 6 42 -58 255
4424 255 235 283 108 -3 107 202 303 28 18 143 210 288 -88 -32 75 106 85 210 -145 -210 230 127 6
4447 6 -107 31 89 69 204 -116 -123 173 53 -176 -294 -116 -92 256 -81 -53 -220 58 -13 -23 -140 -101 -23 -9
4471 -9 -29 -136 59 -53 25 184 177 255 -96 -16 -161 179 -82 -92 -27 106 63 21 -17 -54 83 -8 80 113 1 308
4497 308 153 54 -174 29 254 55 233 -73 -70 -46 248 -262 27 -58 58 182 -38 67 -67 -10 91 34
4519 34 -19 6 -3 -189 143 -14 -59 -105 -20 142 6 -47 -184 228 -6 -24 -31 -196 2 101 -72 -81 -164 -430 -2
4544 -2 -74 -101 -279 -156 -185 -322 0 -150 52 61 26 22 -256 21 196 94 -58 -9 -118 66 114 44 101 -54 94
4569 94 -37 185 37 -135 66 85 6 33 189 -71 49 80 46 -15 -78 -2 -214 15 100 155 161 175 35 -34 -18
4594 -18 114 201 185 70 122 78 3 135 82 -194 -153 -172 75 -137 -214 -78 -1 115 15 -94 -193 119 70 -101
4618 -101 -30 -81 9 -84 141 -157 13 -20 -169 98 -85 92 -63 204 -156 -119 46 -199 -40 68 38 -38 59
4641 59 18 107 213 -75 231 68 -49 249 185 -70 51 20 32 -4 41 71 138 219 52 -105 280 241 -109 30
4665 30 10 107 61 55 34 -257 96 56 -112 75 -29 64 71 47 -42 -37 -62 -180 12 -169 57 -316 202 -69 -137 -78
4691 -78 -78 -145 -244 25 -17 -185 -134 76 -60 -44 22 -378 -57 -164 219 11 -21 101 148 247 -48 -87 143 67 295
4716 295 54 205 -11 148 32 234 -21 -52 201 -20 85 -107 137 155 209 92 200 168 -63 153 44
4737 44 -71 -132 108 73 -24 170 -44 132 -250 -102 -92 -9 -92 97 192 -8 -41 -102 -98 30 -113 -127 14 -63 4
4762 4 135 -111 -281 -321 75 -66 -38 -85 -138 77 -126 -131 -59 15 9 17 -2 -150 22 30 66 -249 -191 -43 -38 209 -28
4789 -28 -10 -220 31 152 83 -20 -5 27 236 2 -42 178 -70 317 190 -10 -157 33 177 45 46 -64 112
4812 112 -73 92 -96 -66 -44 -24 39 -133 -51 66 -25 7 -3 -139 -262 -68 62 114 41 -190 131 -133 -45 -122
4836 -122 53 -344 -89 -65 42 -5 -216 -23 -130 22 -109 -21 -3 -3 53 -254 -87 -35 -115 2 69 -66 -40 41
4860 41 -74 -80 -136 134 0 218 -152 -92 12 216 197 40 -80 80 195 269 69 46 -73 247 -59 46 -59
4883 -59 -10 69 125 200 93 -11 -39 51 118 118 -58 -75 -42 65 183 -152 -148 -78 236 154 -48 -56 44 157 -161 73
4909 73 -83 -63 -41 7 74 34 -129 -257 117 -6 -127 -89 -222 -105 47 -93 18 89 -127 38 95 -42 96
4932 96 -38 106 -14 72 -194 91 31 40 103 -65 132 219 24 2 -71 97 21 17 20 69 -62 98 192 11 90 -83
4958 -83 145 28 198 41 5 -12 251 70 267 41 -194 256 82 -27 -227 49 35 115 -89 -68 232 10
4980 10 -75 -199 -87 -87 -91 69 -297 -22 -167 197 -42 -57 -142 37 24 -193 -11 -142 12 -150 3 -52 -93 -12
5004 -12 -23 47 -25 -77 -16 61 42 -151 135 25 57 64 75 -94 124 96 -109 161 115 -24 -9 294 19 13 32 147
5030 147 84 149 164 -67 -4 7 232 4 -61 -71 189 232 132 7 21 132 25 -26 -161 -87 60 -158 60 -77
5054 -77 -20 -82 -296 -61 -225 106 -145 -110 -214 -50 0 -99 179 -95 30 23 -236 -44 206 5 -267 20 -105
5077 -105 104 -32 -99 -102 -45 75 -219 61 -24 105 -80 287 34 120 92 -48 172 -42 116 12 -17 107 45
5100 45 79 220 -99 -169 164 -112 103 162 -58 -253 -9 1 -21 19 27 106 238 -47 -153 -45 212 -86 210
5123 210 69 -37 194 -60 -152 -76 -4 66 -134 -11 -174 53 -26 -289 -220 -117 -141 47 7 -84 -1 36 91 62
5147 62 -25 -133 -118 -133 25 1 -56 19 -29 -50 -109 -77 -101 3 39 -62 -92 32 77 -76 120 -120 -25 217 -30
5172 -30 -42 119 -155 58 133 -4 78 -187 73 153 178 49 -189 93 -62 220 61 -59 -76 -60 202 -230 -80
5195 -80 -186 -48 -127 199 99 -214 167 -271 82 7 -49 -94 -103 -149 -32 24 -10 -121 -16 59 -217 -165 74 -22
5219 -22 156 -135 87 -260 -110 -4 -97 -170 -7 93 41 112 -109 21 42 163 7 48 168 205 -32 -60 113
5242 113 228 -1 -32 179 -46 -97 126 67 167 140 -27 62 144 275 74 83 64 153 93 -43 109 23 201 -203
5266 -203 211 -63 155 -70 -24 -93 76 -102 -126 66 -187 115 82 -25 -198 -89 -3 15 80 -63 -124 -99 -126
5289 -126 35 216 106 -177 38 -23 -57 15 -194 -101 -171 199 68 -51 -65 -20 116 -35 22 -224 -59 -24 -134
5312 -134 111 55 -36 21 16 47 58 -63 164 65 -13 374 103 136 -39 -35 200 -32 122 117 8 41 18 -37 162 -211
5338 -211 73 -87 -51 -208 84 40 -113 43 4 135 -189 -214 155 -28 192 -216 9 -90 -165 -64 -21 -34 -203
5361 -203 -93 -33 -13 -41 -98 -195 105 -46 -6 39 -138 -54 160 46 -69 -211 -20 -46 95 38 -152 -131 -8 254
5385 254 29 88 -40 -37 -40 49 271 58 109 147 231 28 199 -61 272 228 160 -121 -3 303 20 215 59 -36
5409 -36 -12 -116 -101 -87 -58 165 -11 11 -172 -132 -60 12 81 -61 -147 -5 46 -134 -125 -109 139 103 -6 -119 -159 23
5435 23 84 40 -91 -140 -224 -198 72 40 -31 -66 -21 90 -235 -187 -187 -202 -94 -96 0 -84 34 -65 -82 15 -23 -14 -92 41
5463 41 72 -23 -46 -113 212 -153 -213 -2 39 128 -75 31 43 142 -15 180 19 28 331 66 5 -47 19 -32 15 23
5489 23 -13 16 61 -59 20 95 -149 186 -68 81 -11 -35 -58 23 22 127 -48 -71 -4 23 67 -8 -17 -71 -103 40 -52
5516 -52 -191 -23 -30 -177 138 -107 -62 -196 -78 56 146 -87 -95 43 -65 97 -73 49 49 31 2 -5 -48 262 36
5541 36 -20 -48 67 144 27 58 -60 -67 -121 192 125 89 60 -1 124 108 95 67 280 -54 325 -53 -5 125 143 79
5567 79 29 -163 85 59 -107 -155 -47 -91 264 -71 -101 -167 56 193 -169 117 -377 -35 -36 58 -113 -43 -49 -38 0
5592 0 29 -46 36 -32 -138 217 27 -68 -150 147 -192 19 -70 -73 125 -52 8 31 35 120 -99 -145 -77 90 77 -80
5618 -80 -12 -16 227 -119 86 -32 -142 213 -155 184 -108 312 33 -12 -8 -21 17 98 104 -43 91 -59 41 3
5642 3 157 -33 -158 125 -104 135 126 -41 13 -213 -214 201 50 -2 -53 -9 97 -49 -182 -204 9 -88 -153 -33
5666 -33 -214 -166 -166 0 -25 -57 -93 46 166 -358 14 -280 207 -131 -185 81 -118 16 -159 101 -131 26 100
5689 100 31 20 90 262 15 -6 65 156 147 73 170 -83 97 -16 -71 -175 41 79 61 68 -77 108 10 129 27
5714 27 -8 -67 81 63 -65 101 -163 -26 108 -76 -44 18 -30 -142 -75 -100 -32 -45 119 -62 -448 -150 0 -16
5738 -16 -64 -201 -120 -34 -53 -106 -124 27 18 -43 -11 -112 16 -53 54 6 -37 83 17 119 140 -4 71 123 15 57
5764 57 56 -2 -103 78 73 2 -46 112 -97 -25 -101 -43 76 169 119 -21 -4 61 -48 123 -51 70 -176 -144 -89 177
5790 177 188 32 40 130 73 -39 19 -5 127 -170 -19 -124 -34 -41 -187 -30 -80 53 -44 -65 -66 2 -358 -89 26
5815 26 -69 -90 32 -15 -154 68 -74 55 67 -67 233 75 -104 -113 13 18 33 -25 -3 25 -71 98 30 315 151
5840 151 2 -63 46 160 -94 -68 -11 4 149 -110 79 203 16 -60 14 17 33 -230 151 218 -107 337 224
5863 224 24 49 -19 39 -64 -63 27 95 -120 -163 53 -64 -72 -26 252 -111 -93 -74 5 -94 -47 36 -60 -63 -107 -62 128
5890 128 -309 -53 -211 -145 76 105 43 67 0 -57 -43 -53 -66 -27 -26 34 -19 51 50 22 8 -26 -5 -163 154 -9 -22
5917 -22 20 -67 -7 -220 -10 48 117 163 24 222 173 68 85 60 -59 13 -47 -123 229 -6 -59 -91 -116 -125 -154 -158 175
5944 175 -96 -108 14 -208 -68 -5 261 39 -254 -96 -1 55 -64 -36 -102 -93 28 -134 -177 -130 -172 -225 -80 7
5968 7 -84 -47 133 194 23 13 -80 -148 -110 -93 -19 -154 70 -6 -38 71 -98 256 -81 91 0 55 110 89 28 40
5994 40 -146 38 101 31 45 -12 -95 219 105 -42 -87 197 118 85 -185 -175 144 27 93 -102 198 -46 125 72
6018 72 37 -48 133 -31 16 -131 -197 -97 -121 -141 142 -50 -38 60 41 -76 -163 -51 86 -154 -37 -15 103 16
6042 16 -60 52 144 -59 -26 25 -67 -85 -27 111 69 -94 -84 208 -57 55 -152 92 -115 33 -238 -20 -13 13
6066 13 53 28 -59 27 164 119 8 -54 26 11 -32 141 135 64 -42 -29 -65 78 151 -14 84 -101 99 13 -50 -65 -33
6093 -33 44 -36 104 -244 -214 -97 -84 19 -49 130 -225 -6 -89 238 -14 -129 -26 -271 55 155 -229 -97
6115 -97 112 112 -60 -150 -219 -225 91 139 14 -169 32 2 120 -62 91 -22 -29 -59 25 -155 -60 138 21 112 11
6140 11 28 168 -114 70 71 122 -164 0 -123 46 10 95 262 -10 -41 307 162 -38 302 130 169 170 74 -140
6164 -140 32 -9 -205 34 -34 60 212 -131 38 -294 22 14 -127 -280 -21 -67 -7 -315 -128 -114 33 -124 -111
6187 -111 89 -96 84 -149 -166 14 -37 -7 -110 83 -10 -124 -69 -53 -21 -271 98 -108 -67 -29 -28 90 -38 -87
6211 -87 -119 15 -85 47 -94 54 -139 81 -57 22 -126 -130 -5 2 55 122 52 82 -7 257 -53 20 -26 -73 -40
6236 -40 -38 127 -62 -96 112 -34 58 21 244 -61 -95 -125 13 180 130 -94 5 -50 -146 -155 -178 -22 -109 -118 -11 -125
6262 -125 120 -54 72 -144 146 -96 -57 56 -169 198 -51 10 101 -214 -45 -16 -26 -50 -89 2 -32 3 134
6285 134 87 127 51 -154 107 29 -9 131 74 31 75 -30 -145 30 104 127 3 104 67 -77 337 -90 109 -14
6309 -14 154 -79 -29 72 -97 89 -160 157 -57 -12 172 2 63 -4 162 -31 20 -19 39 -154 -48 80 15
6332 15 -14 -115 114 -83 2 -62 32 2 -60 -6 29 18 -48 -189 20 -194 38 -184 -111 -245 171 21 -123 5
6356 5 -75 -65 175 110 101 -151 -217 -24 79 147 160 -64 54 51 138 7 33 98 -62 70 -81 -50 130 -49 -91 -133
6382 -133 3 -118 309 49 46 -111 -82 116 -78 53 41 22 -29 -85 51 129 -5 -14 130 168 24 -62 2 -87 -84
6407 -84 -204 -143 -11 -117 -17 -47 -132 -193 9 -21 11 27 -112 23 187 -43 7 -23 -69 -70 -80 -87 -61 54 -22 -21 36
6434 36 -55 94 -145 -14 3 -159 186 -72 101 139 -26 42 17 -83 -29 -97 -47 -17 -171 -119 -54 -61 35 154 -9
6459 -9 81 256 44 105 41 31 12 -114 98 -114 58 193 -83 6 -80 99 -3 -112 -189 88 -56 75 -82
6482 -82 -146 -58 36 -48 85 146 -335 55 -10 -142 -158 -160 -188 -142 -42 -75 10 -255 -1 -4 -20 -54 -63 167 -98 -88 -17
6509 -17 49 142 -59 108 -20 -13 -12 58 47 -96 257 -31 163 -41 16 10 -5 -136 -1 150 16 326 38 104 204
6534 204 -2 196 53 -37 -14 15 35 57 -230 13 -47 -100 -133 -114 139 -232 -289 -157 52 -55 -147 -93 -104 -42 -122
6559 -122 -40 -51 -2 123 -71 -186 -64 -63 93 24 -313 14 34 192 -136 150 -169 21 10 44 4 39 -22 25
6583 25 53 95 -9 83 -63 45 12 77 -20 33 -8 -33 98 93 97 17 -40 -65 -109 98 -62 -74 -75 -152 21 -30 111 -49
6611 -49 199 4 -39 -113 48 -23 73 9 -162 127 57 -202 102 -2 -154 34 -45 -5 184 -9 13 61 83 12
6635 12 53 98 -82 160 130 53 -132 81 44 91 66 195 46 5 -11 -98 -91 50 -103 -22 -30 -83 370 -119 69 84
6661 84 -53 -45 -40 6 -124 110 83 151 15 -29 15 10 -21 331 -52 20 -72 116 92 22 191 95 58 16 4 36 -42 118
6689 118 6 68 138 20 64 -137 -90 -139 152 51 -115 -129 -55 -19 -175 12 10 48 -62 -146 -127 -48 -42 148 -240
6714 -240 -123 -156 -253 22 -59 75 -87 -214 80 -79 4 -179 -164 -73 9 -35 160 111 -73 42 53 -60 -127 47
6738 47 24 -115 228 -161 -153 23 82 160 -51 61 -36 -54 -208 103 76 188 -3 36 12 116 178 104 28 -92 -203
6763 -203 219 -74 -39 -8 116 -81 -68 -5 142 49 -81 -18 -148 -13 -90 72 3 50 -117 -83 8 -132 82 -118
6787 -118 169 -101 -87 -228 -92 -81 -102 -29 -64 -194 -227 -83 -138 -39 -11 258 30 -5 -134 -93 160 59 -44 -40
6811 -40 -235 -214 80 6 99 -60 122 202 -89 23 79 64 -130 -27 -87 -47 218 -93 42 70 105 -8 -66 124
6835 124 -86 247 40 -29 132 -75 -139 -58 128 -28 -5 11 -32 -47 -21 -127 -115 -80 -65 -185 86 -198 27 39
6859 39 114 -25 -133 -12 -16 -300 0 6 -55 86 67 -94 -120 -109 -104 -103 27 -100 22 104 18 -6 -25 -82 12 156 -23
6886 -23 2 251 -42 85 -77 -130 28 31 217 55 116 58 76 77 -102 214 145 41 41 86 139 109 -107 64 66 -83
6912 -83 5 41 11 52 133 -22 161 -165 -118 100 137 -136 -11 105 -104 -319 16 82 -111 -44 -2 -236 81 -29
6936 -29 94 130 28 -42 -11 -96 84 117 13 -39 49 99 56 49 -74 -77 53 58 -219 52 64 -63 21 55 -26 -229 -30
6963 -30 69 194 -97 -117 -56 72 177 -121 -79 132 -153 178 15 3 -139 -35 -31 32 64 206 -10 37 -151 -86
6987 -86 -13 -241 31 116 -28 -59 -55 116 -150 47 36 -84 125 -15 -48 -47 -13 -175 -93 -131 199 -33 -229 -51
7011 -51 -28 -139 -29 -223 -113 112 119 36 -108 74 -249 89 -42 -96 -132 29 -135 119 28 138 21 115 -3
7034 -3 100 348 26 87 55 106 39 -46 -150 -70 98 99 -28 155 -91 -84 -80 33 -36 -95 3 82 7 -45 -30 -28 -112 15
7062 15 115 -11 25 -69 36 -204 -103 29 63 49 -8 -99 -104 -71 14 -9 -122 146 15 -66 120 -55 43 -127 89
7087 89 -125 -122 -38 -87 -181 187 -89 -98 -70 -68 -71 -190 196 42 -63 86 23 -173 -23 -72 -120 -201 -112 -62 15 -145 -163
7114 -163 -32 -7 -144 -35 -4 -208 -81 -20 -234 -138 -48 78 149 -4 226 137 -2 284 -143 160 -59 157
7136 157 80 -73 -23 -197 2 61 -92 -172 -101 89 115 8 60 -12 -109 -4 161 115 -42 -97 251 22 -38 94
7160 94 17 -315 43 31 -28 -166 -123 -78 -180 -135 -94 -109 108 -170 -40 131 114 45 98 -76 0 53 -325 -15 -173
7185 -173 121 59 19 66 -8 20 89 -171 -36 73 -35 118 -71 -17 200 -88 -46 -149 231 22 -126 61 -97
7208 -97 126 -8 -135 -135 -141 102 -62 -69 214 -180 -44 -47 -93 -10 78 109 -9 -106 91 -6 14 -61 23 -149 100 11
7234 11 -97 -28 -96 57 -146 155 4 -124 -148 66 16 -171 -182 105 58 -140 11 -60 -45 -302 -255 67 -46
7257 -46 -43 -122 -69 106 76 229 -116 48 -14 33 56 14 159 261 194 -44 69 -53 -34 102 24 47 177 89 68
7282 68 -79 -44 -115 -2 -74 63 -102 106 34 50 108 219 31 -64 -50 111 -144 39 104 -210 -252 -16 -64 -56 -192
7307 -192 122 59 -53 -138 -237 93 101 -196 140 20 -108 -171 -52 -72 55 -101 -33 83 -42 -29 -4 125 -126
7330 -126 56 -64 -32 29 -158 -63 -14 -11 0 291 198 -10 -43 33 139 81 97 -68 86 238 3 4 -52 -61 142 -2
7356 -2 -151 104 126 -188 -107 -107 -113 142 -97 -5 -38 -121 -43 -67 -132 -9 -77 -180 -113 68 -28 -13 -84 150 61 -78 -126
7383 -126 26 -265 42 -111 -4 -99 -50 63 -221 -7 71 -169 -46 -21 -83 -139 -12 125 -1 54 65 -47 -74
7406 -74 158 37 40 -31 -133 -16 -157 -133 135 -78 95 40 -42 8 158 41 114 -44 -144 -33 86 4 97 81
7430 81 89 -53 15 -77 59 190 -140 -104 66 -30 125 -108 21 170 71 -4 140 -155 1 -75 19 47 -112 -219
7454 -219 -15 12 -131 -24 79 -29 4 -72 -8 36 -66 -44 -111 -122 -41 -133 74 92 -123 -75 37 123 -180 -14
7478 -14 -49 -20 -152 115 40 11 -198 -10 -71 57 -104 -189 39 100 -79 -237 187 -146 91 39 -39 136 9
7501 9 183 76 -16 -19 42 8 234 11 -79 11 -152 2 -70 -13 -66 15 -82 -127 92 240 137 77 134 -81 -61 178
7527 178 -113 -50 -32 -85 -110 6 -25 -42 62 57 -9 -63 90 9 255 -99 -54 71 18 -84 -49 -93 -109 31 -119
7552 -119 3 -57 -179 82 24 27 -68 -26 -138 -277 42 144 54 -10 145 -201 -80 408 -155 41 200 -154 29
7575 29 -57 -112 3 59 -22 -62 41 -40 -149 354 171 -149 12 35 -30 -12 2 -136 73 44 -133 21 -15 -224
7599 -224 7 -167 -206 27 -66 137 89 -141 -25 56 100 -8 -143 24 -125 102 -56 212 30 -155 8 -46
7621 -46 -30 -46 -77 138 26 -154 36 -57 205 17 -73 -35 -79 97 100 50 -26 14 176 192 38 96 203 -154 -48
7646 -48 -10 -18 -69 36 -66 37 122 106 -50 -40 68 15 -57 -46 164 -99 -17 -87 -77 -47 -169 -171 -30 -10 -41 11 -108
7673 -108 -11 -184 -13 -15 -127 -3 -27 -55 167 -49 186 75 7 132 17 33 -203 -86 -66 75 8 83 -18
7696 -18 10 9 -75 267 28 105 159 -106 -33 -106 102 -79 106 -29 40 -81 -70 89 -28 -137 -7 225 138 -42
7720 -42 32 241 -52 177 108 -134 -23 -110 68 207 -161 23 -189 101 89 -58 204 -1 63 18 -92 -44 207
7743 207 190 -43 -184 54 -128 -54 -16 -135 -15 153 180 -137 -48 3 170 60 -112 4 15 -9 -37 21 -129
7766 -129 -47 -38 32 200 48 151 -27 62 -169 94 -4 53 130 -157 31 184 99 -58 2 -111 -40 134 -188 -125
7790 -125 58 52 3 1 22 -175 -186 -54 13 19 -40 -138 16 -105 44 73 -43 -59 207 -36 53 71 133 -155 62 -38
7816 -38 -20 18 -8 -232 -34 96 -95 81 28 65 49 24 114 -30 -112 -20 42 -43 20 -27 -10 202 31 56 -279 96
7842 96 -20 118 -16 133 21 11 -40 96 120 -70 133 89 -89 118 -78 55 118 10 56 21 317 73 45
7865 45 -56 143 65 7 -102 44 -185 2 -33 9 -131 -77 -102 66 6 6 34 -22 31 -37 204 60 -35 -173 -26
7890 -26 -96 138 -216 -127 -45 44 -213 122 -19 -72 66 115 -27 -277 210 -14 -52 57 53 73 -24 -7 -162 -87 -11
7915 -11 181 80 83 -182 -95 30 3 -87 -59 65 248 227 128 7 -10 -3 128 -60 86 -111 -54 64 11 -26 -31 87
7941 87 71 84 11 159 -20 70 -47 95 25 -55 120 -83 49 -129 217 26 12 75 23 32 63 152 15 22 -137
7966 -137 -69 9 -293 -35 87 -86 205 -105 141 78 26 45 26 -134 0 42 -47 7 6 54 -121 60 -81 -163
7990 -163 21 -139 -95 -34 -97 174 63 -58 7 236 -124 -52 -6 64 16 -3 -101 40 -32 65 61 -117 0 167 102
8015 102 -7 -38 -107 104 118 114 48 -73 -23 -94 -37 -5 -56 -3 -59 40 -50 15 -80 -4 -109 -134 80 -71 190 -29
8041 -29 -99 108 -13 53 192 -37 -80 -84 67 152 -100 -26 -64 -50 -6 40 -38 1 -12 -52 -90 111 -87 75 29 184
8067 184 -16 244 65 -124 44 58 -89 0 -238 110 -111 117 81 -128 -135 104 -145 -7 11 9 -28 -131 92
8090 92 21 -2 59 125 122 -90 39 12 35 51 129 -51 -84 89 -6 -21 -87 -58 -95 102 52 32 -110 -105 156 -40 51
8117 51 -14 -147 69 -1 -12 13 -73 -17 -66 -3 116 6 -139 -59 205 73 -70 111 -66 204 24 54 137 -112
8141 -112 88 46 -105 16 145 38 56 -104 146 278 198 46 -22 215 -133 -14 130 -27 139 -83 -7 3
8163 3 243 -23 -14 -235 48 -8 30 60 -65 -20 2 -72 163 67 -113 28 243 -40 -68 71 98 12 165 184 109
8188 109 99 61 189
8191A89
##END NTUPLES=NMR FID
##END=
