##TITLE=1H_Pr 4687-EDA
 CDCl3, 8 sc, 
 25.3.2020
##JCAMPDX= 6.0         $$ Bruker NMR JCAMP-DX V2.0
##DATA TYPE= NMR FID
##DATA CLASS= NTUPLES
##ORIGIN= UXNMR, Bruker Analytische Messtechnik GmbH
##OWNER= root
$$ XWIN-NMR		Version 3.5
$$ Wed Mar 25 16:12:23 2020 Russian Standard Time (UT+4h)  she@DPX200
##.OBSERVE FREQUENCY= 200.1315
##.OBSERVE NUCLEUS= ^1H
##.DELAY= (6, 6)
##.ACQUISITION MODE= SIMULTANEOUS
##.ACQUISITION SCHEME= undefined
##.AVERAGES= 8
##.DIGITISER RES= 18
##SPECTROMETER/DATA SYSTEM= spect
##.PULSE SEQUENCE= zg30
##.SOLVENT NAME= CDCl3
##.SHIFT REFERENCE= (INTERNAL, CDCl3, 0, 15.7039)
##AUDIT TRAIL= $$ (NUMBER, WHEN, WHO, WHERE, WHAT)
$$ ##TITLE= Audit trail, XWIN-NMR		Version 3.5
$$ ##JCAMPDX= 5.01
$$ ##ORIGIN= Bruker BioSpin GmbH
$$ ##OWNER= she
$$ F:/spectra/data/she/nmr/H-F/1/audita.txt
$$ ##AUDIT TRAIL=  $$ (NUMBER, WHEN, WHO, WHERE, WHAT)
(   1,<2020-03-25 16:11:24.89 +0400>,<she>,<DPX200>,
      <created by zg, POWCHK disabled, PULCHK disabled
       configuration hash MD5:
       00 E9 B6 7A A2 85 ED C7 34 08 36 98 17 FE 4E 26
       data hash MD5: 16K
       21 B5 75 86 F8 79 0B C6 6F E6 6B 03 FE FD D6 D9>)
$$ ##END=
$$ 
$$ hash MD5
$$ AD 50 9B A1 87 07 D9 96 68 C3 77 61 7F 59 F5 12
##$RELAX= 
##$RELAX= 
##$RELAX= 
##$RELAX= 
##$RELAX= 
##$RELAX= 
$$ Bruker specific parameters
$$ --------------------------
##$DU= <F:/spectra>
##$EXPNO= 1
##$NAME= <H-F>
##$PROCNO= 1
##$TYPE= <nmr>
##$USER= <she>
##$AMP= (0..31)
100 100 100 100 100 100 100 100 100 100 100 100 100 100 100 100 100 100 
100 100 100 100 100 100 100 100 100 100 100 100 100 100 
##$AQSEQ= 0
##$AQ_mod= 1
##$AUNM= <au_zg>
##$AUTOPOS= <>
##$BF1= 200.13
##$BF2= 200.13
##$BF3= 200.13
##$BF4= 200.13
##$BF5= 200.13
##$BF6= 200.13
##$BF7= 200.13
##$BF8= 200.13
##$BYTORDA= 1
##$CFDGTYP= 0
##$CFRGTYP= 5
##$CHEMSTR= <none>
##$CNST= (0..31)
1 1 145 1 1 1 1 1 1 1 1 1 1 1 1 1 1 1 1 1 1 1 1 1 1 1 1 1 1 1 1 1 
##$CPDPRG= <>
##$CPDPRG1= <>
##$CPDPRG2= <>
##$CPDPRG3= <>
##$CPDPRG4= <mlev>
##$CPDPRG5= <mlev>
##$CPDPRG6= <mlev>
##$CPDPRG7= <mlev>
##$CPDPRG8= <mlev>
##$CPDPRGB= <>
##$CPDPRGT= <>
##$D= (0..31)
0 1.2 0 0 0 0 0 0 0 0.06 0 0.03 0 0 0 0 0.0002 0 0 0 0 0 0 0 0 0 0 0 0 
0 0 0 
##$DATE= 1585138284
##$DBL= (0..7)
120 120 120 120 120 120 120 120 
##$DBP= (0..7)
150 150 150 150 150 150 150 150 
##$DBP07= 0
##$DBPNAM0= <>
##$DBPNAM1= <>
##$DBPNAM2= <>
##$DBPNAM3= <>
##$DBPNAM4= <>
##$DBPNAM5= <>
##$DBPNAM6= <>
##$DBPNAM7= <>
##$DBPOAL= (0..7)
0.5 0.5 0.5 0.5 0.5 0.5 0.5 0.5 
##$DBPOFFS= (0..7)
0 0 0 0 0 0 0 0 
##$DE= 6
##$DECBNUC= <off>
##$DECIM= 24
##$DECNUC= <off>
##$DECSTAT= 4
##$DIGMOD= 1
##$DIGTYP= 9
##$DL= (0..7)
0 120 120 120 120 120 120 120 
##$DP= (0..7)
150 150 150 150 150 150 150 150 
##$DP07= 0
##$DPNAME0= <>
##$DPNAME1= <>
##$DPNAME2= <>
##$DPNAME3= <>
##$DPNAME4= <>
##$DPNAME5= <>
##$DPNAME6= <>
##$DPNAME7= <>
##$DPOAL= (0..7)
0.5 0.5 0.5 0.5 0.5 0.5 0.5 0.5 
##$DPOFFS= (0..7)
0 0 0 0 0 0 0 0 
##$DQDMODE= 0
##$DR= 18
##$DS= 0
##$DSLIST= <SSSSSSSSSSSSSSS>
$$ [...]
##$SUBNAM2= <"">
##$SUBNAM3= <"">
##$SUBNAM4= <"">
##$SUBNAM5= <"">
##$SUBNAM6= <"">
##$SUBNAM7= <"">
##$SUBNAM8= <"">
##$SUBNAM9= <"">
##$SW= 24.9337058887773
##$SWIBOX= (0..15)
0 0 2 0 0 0 0 0 0 0 0 0 0 0 0 0 
##$SW_h= 4990.01996007984
##$TD= 16384
##$TD0= 1
##$TE= 0
##$TE2= 300
##$TE3= 300
##$TEG= 300
##$TL= (0..7)
0 120 120 120 120 120 120 120 
##$TP= (0..7)
150 150 150 150 150 150 150 150 
##$TP07= 0
##$TPNAME0= <>
##$TPNAME1= <>
##$TPNAME2= <>
##$TPNAME3= <>
##$TPNAME4= <>
##$TPNAME5= <>
##$TPNAME6= <>
##$TPNAME7= <>
##$TPOAL= (0..7)
0.5 0.5 0.5 0.5 0.5 0.5 0.5 0.5 
##$TPOFFS= (0..7)
0 0 0 0 0 0 0 0 
##$TUNHIN= 0
##$TUNHOUT= 0
##$TUNXOUT= 0
##$USERA1= <user>
##$USERA2= <user>
##$USERA3= <user>
##$USERA4= <user>
##$USERA5= <user>
##$V9= 5
##$VALIST= <valist>
##$VCLIST= <CCCCCCCCCCCCCCC>
##$VD= 0
##$VDLIST= <DDDDDDDDDDDDDDD>
##$VPLIST= <PPPPPPPPPPPPPPP>
##$VTLIST= <TTTTTTTTTTTTTTT>
##$WBST= 1024
##$WBSW= 4
##$XGAIN= (0..3)
0 0 0 0 
##$XL= 0
##$YL= 0
##$YMAX_a= 173545
##$YMIN_a= -148298
##$ZGOPTNS= <>
##$ZL1= 120
##$ZL2= 120
##$ZL3= 120
##$ZL4= 120
##$ABSF1= 10
##$ABSF2= 0
##$ABSG= 5
##$ABSL= 3
##$ALPHA= 0
##$AQORDER= 0
##$ASSFAC= 0
##$ASSFACI= 0
##$ASSFACX= 0
##$ASSWID= 0
##$AUNMP= <proc_1d>
##$AZFE= 0.1
##$AZFW= 0.1
##$BCFW= 1
##$BC_mod= 2
##$BYTORDP= 1
##$COROFFS= 0
##$CY= 11.3945322036743
##$DATMOD= 1
##$DC= 2
##$DFILT= <>
##$DTYPP= 0
##$F1P= 16.9975609425685
##$F2P= -3.02152046262296
##$FCOR= 0.5
##$FTSIZE= 0
##$FT_mod= 4
##$GAMMA= 1
##$GB= 0.15
##$INTBC= 1
##$INTSCL= 1
##$ISEN= 128
##$LB= 0.24
##$LEV0= 0
##$LPBIN= 0
##$MAXI= 10000
##$MC2= 0
##$MEAN= 0
##$ME_mod= 0
##$MI= 1.114404
##$NCOEF= 0
##$NC_proc= 0
##$NLEV= 6
##$NOISF1= 3.799351
##$NOISF2= 2.8
##$NSP= 1
##$NTH_PI= 0
##$NZP= 0
##$OFFSET= 15.70392
##$PC= 1
##$PHC0= -9782.961
##$PHC1= 12.00082
##$PH_mod= 1
##$PKNL= yes
##$PPARMOD= 0
##$PSCAL= 0
##$PSIGN= 0
##$REVERSE= no
##$SF= 200.130013532006
##$SI= 16384
##$SIGF1= 3
##$SIGF2= 2
##$SINO= 400
##$SIOLD= 16384
##$SREGLST= <1H.CDCl3>
##$SSB= 0
##$STSI= 0
##$STSR= 0
##$SW_p= 3612.71676300578
##$SYMM= 0
##$S_DEV= 0
##$TDeff= 0
##$TDoff= 0
##$TI= <>
##$TILT= no
##$TM1= 0
##$TM2= 0
##$TOPLEV= 0
##$USERP1= <user>
##$USERP2= <user>
##$USERP3= <user>
##$USERP4= <user>
##$USERP5= <user>
##$WDW= 1
##$XDIM= 8192
##$YMAX_p= 0
##$YMIN_p= 0
$$ End of Bruker specific parameters
$$ ---------------------------------
##NTUPLES= NMR FID
##VAR_NAME=  TIME,          FID/REAL,        FID/IMAG
##SYMBOL=    X,             R,               I
##VAR_TYPE=  INDEPENDENT,   DEPENDENT,       DEPENDENT
##VAR_FORM=  AFFN,          ASDF,            ASDF
##VAR_DIM=   8192,          8192,            8192
##UNITS=     SECONDS,       ARBITRARY UNITS, ARBITRARY UNITS
##FACTOR=    0.0002004,     1,               1
##FIRST=     0,             0,               0
##LAST=      1.6414764,     0,               0
##MIN=       0,             -148298,         0
##MAX=       1.6414764,     173545,          0
$$ Real data points
##PAGE= N=1
##DATA TABLE= (X++(R..R)), XYDATA
$$ [...]
$$ plain form
1990 -647 -583 -919 -634 -73 -350 -665 -903 -297 -41 262 -1314 -1427 -473 -543 311 -938 -946 -670 39 -185 -920
2011 -920 -498 630 223 -221 -600 404 449 178 -915 -111 160 -49 193 -933 954 702 216 -93 -219
2030 -219 279 749 292 -152 -544 860 690 -123 213 67 1036 379 -315 230 633 969 568 -130 431 867
2050 867 691 172 541 331 1043 379 -13 -237 640 812 792 30 800 700 225 503 286 702 567 403
2070 403 -614 -9 10 161 -179 -305 -32 613 106 523 -207 574 561 274 -515 -841 392 -93 -94 -337 -424
2091 -424 -277 257 140 -387 -341 435 324 -198 -194 -343 268 -469 -748 -1386 -529 -562 -331 -891 -455 -265 -952
2112 -952 -640 -770 -203 -199 -534 -730 -694 327 109 -492 -769 -505 38 -22 -758 -511 -184 222 -180 -522 -473
2133 -473 66 -97 -471 -23 -411 336 -48 -479 -413 736 10 -1037 -217 -25 53 -82 857 146 222 -160
$$ packed form
1990f47O4l36K85N61k77l15k38O06K56L03j576j13R54p0Q54j249qK76P09k24p35
2011i20M22J128m07m44l79J004M5k71j093Q04K71k09K42j126J887k52m86l09j26
2030b19M98M70m57m44l92J404j70q13L36j46R69o57o94N45M03L36m01o98N61M36
2050H67j76n19L69k10P12o64l92k24Q77J72k0p62P70j00m75K78k17M16j35j64
2070D03j017O05J9J51l40j26K73O45n07M17p30P81j3k87p89l26J233m85jk43q7
2091d24J47N34j17n27M6P76j11n22Mj49O11p37k79o38Q57l3K31n60M36J90o87
2112i52L12j30N67Ml35j96L6J021k18o01k77K64N43o0p36K47L27M06m02l42M9
2133d73N39j63l74M48l88P47l84m31O6J149p26j047Q20J92P8j35R39p11P6l82
$$ plain form
2153 -160 755 -159 86 526 520 -229 -48 155 1273 -205 -137 -129 631 141 92 124 545 1090 1160 31 -364 -109
2175 -109 496 936 700 -174 -306 268 -148 41 -97 78 438 -205 262 733 635 875 367 288 0 607 331
2196 331 556 155 327 288 562 382 -128 82 758 -459 657 -364 335 709 -725 130 -725 478 -685
2215 -685 -207 -174 -124 1233 -416 -77 222 133 -265 -155 266 337 317 -736 -847 106 -294 -64 -256 -361 -222
2236 -222 -501 -665 -964 -627 -90 -237 -568 -372 -308 -34 -264 -682 -593 -425 -828 -638 -71 -65 -723 -633 -115 -553
2258 -553 -1060 -680 274 -307 -834 -1147 201 -225 91 -139 -576 -609 -50 -498 -829 -565 144 511 19 10 -323
2279 -323 -72 368 -322 228 741 206 124 -342 483 826 255 -44 -272 233 700 129 -66 397 398 287 265
2300 265 196 705 557 98 101 605 524 478 49 153 418 377 321 139 411 519 496 179 158 383 518 127 -137
$$ packed form
2153a60R15r14K45M40op49J81K03J118j478O8QP60m90m9L2M21N45P0j129l95K55
2175a09O05M40k36q74j32N74m16J89j38J75L60o43M67M71r8K40n08p9k88O07k76
2196C31K25m01J72l9K74j80n10K10O76j217J116j021O99L74j434Q55q55J203j163
2215f85M78L3N0J357j649L39K99q9l98J10M21P1k0j053j11R53m00K30j92j05J39
2236b22k79j64k99L37N37j47l31J96O4K74k30m18Q9J68m03J90N67Oo58R0N18m38
2258e53n07L80R54n81n27l13J348m26L16k30m37l3N59m48l31K64P09L67m92rl33
2279c23K51M40o90N50N13n35q2m66Q25L43n71k99k28N05M67n71j95M63Jj11k2
2300B65o9N09j48m59LN04q1m6m29J04K65m1n6j82K72J08k3l17k1K25J35l91k64
$$ plain form
2323 -137 265 427 472 10 306 198 423 274 267 -77 310 196 36 -49 250 287 108 216 177 -16 110 -58
2345 -58 130 216 -56 -138 -155 -134 -69 -80 81 -182 -219 -465 -183 -45 54 -338 -336 -381 279 -128 -601 -52 -72 -1045
2369 -1045 15 -336 -116 -250 -842 73 -388 -605 355 316 -342 -316 -693 -75 -606 -52 -281 -176 -148 -579
2389 -579 -530 7 356 -319 -544 -248 178 -255 -597 -391 151 -52 -230 -287 -47 -19 59 -237 137 -102 11
2410 11 138 -383 205 -64 77 -10 170 77 394 329 183 80 551 148 219 127 316 55 273 224 439 200
2432 200 275 411 290 261 360 281 417 603 427 181 263 491 412 338 296 497 419 258 314 114 222 498 550 181
2456 181 401 383 130 -53 -107 405 156 175 201 198 158 245 -55 -214 91 195 51 24 -172 238 44 -127 -156
2479 -156 141 205 -142 -162 -39 -203 163 -385 -175 -455 -178 -49 -273 -470 -351 -196 -51 -526 -360 27 -193
$$ packed form
2323a37M02J62M5m62K96j08K25j49pl44L87j14j60q5K99L7j79J08l9j93J26j68
2345e8J88Q6k72q2j7K1O5j1J61k63l7k46K82J38R9l92Km5O60m07m73N49k0r73
2369a045J060l51K20j34n92R15m61k17R60l9o58K6l77O18n31N54k29J05K8m31
2389e79M9N37L49o75k25K96M26m33l42K06N42k03j78n7K40K8P8k96L74k39J13
2410A1J27n21N88k69J41q7J80r3L17o5j46j03M71m03P1r2J89k61K18m9K15k39
2432B00P5J36j21k9R9p9J36J86j76k46Q2K28p9p4m2K01p8j61N6k00J08K76N2l69
2456A81K20j8k53j83n4N12k49J9K6lm0Q7l00j59L05J04j44k7j96M10j94j71k9
2479a56K97O4l47k0J23j64L66n48K10k80K77J29k24j97J19J55J45m75J66L87k20
$$ plain form
2500 -193 -240 -187 -402 -377 -384 -383 -462 -276 -97 -695 -374 -323 -207 -476 -308 -190 -295 -238 -150 -208 -434 -462 -405 -153 -270
2525 -270 -39 -289 -272 -133 -263 -120 129 -387 157 84 -293 -208 230 -78 130 -179 207 58 -66 33 142
2546 142 195 269 222 -35 214 523 303 -196 152 314 461 345 173 435 390 411 250 346 592 304 346 234
2568 234 91 316 384 221 -34 116 458 298 127 221 121 376 381 -15 322 441 579 295 36 221 406
2589 406 456 84 -60 115 317 -61 28 107 137 110 31 -179 36 -182 -34 -145 -298 23 216 76 -197 -71
2611 -71 -43 -53 16 -95 -63 -197 -35 16 -376 -419 -58 -74 -624 -140 -242 -130 -202 -190 -171 -62 -68 -571 -712 -316
2635 -316 -535 -129 -496 27 -463 -387 -172 -483 -290 -90 -235 -226 -487 -370 -312 -407 -364 -532 -42 -232 -116 -579
2657 -579 -164 -176 51 -152 -332 -416 71 219 -9 86 24 324 25 -249 -49 -78 226 185 -181 -150 132 10
$$ packed form
2500a93m7N3k15K5pJp9J86J79n98L21N1J16k69J68J18j05N7Q8n8k26k8N7K52j17
2525b70K31k50J7J39j30J43K49n16N44p3l77Q5M38l08K08l09L86j49j24R9J09
2546A42N3P4m7k57K49L09k20m99L48J62J47j16j72K62m5K1j61R6K46k88M2j12
2568B34j43K25O8j63k55J50L42j60j71R4j00K55Nl96L37J19J38k84k59J85J85
2589D06N0l72j44J75K02l78Q9P9L0k7p9k10K15k18J48j11j53L21J93j40k73J26
2611g1K8j0O9j11L2j34J62N1l92m3L61j6n50M84j02J12p2J2J9J09on03j41L96
2635c16k19M06l67N23m90P6K15l11J93K00j45Rk61J17N8r5M3j68M90j90J16m63
2657e79M15j2K27k03j80q4M87J48k28R5o2L00k99k74K00k9L04m1l66L1K82j22
$$ plain form
2679 10 273 -287 124 279 263 -41 90 -27 389 439 260 390 329 616 177 170 351 544 465 187 49 80 622
2702 622 286 55 476 459 271 407 -211 24 416 399 176 -122 200 386 161 24 25 324 147 561 213
2723 213 -50 106 298 57 -187 59 112 -36 -165 -225 -58 19 -224 -227 174 63 103 -289 -65 -185 36 -235
2745 -235 -335 -105 28 -121 -47 -505 -221 -119 -158 -207 -447 -91 180 -52 -310 -268 -369 -328 -265 -378 -272 -380
2767 -380 -140 -179 -521 -112 -453 -302 -246 -438 -424 -369 -184 -211 -65 -324 -244 -271 -240 -443 71 -146 -48 -23 -205
2790 -205 -142 176 -77 -361 190 -60 47 -290 -164 52 -46 15 -281 42 228 231 -57 -165 225 37 99 -61
2812 -61 44 244 265 -59 52 295 330 292 -149 47 488 198 262 -147 372 443 165 -387 263 455 215 143
2834 143 -49 537 719 425 46 -36 377 334 157 -292 47 226 136 19 -23 6 129 58 109 399 260 68
$$ packed form
2679A0K63n60M11J55j6l04J31j17M16N0j79J30o1K87m39pJ81J93p9k78j38L1N42
2702F22l36k31M21j7j88J36o18K35L92j7k23k98L22J86k25j37JK99j77M14l48
2723B13k63J56J92k41k44K46N3j48j29o0J67P7k43lM01j11M0l92K24j20K21k71
2745b35j00K30J33j49P4m58K84J02l9m9k40L56K71k32k58M2j01M1O3j13J06j08
2767c80K40l9l42M09l41J51N6j92J4N5J85k7J46k59Q0k7L1k03N14k17R8K5j82
2790b05O3L18k53k84N51k50J07l37J26K16r8O1k96L23J86Lk88j08L90j88O2j60
2812f1J05K00K1l24J11K43L5l8m41J96M41k90O4m09N19P1k78n52O50J92k40p2
2834A43j92N86J82k94l79q2M13m3j77m49L39J79r0j17m2K9J23p1N1K90j39j92
$$ plain form
2856 68 -3 297 198 47 -164 118 110 -389 -94 -72 -147 64 -256 -49 102 360 79 -249 -213 -57 -232 -364 -281
2879 -281 -70 -293 -211 -545 -244 -65 -171 -378 -374 9 -127 -340 -491 41 27 -303 -454 -220 -256 60 -270 -734
2901 -734 -290 166 -256 -333 -334 -7 120 -251 -486 -340 -151 -7 -745 -327 112 -128 -107 -354 -233 39 -279
2922 -279 -128 -200 118 126 -4 -203 50 115 31 99 -24 298 320 -183 -164 348 222 99 14 74 247 145 -232
2945 -232 403 177 62 111 88 482 393 194 18 451 605 170 58 234 578 367 233 176 314 148 258
2966 258 -57 196 316 262 -62 -26 384 514 -136 -154 315 286 173 -66 -239 316 4 -171 -181 -105 537 -32
2988 -32 -287 -58 -116 -93 17 -164 -40 302 37 -349 -359 -127 74 -331 -247 -190 101 -20 -333 -635 216 -32
3010 -32 -153 -241 2 70 -101 -427 -407 -218 18 -344 -411 37 -261 -537 -604 -399 -58 15 -304 -368 378 -116 -437
$$ packed form
2856F8p1L00r9j51k11K82qm99K95K2p5K11l20K07J51K58k81l28L6J56j75j32Q3
2879b81K11k23Q2l34L01J79j06k07ML83j36k13j51N32j4l30j51K34l6L16l30m64
2901g34M44M56m22p7jL27J27l71k35J46J89J44p38M18M39k40K1k47J21K72l18
2922b79J51p2L18Qj30j99K53O5q4O8j23L22K2n03J9N12j26j23q5O0J73j02l77
2945b32O35k26j15M9k3L94q9j99j76M33J54m35j12J76L44k11j34n7J38j66J10
2966B58l15K53J20n4l24L6M10J30o50j8M69k9j13k39j73N55l12j75j0P6O42n69
2988c2k55K29n8K3J10j81J24L42k65l86j0K32K01m05Q4N7K91j21l13l02Q51k48
3010c2j21q8K43O8j71l26K0J89K36l62o7M48k98k76o7K05L41P3l19o4P46m94l21
$$ plain form
3033 -437 -355 -447 -161 -143 -191 -473 -320 -115 -233 -345 73 101 -312 -373 -219 131 64 -239 -4 111 136 -199 -52
3056 -52 309 37 -52 -249 -31 460 209 -93 -27 -53 95 29 -10 -54 59 221 -40 8 51 245 164 -27 48 232
3080 232 427 388 172 194 503 193 -76 -31 218 563 -2 164 478 75 164 -84 154 317 -93 26 -58 410
3102 410 163 165 -82 226 273 -60 -15 95 -228 441 -63 79 -46 180 411 -197 60 291 118 -124 -259
3123 -259 320 126 -88 -257 -50 364 87 -152 -495 279 -27 -323 -314 98 -27 -326 -380 48 75 -210 -131 -218
3145 -218 -421 -537 -931 -272 -286 -327 137 -722 -948 204 -792 -1029 -1098 45 51 -488 -335 -689 75 -611 -694
3166 -694 -32 75 204 -181 -359 -477 -364 352 1 429 488 -283 497 -492 -747 -1195 -322 -481 -175 458
3186 458 -1019 0 -540 -751 640 208 42 211 262 -54 -173 375 -253 344 226 -170 231 227 -6 -488
$$ packed form
3033d37Q2r2K86J8m8k82J53K05j18j12M18K8m13o1J54L50o7l03K35J15K5l35J47
3056e2L61k72q9j97K18M91k51l02O6k6J48o6l9m4J13J62k61M8M3J94q1j91P5J84
3080B32J95l9k16K2L09l10k69M5K49L45n65J66L14m03Q9k48K38J63m10J19q4M68
3102D10k47Kk47L08M7l33M5J10l23O69n04J42j25K26K31o08K57K31j73k42j35
3123b59N79j94k14j69K07M14k77k39l43P74l06k96RM12j25k99n4M28K7k85P9q7
3145b18k03j16l94O59j4m1M64q59k26J152r96k37o9J143On39J53l54P64o86q3
3166f94O62J07J29l85j78j18J13P16l51M28N9p71P80r89k55m48Q73j59L06O33
3186D58j477J019n40k11J391m32j66J69N1l16j19N48o28N97j18l96M01mk33m82
$$ plain form
3206 -488 -134 196 27 264 -377 221 183 -60 112 289 255 16 106 87 251 78 199 133 302 -49 244 -121
3228 -121 -152 335 311 278 157 -24 205 476 -15 367 162 76 249 22 -1 192 -69 234 54 -22 10 -62 -212
3251 -212 -37 -319 -98 -379 -184 -230 -228 36 12 -304 101 68 -194 305 -419 -47 -187 -87 39 -282 -703 -387
3273 -387 -298 -120 -200 -361 -107 -225 -203 -281 -104 -200 124 -286 45 97 -295 -272 -330 8 83 -142 -148 -270 -384 -139
3297 -139 -76 -379 61 -116 -86 -235 -84 -76 -74 159 -321 -213 -109 114 32 -130 83 68 -54 -104 -197 -108 129 -159
3321 -159 -114 98 321 68 -276 195 115 85 75 221 162 127 92 144 332 165 -227 -364 18 382 -88 161 403
3344 403 314 112 -39 -145 -36 104 95 42 168 25 160 -30 -24 476 22 119 44 255 182 -48 339 434 183
3367 183 39 63 176 -3 263 267 5 65 -172 178 -27 -136 89 -74 -181 -86 200 -140 -105 -129 56 -284
$$ packed form
3206d88L54L30j69K37o41N98l8k43J72J77l4k39R0j9J64j73J21o6J69l51K93l65
3228a21l1M87k4l3j21j81K29K71m91L82k05q6J73k27k3J93k61L03j80p6L2p2j50
3251b12J75k82K21k81J95m6KK64k4l16M05l3k62M99p24L72j40J00J26l21m21L16
3273c87Q9J78q0j61K54j18K2p8J77r6L24m10L31N2l92K3n8L38P5k25oj22j14K45
3297a39O3l03M40j77L0j49J51QKK33m80J08J04K23q2j62K13j5j22n0r3Q9K37k88
3321a59M5K12K23k53l44M71q0l0j0J46n9l5l5N2J88j67l92j37L82L64m70K49K42
3344D03q9k02j51j06J09J40rn3J26j43J35j90ON00m54R7p5K11p3k30L87R5k51
3367A83j44K4J13j79K66Mk62O0k37L50k05j09K25j63j07R5K86l40L5k4J85l40
$$ plain form
3389 -284 -193 -48 -205 -117 -160 130 -179 -32 -321 -61 -125 -346 -336 -91 28 -140 13 -329 -411 -120 -170 -44
3411 -44 -345 -294 -217 188 48 -128 -259 -56 -23 -21 44 -246 -278 -172 -222 -71 -284 122 -28 -59 -111 214 -51 -136
3435 -136 -173 -106 299 296 148 118 329 -63 -81 -39 -99 47 80 56 -10 -42 254 15 -49 16 92 273 218 141 171 115
3461 115 -12 275 -85 349 -137 166 252 -270 -18 207 53 127 175 149 -69 289 126 242 164 166 14 188
3483 188 373 39 207 435 4 230 -79 -132 236 318 -86 -24 308 247 289 110 -74 43 5 53 17 111 162
3506 162 -87 -42 -141 23 -126 -40 -152 6 -168 137 167 -26 -360 218 -124 -323 -256 -113 -250 -32 -476 -178
3528 -178 63 -272 48 -193 112 -84 -62 86 -373 -290 100 -66 -169 -152 277 -127 -372 -295 -224 116 -258 -6
3550 -6 58 52 -465 -183 -132 -75 -103 139 73 67 -206 -133 -211 -298 -166 -188 17 184 -361 -59 -130 -171 -151 119 150 179 179
$$ packed form
3389b84R1J45j57Q8m3K90l09J47k89K60o4k21J0K45J19j68J53l42q2K91n0J26
3411d4l01N1P7M05j40j76j31K03L3KO5k90l2J06n0J51k13M06j50l1n2L25k65q5
3435a36l7O7M05lj48l0K11l92j8M2o0J46L3k4o6l2K96k39o4O5P6J81n5p7L0n6
3461A15j27K87l60M34m86L03Q6n22K52K25j54P4M8k6k18L58j63J16p8Kj52J74
3483A88J85l34J68K28m31K26l09n3L68Q2m04O2L32o1M2j79j84J17l8M8l6R4N1
3506A62k49M5r9J64j49Q6j12J58j74L05L0j93l34N78l42j99O7J43j37K18m44K98
3528a78K41l35L20k41L05j96K2J48m59Q3L90j66j03J7M29m04k45P7P1L40l74K52
3550fO4on17K82N1N7k8K42o6ok73P3p8q7J32k2K05J67n45L02p1m1K0K70L1K9%
$$ plain form
3577 179 2 -221 62 86 68 -2 -176 181 -25 239 159 48 182 204 14 200 178 61 57 391 117 219 353
3600 353 91 74 59 23 80 -22 180 170 -73 240 -26 284 307 272 252 285 131 256 59 -27 186 379 174
3623 174 77 80 245 34 41 -114 8 417 -165 159 399 -48 -70 32 -227 178 -13 -70 -1 -52 -46 -195 -201 -349
3647 -349 -135 117 -90 8 -331 76 -70 -65 -45 10 -202 0 -18 -181 15 83 46 -222 -307 -53 -153 -309 -287
3670 -287 -353 -7 -172 -114 -3 -29 -58 -21 -36 150 -126 9 -98 -260 139 -114 -345 41 58 -3 126 43 -82
3693 -82 -204 -27 -279 -73 172 -153 -135 -33 122 -88 -261 -14 163 -96 -66 -82 -147 328 348 -50 95 -12
3715 -12 87 -257 -127 4 193 355 286 4 196 132 198 153 223 168 318 -36 86 231 295 107 101 155 24 205
3739 205 -45 -17 9 343 -93 -216 -192 316 104 57 -54 -131 1 22 -115 227 -72 48 -246 -161 414 31
$$ packed form
3577A79j77k23K83K4j8p0j74L57k06K64q0j11J34K2j90J86k2j17mL34k74J02J34
3600C53k62j7j5l6N7j02K02j0k43L13k66L10K3l5k0L3j54J25j97q6K13J93k05
3623A74r7LJ65k11Pj55J22M09n82L24K40m47k2J02k59M05j91n7O9n1Oj49oj48
3647c49K14K52k07R8l39M07j46NK0N5k12K02j8j63J96O8l7k68q5K54j00j56K2
3670b87o6L46j65N8J11k6k9L7j5J86k76J35j07j62L99k53k31L86J7o1J29q3j25
3693h2j22J77k52K06K45l25J8J02J55k10j73K47J77k59L0j6o5M75K0l98J45j07
3715a2R9l44J30J31J89J62o9k82J92o4O6m5P0n5J50l54J22J45O4j88oN4j31J81
3739B05k50K8K6L34m36j23K4N08k12m7j11p7J32K1j37L42k99J20k94Q5N75l83
$$ plain form
3761 31 57 -25 74 93 40 -181 -7 -13 105 -214 176 -15 24 -107 -63 -176 109 234 -229 -151 -289 -90 34 -140
3785 -140 -108 -165 -182 92 -67 -133 38 -221 -56 49 -277 -402 39 -175 10 -289 -38 -155 -283 59 -150
3806 -150 -235 -194 -10 21 -307 112 -183 77 77 -301 59 -93 13 -120 1 177 232 -67 247 277 72 105 -57
3829 -57 -156 -27 -131 49 121 -43 133 245 50 140 -15 78 68 -56 -49 -8 228 72 11 171 179 166 68 -83 235
3854 235 -385 283 -17 -79 -94 227 327 216 -85 71 -151 -28 404 -35 31 16 166 -33 87 -69 48
3875 48 259 -252 217 98 122 -90 92 105 -57 -144 135 8 116 201 -183 -132 159 207 66 189 168 211 68
3898 68 -179 -209 245 42 5 -236 -98 -15 122 198 -425 -148 38 43 -194 127 82 -133 -93 -206 -71 -140 -105 -71
3922 -71 44 -148 -14 -426 -405 563 118 88 -283 162 15 -1 -60 -287 48 130 -167 -8 -39 -267 -11 14 -270
$$ packed form
3761C1K6q2R9J9n3k21J74oJ18l19L90j91L9j31M4j13K85J25m63P8j38J99J24j74
3785a40L2n7j7K74j59o6J71k59J65J05l26j25M41k14J85k99K51j17j28L42k09
3806a50q5M1J84L1l28M19k95K60%l78L60j52J06j33J21J76N5k99L14L0k05L3j62
3829e7r9J29j04J80P2j64J76J12j95R0j55R3j0j24PM1K36j56o1J60Qj3r8j51L18
3854B35o20O68l00o2j5L21J00j11l01J56k22J23M32m39O6j5J50j99J20j56J17
3875D8K11n11M69j19K4k12J82J3j62q7K79j27J08Q5l84N1K91M8j41J23k1M3j43
3898F8k47l0M54k03l7k41J38Q3J37P6o23K77J86Nk37L21m5k15M0j13J35o9L5L4
3922g1J15j92J34m12K1R68m45l0l71M45j47j6n9k27L35Q2k97J59l1k28K56K5k84
$$ plain form
3945 -270 -99 220 -103 -161 -100 -84 -66 -177 73 105 -121 135 -172 278 -116 151 43 114 126 3 -91 234 202
3968 202 168 41 -89 278 97 -57 64 -52 64 -101 -105 43 193 178 2 -89 -187 84 -65 105 183 217 180
3991 180 59 145 -26 168 112 104 253 199 261 -60 -383 59 105 165 216 -137 282 161 60 -29 -217 50 -30 -79
4015 -79 -144 -14 251 313 32 268 87 -305 -130 322 -43 -98 -41 39 56 392 283 31 -131 -264 60 -128
4037 -128 31 -280 112 -148 38 53 -374 16 -25 -35 11 -633 -101 145 -93 -17 -105 -1 36 -263 -8 -4 -266
4060 -266 -29 -188 -98 -371 -200 46 26 -77 -85 -172 -201 -90 -185 7 92 -269 -177 -24 -171 -130 -29 39 -43 -103
4084 -103 136 56 121 -206 -173 -77 35 -28 264 166 158 -111 -176 -4 -11 97 -36 -1 -170 -181 59 -253 256 269 81
4109 81 171 4 132 189 139 -52 66 310 -127 198 235 81 123 -199 357 405 6 302 91 375 228 315 136
$$ packed form
3945b70J71L19l23n8O1J6J8j11K50L2k26K56l07M50l94K67j08P1J2j23r4L25l2
3968B02l4j27j30L67j81j54J21j16J16j65mJ48J50j5j76r1r8K71j49J70P8L4l7
3991A80j21Q6j71J94n6qJ49n4O2l21l23M42M6O0N1l53M19j21j01q9j88K67q0m9
4015g9o5J30K65O2k81K36j81l92J75M52l65n5N7Q0J7L36j09k52j62j33L24j88
4037a28J59l11L92k60J86J5m27L90m1j0M6o44N32K46k38P6q8J04L7k99K55Mk62
4060b66K37j59R0k73J71K46k0j03qq7k9J11r5J92Q5l61R2J53j47M1J01O8q2o0
4084a03K39q0O5l27L3R6J12o3K92r8qk69o5J72pJ08j33L5j69j1K40l12N09J3j88
4109H1R0j67J28N7n0j91J18K44m37L25L7j54M2l22N56M8l99K96k11K84j47Q7j79
$$ plain form
4132 136 275 113 165 -25 25 133 -40 105 187 142 42 392 120 153 16 -152 42 222 -169 89 314 -10
4154 -10 165 -191 -22 33 82 0 0 -68 -145 -123 -37 82 37 -50 -43 -197 -189 -207 95 -230 -200 -74 -263 302 -320 -351
4180 -351 23 -151 -195 -154 29 -145 -133 114 42 -155 148 80 -71 -149 -137 154 104 -23 2 -200 143 -214 117
4203 117 40 8 -54 -259 -221 -127 -103 -112 -127 95 21 50 -355 -112 93 -113 -23 -263 307 -402 47 139 -42 -41 -30
4228 -30 136 31 -12 320 -708 -171 -70 -17 -31 452 415 -20 -395 107 189 -116 442 258 258 143 289 -206
4250 -206 25 1 168 197 -177 -123 -77 409 106 -149 -221 601 183 11 -39 80 -165 -77 -124 137 -68 -63 -88 -125
4274 -125 61 -65 -17 204 -302 125 -109 138 60 -294 53 5 -84 115 -271 -140 18 -104 8 -191 75
4295 75 245 160 -143 -86 -227 133 239 -128 53 -48 21 -98 -152 -4 -15 86 -6 -118 15 -278 -48 -66 82
$$ packed form
4132A36J39j62N2j90N0J08j73J45Q2m5j00L50k72L3j37j68J94J80l91K58K25l24
4154a0J75l56J69N5M9q2%o8p7K2Q6J19m5q7Pj54Qj8L02l25L0J26j89N65o22l1
4180c51L74j74m4M1J83j74J2K47p2j97L03o8j51p8J2K91n0j27K5k02L43l57L31
4203A17p7l2o2k05L8R4K4rj5K22p4K9m05K43K05k06R0k40N70p09M49R2j81JJ1
4228c0J66j05m3L32j028N37J01N3j4M83l7m35l75N02Q2l05N58j84%j15J46m95
4250b06K31k4J67K9l74N4M6M86l03k55p2Q22m18j72n0J19k45Q8m7K61k05Nk5l7
4274a25J86j26M8K21n06M27k34K47p8l54L47m8q9J99l86J31J58j22J12j99K66
4295G5J70q5l03N7j41L60J06l67J81j01O9j19n4J48j1J01r2j12J33k93K30j8J48
$$ plain form
4318 82 -286 -124 -69 -275 -17 -18 -352 -45 -229 -10 10 -288 -368 -436 -112 -223 -246 -380 -570 -224 -837 -782 -341
4341 -341 -915 85 -289 -298 -237 -887 -268 208 -45 977 -143 447 -175 51 -145 -5 142 137 -35 359 -95
4362 -95 321 166 282 -150 -114 50 127 -16 -149 -262 226 216 -42 62 -255 79 256 123 -173 -62 275
4383 275 331 -11 -170 137 -85 -22 165 103 52 127 75 291 198 -16 98 11 -41 88 12 -293 188 15 -68 -55
4407 -55 75 -7 203 228 -167 336 202 -70 26 -135 0 -80 -94 -30 -118 -70 -580 -218 22 -212 -176 -363 348
4430 348 387 -298 -110 302 -47 130 -96 49 -172 -48 139 -215 39 178 93 88 -112 -13 -236 -39 10 189
4452 189 98 55 113 -195 -80 -213 -140 -298 14 -90 -46 -154 -46 301 -96 119 -141 68 141 -465 158 -283
4474 -283 -156 -468 23 -130 -11 202 -152 506 -448 115 4 222 -464 56 243 76 53 311 56 -796
$$ packed form
4318H2l68J62N5k06K58jl34L07j84K19K0k98q0o8L24j11k3j34j90L46o13N5M41
4341c41n74J000l74rO1o50O19M76k53J022j120N90o22K26j96J40J47nj72L94m54
4362i5M16j55J16m32L6J64P7j43j33j13M88j0k58J04l17L34J77j33k96J11L37
4383B75N6l42j59L07k22O3J87o2n1P5n2K16r3k14J14q7n2J29p6l05M81j73q3J3
4407e5J30q2K10K5l95N03j34k72R6j61J35q0j4O4q8M8n10L62K40k34L6j87P11
4430C48L9o85J88M12l49J77k26J45k21J24J87l54K54J39q5nk00R9k23J97M9J79
4452A89r1m3N8l08J15j33P3j58L12j04M4j08J08L47l97K15k60K09P3o06O23m41
4474b83J27l12M91j53J19K13l54O58r54N63j11K18o86N20J87j67k3K58k55q52
$$ plain form
4494 -796 -389 263 793 -710 -564 560 -462 135 11 -618 -368 478 158 -103 109 482 -39 -4 -184
4513 -184 327 88 -415 186 301 44 -48 278 -295 -38 279 70 -699 -194 -202 -588 329 -158 118 81 -213
4534 -213 707 -236 -540 489 252 -10 -131 175 -153 152 -212 -158 -141 -77 80 18 188 204 -327 -7 206
4555 206 -75 32 134 -183 66 176 -51 -88 71 -54 -4 51 -85 -114 -39 -233 10 -187 -366 -312 -523 -61
4577 -61 376 -39 97 -421 -84 413 154 357 246 140 -228 452 -219 -62 -301 324 -256 -66 477 -81
4597 -81 251 -186 17 -110 -56 -125 417 118 -230 -168 -369 93 415 494 -962 367 405 -425 25 -73 119 118
4619 118 -21 61 130 105 50 105 101 -39 175 -311 152 -54 235 189 68 46 90 74 267 -21 114 79 -177 -370
4643 -370 151 -135 -28 120 218 -180 -186 408 6 207 -222 -125 108 1 226 137 263 6 32 -198 159 149
$$ packed form
4494g96M07O52N30j503J46J124j022N97j24o29K50Q46l20k61K12L73n21L5j80
4513a84N11k39n03O01J15k57r2L26n73K57L17k09p69N05ql86R17m87K76l7k94
4534b13R20r43l04J029k37k62j21L06l28L05l64N4J7O4J57o2J70J6n31L20K13
4555B06k81J07J02l17K49J10k27l7J59j25N0N5j36k9P5j94K43j97j79N4k11M62
4577f1M37m15J36n18L37M97k59K03j11j06l68O80o71J57k39O25n80J90N43n58
4597h1L32m37K03j27N4o9N42k99l48O2k01M62L22P9j456J329L8q30M50r8J92j
4619A18j39Q2O9k5n5N5mj40K14m86M63k06K89m6j21k2M4j6J93k88J35l5k56j93
4643c70N21k86J07J48R8l98oN94m02K01m29R7K33j07K25q9J26k57K6k30L57j0
$$ plain form
4665 149 25 192 -102 249 -124 23 143 -46 54 25 130 -40 -231 -11 125 -122 82 -205 108 15 -212
4686 -212 -147 4 84 -50 -175 57 -111 154 -98 88 151 -211 -218 -69 -201 232 -77 -33 -81 -1 122 -132 -120
4709 -120 228 -141 -14 -226 28 -11 8 -139 238 102 -280 -69 66 117 -141 118 342 197 2 62 168
4730 168 -174 14 19 -186 -25 167 105 -184 -16 -121 -15 -114 -19 -349 311 32 -77 158 -87 16 192 354
4752 354 295 -28 -91 -267 46 67 278 -49 486 -139 -462 -55 -151 -31 215 121 -370 -515 -49 182 185 -585
4774 -585 400 835 337 -401 87 85 -521 276 502 -196 -139 -32 110 4 -169 15 -2 58 -3 -40 -355 31
4796 31 297 501 150 -103 -34 -36 -550 -245 -33 272 -817 4 143 -158 -121 -96 -34 -96 -308 230 -67 -260
4818 -260 7 7 -76 254 -321 -4 14 -156 -101 -111 -151 -26 81 41 -51 -145 7 -174 202 210 -197 118 -18 253
$$ packed form
4665A49j24J67k94L51l73J47J20j89J00k9J05j70j91K20J36k47K04k87L13r3k27
4686b12O5J51Q0j34j25K32j68K65k52J86O3l62pJ49j32M33l09M4m8Q0J23k54J2
4709a20L48l69J27k12K54l9J9j47L77j36l82K11J35N1k58K59K24j45j95O0J06
4730A68l42J88Nk05J61J92o2k89J68j05J06r9R5l30O60k79j09K35k45J03J76J62
4752C54n9l23o3j76L13K1K11l27N35o25l23M07r6J20K46r4m91j45M66K31Lp70
4774e85R85M35m98p38M88ko06P97K26o98N7J07J42j06j73J84j7O0o1l7l15L86
4796C1K66K04l51k53O9kn14L05K12L05j089Q21J39l01L7K5O2o2k12N38k97j93
4818b60K67%q3L30n75L17J8j70N5j0m0J25J07m0r2r4J52j81L76Qm07L15j36K71
$$ plain form
4842 253 70 89 -108 -259 151 -123 245 -134 -56 36 -79 -58 -173 -27 -206 78 -110 92 56 -38 -162 155
4864 155 143 167 -186 17 -80 -29 -218 -512 -180 -76 329 170 184 -150 31 -196 -108 -221 -90 -33 97 -4
4886 -4 -124 -42 -48 -43 168 137 99 172 414 -14 123 34 -78 -19 157 -3 80 295 -4 217 -75 318 107 55 -114
4911 -114 15 125 92 -87 70 185 172 194 27 45 -162 -42 -159 -45 118 -292 105 -10 30 138 212 -128
4933 -128 220 -15 -228 -13 207 0 -89 -72 -285 156 -57 34 -141 -139 190 41 -42 191 167 66 -154 -14
4955 -14 -15 135 113 158 128 -105 65 -322 -64 192 -212 -280 110 -144 66 70 -176 -129 153 2 -168 -54 187
4978 187 -343 -173 122 59 106 121 -61 -7 -19 -213 114 125 -12 -206 57 -97 -250 25 -164 20 -204 266
5000 266 -39 -64 -72 141 -55 33 289 187 123 58 285 156 -268 74 46 76 44 -163 -119 229 -106 93 86 20
$$ packed form
4842B53j83J9j97j51M10k74L68l79P8R2j15K1j15J46j79K84j88K02l6r4j24L17
4864A55j2K4l53K03r7N1j89k94L32J04M05j59J4l34J81k27Q8j13J31N7J30j01
4886dj20Q2oNK11l1l8P3K42m28J37q9j12N9J76j60Q3K15k99K21k92L93k11n2j69
4911a14J29J10l3j79J57J15j3K2j67J8k07J20j17J14J63m10L97j15M0J08P4l40
4933a28L48k35k13K15K20k07q9J7k13M41k13R1j75KL29j49q3K33k4j01k20J40
4955a4jJ50k2M5l0k33J70l87K58K56m04o8L90k54K10Mk46M7K82j51j70J14K41
4978A87n30J70K95o3M7J5j82N4j2j94L27J1j37j94K63j54j53K75j89J84k24M70
5000B66l05k5qK13j96Q8K56j02o4o5K27j29m24L42k8L0l2k07M4L48l35J99po6
$$ plain form
5024 20 371 131 110 124 179 -243 232 44 -85 -122 132 127 59 322 59 -30 52 -162 -62 55 126 14 294 403
5048 403 -98 -40 3 150 -41 203 121 -22 38 343 -222 -70 -11 -92 11 -51 77 -135 148 48 201 -244
5070 -244 109 -18 237 159 53 33 -43 359 224 47 60 -197 6 -22 -110 194 -10 -94 -178 163 -149 -31 -300
5093 -300 229 11 -117 -121 61 85 -168 -108 -199 -74 11 -171 -215 -149 22 -320 142 -8 25 104 103 134 -84 119
5117 119 11 -35 127 165 -34 0 -65 -17 -3 -200 179 177 -74 -68 283 53 -208 -160 5 54 146 -48 0 -158 -113
5142 -113 -214 -341 636 192 -714 -255 161 -141 -309 9 38 -255 323 -385 -234 472 734 144 186 -264 393
5163 393 464 178 -75 -135 -6 -53 322 -234 -109 129 267 132 188 83 -160 -379 7 96 70 -177 -541 58
5185 58 205 -29 73 -24 -152 -25 -313 -38 -25 -46 69 -228 91 93 286 -8 93 -80 312 2 -44 125
$$ packed form
5024B0L51k40k1J4N5m22M75j88j29l7K54no8K63k63q9Q2k14J00J17P1j12K80J09
5048D03n01N8M3J47j91K44q2j43O0L05n65J52N9q1J03o2J28k12K83j00J53m45
5070b44L53j27K55p8j06k0p6M02j35j77J3k57K03k8q8L04k04q4q4L41l12J18k69
5093c00N29k18j28mJ82K4k53O0r1J25Q5j82m4O6J71l42M62j50L3P9jL1k18K03
5117A19j08m6J62L8j99L4o5M8J4j97L79kk51OL51k30k61M8J65M9R2j94M8j58M5
5142a13j01j27R77m44r06M59M16l02j68L18K9k93N78p08J51P06K62n90M2m50O57
5163C93P1k86k53o0J29m7L75n56J25K38J38j35N6j05k43k19L86Q9k6k47l64N99
5185E8J47k34J02r7j28J27k88K75J3k1J15k97L19KJ93k94J01j73L92l10m6J69
$$ plain form
5207 125 126 -43 102 -24 -7 110 202 -165 -88 -83 93 -97 47 101 -14 -7 -248 -92 -127 22 -72 -145 212 -249
5231 -249 123 -1 -87 -38 -243 87 -181 -162 -448 -33 1 -33 -283 96 60 -244 116 379 206 98 -119 63
5253 63 -107 92 8 133 59 -27 1 11 -350 23 -126 -113 -45 267 190 210 53 -18 -22 -28 -244 21 -90 -128 109
5278 109 50 77 328 6 227 113 162 118 -39 73 -94 382 -98 6 -10 2 34 79 91 208 294 294 -34 -14
5302 -14 40 85 66 32 -180 94 -75 -92 -93 65 160 76 -7 -59 -113 -6 -47 11 267 179 81 6 157 148 -222 -219 -81
5329 -81 -80 -142 -22 -138 -188 96 -124 -83 -34 -36 -2 -52 -123 -435 48 101 -59 -103 -164 -198 -138 -37 80 250 -47 31
5355 31 56 -283 115 -126 -113 365 -158 -478 473 172 -396 -877 -1 -158 0 169 -192 91 -207 -35 -41 -128
5377 -128 63 -243 -307 181 -101 -125 36 99 -138 -266 212 182 -86 -27 -269 -75 327 273 -263 2 -33 -192
$$ packed form
5207A25Jj69J45j26J7J17R2l67P7NJ76j90J44N4j15Pk41J56l5J49r4p3L57m61
5231b49L72j24q6M9k05L30k68J9k86M15L4l4k50L79l6l04L60K63j73j08k17J82
5253F3j70J99q4J25p4q6K8J0l61L73j49J3O8L12p7K0j57p1mok16K65j11l8K37
5278A09n9K7K51l22K21j14M9m4j57J12j67M76m80J04j6J2L2M5J2J17Q6%l28K0
5302a4N4M5j9l4k12K74j69j7jJ58R5q4q3n2n4J07m1N8K56q8r8p5J51rl70LJ38
5329h1Jo2J20j16n0K84k20M1M9kL4n0p1l12M83N3j60m4o1l4O0J01J17J70k97P8
5355C1K5l39L98k41J3M78n23l20R51l01n68m81Q76j57J58J69l61K83k98J72oq7
5377a28J91l06o4M88k82k4J61O3k37j28M78l0k68N9k42J94M02n4n36K65l5j59
$$ plain form
5399 -192 285 -109 -97 224 -97 214 121 -215 57 44 172 -256 -372 -122 33 -44 268 193 -21 109 -99 65
5421 65 -135 -30 148 -108 155 -142 91 195 52 -3 -139 210 -25 -129 106 -77 257 109 -87 6 -39
5442 -39 -78 21 -142 18 142 68 182 268 -44 -149 174 294 -148 -108 28 106 95 -110 -130 -32 190 40 -45 79
5466 79 173 57 10 -211 14 -50 313 199 -24 -65 66 33 107 -517 -89 50 60 -70 -113 32 -331 -55 -410
5489 -410 -234 -253 -78 -164 -77 -115 218 85 298 -386 239 179 -413 -92 -22 -267 1 -90 -408 217 -47 19 -149
5512 -149 -66 83 -1 134 -58 -200 -126 -374 -73 -244 101 44 129 -12 -123 145 -42 -204 -51 -423 -64 -60
5534 -60 122 215 -171 50 95 -109 170 149 73 -86 -15 45 -6 190 72 76 170 128 -200 122 37 185 73 -201
5558 -201 -111 267 -45 23 -158 52 205 124 -29 -64 168 172 86 -69 -22 -66 -19 -147 -78 142 31 231 -79 -228
$$ packed form
5399a92M77l94J2L21l21L11r3l36K72j3J28m28j16K50J55p7L12p5k14J30k08J64
5421F5k00J05J78k56K63k97K33J04j43n5j36L49k35j04K35j83L34j48j96R3m5
5442c9l9R9j63J60J24p4J14Q6l12j05L23J20m42M0J36P8j1k05k0R8K22j50q5J24
5466G9R4j16m7k21K25o4L63j14k23m1J31l3P4o24M28J39J0j30m3J45l63K76l55
5489d10J76j9J75q6Q7l8L33j33K13o84O25o0n92L21P0k45K68r1l18O25k64O6j68
5512a49Q3J49q4J35j92j42P4k48L01j71L45n7Q5j41j11K68j87j62J53l72L59M
5534f0J82R3l86K21M5k04K79k1p6j59P1O0n1J96j18MR4m2l28L22q5J48j12k74
5558b01R0L78l12O8j81K10J53q1j53l5K32Mq6j55M7m4M7j28O9K20j11K00l10j49
$$ plain form
5582 -228 -100 136 -31 208 -69 -190 -22 125 43 198 -248 -116 230 70 -273 -285 147 18 -204 -199 -215 282
5604 282 -101 56 -41 -122 -82 22 208 -145 8 -368 -79 -161 67 223 -16 160 279 -156 -139 -73 -163 44
5626 44 98 -43 -15 193 208 43 -126 -36 121 23 -80 -16 -205 -244 -85 -381 -1 -435 -20 269 338 -415 -227
5649 -227 -346 154 -159 -34 53 -47 -61 -96 209 86 -220 54 -11 195 -89 -206 42 -184 -118 63 -80 105
5671 105 124 194 243 -263 93 0 156 -20 -30 -9 25 -70 95 -24 390 5 -37 -157 -171 -109 287 3 -19 265
5695 265 -43 96 97 106 -62 -72 -151 -56 221 25 198 140 0 -35 -170 171 -21 -80 -21 95 -90 205 10 -96
5719 -96 -38 200 242 149 133 -99 180 50 205 75 -258 -117 355 -210 -144 -135 -87 81 -7 -25 223 -23 239 -328
5743 -328 -45 -63 -42 -93 21 -101 9 -91 -63 191 -94 22 -8 230 15 14 -39 10 13 -150 -102 -76 96 -70
$$ packed form
5582b28J28K36j67K39k77j21J68J47q2J55m46J32L46j60l43j2M32j29k22Nj6M97
5604B82l83J57r7q1M0J04J86l53J53l76K89q2K28J56k39J76J19m35J7O6r0K07
5626D4N4j41K8K08J5j65j69R0J57r8j03O4j89l9J59k96L80m34M15K89O9p53J88
5649b27j19N00l13J25Q7j00j4l5L05j23l06K74o5K06k84j17K48k26O6J81j43J85
5671A05J9P0M9n06L56r3J56j76j0K1L4r5J65j19M14l85m2j20j4O2L96k84k2K84
5695B65l08J39JRj68j0p9R5K77j96J73n8j40l5j35L41j92n9N9J16j85K95j95j06
5719i6N8K38M2r3j6k32K79j30J55j30l33J41M72n65O6RM8J68q8j8K48k46K62n67
5743c28K83j8K1n1J14j22J10j00K8K54k85J16l0K38k15jn3M9Lj63M8K6J72j66
$$ plain form
5767 -70 181 -156 1 316 57 -145 71 86 -33 58 94 16 261 -151 68 47 115 35 21 -165 38 -4 56 -54
5791 -54 133 -239 323 36 41 -86 -166 -184 -49 103 123 230 -4 211 156 36 -158 -49 6 31 134 -207 306
5814 306 98 138 -239 22 -69 -395 140 330 -210 32 -119 37 -193 -148 314 -273 12 113 5 -49 423
5835 423 19 39 179 -22 43 301 180 188 224 -31 -3 -41 -139 115 -174 114 65 180 -38 -18 45 -97 7 -207
5859 -207 156 -174 7 -158 -187 72 -108 -162 -55 -40 -104 -108 -252 -155 -103 -182 116 216 -240 -34 -64 -99 169 -23
5883 -23 125 68 48 227 203 -159 94 -128 -204 -18 40 -21 -163 44 -31 46 50 -91 -162 179 266 113 182 -17 21
5908 21 -50 -294 -22 118 290 -188 110 -103 133 -139 -141 75 147 -98 -26 90 -214 140 108 115 1 141 48
5931 48 167 134 -27 -28 106 97 -15 219 196 -160 -266 96 23 170 48 -17 -16 -55 182 462 -109 106 -17 216
$$ packed form
5767g0K51l37J57L15k59k02K16J5j19R1L6p8K45m12K19k1O8q0j4j86K03m2O0j10
5791e4J87l72N62k87Nj27q0j8J35J52K0J07k34K15n5j20j94J09N5K5J03l41N13
5814C06k08M0l77K61r1l26N35J90n40K42j51J56k30M5M62n87K85J01j08n4M72
5835D23m04K0J40k01O5K58j21QL6k55K8l8r8K54k89K88m9J15k18K0O3j42J04k14
5859b07L63l30J81j65k9K59j80n4J07J5o4mj44R7N2p9K98J00m56K06l0l5K68j92
5883b3J48n7k0J79k4l62K53k22p6J86N8o1j42K07p5P7Mj41p1L41Q7j53O9j99L8
5908B1p1k44K72J40J72m78K98k13K36k72kK16P2k45P2J16l04L54l2Pj14J40r3
5931D8J19l3j61jJ34rj12K34k3l56j06L62p3J47j22o5Jl9K37K80n71K15j23K33
$$ plain form
5955 216 6 -78 -49 253 -80 8 100 313 -24 119 230 108 -64 -157 -88 -48 250 -220 -4 96 -87 -43 40
5978 40 -141 -153 129 174 -51 -177 -123 95 103 -205 -92 -198 -133 8 240 -59 135 -25 -155 -119 -63 -42 96
6001 96 -285 -168 139 -270 -151 18 -208 -23 -87 -24 -10 67 -3 89 -32 96 -77 -87 276 -152 -111 -190 48
6024 48 -206 -213 15 9 -316 -149 -112 73 359 -220 -23 290 -395 160 -13 65 60 -272 -143 -106 -111 40 86 151 -102
6049 -102 -53 82 7 -4 46 -113 -35 303 150 16 -209 252 71 77 -22 -4 -121 23 15 -165 -129 126 40 365
6073 365 126 228 -255 242 -110 213 259 -21 -280 -9 285 -2 -104 -79 -96 -5 -215 -73 37 13 -3 101
6095 101 130 29 190 -129 264 -34 96 -6 -292 101 42 -37 21 -115 -174 -48 154 20 26 114 113 214 188 145
6119 145 144 -8 275 161 22 -610 -267 -332 511 -124 -852 -594 -376 95 -48 256 -112 -82 -20 31 60 -12 -39
$$ packed form
5955B16k10q4K9L02l33Q8R2K13l37J43J11j22j72r3O9M0K98m70K16J00j83M4Q3
5978D0j81j2K82M5k25j26N4K18Ql08J13j06O5J41K32k99J94j60j30L6N6K1J38
6001I6l81J17L07m09J19J69k26J85o4O3J4P7p0R2j21J28j73j0L63m28M1p9K38
6024D8k54pK28ol25J67L7J85K86n79J97L13o85N55j73P8nl32J29L7nJ51M6O5k53
6049a02M9J35p5j1N0j59P8L38j53j34k25M61j81Or9J8j17J44qj80L6K55q6L25
6073C65k39J02m83M97l52L23M6k80k59K71K94k87j02K5j7R1k10J42J10k4j6J04
6095A01K9j01J61l19L93k98J30j02k86L93n9p9N8j36n9J26K02j34OQ8jJ01k6m3
6119A45jj52K83j14j39o32L43o5Q43o35p28K58K18M71j43L04l68L0O2N1K9p2k7
$$ plain form
6142 -39 -83 61 212 14 11 -204 103 127 -284 -28 -410 278 90 -172 -112 461 -25 117 -69 -191 -20 27
6164 27 128 53 258 267 15 78 6 70 -19 -1 98 -90 -154 -13 37 90 2 74 27 168 46 72 -154 408 -58 -128
6190 -128 64 187 8 205 -81 24 60 154 161 57 31 -65 -82 -60 182 31 194 193 -68 138 -298 102 -107
6213 -107 -32 319 -22 200 48 265 353 122 -116 101 79 -188 61 185 -176 -64 -44 -140 261 -39 -64 -175
6235 -175 245 312 -10 66 -22 149 -18 -300 354 -108 -28 -179 118 -25 -198 -40 -92 17 284 -38 72 -9
6257 -9 117 -148 -90 -5 167 -196 69 12 -214 186 -155 119 140 -145 348 123 -303 -152 -338 -40 -95 -27 -21
6280 -21 203 -19 -308 -75 -100 -16 8 -138 183 -111 -25 -287 873 101 555 -246 -604 -771 888 653 153
6301 153 525 -392 -76 -12 135 300 87 -134 110 136 125 -594 194 -214 -234 354 705 5 -51 131 -20 164
$$ packed form
6142c9m4J44J51j98lk15L07K4m11K56l82O88j88k62O0N73m86J42j86j22J71M7
6164B7J01p5K05Rk52O3p2O4q9J8R9j88o4J41N0N3q8P2m7J41j22K6k26N62m66p0
6190a28J92J23j79J97k86J05L6R4Pj04k6r6j7K2K42j51J63jk61K06m36M00k09
6213a07P5L51l41K22j52K17Q8k31k38K17k2k67K49J24l61J12K0r6M01l00k5j11
6235a75M20O7l22P6q8J71j67k82O54m62Q0j51K97j43j73J58n2J09K67l22J10q1
6257iJ26k65N8Q5J72l63K65n7k26M00l41K74K1k85M93k25m26J51j86K98n5O8O
6280b1K24k22k89K33k5Q4K4j46L21k94Q6k62J160p72M54q01l58j67J659k35n00
6301A53L72r17L16O4J47J65k13k21K44K6j1p19P88m08k0N88L51p00n6J82j51J84
$$ plain form
6323 164 388 250 173 127 -352 577 -28 10 136 153 -50 67 -107 22 141 -2 40 275 111 -27 46 7
6345 7 266 218 -177 -261 0 -36 330 1 -194 -135 58 16 -211 185 109 42 -57 30 98 82 51 62 113 145 -85 287
6371 287 134 -143 -89 -71 -55 208 117 21 -1 -160 -256 59 -36 -99 -281 -250 100 88 -94 11 159 108 14 -133
6395 -133 -98 5 -25 93 278 -40 -2 -76 30 -128 -112 -230 104 -50 66 -119 -7 68 7 193 -16 -201
6417 -201 -31 145 116 264 167 97 -152 -271 -44 10 -5 78 -206 -212 -148 -123 312 52 33 93 81 -170 105 94 9
6442 9 14 -5 227 -104 -41 42 -36 -66 2 421 128 120 -64 -80 -6 24 -239 50 -176 307 8 121 97 -279 -132
6467 -132 133 166 340 -158 -106 343 -32 -100 -29 146 -119 -86 -56 242 -234 26 -109 228 37 -173 -114 -156 -172
6490 -172 -98 -10 -80 29 110 215 178 42 105 -44 23 -9 108 -31 -94 -94 -279 -32 -87 -215 123 -124 -303 -141
$$ packed form
6323A64K24j38p7m6m79R29o05L8J26J7k03J17j74J29J19j43M2K35j64j38P3l9
6345GK59m8l95q4K61l6L66l29j95N9J93m2k27L96p6o7r9Q7O8j6l1J1N1L2k30L72
6371B87j53k77N4J8J6K63r1r6k2j59r6L15r5o3j82L1L50j2j82J05J48n1r4j47
6395a33L5J03l0J18J85l18L8p4J06j58J6j18L34j54J16j85J12P5o1J86k09j85
6417b01J70J76k9J48r7p0k49j19K27N4j5Q3k84oO4K5M35k60j9O0j2k51K75j1q5
6442INj9K32l31O3Q3p8l0O8M19k93qj84j6P4L0k63K89k26M83k99J13k4l76J47
6467a32K65L3J74m98N2M49l75o8P1J75k65L3L0K98m76K60j35L37j91k10N9m2j6
6490a72P4Q8p0J09Q1J05l7j36O3j49O7l2J17j39o3%j85K47n5j28L38k47j79J62
$$ plain form
6514 -141 234 -72 2 75 -231 50 5 -141 -86 250 -430 126 43 -96 -145 23 -198 -39 81 82 -49 62 10
6537 10 -48 330 -163 -185 40 -273 122 350 -43 -99 -116 207 125 196 -118 -223 -217 165 -145 68 102 73 299 -131
6561 -131 28 -78 195 216 78 -1 106 294 56 147 37 123 39 -36 175 -293 344 189 -118 214 155 -116
6583 -116 10 51 -203 -260 -342 194 -61 -200 98 -69 14 -227 -47 -184 -116 -72 -108 378 9 198 44 143 -208
6606 -208 -43 -57 -83 -99 -6 -201 20 -177 99 58 -130 329 -30 191 172 -212 -78 -13 -110 -300 -293 -224 -311 -38
6630 -38 155 -150 -3 191 39 -226 61 -2 -4 -40 -241 -366 -248 122 -204 154 297 41 236 -21 -106 58
6652 58 -430 127 -3 -229 39 200 262 54 59 -76 -101 29 98 -67 152 -97 -43 197 158 18 -21 -186 172
6675 172 23 197 -69 -38 -95 94 122 1 64 233 -55 2 -34 -100 149 207 -167 91 238 -160 -235 -249 -116
$$ packed form
6514a41L75l06P4P3l06K81m5j46N5L36o80N56q3j39m9J68k21J59J20Jj31J11n2
6537A0n8L78m93k2K25l13L95K28l93n6j7L23q2P1l14j05OL82l10K13L4k9K26m30
6561a31J59j06K73K1j38p9J07J88k38R1j10Q6q4p5K11m68O37j55l07L32n9k71
6583a16J26M1k54n7q2N36k55j39K98j67Q3k41J80j37O8M4l6M86l69J89j54R9l51
6606b08J65j4k6j6R3j95K21j97K76m1j88M59l59K21j9l84J34O5r7j90PO9q7K73
6630c8J93l05J47J94j52k65K87o3kl6k01j25J18L70l26L58J43k56J95k57q5J64
6652E8m88N57j30k26K68J61O2k08Nj35k5J30O9j65K19k49N4K40l9j40l9j65L58
6675A72j49J74k66L1n7J89K8j21O3J69k88N7l6o6K49N8l74K58J47l98p5j4J33
$$ plain form
6698 -116 95 170 6 77 259 -203 211 -109 -135 -26 -152 50 -25 -43 -89 158 259 -242 214 120 121 101 -86
6721 -86 203 22 -233 35 -154 41 -167 118 49 -42 38 80 16 -20 233 -164 153 -40 97 369 269 8
6743 8 170 -181 -34 -174 -9 -113 2 255 -3 178 96 -12 -176 -139 36 -155 -87 100 -344 -86 18 62
6765 62 176 -11 114 -97 7 78 -335 -22 240 -66 85 -63 -151 -130 67 38 -362 -160 22 39 -209 -17
6787 -17 -175 60 -391 104 -136 -68 -56 108 103 -8 23 54 -187 170 119 -150 -402 77 -56 149 12 57 246
6810 246 -359 3 58 72 134 57 4 -105 -52 229 -32 29 -100 -23 -133 82 -164 429 -8 -236 111 -219 -15
6833 -15 -87 -126 205 -1 7 122 -28 -290 -85 -222 -43 -127 -46 167 -2 -42 52 -67 -501 17 31 147 113 -54
6857 -54 17 -73 58 151 -7 22 -132 221 -111 -156 -40 -72 -21 -192 -63 150 66 15 -47 -234 -505 160 82 -138
$$ packed form
6698a16K11P5j64P1J82m62M14l20k6J09j26K02p5j8m6K47J01n01M56r4Jk0j87
6721h6K89j81k55K68j89J95k08K85o9r1Q0M2o4l6K53l97L17j93J37K72j00k61
6743HJ62l51J47j40J65j04J15K53k58J81q2j08j64L7J75j91O8J87m44K58J04M4
6765F2J14j87J25k11J04P1m13L13K62l06J51j48q8K1J97k9m00K02J82J7k48J92
6787a7j58K35m51M95k40O8J2J64nj11L1L1k41L57n1k69k52M79j33K05j37M5J89
6810B46o05L62N5J4O2p7n3j09N3K81k61O1j29P7j10K15k46N93m37k28L47l30K04
6833a5p2l9L31k06QJ15j50k62K05j37J79q4Q1K13j69m0R4j19m34N18J4J16l4j67
6857e4P1r0J31R3j58K9j54L53l32m5J16l2N1j71J29K13q4n1o2j87k71O65p8k20
$$ plain form
6881 -138 55 48 -50 -36 -241 -136 -122 -89 95 243 7 -308 -48 -117 43 57 232 -190 256 -157 23 70 48
6904 48 359 138 -135 -119 -61 40 -31 39 -103 -28 10 295 -93 7 -77 -203 34 -182 181 121 13 354 -102
6927 -102 -192 -106 -30 -48 -60 5 -70 20 133 198 -128 142 -97 97 2 29 -130 -13 101 -101 -137 -154 -49 115
6951 115 -35 -22 -7 122 -71 260 -150 115 -7 51 -160 76 262 75 -311 204 -51 -147 172 33 35 29 -269
6974 -269 29 37 146 21 161 -235 100 -8 111 103 -107 90 187 -87 247 426 -65 26 322 51 -130 194
6996 194 -41 -47 -77 387 -209 -87 226 -196 -20 -13 336 72 -124 -113 8 -234 -272 -36 186 108 -160 107 315
7019 315 58 -224 297 -8 -135 180 -35 32 7 66 -9 -16 0 81 73 45 99 82 -183 37 148 -20 118 -240
7043 -240 -80 -4 35 -110 50 -223 -51 -52 -161 261 115 -138 119 -166 -226 203 -145 -160 -98 -160 -180 -25 95
$$ packed form
6881a38J93pr8J4k05J05J4L3J84J48k36l15K60o9J60J4J75m22M46m13J80M7k2
6904D8L11k21k73J6N8J01p1P0j42P5L8K85l88J00q4j26K37k16L63o0j08L41m56
6927a02r0Q6P6j8j2O5p5R0J13O5l26K70k39J94r5K7j59J17J14k02l6j7J05J64
6951A15j50J3J5J29j93L31m10K65j22N8k11K36J86j87l86N15k55r6L19j39Kok98
6974b69K98QJ09j25J40l96L35j08J19qk10J97R7k74L34J79m91R1K96k71j81L24
6996A94k35ol0M64n96J22L13m22J76PL49k64j96J1J21k42l8K36K22p8k68K67K08
7019C15k57k82N21l05j27L15k15O7k5N9p5pJ6Q1qk8N4j7k65K20J11j68J38l58
7043b40J60P6L9j45J60k73J72jj09M22j46k53K57k85o0M29l48j5O2o2k0J55J20
$$ plain form
7066 95 -125 215 208 277 137 150 99 75 -50 -33 -19 -23 -62 -210 258 -29 82 -17 -33 149 81 -145 -299 159 59
7091 59 -23 -161 174 19 -265 3 -162 -203 81 305 235 270 -52 81 -55 18 14 63 120 -43 -95 51 56 -201
7115 -201 -111 -256 -35 -173 -89 23 219 -30 189 190 67 -96 30 51 -9 12 182 183 8 105 -29 292 99
7138 99 -83 103 -84 185 -107 420 192 -10 51 306 7 -126 46 98 122 -77 125 212 -133 152 147 9
7160 9 -8 170 35 -125 69 -80 -134 -22 32 221 -10 -60 -15 36 -1 72 5 -65 9 -144 180 -76 -82 -271 -346
7185 -346 29 47 -105 -138 27 253 -217 152 -9 181 262 14 310 80 -39 177 -84 166 -253 125 -24
7206 -24 -86 -42 26 -133 152 112 -85 -13 8 -1 75 114 -157 -110 -279 152 -146 218 118 -133 -185 -23 158 -22
7230 -22 -125 -257 352 140 182 -66 -61 -140 -54 -32 260 -4 105 203 39 -268 -21 -49 -20 5 17 -20 -1 -48 116
$$ packed form
7066I5k20L40pO9j40J3n1k4j25J7J4ml9j48M68k87J11r9j6J82o8k26j54M58j00
7091E9q2j38L35j55k84K68j65m1K84K24p0L5l22J33j36P3mM9N7j63n2J46Nk57
7115b01R0j45K21j38Q4J12J96k49K19Jj23j63J26K1o0K1J70Jj75R7j34L21j93
7138I9j82J86j87K69k92N27k28k02O1K55k99j33J72N2K4j99K02Q7l45K85nj38
7160Ij7J78j35j60J94j49n4J12N4J89k31n0M5N1l7P3o7p0P4j53L24k56oj89p5
7185c46L75J8j52l3J65K26m70L69j61J90Q1k48K96k30j19K16k61K50m19L78j49
7206b4o2M4O8j59K85m0j97P2K1rP6L9k71M7j69M31k98L64j00k51n2J62J81j80
7230b2j03j32O09k12M2k48Np9Q6K2K92k64J09R8j64l07K47k8K9K5J2l7J9m7J64
$$ plain form
7255 116 -224 4 150 69 38 0 -54 -16 79 186 233 326 -238 107 27 -130 260 -192 -107 -245 -162 -181 336 -247
7279 -247 0 45 -96 -104 55 50 -46 -178 122 227 177 -107 56 -151 159 295 -165 -5 -30 -114 192 -143 -91
7302 -91 -54 -115 214 -129 -273 6 -99 -44 -93 -178 191 -175 -211 40 -334 155 -12 427 250 -153 -302 129
7324 129 76 64 -130 -14 -96 -23 -8 -34 0 -78 -54 12 73 261 -80 -176 88 9 260 -39 -231 134 -28 -39 142
7349 142 434 -75 19 218 42 32 108 -194 158 80 -171 -1 4 -77 95 99 -118 18 -53 97 183 -1 -61 94
7373 94 53 -61 56 -26 -211 -125 -115 -147 148 210 233 96 -135 358 28 -124 -114 34 58 -337 -305 -302 -346 179 -24
7398 -24 -105 -115 -254 109 22 -7 -199 17 101 235 45 -177 1 -210 173 63 241 -115 55 54 -237 -22 -93
7421 -93 -36 -62 91 134 -20 -39 55 353 -55 212 -128 109 -242 142 -135 -328 175 -80 -8 71 -64 -195 187
$$ packed form
7255A16l40K28J46q1l1l8n4L8R5J07M7R3n64L45q0j57L90m52Q5j38Q3j9N17n83
7279b47K47M5j41qJ59nr6j32L00J05n0k84J63k07L10J36m60J60k5q4L06l35N2
7302i1L7o1L29l43j44K79j05N5m9q5L69l66l6K51l74M89j67M39j77m03j49M31
7324A29n3j2j94J16q2P3J5k6L4p8K4O6O1J88l41r6K64p9K51k99j92L65j62j1J81
7349A42K92n09R4J99j76j0P6l02L52p8k51J70Nq1J72Mk17J36p1J50Q6j84o0J55
7373I4m1j14J17q2j85Q6J0l2K95O2K3j37k31M93l30j52J0J48K4l95L2Lm4N25k03
7398b4q1j0j39L63q7k9j92K16Q4J34j90k22J78k11L83j10J78l56J70jk91K15p1
7421i3N7k6J53M3j54j9R4K98m08K67l40K37l51L84k77j93N03k55P2P9j35j31L82
$$ plain form
7444 187 34 -45 -30 -20 -386 -172 22 176 173 187 276 -198 277 -39 23 106 -96 264 51 11 8 -52 -124 -87 -44
7469 -44 -5 21 -253 94 110 99 -11 293 155 49 56 219 -20 92 108 -310 35 71 -5 -34 302 -127 92 -57
7493 -57 104 -186 93 136 -190 80 -28 137 -47 75 -31 -127 8 78 -121 -13 214 2 117 -46 109
7514 109 -18 95 -77 17 -165 -1 -17 124 24 -26 95 254 16 -166 -47 48 239 135 -161 -67 -12 70
7536 70 -31 144 -153 -75 -16 -266 -87 4 -67 -374 -186 -42 -7 -33 -176 -1 112 -22 -27 13 -81 74 31 -30
7560 -30 91 252 -27 -132 -368 153 -48 -105 -50 -491 -241 -70 8 -9 431 -71 168 -244 52 55 -142 205
7582 205 -32 82 314 205 95 42 -311 -24 -23 -241 193 28 -238 -230 118 196 -105 53 -138 -54 8 166 157
7605 157 -91 199 -208 -27 71 85 -200 -3 77 28 13 -28 50 -341 19 130 125 154 -3 -37 107 4 -18 -185
$$ packed form
7444A87j53p9J5J0l66K14J94J54lJ4Q9m74M75l16O2Q3k02L60k13m0lo0p2L7M3
7469d4L9K6k74L47J6j1j10L04j38j06PJ63k39J12J6m18L45L6p6k9L36m29K19j49
7493e7J61k90K79M3l26K70j08J65j84J22j06r6J35P0j99J08K27k12J15j63J55
7514A09j27J13j72R4j82J64j6J41j00n0J21J59k38j82J19R5J91j04k96R4N5Q2
7536G0j01J75k97P8N9k50J79R1p1l07J88J44L5k6j43J75J13j34nM0r4J55m3o1
7560c0J21J61k79j05k36N21k01n7N5m41K50J71P8j7M40n02K39m12K96Lj97L47
7582B05k37J14K32j09j10n3l53K87Jk18M34j65k66QL48P8l01J58j91Q4O2J58r
7605A57k48K90m07J81R8J4k85J97Q0m9j5m1P8l91L60J11nK9j57l4J44j03k2j67
$$ plain form
7629 -185 -15 28 -152 -31 -94 58 197 -5 95 75 -54 -51 -178 -140 -12 -37 -34 285 322 216 8 -250 65
7652 65 16 -47 -27 -181 193 -213 84 -12 107 145 -228 -20 -22 73 149 -198 -9 -285 89 175 -38 105 -155 209
7676 209 -61 18 73 -6 17 186 152 -30 108 -235 191 352 -138 -58 -121 316 -177 -334 168 25 186 -119
7698 -119 111 213 292 115 22 -185 283 -179 129 801 -254 76 757 135 162 -476 -385 -468 -68 -264 121
7719 121 -609 73 33 107 -508 314 92 63 304 412 -169 445 11 -81 -196 177 24 -517 65 -167 69
7740 69 159 169 -176 -291 -347 5 -87 -240 278 30 404 -22 -186 38 -197 -254 -163 89 226 108 -79 -276
7762 -276 -401 37 141 -57 243 133 105 34 -19 171 -20 -18 116 -38 30 161 -71 -382 -626 -117 50 153
7784 153 -217 -576 437 -144 -471 -465 254 -761 -75 -633 120 421 183 -359 209 150 281 -135 -30 -56 280
$$ packed form
7629a85J70M3j80J21o3J52J39k02J00k0j29Lj27L8J28k5LL19L7j06k08k58L15
7652F5m9o3K0j54L74m06K97r6J19L8l73K08kR5P6l47J89k76L74Q6k13J43k60L64
7676B09k70P9N5p9K3J69l4j82J38l43M26J61m90Q0o3M37m93j57N02j43J61l05
7698a19K30J02P9j77r3k07M68m62L08O72j055L30O81o22K7o38R1q3M00j96L85
7719A21p30O82m0P4o15Q22k22k9K41J08n81O14m34r2j15L73j53n41N82k32K36
7740F9R0J0l45j15n6L52r2j53N18k48L74m26j64K24k35n7R1K52J37j18j87j97
7762b76j25M38J04j98L00j10k8p1n3J90j91KJ34j54O8J31k32l11k44N09J67J03
7784A53l70l59J013n81l27OP19j015O86n58P53L01k38n42N68n9J31m16J05k6L36
$$ plain form
7805 280 282 133 -102 -108 -169 -143 -89 -47 -31 -103 -15 -96 -194 18 93 -225 85 184 153 -203 -228 -67 170 -123 -188 318
7831 318 -309 -99 216 -150 47 -25 -113 50 -169 177 -178 -448 -568 65 88 339 -160 -89 139 -44 100
7852 100 -37 241 172 -36 -131 38 -141 -9 109 153 125 -69 21 98 -176 242 71 108 -704 238 -194 -188 106
7875 106 262 -300 257 263 86 208 527 -209 -101 -87 199 -305 11 111 79 -42 -126 -138 123 -6 562 -89
7897 -89 -217 -89 372 452 363 103 37 -29 46 344 -445 617 -571 660 399 39 405 -455 -484 -175 220
7918 220 31 -84 105 283 372 95 86 -377 440 235 333 -19 66 5 -235 -106 696 -94 999 188 251 174
7940 174 21 -629 -397 44 -124 -303 16 41 155 205 363 105 488 -268 188 -4 110 -287 -9 -7 -9 269
7962 269 503 -257 -13 -71 317 154 -670 14 -293 -509 92 -70 95 -208 28 25 -145 475 56 502 51
$$ packed form
7805B80Kj49k35oo1K6N4M2J6p2Q8q1r8K12P5l18L10R9l1l56k5J61K37k93o5N06
7831C18o27K10L15l66J97p2q8J63k19L46l55k70j20O33K3K51m99P1K28j83J44
7852A00j37K78o9k08r5J69j79J32J18M4k8j94R0P7k74M18j71L7q12R42m32OK94
7875A06J56n62N57Oj77J22L19p36J08J4K86n04L16J00l2j21q4j2K61j29N68o51
7897h9j28J28M61Q0q9k60o6o6P5K98p89J062j188J231k61l60L66q60k9L09L95
7918B20j89j15J89J78Q9k77rm63Q17k05R8l52Q5o1k40J29Q02p90J093q11O3p7
7940A74j53o50K32M41j68j79L19K5J14N0J58k58L83p56M56j92J14l97K78KkK78
7962B69K34p60K44n8L88j63q24O84l07k16O01j62J65l03K36lj70O20m19M46m51
$$ plain form
7983 51 -13 -192 53 211 255 -94 86 -71 225 157 -392 285 51 -10 -411 -340 -206 -35 245 260 -191 -130 192
8006 192 427 224 -95 62 -286 -204 -54 335 106 124 -26 -54 -249 13 -4 33 -7 -61 140 164 -335 13 -193
8029 -193 -189 60 -194 72 -371 17 -56 119 182 219 -43 131 41 0 -123 49 214 97 72 -150 -133 -537 249
8052 249 -199 -119 218 150 133 578 196 -180 668 -149 142 286 80 -6 414 -462 -248 617 -338 -170 -231 -37
8074 -37 -677 -57 34 782 -596 584 867 -228 779 573 567 237 -340 -507 224 844 403 260 466 -293
8094 -293 -364 -211 268 91 -954 -59 247 918 34 -689 -174 594 1115 510 -89 -370 708 258 82 621
8114 621 299 -94 497 -181 -325 -756 -373 89 317 -534 135 -14 -108 136 705 -145 30 -88 550 -43
8134 -43 -461 325 639 -106 -79 14 169 -168 -239 421 324 18 207 37 -216 3 854 85 -221 -472 -337 181
$$ packed form
7983E1o4j79K45J58M4l49J80j57K96o8n49O77k34o1m01P1J34J71K80J5m51O1L22
8006A92K35k03l19J57l48Q2J50L89k29J8j50k8j95K62j7L7m0n4K01K4m99L48k06
8029a93MK49k54K66m43L88p3J75O3L7k62J74r0m1j23J72J65j17k5k22J7m04P86
8052B49m48Q0L37o8j7M45l82l76Q48q17K91J44k06q6M20q76K14Q65r55J68o1J94
8074c7o40O20R1P48j378J180K83j095J007k06ol30n77j67P31O20m41j43K06p59
8094b93p1J53M79j77j045Q95L06O71q84p23N15P68N21o05n99k81J078m50j76N39
8114F21l22l93N91o78j44m31L83M62K28q51O69j49r4K44N69q50J75j18O38n93
8134d3m18P86L14p45K7R3J55l37p1O60r7l06J89j70k53K19Q51p69l06k51J35N18
$$ plain form
8156 181 656 -263 519 337 -75 -253 572 483 359 88 -109 307 646 -579 333 178 -342 494 185 -525
8176 -525 216 582 -938 304 -779 572 -372 123 -307 -305 424 75 860 -65 -486
$$ packed form
8156A81M75r19P82j82m12j78Q25q9j24k71j97M16L39j225R12j55n20Q36l09p10
8176e25P41L66j520J242j083J351r44M95m30KP29l49P85r25m21
8191d86
$$ Imaginary data points
##PAGE= N=2
##DATA TABLE= (X++(I..I)), XYDATA
$$ plain form
0 0 0 0 0 0 0 0 0 -8 8 -8 8 -8 14 -16 16 -24 24 -32 40 -46 54 -62 71 -80 94 -105 120 -136 157 -174 198
31 198 -222 250 -279 311 -347 386 -428 475 -528 583 -645 714 -791 877 -973 1083 -1204 1349
49 1349 -1514 1710 -1948 2241 -2611 3096 -3770 4767 -6392 9504 -17633 82466 173545 -48043
63 -48043 -148298 -44969 109875 80205 -36709 -71950 12164 62095 23156 -38528 -30283 13645
75 13645 35115 18671 4409 -4815 -15554 -23958 945 44106 51333 -7465 -59982 -33665 40190
88 40190 57675 3587 -38880 -15683 24102 21308 -11260 -18737 5422 21262 11156 -1192 -8054
101 -8054 -18485 -18326 14372 46770 21011 -41449 -53551 5523 51867 23186 -28469 -28244 9584
114 9584 15026 -12932 -16644 9327 16280 -5243 -15869 -2581 2521 -11100 -13786 9010 27126
$$ packed form
0@%%%%%%%qJ6j6J6j6K2l0L2m0M8n6P2q6J00j16J33j51J74j99K25k56K93l31L72
31A98m20M72n29N90o58P33q14R03j003J111j228J359j505J668j850K056k287K553
49A349k863L224l658M189m852N707o866Q537j1159J5896k7137J00099R1079k21588
63d8043j00255J03329J54844k9670j16914l5241Q4114M9931l8939o1684Q245M3928
75A3645K1470j6444j4262r224j0739q404K4903M3161P227n8798n2517K6317P3855
88D0190J7485n4088m2467K3197L9785k794l2568p477K4159J5840j0106j2348o862
101h054j0431J59L2698L2398k5759o2460j2102N9074M6344k8681n1655K25L7828
114I584N442k7958l712K5971O953k1523j0626J3288N102j3621k686K2796J8116
$$ plain form
127 27126 3924 -38687 -40465 10720 47232 15200 -40245 -37272 15660 31664 -14515 -43142
139 -43142 1567 48489 12215 -56527 -45189 31466 52997 -11062 -55273 -11872 42534 17901
151 17901 -44158 -41118 26251 53542 -480 -54278 -33206 23150 36293 2442 -23292 -15042
163 -15042 3967 6281 -1054 -2269 1277 1080 579 2770 -33 -9488 -10509 6904 23204 12324
177 12324 -18389 -28377 1200 31964 19620 -16498 -19806 10683 19590 -6535 -17457 8375 29045
190 29045 5769 -22641 -10769 18737 18176 -6893 -8308 14514 17424 -7885 -19667 4305 25991
203 25991 15491 -11140 -13269 4060 14681 2781 -7114 3847 15476 6231 -12506 -10518 8642
216 8642 18360 4311 -8651 -3050 7972 1742 -8629 248 17457 11715 -12419 -16478 7373
$$ packed form
127B7126k3202m2611j778N1185L6512l2032n5445K973N2932J6004m6179k8627
139d3142M4709M6922l6274o8742J1338P6655K1531o4059m4211M3401N4406k4633
151A7901o2059L040O7369K7291n4022n3798K1072N6356J3143l3851k5734Q250
163a5042J9009K314p335j215L546j97n01K191k803r455j021J7413J6300j0880
177A2324l0713r988K9577L0764j2344l6118l308L0489Q907k6125j0922K5832K0670
190B9045k3276k8410J1872K9506n61k5069j415K2822K910k5309j1782K3972K1686
203B5991j0500k6631k129J7329J0621j1900r895J0961J1629r245j8737J988J9160
216H642R718j4049j2962N601J1022o230j0371Q877J7209n742k4134m059K3851
$$ plain form
229 7373 20537 791 -18128 -3002 21740 11176 -21635 -23296 11399 30479 5478 -24268
241 -24268 -19238 7091 16104 2854 -9355 -7894 -185 2552 817 -3315 -7423 -6156 3615 9466
255 9466 1237 -16168 -18775 774 19763 12548 -16014 -28585 -5807 21721 13068 -17074 -22933
268 -22933 3411 18366 -1371 -22737 -11833 13556 12968 -10014 -16612 -485 6840 -4575 -9602
281 -9602 3208 10603 -3928 -18902 -9448 11854 14614 -4400 -17229 -6007 8040 5847 -4601
294 -4601 -8957 -120 7427 4084 -5307 -8192 -1527 6092 5886 2293 -2035 -5894 -5536 2782 11327 7332
310 7332 -5816 -10353 1312 12796 5465 -8426 -5322 10478 11607 -3400 -9747 1627 11257
323 11257 6334 -1324 -585 3066 952 -1509 3405 9756 5440 -4514 -4434 5245 9036 2626 -2611 1005
$$ packed form
229G373J3164j9746j8919J5126K4742j0564l2811j661L4695J9080k5001k9746
241b4268N030K6329R013j3250j2209J461P709K737j735m132m108J267R771N851
255I466q229j7405k607J9549J8989p215k8562j2571K2778K7528q653l0142n859
268b2933K6344J4955j9737k1366J0904K5389n88k2982o598J6127P325j1415n027
281i602J2810P395j4531j4974R454K1302K760j9014j2829J1222J4047k193j0448
294d601m356Q837P547l343r391k885O665P619k06l593m328l859L58Q318Q545l995
310G332j3148m537J1665J1484p331j3891L104J5800J129j5007o347J1374R630
323A1257m923p658P39L651k114k461M914O351m316r954Q0R679L791o410n237L616
$$ plain form
339 1005 6414 5149 -1946 -4647 2903 10237 6021 -4149 -4581 4123 6566 568 -3353 4204 8859
354 8859 796 -9593 -4098 10656 11286 -5130 -10497 1997 10640 3045 -8425 -5147 7542 8587
368 8587 -3362 -9879 -2850 6310 5889 -329 -4434 -4261 -2426 1369 1028 -1893 -3295 -1527 27 -1166
384 -1166 -3052 -3968 -2555 1060 1654 -2701 -7060 -5358 286 3341 -790 -6376 -5426 482 216 -5177
400 -5177 -4835 2209 2164 -5751 -7708 -1166 3498 -1425 -6738 -2619 3281 341 -7469 -6526 2630 5501
416 5501 -1672 -6843 -3546 1144 1698 -1000 -2838 -1382 1031 78 -2799 -2451 1754 2922 -178 -2526
432 -2526 -1131 1549 1479 -1314 -905 3840 3961 -2030 -4740 1844 6799 2883 -2371 -722 3407 3144
448 3144 239 -482 2758 4331 2034 -242 711 1670 1866 3252 3896 1317 -1345 1035 4005 3414 1002
$$ packed form
339A005N409j265p095k701P550P334m216j0170m32Q704K443n998l921P557M655
354H859q063j0389N495J4754O30j6416n367J2494Q643p595j1470L278J2689J045
368H587j1949o517P029R160m21o218m105J73J835L795l41k921j402J768J554j193
384a166j886r16J413L615N94m355m359J702N644L055m131n586R50N908k66n393
400e177L42P044m5p915j957O542M664m923n313M119N900k940p810R43R156K871
416E501p173n171L297M690N54k698j838J456K413r53k877L48M205J168l100k348
432b526J395K680p0k793M09M745J21n991k710O584M955l916n254J649M129k63
448C144k905p21L240J573k297k276R53R59J96J386O44k579k662K380K970n91k412
$$ plain form
465 1002 867 2421 3314 1628 296 762 2810 3480 1981 1083 -511 1244 3113 2960 -22 -507 1665
482 1665 1497 -1501 -450 3472 4541 -574 -3573 -32 4615 2702 -3021 -3162 3002 4993 -741 -5482
498 -5482 -2179 2619 3098 290 -3119 -4070 -1179 1928 2325 -1196 -3885 -2798 -38 1409 -1089 -3311
514 -3311 -2767 -830 211 -200 -2050 -5137 -4199 785 3576 -1249 -7804 -5914 963 3695 -603 -5447
530 -5447 -5174 -1270 678 44 -2344 -4314 -3867 -34 2321 -1091 -6112 -4784 845 2725 -630 -3925
546 -3925 -3720 -1248 937 1403 -165 -3012 -3372 -978 2010 1391 -1895 -2323 331 1641 543 -758
562 -758 -112 -624 -198 1444 2254 454 -1747 -899 2130 3793 1844 -1277 -666 1062 2282 3245 2926
579 2926 269 -1507 788 4774 3831 283 -1196 1455 3926 3466 1131 642 890 966 2945 4624 3209
$$ packed form
465A002j35J554Q93j686j332M66K048O70j499q98j594J755J869j53k982m85K172
482A665j68k998J051L922J069n115k999L541M647j913n723j41O164J991n734m741
498e482L303M798M79k808l409r51K891L107L97l521k689J087K760J447k498k222
514c311N44J937J041m11j850l087R38M984K791m825o555J890O877K732m298m844
530e447K73L904J948o34k388j970M47L833K355l412n021J328N629J880l355l295
546c925K05K472K185M66j568k847l60K394K988o19l286m28K654J310j098j301
562g58O46n12M26J642Q10j800k201Q48L029J663j949l121O11J728J220R63l19
579B926k657j776K295L986r43l548j479K651K471m60k335m89K48P6J979J679j415
$$ plain form
596 3209 -2004 -2990 2823 8082 4941 -2028 -4904 -31 7102 8254 162 -6905 -3603 6722 10678
611 10678 1950 -8622 -6021 6421 11024 1513 -8156 -5536 3808 7698 2954 -3668 -5541 -1447
625 -1447 3483 5030 875 -4173 -5438 -522 5004 4447 -2714 -7407 -4456 2957 6275 450 -8262
640 -8262 -8853 1439 9028 3334 -9114 -11070 -350 8829 3796 -7536 -9787 -1185 5068 2294
654 2294 -4527 -6029 -2913 1106 1704 -1700 -4444 -3645 -837 311 -553 -1406 -2186 -3791 -2977 432 2661
671 2661 -508 -6007 -5639 1815 5264 -1010 -7250 -4039 3438 3841 -2005 -5518 -1742 3499 2784 -3161
687 -3161 -4141 1487 4479 1060 -4807 -2635 4787 6686 -1774 -7528 -1816 9158 7503 -4994 -9929
702 -9929 463 11292 5925 -5826 -8198 2153 9978 5343 -4205 -4450 1851 5969 3455 676
$$ packed form
596C209n213r86N813N259l141o969k876M873P133J152q092p067L302J0325L956
611A0678q728j0572K601J2442M603r511r669K620R344L890m744o622j873M094
625a447M930J547m155n048j265M916N526n57p161m693K951P413L318n825q712
640h262n91J0292P589n694j2448j956J0720R179n033j1332k251Q602O253k774
654B294o821j502L116M019N98l404k744P99K808J148q64q53p80j605Q14L409K229
671B661l169n499L68P454L449o274o240L211P477M03n846l513L776N241p15n945
687c161r80N628K992l419n867K172P422J899q460n754N712J0974j655j2497m935
702i929J0392J0829n367j1751k372J0351P825m635r548k45O301M118k514k779
$$ plain form
716 676 -991 -647 1291 3474 4287 2850 -919 -3229 663 7031 7220 -934 -7195 -1653 8663 10440
732 10440 -830 -9660 -3150 9644 10243 -1181 -8659 -3270 6813 8661 1763 -6129 -4574 2765
746 2765 7077 3415 -2982 -4478 -194 3293 3351 -124 -2402 -2124 -232 1875 2601 616 -4209 -4838
762 -4838 1478 5917 1806 -6189 -7621 344 7154 3268 -7265 -8224 581 5274 2319 -6383 -6158
777 -6158 236 4874 1223 -6997 -6113 1435 4061 -2920 -6231 -2165 2934 314 -5163 -6240 2295
792 2295 4283 -1696 -6653 -2915 2670 2026 -3071 -5435 -2234 1783 1235 -1841 -4170 -1618 629 -512
808 -512 -211 -871 -1043 -1988 -1857 2282 2365 -214 -4009 -3306 1551 5625 113 -5689 -3600 2950 5898
825 5898 1673 -3890 -3752 1755 5204 3414 -1522 -3447 -260 3628 4697 1338 -3229 -2205 2942
$$ packed form
716F76j667L44J938K183Q13j437l769k310L892O368J89q154o261N542J0316J777
732A0440j1270q830O510J2794N99j1424p478N389J0083J848o898p892J555P339
746B765M312l662o397j496M284L487N8l475k278K78J892K107P26j985m825o29
762d838O316M439m111p995j432P965O810l886j0533r59Q805M693k955q702K25
777f158O394M638l651q220Q84P548K626o981l311M066N099k620n477j077Q535
792B295J988n979m957L738N585o44n097k364L201M017n48l076k329K552K247j141
808e12L01o60j72r45J31M139Q3k579l795P03M857M074n512n802K089O550K948
825E898m225n563J38N507L449j790m936j925L187L888J069l359m567J024N147
$$ plain form
840 2942 5767 2087 -2216 -1998 1447 4074 3707 657 -1649 -1387 1544 5627 3962 -997 -3711 296
856 296 5881 5241 -835 -4654 400 5075 6608 770 -5372 -3920 4408 7234 1039 -5143 -2806 3621
872 3621 5910 154 -3469 -780 2220 3307 717 -189 -737 173 -276 675 742 -770 -1760 -413 645
889 645 989 -243 -3109 -440 676 315 -116 -1679 -1254 -454 131 -895 -991 -1524 -45 -927 -1277 -1171
907 -1171 -723 -1378 -2049 -1342 -136 -909 -2603 -2679 -573 1059 -1238 -3139 -2027 -115 -263 -2125 -1974
924 -1974 -1450 -659 -691 -1263 -695 -707 -1207 -691 -543 49 -881 -1057 -692 -170 -637 -511 -594 -886 -642 -610 42
945 42 251 710 -216 -279 -255 518 1343 -298 -1108 866 1806 1079 -290 -115 1074 1613 634 -784 619
964 619 2100 2213 858 276 408 1606 1745 428 656 479 1815 1369 1289 493 434 -122 2337 1698 -131
$$ packed form
840B942K825l680m303K18L445K627l67l050k306K62K931M083j665m959k714M007
856B96N585o40o076l819N054M675J533n838o142J452Q328K826o195o182K337O427
872C621K289n756l623K689L000J087k590r06n48R10m49R51O7j512r90J347J058
889F45L44j232k866K669J116l61m31j563M25Q00N85j026r6n33J479q82l50J06
907a171M48o55o71P07J206p73j694p6K106J632k297j901J112J912j48j862J51
924a974N24P91l2n72N68j2n00N16J48N92r30j76L65N22m67J26q3k92K44L2O52
945D2K09M59r26o3K4P73Q25j641q10J974R40p27j369J75J189N39r79j418J403
964F19J481J13j355n82J32J198J39j317K28j77J336m46q0p96n9n56K459o39j829
$$ plain form
983 -131 155 370 2395 1868 975 453 719 1823 2029 1098 -367 105 2094 2515 389 -598 516 2200
1001 2200 1346 -76 -105 486 1237 566 -42 256 617 115 -165 261 318 -189 -191 -207 -78 -335 -163 -80 -795
1022 -795 -607 -517 -254 -469 -775 -1272 -842 126 -388 -1339 -947 -1004 -774 15 -839 -1750 -1664 73 -385 -746 -1782
1043 -1782 -2096 -943 -1196 -1232 -2010 -794 -1106 -1139 -1300 -1081 -624 -1809 -1571 -527 -351 -1418 -1710 -883 -515
1062 -515 -321 -851 -1102 -937 -211 -204 -270 -677 -1162 -870 141 172 -989 -771 41 -65 -152 702 -16 -976 -613
1083 -613 328 1190 1 -1020 -379 1191 1650 77 -665 171 1481 1315 85 362 1167 1201 1681 1438
1101 1438 711 927 1610 1380 1431 61 790 1581 1557 2288 1912 215 671 1768 2173 1426 -43 503 2172
1120 2172 2267 630 310 688 1441 1459 524 443 580 1340 790 577 640 926 20 -144 957 808 81 -651
$$ packed form
983a31K86K15K025n27q93n22K66J104K06r31j465M72J989M21k126r87J114J684
1001B200q54j422k9N91P51o71o08K98L61n02k80M26N7n07kj6J29k57J72Q3p15
1022g95J88R0K63k15l06m97M30R68n14r51L92n7K30P89q54r11Q6J737m58l61j036
1043a782l14J153k53l6p78J216l12l3j61K19M57j185K38J044J76j067k92Q27L68
1062e15J94n30k51J65P26Po6m07m85K92J011L1j161K18Q12j06q7Q54p18r60L63
1083f13R41Q62j189j021O41J570M59j573p42Q36J310j66j230K77Q05L4M80k43
1101A438p27K16O83k30N1j370P29P91k4P31l76j697M56J097M05p47j469N46J669
1120B172R5j637l20L78P53J8r35q1J37P60n50k13O3K86r06j64J101j49p27p32
$$ plain form
1140 -651 108 745 430 -252 -693 -319 448 514 -576 -617 -390 94 -285 -104 -338 -615 -630 -521 -575 -340 -558
1161 -558 -1143 -1237 -347 -183 -1041 -1585 -1076 -28 -147 -1345 -1659 -727 -452 -965 -1592 -766 -307 -1423 -1745
1180 -1745 -839 -58 -532 -2022 -2029 -457 339 -1147 -1845 -1539 -29 38 -769 -1156 -1169 -634 -136 -216 -910 -701
1200 -701 -613 -599 -294 255 27 -1305 -879 478 1027 251 -1074 -899 718 1849 618 -1153 -521 916
1218 916 1128 421 -366 -63 555 767 916 1393 84 -3 550 2406 1204 1104 -1084 -235 1471 917 54
1237 54 -146 444 1639 1720 686 480 1466 1385 726 274 616 1171 541 -1556 -226 2148 1930 160 -1425
1256 -1425 1510 2427 1217 -657 -1753 1572 2191 -77 -1061 113 797 115 -674 324 1055 79 -1618
1273 -1618 -452 1200 1348 -1088 -2123 -726 1173 935 -605 -2345 -1139 1410 1268 -713 -2382 -1231
$$ packed form
1140f51P59O37l15o82m41L74P67O6j090m1K27M84l79J81k34k77j5J09n4K35k18
1161e58n85r4Q90J64q58n44N09J048j19j198l14R32K75n13o27Q26M59j116l22
1180a745R06P81m74j490pJ572P96j486o98L06J510O7q07l87j3N35M98q0o94K09
1200g01Q8J4L05N49k28j332M26J357N49p76j325J75J617J131j231j771O32J437
1218I16K12p07p87L03O18K12J49M77j309q7N53J856j202j00k188Q49J706n54q63
1237E4k00N90J195Q1j034k06R86q1o59m52L42N55o30k097J330K374k18j770j585
1256a425K935R17j210j874j096L325O19k268r84J174O84o82p89R98P31r76j697
1273a618J166J652J48k436j035J397J899k38j540j740J206K549j42j981j669J151
$$ plain form
1289 -1231 339 867 -458 -1616 -1674 -619 52 440 -672 -2290 -2130 -138 840 -555 -2436 -2258 -499
1306 -499 588 -247 -1956 -1636 -1263 -670 -297 -27 -978 -2346 -2005 1191 1391 -712 -2954 -2274 1593 2818
1324 2818 -1170 -3970 -1293 1902 2383 -1604 -2873 -668 2157 1301 -1812 -1480 496 2130 -181 -1488
1340 -1488 662 2115 -38 -2046 -403 2510 2235 -1445 -2591 879 3636 1507 -1948 -1347 2446
1355 2446 2684 110 -2149 -569 2165 2045 -526 -577 1566 2303 304 -893 755 2496 1685 -481
1371 -481 -654 1494 2856 1108 -1056 -166 2274 2150 767 -672 -44 1336 1785 886 398 -366 -5
1388 -5 642 1304 1243 -428 -818 -161 1873 799 -1304 -111 653 897 411 844 130 -266 -1027 -155 1597
1407 1597 1595 -1591 -2914 231 2480 876 -2739 -3045 184 3399 509 -3844 -3300 1172 2881 -686
$$ packed form
1289a231J570N28j325j158n8J055O71L88j112j618J60J992R78j395j881J78J759
1306d99J087q35j709L20L73N93L73K70r51j368L41L196K00k103k242O80L867J225
1324B818l988k800K677L195M81l987j269K205K825q56l113L32J976J634k311j307
1340a488K150J453k153k008J643K913k75l680j146L470K757k129l455O01L793
1355B446K38k574k259J580K734j20k571n1K143P37j999j197J648J741q11k166
1371d81j73K148J362j748k164Q90K440j24j383j439O28J380M49q99m88p64L61
1388eO47O62o1j671l90O57K034j074k103J193P64K44m86M33p14l96p61Q72J752
1407A597kl186j323L145K249j604l615l06L229L215k890m353N44M472J709l567
$$ plain form
1423 -686 -3718 -1624 1369 1117 -1553 -2644 -7 1055 -1033 -2365 -297 1184 -920 -3227 -1437
1438 -1437 1396 1268 -2226 -3609 -673 2383 342 -3685 -2906 927 1960 -958 -3226 -1023 1219
1453 1219 1154 -1248 -2203 -140 1166 -464 -1944 -461 865 392 -1330 -974 402 763 -771 -1153 102
1470 102 1329 311 -1103 -6 1219 377 -489 -410 1091 459 315 214 272 374 76 386 237 1537
1488 1537 950 -60 151 1309 944 45 337 1126 1431 209 -439 831 2386 1391 -1146 -710 1824
1505 1824 2903 620 -1556 12 2208 2395 -396 -1684 1083 2572 1040 -1214 295 1589 1413
1520 1413 -662 -840 1144 1499 -386 -1112 430 2279 718 -1762 -866 1527 1935 -757 -2173 -282
1536 -282 1991 671 -1659 -1629 518 1459 -504 -1937 -531 1060 176 -1477 -1494 311 472 -907 -1721
$$ packed form
1423f86l032K094K993k52k670j091K637J062k088j332K068J481k104k307J790
1438a437K833j28l494j383K936L056k041m027P79L833J033k918k268K203K242
1453A219o5k402r55K063J306j630j480J483J326m73j722L56J376L61j534l82J255
1470A02J227j018j414J097J225q42q66P9J501o32j44j01N8J02k98L10j49J300
1488A537n87j010K11J158l65q99K92P89L05j222o48J270J555r95k537M36K534
1505A824J079k283k176J568K196J87k791j288K767J489j532k254J509J294j76
1520A413k075j78J984L55j885p26J542J849j561k480Q96K393M08k692j416J891
1536b82K273j320k330L0K147R41j963j433J406J591q84j653j7J805J61j379q14
$$ plain form
1553 -1721 -82 889 -485 -2281 -840 890 -48 -1639 -1935 -24 832 -639 -2228 -857 581 -256
1569 -256 -1716 -1563 11 288 -1416 -1591 -314 319 -442 -1587 -897 398 -259 -1087 -1669 463 563 -901
1587 -901 -1622 -525 672 73 -1168 -1199 514 981 -535 -1522 -147 1448 390 -979 -828 1159 1214
1604 1214 -471 -985 449 1459 293 -1142 147 970 926 -117 -809 805 2116 966 -675 -141
1620 -141 2024 1534 -209 -711 731 1740 314 -47 564 1342 899 -161 -26 1482 1359 146 -801
1637 -801 604 2048 946 -633 96 1291 1716 166 -537 820 1611 309 -651 22 1593 777 -865
1654 -865 -465 1845 620 -274 144 606 1128 248 -666 -998 -41 380 -348 -1421 -608 311 559 -708 -568
1673 -568 972 427 -1057 -1865 -477 317 -441 -1476 -497 525 212 -1373 -1924 41 299 -503 -1750
$$ packed form
1553a721J639R71j374j796J441J730r38j591k96J911Q56j471j589J371J438q37
1569b56j460J53J574K77j704j75J277O33p61j145O90J295o57q28n82K132J00j464
1587i01p21J097J197n99j241l1J713M67j516r87J375J595j058j369J51J987N5
1604A214j685n14J434J010j166j435J289Q23m4j043o92J614J311j150j641N34
1620a41K165m90j743n02J442J009j426l61O11P78m43j060J35J508j23j213r47
1637h01J405J444j102j579P29J195M25j550p03J357P91j302r60O73J571q16j642
1654h65M00K310j225q94M18M62N22q80r14l32R57M21p28j073Q13R19K48j267J40
1673e68J540n45j484q08J388P94p58j035R79J022l13j585n51J965K58q02j247
$$ plain form
1690 -1750 -708 575 -89 -1568 -1329 -198 83 -876 -1517 -554 166 -280 -1818 -861 13 -37 -1080 -1398
1708 -1398 -227 461 -503 -1364 -960 156 2 -1103 -1129 -51 643 -815 -1028 -152 873 305 -1126 -718
1726 -718 315 893 -400 -1109 -37 1142 691 -773 -346 973 987 -313 -541 593 955 244 -436 124
1744 124 1385 711 -111 -222 988 815 247 -215 376 1681 939 -119 -352 1215 1126 407 -218 505 1067
1763 1067 794 -41 176 818 962 214 -77 531 1392 477 -622 23 1496 1241 -280 515 437 1033 231
1782 231 -505 -163 889 719 -516 -97 357 452 39 -541 273 723 464 38 -562 829 138 562 -698
1801 -698 -498 1019 59 -40 -902 212 -5 -588 -775 -418 309 -390 -1560 -730 -389 147 -1103 -426 -246
1820 -246 -42 -827 -1357 -257 433 -423 -964 -726 186 -146 -982 -1030 -75 146 -469 -1087 -839 68 114 -841
$$ packed form
1690a750J042J283o64j479K39J131K81r59o41R63P20m46j538R57Q74n0j043l18
1708a398J171O88r64q61M04J116j54j105k6J078O94j458k13Q76J025n68j431M08
1726g18J033N78j293p09J072J179m51j464M27J319J4j300k28J134L62p11o80N60
1744A24J261o74q22j11J210j73n68m62N91J305p42j058k33J567q9p19o25P23N62
1763A067k73q35K17O42J44p48k91O08Q61r15j099O45J473k55j521P95p8N96q02
1782B31p36L42J052j70j235M19M54R5m13n80Q14M50k59m26o00J391o91M24j260
1801f98K00J517r60r9q62J114k17n83j87L57P27o99j170Q30L41N36j250O77J80
1820b46K04p85n30J100O90q56n41K38R12l32q36m8R55K21o15o18K48R07M6r55
$$ plain form
1840 -841 -1090 -80 336 -212 -728 -612 -36 169 -545 -869 -315 401 -4 -560 -413 300 366 -477 -524 374
1860 374 488 -51 -225 -34 595 537 -120 -58 355 218 -76 378 468 899 493 11 367 450 373 506 214 471
1882 471 681 767 491 298 764 721 615 390 603 352 318 750 470 757 480 21 503 710 599 218 -55
1903 -55 548 955 440 -40 118 571 754 45 300 495 484 296 164 210 172 308 -67 150 268 474 -80
1924 -80 -280 -24 52 424 -248 -468 -526 15 107 -711 -504 -304 10 -243 -494 -337 -268 -465 -591 -742 -594 -113
1946 -113 -393 -774 -487 -141 -368 -592 -581 -549 -220 64 -380 -571 -777 17 -204 -985 -526 -546 -754 -657 -918
1967 -918 -736 -855 22 130 -860 -385 -443 -288 -460 -264 115 -867 -183 -923 -611 373 113 -186 -572 -484 269
1988 269 -6 -674 -225 -629 1216 453 -104 -299 325 984 360 769 86 -15 349 282 -159 288 -137 -144 1008
$$ packed form
1840h41k49J010M16n48n16J16N76K05p14l24N54P16m05n56J47P13O6q43m7Q98
1860C74J14n39j74J91O29n8o57O2M13j37k94M54R0M31m06m82L56Q3p7J33k92K57
1882D71K10Q6k76j93M66m3j06k25K13k51l4M32k80K87k77m59M82K07j11l81k73
1903e5O03M07n15m80J58M53J83p09K55J95j1j88j32M6l8J36l75K17J18K06n54
1924h0k00K56P6L72o72k20n8N41R2q18K07K00L14k53k51J57O9j97j26j51J48M81
1946a13k80l81K87L46k27k24J1L2L29K84m44j91k06P94k21p81M59k0k08R7k61
1967i18J82j19Q77J08r90M75n8J55j72J96L79r82O84p40L12R84k60k99l86Q8P53
1988B69k75o68M49m04J845p63n57j95O24O59o24M09o83j01L64o7m41M47m25pJ152
$$ plain form
2009 1008 46 9 869 159 151 -27 1355 803 833 -132 962 1189 778 135 503 702 923 1118 -162 -56
2029 -56 66 623 929 -148 -346 516 1177 695 -693 39 598 -343 412 -238 260 1014 -507 -370 -194
2048 -194 464 -462 -117 -57 316 -293 113 -115 -335 -129 -967 75 -841 18 -158 501 -230 -594 -418 -880
2068 -880 -1147 -131 -336 -361 -303 -332 -735 309 -157 60 -871 -57 -431 -557 -499 -177 -685 -474 71 -41 -1011
2089 -1011 -643 -270 -502 -3 -390 -166 -235 285 -722 -454 200 357 180 -689 -1221 575 -132 -700 -696 -237
2109 -237 216 324 -135 79 -308 333 -4 -849 -54 325 211 -557 -546 419 433 -15 -455 -156 70 708 -204
2130 -204 -266 85 605 600 -127 292 618 537 326 -136 -261 716 624 140 -404 748 698 469 83 296 782 298
2152 298 902 -352 246 771 285 619 103 463 533 215 -152 -264 706 332 295 40 463 179 -633 124
$$ packed form
2009A008r62l7Q60p10qj78J382n52L0r65J094K27m11o43L68J99K21J95j280J06
2029e6J22N57L06j077j98Q62O61m82j388P32N59r41P55o50M98P54j521J37J76
2048a94O58r26L45O0L73o09M06k28k20K06q38J042r16Q59j76O59p31l64J76m62
2068h80k67J016k05k5N8k9m03J044m66K17r31Q14l74j26N8L22n08K11N45j12r70
2089a011L68L73k32M99l87K24o9N20j007K68O54J57j77q69n32J796p07n68MM59
2109b37M53J08m59K14l87O41l37q45P95L79j14p68J1R65J4m48m40K99K26O38r12
2130b04o2L51N20np27M19L26q1k11m62j25R77r2m84n44J152n0k29l86K13M86m84
2152B98O04j254N98N25m86L34n16L60P0l18l67j12R70l74l7k55M23k84q12P57
$$ plain form
2172 124 -183 353 51 -184 -172 -530 -83 285 -405 158 -188 838 390 -320 -433 -795 -173 141 234 -760
2192 -760 470 -401 -505 -435 -82 -483 -5 -210 -270 -343 -318 -383 -606 -539 -700 -170 237 -520 -1037 571 -343
2213 -343 -139 -1198 -79 32 -909 -1097 -876 -198 -568 -751 -1146 -778 98 199 -979 -360 -129 -36 -783
2232 -783 -571 -301 -193 -591 -456 -139 393 379 -278 247 -60 -154 136 -395 -196 797 52 373 760 357 -389
2253 -389 -367 7 -337 16 560 424 271 472 699 -28 390 701 589 717 -502 -49 977 -37 -131 156
2273 156 338 607 457 193 483 409 430 -275 178 280 581 144 27 368 310 340 -168 83 832 697 249
2294 249 336 248 719 406 222 -50 467 426 95 93 -16 329 230 -143 104 156 32 -265 -236 -109 -61 -315 -341
2317 -341 -83 -85 123 -381 -519 -6 79 -239 -333 -300 -175 -368 -302 -233 -285 -78 -263 -567 -552 -148 -342 -453 -221
$$ packed form
2172A24l07N36l02k35J2l58M47L68o90N63l46J026m48p10j13l62O22L14R3r94
2192g60J230q71j04P0L53m01M78k05o0p3K5o5k23O7j61N30M07p57n17J608r14
2213c43K04j059J119J11r41j88K21O78l70j83l95L68Q76J01j178O19K31R3p47
2232g83K12K70J08l98J35L17N32j4o57N25l07r4K90n31J99R93p45L21L87m03p46
2253c89K2L74l44L53N44j36j53K01K27p27M18L11j12J28j219M53J026j014r4K87
2273A56J82K69j50k64K90p4K1p05M53J02L01m37j17L41n8L0n08K51P49j35m48
2294B49Q7q8M71l13j84k72N17m1l31kj09L45r9l73K47N2j24k97K9J27M8k54k6
2317c41K58kK08n04j38N13Q5l18r4L3J25j93O6O9n2K07j85l04J5M04j94j11K32
$$ plain form
2340 -221 -359 -187 -297 -152 -446 -520 -382 -481 -147 -221 -572 -377 -306 -137 -164 -584 -330 -331 147 -365 -354 -286 -46
2363 -46 -53 -146 -555 906 700 -702 -204 112 197 -141 -522 -109 -225 463 776 516 -291 296 403 -113 -197
2384 -197 211 619 189 -83 241 193 0 206 18 460 438 544 226 307 565 391 291 341 329 225 170 278
2406 278 333 701 184 583 205 112 617 380 466 429 558 334 333 51 316 122 394 223 427 137 121 44 152
2429 152 260 49 43 277 235 149 225 -132 83 32 252 24 -160 24 169 -77 -312 -311 -194 -393 -111 -75 -191
2452 -191 52 -409 -177 -82 -113 -5 -330 -333 112 -154 -198 -288 -645 -141 -420 -118 -585 -305 -143 -321 -290 -237 -103
2475 -103 -313 -560 -518 -427 -241 -128 -624 -366 -287 -66 -449 -560 -171 -206 -242 -237 -185 -265 -242 -336 -429 -146 41 -233
2499 -233 42 -361 -235 -45 78 -151 -319 -151 135 -48 226 123 -100 52 115 66 3 98 292 239 260 -12
$$ packed form
2340b21j38J72j10J45k94p4J38r9L34p4l51J95P1J69k7m20K54jM78n12J1O8K40
2363d6pr3m09J461k06j402M98L16Q5l38l81M13j16O88L13k60q07N87J07n16q4
2384a97M08M08m30k72L24m8j93K06j88M42k2J06l18Q1K58j74j00N0j2j04n5J08
2406B78N5L68n17L99l78r3N05k37Q6l7J29k24jk82K65j94K72j71K04k90j6p7J08
2429A52J08k11oK34m2q6P6l57K15n1K20k28j84J84J45k46k35JJ17j99K82L6j16
2452a91K43m61K32R5l1J08l25lM45k66m4r0l57N04k79L02m67K80J62j78L1N3J34
2475a03k10k47M2R1J86J13m96K58P9K21l83j11L89l5l6NN2q0K3r4r3K83J87k74
2499b33K75m03J26J90J23k29j68J68K86j83K74j03k23J52O3m9o3R5J94n3K1k72
$$ plain form
2521 -12 196 323 121 -54 351 542 772 115 -77 362 296 366 363 311 280 338 363 -132 64 535 305 489 278
2544 278 436 536 321 111 65 263 397 381 55 61 362 134 1 154 50 464 454 -198 65 0 214 81
2566 81 -171 -34 222 -76 -64 -206 249 161 -110 -211 -166 155 -311 3 -378 -317 -135 -402 -26 -232 -52 186
2588 186 -270 -343 -323 -117 5 -126 -154 -162 -274 -366 17 -362 -347 -68 -120 -54 -352 -256 129 -375 -333 -400 -49 -86
2612 -86 -234 -225 -126 -91 -99 2 -529 -298 -42 -136 -467 -6 -58 0 -340 -457 -218 250 144 -106 -183 -67 25 -86
2636 -86 -138 -83 -162 161 211 -269 334 191 60 174 -173 217 382 248 -6 112 330 224 416 113 -141 462
2658 462 606 196 128 141 272 388 -63 -5 112 807 358 -110 618 440 451 -59 278 49 276 221 156 273
2680 273 131 484 327 133 94 393 375 31 207 186 106 126 90 93 282 57 75 11 -225 -17 -107 -365 -292 216
$$ packed form
2521a2K08J27k02j75M05J91K30o57j92M39o6P0ln2l1N8K5m95J96M71k30J84k11
2544B78J58J00k15k10m6J98J34j6l26OL01k28j33J53j04M14j0o52K63o5K14j33
2566H1k52J37K56k98J2j42M55q8k71j01M5L21m66L14l81O1J82k67L76k06J80K38
2588A86m56p3K0K06J22j31k8qj12r2L83l79J5K79n2O6k98R6L85n04M2o7L51l7
2612h6j48RR9L5qJ01n31K31K56r4l31M61n2N8l40j17K39M68j06k50p7J16R2j11
2636h6n2N5p9L23N0m80O03j43j31J14l47L90J65j34k54J18K18j06J92l03k54O03
2658D62J44m10o8J3J31J16m51N8J17O95m49m68P28j78J1n10L37k29K27n5o5J17
2680B73j42L53j57j94l9K99j8l44J76k1q0K0l6LJ89k25J8o4k36K08r0k58P3N08
$$ plain form
2704 216 -282 -270 -322 -269 -357 104 111 -204 -251 -286 -371 -535 -411 -50 -197 239 2 -416 -266 -147 64 -508 -449
2727 -449 -163 -422 -58 -443 -335 -191 -182 -490 -623 -114 -154 -431 -391 -193 -211 90 -403 -359 -92 -265 -47 -420
2749 -420 -99 -13 34 -134 -303 -273 94 158 -36 -194 -242 10 -428 -223 51 -48 -235 171 95 -14 165 50
2771 50 297 150 353 130 255 145 121 -76 280 327 16 196 469 251 208 471 120 162 256 486 282 201
2793 201 591 400 265 138 442 322 406 286 214 -31 795 166 69 267 486 550 -134 98 144 53 121 276
2815 276 124 241 384 -75 -325 135 260 177 -22 115 346 70 -156 -115 -483 71 91 -84 -63 1 195 -230
2837 -230 -167 -165 54 83 -248 -412 5 61 -353 -144 -58 146 26 -417 -357 -257 -165 -113 -383 -400 -431 -73 -452 -110
2861 -110 -24 -389 -436 -213 126 -235 -476 -526 -144 -141 -306 -294 -301 -112 -214 -235 116 -124 -43 -349 -226 -271 -213 -197
$$ packed form
2704B16m98J2n2N3q8M61Pl15m7l5q5j64J24L61j47M36k37m18J50J19K11n72N9
2727d49K86k59L64l85J08J44Rl08j33N09m0k77M0J98j8L01m93M4K67j73K18l73
2749d20L21Q6M7j68j69L0L67O4j94j58m8K52m38K05K74r9j87M06p6j09J79j15
2771E0K47j47K03k23J25j10k4j97L56M7l11J80K73k18m3K63l51M2R4K30k04q1
2793B01L90j91j35j27L04j20Q4j20p2k45Q26o29r7J98K19O4o84K32M6r1O8J55
2815B76j52J17J43m59k50M60J25q3j99J37K31k76k26M1l68N54K0j75K1O4J94m25
2837b30O3KK19K9l31j64M17N6m14K09Q6K04j20m43O0J00R2N2k70j7l1L58l79L42
2861a10Q6l65m7K23L39l61k41n0L82Lj65J2pJ89j02k1L51k40Q1l06J23m5N8J6
$$ plain form
2885 -197 -527 -200 213 73 235 46 -74 157 -8 22 -65 424 286 -87 -121 -6 150 -33 -299 103 487
2906 487 231 172 -59 207 350 -35 26 296 310 201 -203 65 369 242 467 53 225 59 439 79 -178
2927 -178 203 464 97 62 329 475 272 -116 -7 -113 348 237 121 291 371 -95 17 106 201 -191 239
2948 239 -18 189 243 33 17 236 523 83 -316 -23 110 161 -423 241 -168 223 19 -412 192 -9 162
2969 162 -211 -303 165 116 -68 -294 -213 -28 -71 -365 -415 271 -79 -292 -83 116 -140 -134 -166 -219 -69 -352 -312
2992 -312 -446 -150 174 -187 -118 -121 -6 -107 -30 -542 -510 153 -185 -428 -341 93 207 175 -364 122 -57 -153 -476
3015 -476 -162 43 -214 -406 -129 197 317 169 -218 -23 141 281 -193 40 240 -109 -20 -176 129 381
3035 381 -21 233 312 160 -108 -52 142 218 121 61 -165 -20 237 152 -93 287 284 299 -45 181 143 314 228 72
$$ packed form
2885a97l30L27M13j40J62j89j20K31j65L0q7M89j38l73l4J15J56j83k66M02L84
2906D87k56n9k31K66J43l85O1K70J4j09m04K68L04j27K25m14J72j66L80l60k57
2927a78L81K61l67l5K67J46k03l88J09j06M61j11j16J70Q0m66J12Q9R5l92M30
2948B39k57K07N4k10j6K19K87m40l99K93J33N1n84O64m09L91k04m31O04k01J71
2969A62l73r2M68m9j84k26Q1J85m3k94n0O86l50k13K09J99k56Ol2n3J50k83M0
2992c12j34K96L24l61O9lJ15j01P7n12L2O63l38k43Q7M34J14l2n39M86j79r6l23
3015d76L14K05k57j92K77L26J20j48l87J95J64J40m74K33K00l49Q9j56L05K52
3035C81m02K54P9j52k68N6J94P6r7o0k26J45K57q5k45L80lJ5l44K26l8J71q6j56
$$ plain form
3059 72 300 463 629 -258 -2 393 393 131 -16 240 373 221 6 -57 179 297 119 -203 289 -29 233
3080 233 11 -66 -56 337 313 -308 215 173 -60 -155 -160 62 338 -195 -264 89 6 -117 46 -123 -28 -45 -272 -164
3104 -164 31 100 -277 -292 -264 -57 -145 -13 87 18 -14 -328 -147 180 -139 22 -204 -162 55 -318 -381 -218 -1
3127 -1 -236 -55 -366 -146 -80 -269 -160 -253 27 144 -3 -254 -199 103 53 313 317 15 -360 -898 277 567
3149 567 538 -409 -891 -739 146 43 -133 319 575 258 -105 40 36 444 574 596 -289 -407 59 -23 -235 -414
3171 -414 -252 499 63 385 279 99 -195 4 -368 657 258 169 869 -970 739 -281 63 939 -15
3190 -15 -551 -633 271 491 406 105 170 419 245 -204 -1 -288 252 -323 -235 -222 346 91 20 -140 -130 301 -261
3213 -261 -147 137 331 54 -301 -163 116 84 -133 -13 36 143 283 -90 -388 -85 34 -246 -78 -202 -105
$$ packed form
3059G2K28J63J66q87K56L95%k62j47K56J33j52k15o3K36J18j78l22M92l18K62
3080B33k22p7J0L93k4o21N23m2k33r5nK22K76n33o9L53q3j23J63j69R5j7k27J08
3104a64J95O9l77j5K8K07q8J32J00o9l2l14J81L27l19J61k26M2K17l73o3J63K17
3127ak35J81l11K20O6j89J09r3K80J17j47k51N5L02n0K60Ml02l75n38J175K90
3149E67k9r47m82J52Q85j03j76M52K56l17l63J45mM08J30K2q85j18M66q2k12j79
3171d14J62P51m36L22j06j80k94J99l72J025l99q9P00j839J709j020L44Q76r54
3190a5n36q2R04K20q5l01O5K49j74m49K03k87N40n75Q8J3N68k55p1j60J0M31n62
3213b61J14K84J94k77l55J38K79l2k17J20M9J07J40l73k98L03J19k80J68j24R7
$$ plain form
3234 -105 -75 -327 27 83 -335 -275 -242 -182 -245 -239 -173 -368 -38 -119 -168 -199 -2 -297 2 -11 -73 12 -119 -185 -343
3259 -343 -208 -52 -213 -249 -203 -14 44 -199 -127 -149 -172 -209 -158 63 -215 -204 77 -2 -146 69 89 140 144 219 254
3284 254 128 -70 245 89 172 -142 126 66 -69 -186 145 270 156 129 -77 173 -11 338 -34 140 127
3305 127 124 110 -31 192 36 165 297 43 312 72 331 -115 257 230 -118 -62 393 402 158 121 389 214 79
3328 79 317 108 -72 404 97 149 404 68 119 -85 45 92 62 149 34 85 118 -191 97 41 -106 -231 43
3351 43 66 91 -212 -319 -108 -140 182 -135 -379 -40 222 -30 -31 -297 -45 -80 -102 -83 -160 -124 -14 -170 -205 -173
3375 -173 -27 -354 -251 -163 -149 -237 -183 -333 -173 -25 43 -160 -163 -109 -5 -206 -294 -79 77 20 -111 -294 -438
3398 -438 45 -70 43 137 -47 88 -174 -66 -45 174 197 -40 -13 -36 -502 87 -281 55 375 -61 101 -25
$$ packed form
3234a05L0k52L54N6m18O0L3O0o3OO6j95L30q1m9l1J97k95K99j3o2Q5j31o6j58
3259c43J35J56j61l6M6J89N8k43P2k2k3l7N1K21k78J1K81p9j44K15K0N1MP5L5
3284B54j26j98L15j56Q3l14K68o0j35j17L31J25j14k7k06K50j84L49l72J74j3
3305A27lj4j41K23j56J29J32k54K69k40K59m46L72k7l48N6M55Rk44l7K68j75j35
3328G9K38k09j80M76l07N2K55l36N1k04J30M7l0Q7j15N1L3l09K88n6j47j25K74
3351D3K3K5l03j07K11l2L22l17k44L39K62k52jk66K52l5k2J9p7L6J10j56l5L2
3375a73J46l27J03Q8J4q8N4j50J60J48O8k03lN4J04k01q8K15J56n7j31j83j44
3398d38M83j15J13R4j84J35k62J08K1K19K3k37K7k3m66N89l68L36L20m36J62j26
$$ plain form
3420 -25 -106 381 41 -193 155 -138 373 24 67 -20 262 171 53 11 -2 44 299 94 132 -29 -16 160 178 32
3444 32 28 -55 216 -112 344 316 338 129 335 248 242 12 -127 75 -6 264 225 116 228 -119 213 16 -27 208
3468 208 91 80 59 87 103 -239 3 41 24 197 -62 77 -281 374 40 -108 -52 315 64 8 -98 -31 -113
3491 -113 53 -24 -88 -20 -243 -138 -99 -338 -250 -200 -40 -44 -63 -53 -155 -193 -202 -314 -33 222 -171 154 -147 -323
3515 -323 -267 -145 -334 48 -276 -335 2 -71 110 -202 -155 -307 -237 17 -11 -72 328 118 70 -45 51 -3 -18 -342
3539 -342 -426 35 140 -53 -146 -2 168 43 30 -20 286 -50 175 45 182 -92 161 -133 143 127 242 -5
3561 -5 -67 200 107 62 326 -9 9 -127 -113 115 203 259 131 295 176 303 308 140 211 99 22 182 84 122 -133
3586 -133 362 64 100 -83 255 -45 -261 23 155 51 73 13 16 454 -107 42 232 150 -186 -16 119 -1
$$ packed form
3420b5q1M87l40k34L48k93N11l49M3q7K82r1j18m2j3M6K55k05L8j61J3J76J8j46
3444C2mq3K71l28M56k8K2k09K06q7ok30j39K02q1K70l9j09J12l47L32j97m3K35
3468B08j17j1k1K8J6l42K42L8j7J73k59J39l58O55l34j48N6L67k51n6j06O7q2
3491a13J66p7o4O8k23J05L9k39Q8N0J60mj9J0j02l8rj12K81K55l93L25l01j76
3515c23N6J22j89L82l24n9L37p3J81l12M7j52P0K54k8o1M00k10m8j15R6n4j5l24
3539c42q4M61J05j93r3J44J70j25j3n0L06l36K25j30J37k74K53k94K76j6J15k47
3561eo2K67r3m5K64l35J8j36J4K28Q8N6j28J64j19J27Nj68P1j12p7J60r8L8k55
3586a33M95k98L6j83L38l00k16K84J32j04K2o0LM38n61J49J90q2l36J70J35j20
$$ plain form
3608 -1 -48 81 -120 -95 -96 6 -2 26 -279 -53 -155 -232 37 -212 -109 -55 -166 87 -41 -53 -186 -349 -106 -320
3632 -320 -175 -218 -134 -264 -88 64 -285 -238 -114 -275 -129 -63 -94 -132 -117 -31 -341 101 -120 -200 -205 -391 -153 -347
3656 -347 -7 -124 -175 57 -263 98 -310 30 -70 -84 140 -275 150 131 153 91 202 -236 99 103 110 -133 67
3679 67 -62 -55 107 -136 -111 75 277 -28 107 3 117 -27 -215 127 144 -17 322 -52 33 -71 14 163
3701 163 15 324 52 181 -87 -46 3 412 138 80 367 347 114 19 71 -129 111 177 210 264 276 193 378 170
3725 170 -170 -93 7 -134 8 116 64 64 -169 143 19 28 83 -103 58 -107 -187 75 -223 -354 25 -286 27
3748 27 -280 269 -63 -237 19 -10 -101 -44 -252 132 21 -128 -147 -135 -200 -136 -132 -229 49 -34 -239 -42 -100 -248
3772 -248 -131 -447 -188 -16 -36 -345 263 -10 -26 -147 -217 -383 -240 -191 -102 -114 167 49 -65 105 16 -206
$$ packed form
3608am7J29k01K5jJ02qK8l05K26j02p7K69k49J03N4j11K53j28j2j33j63K43k14
3632c20J45m3Q4j30J76J52l49M7J24j61J46O6l1l8J5Q6l10M42k21q0nj86K38j94
3656c47L40j17n1K32l20L61m08L40j00j4K24m15M25j9K2o2J11m38L35MPk43K00
3679F7j29PJ62k43K5J86K02l05J35j04J14j44j88L42J7j61L39l74Q5j04Q5J49
3701A63j48L09k72J29k68M1M9M09k74n8K87k0k33r5N2k00K40O6L3N4J2q3J85k08
3725A70l40P7J00j41J42J08n2%k33L12j24RN5j86J61j65q0K62k98j31L79l11L13
3748B7l07N49l32j74K56k9r1N7k08L84j11j49j9J2o5O4Mr7K78q3k05J97n8j48
3772b48J17l16K59J72k0l09O08k73j6j21p0j66J43M9Q9j2K81j18j14J70q9k22
$$ plain form
3794 -206 -214 -36 237 -205 137 99 -88 330 41 -72 -189 -86 -296 64 132 -33 -11 -225 165 -257 -31 281
3816 281 206 -64 156 310 251 182 70 242 -142 275 221 -178 -15 380 -80 -59 170 346 121 33 115 -153
3838 -153 -68 -67 386 226 94 40 -16 68 199 122 -49 -24 -52 215 91 80 -161 63 203 7 232 138 242 16
3862 16 146 -64 133 -100 -283 -71 -60 -28 -245 -79 -61 220 -52 86 -173 -80 -160 85 -88 -191 -280 -27
3884 -27 -100 20 20 -156 -59 -152 -90 -30 108 -222 -119 -74 18 -223 -175 -82 161 -189 -24 -164 -343 -287 -102 -2
3908 -2 -40 -43 226 -147 -177 54 206 -101 -216 -100 -61 -38 -154 -42 -16 170 -117 -827 -683 -101 -19 -551 -252
3931 -252 242 -11 -91 -15 10 -237 54 -12 -155 18 275 5 20 -6 -55 268 250 107 131 239 126 7 -99
3954 -99 -66 230 150 344 -288 38 -9 -76 135 -42 -43 393 230 -83 -10 61 -131 383 -52 46 123 81 -339 -269
$$ packed form
3794b06qJ78K73m42L42l8j87M18k89j13j17J03k10L60O8j65K2k14L90m22K26L12
3816B81p5k70K20J54n9o9j12J72l84M17n4l99J63L95m60K1K29J76k25q8Q2k68
3838a53Q5JM53j60j32n4n6Q4J31p7j71K5k8K67j24j1k41K24J40j96K25r4J04k26
3862A6J30k10J97k33j83K12J1L2k17J66J8K81k72J38k59R3q0K45j73j03q9K53
3884b7p3J20%j76R7r3O2O0J38l30J03M5R2k41M8R3K43l50J65j40j79N6J85J00
3908bl8lK69l73l0K31J52l07j15J16L9K3j16J12K6J86k87p10J44N82Q2n32K99
3931b52M94k53q0P6K5k47K91o6j43J73K57k70J5k6m9L23j8j43K4J08j13j19j06
3954i9L3K96q0J94o32L26m7o7K11j77jM36j63l13P3P1j92N14m35R8P7m2m20P0
$$ plain form
3978 -269 0 0 58 26 67 4 179 242 100 250 244 138 78 -169 85 94 40 8 -193 -196 -9 9 -146 96 -61 373
4004 373 -19 8 -297 87 -94 48 -101 276 -62 -121 65 -277 116 -69 16 -13 -564 -103 112 10 -80 -450
4026 -450 -406 64 -425 -3 -262 -132 -144 -62 -166 -202 21 171 172 215 -135 -342 24 -94 87 -180 -96 -87 -30 -2
4050 -2 173 -51 -265 -23 104 -385 159 -43 -9 -93 -20 -53 240 265 -22 124 204 -147 -18 240 -3 200 -72
4073 -72 113 209 86 132 184 145 145 23 -50 239 -11 -218 381 351 12 106 152 183 235 86 -105 -114 130 -36 -70
4098 -70 14 211 206 -12 -118 211 126 120 -92 -138 -19 224 152 187 118 175 61 162 79 169 134 93 -152 -22 25 21
4124 21 45 123 8 -283 225 -44 -208 -165 -251 -50 -7 -361 392 139 -113 145 -28 40 -109 -178 -213 -72 -127
4147 -127 -39 -72 -272 174 -464 -97 168 -395 -155 42 28 -92 210 -414 59 -161 -173 -181 297 -75 79 112
$$ packed form
3978b69K69%N8l2M1o3J75O3j42J50oj06o0k47K54Rn4l2k01lJ87J8j55K42j57M34
4004C73l92K7l05L84j81J42j49L77l38n9J86l42L93j85Q5k9n51M61K15j02r0l70
4026d50M4M70m89M22k59J30j2Q2j04l6K23J50JM3l50k07L66j18J81k67Q4RN7K8
4050bJ75k24k14K42J27m89N44k02L4q4P3l3K93K5k87J46Q0l51J29K58k43K03k72
4073g2J85R6j23M6N2l9%j22p3K89k50k07N99l0l39R4M6L1N2j49j91rK44j66l4
4098g0Q4J97nk18j06L29q5ok12m6J19K43p2L5o9N7j14J01q3R0l5m1k45J30M7m
4124B1K4P8j15k91N08k69j64M3q6K01M3l54P53k53k52K58j73O8j49o9l5J41n5
4147a27Q8l3k00M46o38L67K65n63K40J97j4j20L02o24M73k20j2qM78l72J54L3
$$ plain form
4169 112 -257 341 -245 47 12 138 85 81 -35 -3 52 -118 -197 -276 48 4 -34 -124 132 159 202 -85 -221 -128 -234
4194 -234 7 -120 133 60 128 315 37 -160 -35 -41 146 108 161 114 205 211 206 122 29 137 228 -217 389 356 14
4219 14 48 150 212 140 304 423 121 -54 -82 179 146 905 1066 -7 -120 335 124 768 110 264 -133 -296
4241 -296 185 -299 549 -353 206 -43 -265 126 98 217 -53 -13 547 3 146 410 519 213 104 62 472
4262 472 -160 -169 75 60 -33 -15 -233 251 -302 -85 -40 -111 134 -287 164 -79 -292 -65 -85 88 -44 -291 11
4285 11 -47 235 318 -194 33 233 -202 -24 -109 218 245 -1 7 -104 80 -104 -134 -172 -251 -235 -178 -198 -153 -140 12
4310 12 -78 -149 -119 -68 -237 -182 -9 30 127 99 325 -76 -215 143 -49 -45 -4 -247 -261 -136 -145 167 -322 154 470
4335 470 -210 -38 711 -22 -6 56 -151 59 212 -678 -202 -463 -328 768 497 217 -140 -64 -119 -55 160
$$ packed form
4169A12l69N98n86K92l5J26n3mj16L2N5j70p9p9L24m4l8r0K56K7M3k87j36R3j06
4194b34K41j27K53p3O8J87k78j97J25oJ87l8N3m7R1Onq4r3J08R1m45O06l3l42
4219A4L4J02O2p2J64J19l02j75k8K61l3P59J61j073j13M55k11O44o58J54l97j63
4241b96M81m84Q48r02N59k49k22L91k8J19k70M0N60n44J43K64J09l06j09m2M10
4262D72o32rK44j5r3J8k18M84n53K17M5p1K45m21M51k43k13K27k0J73j32k47L02
4285A1n8K82Q3n12K27K00m35J78q5L27K7k46Qj11J84j84l0l8p9J6N7k0M5J3J52
4310A2r0p1L0N1j69N5J73L9R7k8K26m01j39L58j92MM1k43j4J25rL12m89M76L16
4335D70o80J72P49p33J6O2k07K10J53q90M76k61J35J096k71k80l57P6n5O4K15
$$ plain form
4356 160 -10 127 -101 21 324 6 134 -194 309 123 262 87 220 -36 -153 -96 -257 505 323 366 -65
4377 -65 -60 151 -58 -130 240 -169 -53 33 10 -166 -63 174 114 -117 110 -105 -2 225 -80 -30 61 -104 -72
4400 -72 -91 54 -102 -87 -66 -140 -64 -221 -244 -411 -219 -218 -104 -39 -107 -143 168 -38 -120 -219 -423 202 -35 -335 206
4425 206 471 19 684 376 181 163 -31 -106 374 -218 125 -106 -101 132 1 76 72 -163 -108 -82 196 -44 80
4448 80 23 67 -12 103 -132 86 345 456 -85 312 -120 30 -208 -103 290 -139 61 -11 84 63 -332 159
4470 159 469 -232 -43 -91 -270 -39 -196 -232 74 401 52 -448 35 246 -353 -16 -39 -392 -1005 -554 286
4491 286 -723 -218 -841 625 -73 212 394 482 -549 -263 502 214 -355 405 -787 -185 683 382 -270
4510 -270 216 -39 -101 34 217 -303 76 112 -125 -26 271 200 45 -374 -61 471 -796 -147 -201 322 188
$$ packed form
4356A60j70J37k28J22L03l18J28l28N03j86J39j75J33k56j17N7j61P62j82M3m31
4377f5NK11k09p2L70m09J16Q6k3j76J03K37o0k31K27k15J03K27l05N0R1j65L2
4400g2j9J45j56J5K1p4P6j57k3j67J92JJ14O5o8l6L11k06q2r9k04O25k37l00N41
4425B06K65m52O65l08j95j8j94p5M80n92L43k31NK33j31P5mk35N5K6K78k40J24
4448H0n7M4p9J15k35K18K59J11n41L97m32J50k38J05L93m29K00p2R5k1l95M91
4470A59L10p01J89m8j79K31j57l6L06L27l49n00M83K11n99L37k3l53o13M51Q40
4491B86j009N05o23J466o98K85J82Q8j031K86P65k88n69P60j192O02Q68l01o52
4510b70M86k55o2J35J83n20L79L6k37R9K97p1j55m19L13N32j267O49n4N23j34
$$ plain form
4531 188 -138 -406 -186 -111 -534 -265 230 -406 -65 140 -364 -86 -400 90 -39 -175 -111 -59 -201 -178 -139 -147
4553 -147 103 162 30 1 -199 -163 -109 -125 -113 -67 -18 -409 -51 -88 7 31 -120 -8 121 -157 -213 -216 125 81 -52
4578 -52 -98 30 227 220 83 -27 -515 -665 -49 51 62 1018 -10 383 -810 289 270 -1712 45 87 954
4599 954 -331 609 1213 400 293 -720 -121 -513 366 150 -40 463 783 347 -394 138 -92 382 -25
4618 -25 108 106 -78 30 -281 185 385 330 128 -113 94 288 -16 28 -260 -33 -59 123 -287 -28 -249 -10
4640 -10 -240 -189 223 141 207 130 239 38 -58 -99 84 196 79 -55 203 358 -106 -328 172 276 253 -485 -133
4663 -133 168 140 -307 211 -50 191 -71 -171 -30 21 274 62 -423 -28 85 -182 -185 -103 -325 -19 279 17
4685 17 -245 -263 -122 167 53 -104 -163 261 43 3 139 -133 131 249 -97 -147 191 195 30 100 -87 -53 30
$$ packed form
4531A88l26k68K20P5m23K69M95o36L41K05n04K78l14M90j29j36O4N2j42K3L9q
4553a47K50N9j32k9k00L6N4j6J2M6M9l91L58l7R5K4j51J12J29k78n6lL41m4j33
4578e2m6J28J97pj37j10m88j50O16J00J1R56j028L93j193J099j9j982J757M2Q67
4599I54j285R40O04q13j07j013N99l92Q79k16j90N03L20m36p41N32k30M74m07
4618b5J33kj84J08l11M66K00n5k02k41K07J94l04M4k88K27k6J82m10K59k21K39
4640a0k30N1M12q2O6p7J09k01r6m1J83J12j17j34K58J55m64k22N00J04k3p38L52
4663a33L01k8m47N18k61K41k62j00J41N1K53k12m85L95J13k67lQ2k22L06K98k62
4685A7k62j8J41K89j14j57n9M24k18m0J36k72K64J18l46n0L38Mj65P0j87L4Q3
$$ plain form
4708 30 71 -15 -209 -42 63 203 -161 -79 -11 387 337 143 -69 316 62 496 -51 218 -177 83 -191 80
4730 80 14 -102 14 60 241 -135 205 -94 -113 161 180 -33 -196 228 -27 136 317 188 545 476 -308 880
4752 880 536 -836 171 -342 65 747 239 -584 248 158 -772 337 548 544 198 55 -420 -181 164 -537
4772 -537 495 35 277 9 107 -222 227 22 523 16 238 -262 -309 93 -298 108 120 62 65 27 170 0
4794 0 279 -397 -158 20 -312 -530 371 43 343 338 11 525 -126 386 148 638 -252 -174 -194 15 -224 149
4816 149 20 38 388 211 -234 234 97 -232 31 6 -110 102 -117 -133 -1 -99 123 -23 -185 -135 -234 239
4838 239 156 -17 9 46 69 -20 -53 134 -118 274 33 -67 22 -84 154 -53 258 407 303 -160 249 84
4860 84 120 11 235 -242 19 32 -29 55 230 -190 180 132 -79 228 103 339 82 -1 355 187 -143 -261
$$ packed form
4708C0M1q6j94J67J05J40l64Q2O8L98n0j94k12L85k54M34n47K69l95K60k74K71
4730H0o6j16J16M6J81l76L40k99j9K74J9k13j63M24k55J63J81j29L57o9p84J188
4752H80l44j372J007n13M07O82n08q23Q32r0r30J109K11ml46j43m75K39L45p01
4772e37J032m60K42k68R8l29M49k05N01n07K22n00m7M02l91M06J2n8Ll8J43j70
4794@K79o76K39J78l32k18R01l28L00nl27N14o51N12k38M90q90P8k0K09k39L73
4816A49j29J8L50j77m45M68j37l29K63k5j16K12k19j6J32r8K22j46j62N0r9M73
4838B39q3j73K6L7K3q9l3J87k52L92k41j00Q9j06K38k07L11J49j04m63M09j65
4860H4L6j09K24m77K61J3o1Q4J75m20L70m8k11L07j25K36k57q3L56j68l30j18
$$ plain form
4882 -261 173 193 -65 -73 48 24 -273 -248 -5 -58 436 -287 28 38 110 30 -137 -351 -105 -145 89 77 -210 -36
4906 -36 123 2 -82 262 -31 -75 5 313 193 80 23 177 -163 -30 39 -54 115 -175 -158 -89 119 -296 49
4929 49 138 -385 -169 68 -240 13 20 -88 240 -331 48 -72 -16 -156 57 -42 1 74 -83 227 -205 -160 -55
4952 -55 30 -13 35 -42 51 -154 74 299 275 11 -34 -48 -30 2 101 -177 155 38 -225 139 -257 119 156 20
4976 20 -5 -4 -80 37 -173 -21 322 72 63 128 153 102 -20 321 203 -24 3 -131 253 -128 0 81 125 101 46
5001 46 288 35 62 -208 -292 23 261 141 170 -336 -163 -215 5 254 54 68 105 176 -150 204 -203 44 -66
5024 -66 -14 -183 321 0 -150 236 66 -169 28 84 -201 -173 130 293 37 -135 77 52 154 -100 207 -3
5046 -3 -37 148 -566 -144 134 104 -205 -37 -62 -3 -13 89 -84 -266 6 -195 -235 35 -159 -102 191 -69 -117
$$ packed form
4882b61M34K0k58qJ21k4k97K5K43n3M94p23L15J0P2q0j67k14K46m0K34j2k87J74
4906c6J59j21q4L44k93m4Q0L08j20j13n7J54l40J33O9r3J69k90J7O9K08m15L45
4929D9Q9n23K16K37l08K53Pj08L28n71L79j20N6j40K13r9M3P3j57L10m32M5J05
4952e5Q5m3M8p7R3k05K28K25k4k64m5j4J8L2R9k78L32j17k63L64l96L76L7j36
4976B0k5Jp6J17k10J52L43k50rO5K5n1j22L41j18k27K7j34L84l81J28Q1M4k4n5
5001D6K42k53K7k70q4L15K38j20K9n06J73n2K20K49k00J4L7P1l26L54m07K47j10
5024f6N2j69N04l21j50L86j70k35J97N6k85K8L03J63k56j72K12k5J02k54L07k10
5046cl4J85p14M22K78l0l09J68k5N9j0J02j73j82K72k01m0K70j94N7K93k60m8
$$ plain form
5069 -117 24 -257 169 -111 -124 -255 -336 11 -12 -95 -33 219 73 36 38 82 98 -66 -90 11 113 -98 -103 -112 -143
5094 -143 107 439 226 150 -167 -78 -136 13 108 294 185 63 231 -36 -17 332 -58 -108 164 -70 54 173
5116 173 42 115 -29 -10 -60 152 82 -140 167 33 66 -98 287 347 -41 34 -121 32 55 44 -67 371 1
5139 1 57 -62 379 -124 246 78 741 190 5 -435 -345 -907 74 18 140 420 442 -586 -15 442 175 -561
5161 -561 -46 -826 -471 190 43 -9 40 10 -46 -47 43 20 266 284 5 171 527 469 -295 -610 -509 -511 -271 88
5185 88 -72 -307 -205 -43 -50 332 -96 -123 -147 13 87 -154 -180 -115 76 71 -72 219 62 222 -291 -20 -72 19
5209 19 105 -124 -78 -50 13 146 -46 -90 -49 -116 41 132 -38 213 76 58 126 114 244 -130 48 127 243 -205
5233 -205 4 174 13 -11 -185 -16 41 -20 -46 262 209 172 6 -142 38 -19 32 -61 -193 261 139 34 206
$$ packed form
5069a17J41k81M26k80j3j31q1L47k3q3O2K52j46l7KM4J6j64k4J01J02k11nrl1
5094a43K50L32k13p6l17Q9n8J49R5J86j09j22J68k67J9L49l90n0K72k34J24J19
5116A73j31P3j44J9n0K12p0k22L07j34L3j64L85O0l88P5j55J53K3j1j11M38l70
5139AN6j19M41n03L70j68O63n51j85m40R0n62R81n6J22K80K2j028N71M57k67p36
5161e61N15p80L55O61j47n2M9l0n6jR0k3K46J8k79J66L56n8p64l15J01kK40L59
5185H8j60k35J02J62pL82m28k7k4J60P4k41k6O5J91nj43K91j57J60n13K71n2R1
5209A9Q6k29M6K8O3J33j92m4M1o7J57R1j70K51j37j8O8j2J30l74J78P9J16m48
5233b05K09J70j61k4j74J69N7o1k6L08n3l7j66j48J80n7N1r3j32M54j22j05J72
$$ plain form
5256 206 -17 75 -12 269 15 204 221 123 125 19 -90 80 56 -122 411 1 -153 200 110 216 7 105 4
5279 4 -21 80 -121 -96 202 -42 -267 -28 138 122 -64 -1 -94 118 -11 74 121 -70 -32 215 -112 -217 -10
5302 -10 192 314 -113 294 -71 -263 203 -251 100 -239 102 -340 -100 -30 70 66 -54 -119 -295 -153 48 -128
5324 -128 -55 398 106 129 45 -242 -50 -77 -219 298 56 -32 -306 -114 -184 -92 -239 380 41 -106 -297 -179
5346 -179 225 -103 214 -179 133 246 413 191 -17 133 20 143 57 -271 168 410 454 -260 138 46 29
5367 29 142 620 -53 455 116 -198 160 106 -18 57 87 121 -34 57 -114 -104 121 137 102 -220 -207 245 151 115
5391 115 41 -125 -7 -155 94 13 -22 -65 142 0 -83 -25 -126 37 237 -1 -186 2 -24 215 -88 99
5413 99 -18 51 163 -35 -209 121 58 331 15 -196 -170 -387 25 153 159 -187 30 28 -312 25 65 -98 -301
$$ packed form
5256B06k23R2q7K81k54J89J7r8Kj06j09J70k4j78N33m10j54L53r0J06k09R8j01
5279Dk5J01k01K5K98k44k25K39J66j6j86O3r3K12j29Q5M7j91L8K47l27j05K07
5302a0K02J22m27M07l65j92M66m54L51l39L41m42K40P0J00mj20o5j76J42K01j76
5324a28P3M53k92K3q4k87J92k7j42N17k42q8k74J92p0R2j47O19l39j47j91J18
5346a79M04l28L17l93L12J13J67k22k08J50j13J23q6l28M39K42M4p14L98r2j7
5367B9J13M78o73N08l39l14L58n4j24P5L0L4j55R1j71J0K25J6l5l22J3M52r4l6
5391A15p4j66J18j48K49q1l5m3K07j42q3N8j01J63K00k38j85J88k6K39l03J87
5413I9j17O9J12j98j74L30o3K73l16k11K6k17M12J28Ol46K17kl40L37M0j63k03
$$ plain form
5436 -301 21 -40 -331 -156 148 -100 -89 98 35 115 81 -2 143 207 56 -143 35 162 -43 152 45 -84
5458 -84 -39 130 -100 -11 -222 -108 181 -116 -72 -74 -16 69 71 -264 -37 -41 -48 37 -264 174 115 18 15 -284 -1 -108
5484 -108 -108 30 -4 81 -148 15 -108 -171 -17 225 -193 -172 148 57 87 176 108 -173 -159 -159 -107 71 181 285 239
5509 239 -14 -30 98 66 -62 -24 -144 20 123 -73 42 -123 -270 -126 114 -10 8 95 31 -243 94 -4
5531 -4 18 175 137 145 27 63 -136 304 2 148 81 -109 -76 45 -28 37 30 261 86 -250 -114 -59 -125 197 -314
5556 -314 4 -44 51 -58 129 -84 105 109 120 67 172 -128 111 -37 96 -250 109 -97 -120 152 -10 -76 -16
5579 -16 346 -77 -88 176 -154 16 -66 -111 -233 -320 -256 -279 -77 -31 11 -17 96 294 -80 70 172 74 156 -27
5603 -27 -43 -49 -210 -16 -23 -374 163 -14 138 -129 -2 195 -143 -231 183 62 -216 -182 111 -33 17 -143 146
$$ packed form
5436c01L22o1k91J75L04k48J1J87o3Q0l4q3J45O4j51j99J78J27k05J95j07j29
5458h4M5J69k30Q9k11J14K89k97M4kN8Q5Kl35K27mpQ5l01M38n9r7lk99K83j07
5484a08%J38l4Q5k29J63j23o3J54K42m18K1L20r1L0Q9o8k81J4%N2J78J10J04m6
5509B39k53j6J28l2j28L8j20J64J03j96J15j65j47J44K40j24J8Q7o4k74L37r8
5531dK2J57l8Qj18L6j99M40l02J46o7j90L3J21p3O5pK31j75l36J36N5o6L22n11
5556c14L18m8R5j09J87k13J89MJ1n3J05l00K39j48J33l46L59k06k3K72j62o6O0
5579a6L62m23j1K64l30J70q2m5j22q7O4k3K02M6M2k8J13J98l74J50J02r8Q2j83
5603b7j6oj61J94pl51N37j77J52k67J27J97l38q8M14j21k78L4K93j44N0j60K89
$$ plain form
5626 146 235 -62 -16 117 -150 57 -145 -144 -23 8 2 -140 -5 138 120 -5 59 799 230 76 190 -157 -360
5649 -360 -441 -161 24 -58 162 172 -191 72 72 157 -130 74 -29 -136 -49 6 -85 134 228 -35 162 22 39 -76
5673 -76 218 -71 -39 -104 -90 -117 296 -47 -5 -51 233 189 7 -88 -302 118 -165 1 99 -164 117 -29 152
5696 152 76 92 -21 -76 193 11 -94 -240 49 -175 -143 -167 -212 28 130 163 -78 -267 -82 -69 -128 -37 -210
5719 -210 -70 59 66 -49 80 -102 -72 -194 180 27 83 -118 61 -17 54 61 -113 79 -8 387 60 193 -27
5742 -27 -97 -60 30 -120 -52 -127 130 234 58 -101 71 152 47 2 -194 -18 -317 553 -63 -71 61 144 -141 -301
$$ packed form
5626A46Q9k97M6J33k67K07k02JJ21L1oj42J35J43j8j25O4P40n69j54J14l47k03
5649c60q1K80J85q2K20J0l63K63%Q5k87K04j03j07Q7N5r1K19R4k63J97j40J7j15
5673g6K94k89L2o5J4k7M13l43M2m6K84m4j82r5k14M20k83J66R8k63K81j46J81
5696A52p6J6j13n5K69j82j05j46K89k24L2k4m5K40J02L3k41j89J85J3n9R1j73
5719b10J40J29Pj15J29j82L0j22L74j53N6k01J79p8P1Pj74J92q7L95l27J33k20
5742b7p0L7R0j50O8p5K57J04j76j59J72Q1j05m5j96J76k99Q70o16qJ32Q3k85j60
$$ [...]
8191h9
##END NTUPLES=NMR FID
##END=
