##TITLE=1H_Pr 4687-C6
 CDCl3, 8 sc, 
 24.3.2020
##JCAMPDX= 6.0         $$ Bruker NMR JCAMP-DX V2.0
##DATA TYPE= NMR FID
##DATA CLASS= NTUPLES
##ORIGIN= UXNMR, Bruker Analytische Messtechnik GmbH
##OWNER= root
$$ XWIN-NMR		Version 3.5
$$ Tue Mar 24 16:36:51 2020 Russian Standard Time (UT+4h)  she@DPX200
##.OBSERVE FREQUENCY= 200.1315
##.OBSERVE NUCLEUS= ^1H
##.DELAY= (6, 6)
##.ACQUISITION MODE= SIMULTANEOUS
##.ACQUISITION SCHEME= undefined
##.AVERAGES= 8
##.DIGITISER RES= 18
##SPECTROMETER/DATA SYSTEM= spect
##.PULSE SEQUENCE= zg30
##.SOLVENT NAME= D2O
##.SHIFT REFERENCE= (INTERNAL, D2O, 0, 15.7039)
##AUDIT TRAIL= $$ (NUMBER, WHEN, WHO, WHERE, WHAT)
$$ ##TITLE= Audit trail, XWIN-NMR		Version 3.5
$$ ##JCAMPDX= 5.01
$$ ##ORIGIN= Bruker BioSpin GmbH
$$ ##OWNER= she
$$ F:/spectra/data/she/nmr/H-F/1/audita.txt
$$ ##AUDIT TRAIL=  $$ (NUMBER, WHEN, WHO, WHERE, WHAT)
(   1,<2020-03-24 16:35:38.65 +0400>,<she>,<DPX200>,
      <created by zg, POWCHK disabled, PULCHK disabled
       configuration hash MD5:
       00 E9 B6 7A A2 85 ED C7 34 08 36 98 17 FE 4E 26
       data hash MD5: 16K
       A7 61 F4 61 21 E6 1C 02 AB 09 CB 86 8E D0 CB 0F>)
$$ ##END=
$$ 
$$ hash MD5
$$ 3E CF 48 3E 4F 3E 89 A5 80 06 BF 47 29 99 C6 28
##$RELAX= 
##$RELAX= 
##$RELAX= 
##$RELAX= 
##$RELAX= 
##$RELAX= 
$$ Bruker specific parameters
$$ --------------------------
##$DU= <F:/spectra>
##$EXPNO= 1
##$NAME= <H-F>
##$PROCNO= 1
##$TYPE= <nmr>
##$USER= <she>
##$AMP= (0..31)
100 100 100 100 100 100 100 100 100 100 100 100 100 100 100 100 100 100 
100 100 100 100 100 100 100 100 100 100 100 100 100 100 
##$AQSEQ= 0
##$AQ_mod= 1
##$AUNM= <au_zg>
##$AUTOPOS= <>
##$BF1= 200.13
##$BF2= 200.13
##$BF3= 200.13
##$BF4= 200.13
##$BF5= 200.13
##$BF6= 200.13
##$BF7= 200.13
##$BF8= 200.13
##$BYTORDA= 1
##$CFDGTYP= 0
##$CFRGTYP= 5
##$CHEMSTR= <none>
##$CNST= (0..31)
1 1 145 1 1 1 1 1 1 1 1 1 1 1 1 1 1 1 1 1 1 1 1 1 1 1 1 1 1 1 1 1 
##$CPDPRG= <>
##$CPDPRG1= <>
##$CPDPRG2= <>
##$CPDPRG3= <>
##$CPDPRG4= <mlev>
##$CPDPRG5= <mlev>
##$CPDPRG6= <mlev>
##$CPDPRG7= <mlev>
##$CPDPRG8= <mlev>
##$CPDPRGB= <>
##$CPDPRGT= <>
##$D= (0..31)
0 1.2 0 0 0 0 0 0 0 0.06 0 0.03 0 0 0 0 0.0002 0 0 0 0 0 0 0 0 0 0 0 0 
0 0 0 
##$DATE= 1585053338
##$DBL= (0..7)
120 120 120 120 120 120 120 120 
##$DBP= (0..7)
150 150 150 150 150 150 150 150 
##$DBP07= 0
##$DBPNAM0= <>
##$DBPNAM1= <>
##$DBPNAM2= <>
##$DBPNAM3= <>
##$DBPNAM4= <>
##$DBPNAM5= <>
##$DBPNAM6= <>
##$DBPNAM7= <>
##$DBPOAL= (0..7)
0.5 0.5 0.5 0.5 0.5 0.5 0.5 0.5 
##$DBPOFFS= (0..7)
0 0 0 0 0 0 0 0 
##$DE= 6
##$DECBNUC= <off>
##$DECIM= 24
##$DECNUC= <off>
##$DECSTAT= 4
##$DIGMOD= 1
##$DIGTYP= 9
##$DL= (0..7)
0 120 120 120 120 120 120 120 
##$DP= (0..7)
150 150 150 150 150 150 150 150 
##$DP07= 0
##$DPNAME0= <>
##$DPNAME1= <>
##$DPNAME2= <>
##$DPNAME3= <>
##$DPNAME4= <>
##$DPNAME5= <>
##$DPNAME6= <>
##$DPNAME7= <>
##$DPOAL= (0..7)
0.5 0.5 0.5 0.5 0.5 0.5 0.5 0.5 
##$DPOFFS= (0..7)
0 0 0 0 0 0 0 0 
##$DQDMODE= 0
##$DR= 18
##$DS= 0
##$DSLIST= <SSSSSSSSSSSSSSS>
$$ [...]
##$SUBNAM2= <"">
##$SUBNAM3= <"">
##$SUBNAM4= <"">
##$SUBNAM5= <"">
##$SUBNAM6= <"">
##$SUBNAM7= <"">
##$SUBNAM8= <"">
##$SUBNAM9= <"">
##$SW= 24.9337058887773
##$SWIBOX= (0..15)
0 0 2 0 0 0 0 0 0 0 0 0 0 0 0 0 
##$SW_h= 4990.01996007984
##$TD= 16384
##$TD0= 1
##$TE= 0
##$TE2= 300
##$TE3= 300
##$TEG= 300
##$TL= (0..7)
0 120 120 120 120 120 120 120 
##$TP= (0..7)
150 150 150 150 150 150 150 150 
##$TP07= 0
##$TPNAME0= <>
##$TPNAME1= <>
##$TPNAME2= <>
##$TPNAME3= <>
##$TPNAME4= <>
##$TPNAME5= <>
##$TPNAME6= <>
##$TPNAME7= <>
##$TPOAL= (0..7)
0.5 0.5 0.5 0.5 0.5 0.5 0.5 0.5 
##$TPOFFS= (0..7)
0 0 0 0 0 0 0 0 
##$TUNHIN= 0
##$TUNHOUT= 0
##$TUNXOUT= 0
##$USERA1= <user>
##$USERA2= <user>
##$USERA3= <user>
##$USERA4= <user>
##$USERA5= <user>
##$V9= 5
##$VALIST= <valist>
##$VCLIST= <CCCCCCCCCCCCCCC>
##$VD= 0
##$VDLIST= <DDDDDDDDDDDDDDD>
##$VPLIST= <PPPPPPPPPPPPPPP>
##$VTLIST= <TTTTTTTTTTTTTTT>
##$WBST= 1024
##$WBSW= 4
##$XGAIN= (0..3)
0 0 0 0 
##$XL= 0
##$YL= 0
##$YMAX_a= 267799
##$YMIN_a= -239165
##$ZGOPTNS= <>
##$ZL1= 120
##$ZL2= 120
##$ZL3= 120
##$ZL4= 120
##$ABSF1= 10
##$ABSF2= 0
##$ABSG= 5
##$ABSL= 3
##$ALPHA= 0
##$AQORDER= 0
##$ASSFAC= 0
##$ASSFACI= 0
##$ASSFACX= 0
##$ASSWID= 0
##$AUNMP= <proc_1d>
##$AZFE= 0.1
##$AZFW= 0.1
##$BCFW= 1
##$BC_mod= 2
##$BYTORDP= 1
##$COROFFS= 0
##$CY= 11.3945322036743
##$DATMOD= 1
##$DC= 2
##$DFILT= <>
##$DTYPP= 0
##$F1P= 16.9975609425685
##$F2P= -3.02152046262296
##$FCOR= 0.5
##$FTSIZE= 0
##$FT_mod= 4
##$GAMMA= 1
##$GB= 0.15
##$INTBC= 1
##$INTSCL= 1
##$ISEN= 128
##$LB= 0.24
##$LEV0= 0
##$LPBIN= 0
##$MAXI= 10000
##$MC2= 0
##$MEAN= 0
##$ME_mod= 0
##$MI= 1.114404
##$NCOEF= 0
##$NC_proc= 0
##$NLEV= 6
##$NOISF1= 3.799351
##$NOISF2= 2.8
##$NSP= 1
##$NTH_PI= 0
##$NZP= 0
##$OFFSET= 15.70392
##$PC= 1
##$PHC0= -9794.366
##$PHC1= 25.60082
##$PH_mod= 1
##$PKNL= yes
##$PPARMOD= 0
##$PSCAL= 0
##$PSIGN= 0
##$REVERSE= no
##$SF= 200.130013532006
##$SI= 16384
##$SIGF1= 3
##$SIGF2= 2
##$SINO= 400
##$SIOLD= 16384
##$SREGLST= <1H.CDCl3>
##$SSB= 0
##$STSI= 0
##$STSR= 0
##$SW_p= 3612.71676300578
##$SYMM= 0
##$S_DEV= 0
##$TDeff= 0
##$TDoff= 0
##$TI= <>
##$TILT= no
##$TM1= 0
##$TM2= 0
##$TOPLEV= 0
##$USERP1= <user>
##$USERP2= <user>
##$USERP3= <user>
##$USERP4= <user>
##$USERP5= <user>
##$WDW= 1
##$XDIM= 8192
##$YMAX_p= 0
##$YMIN_p= 0
$$ End of Bruker specific parameters
$$ ---------------------------------
##NTUPLES= NMR FID
##VAR_NAME=  TIME,          FID/REAL,        FID/IMAG
##SYMBOL=    X,             R,               I
##VAR_TYPE=  INDEPENDENT,   DEPENDENT,       DEPENDENT
##VAR_FORM=  AFFN,          ASDF,            ASDF
##VAR_DIM=   8192,          8192,            8192
##UNITS=     SECONDS,       ARBITRARY UNITS, ARBITRARY UNITS
##FACTOR=    0.0002004,     1,               1
##FIRST=     0,             0,               0
##LAST=      1.6414764,     0,               0
##MIN=       0,             -239165,         0
##MAX=       1.6414764,     267799,          0
$$ Real data points
##PAGE= N=1
##DATA TABLE= (X++(R..R)), XYDATA
0@%%%%%%%Lj1J6j6J8k5L1l9M7n5P0q2R3j10J31j52J75k02K30k62L00l41L85m37
$$ 0 0 0 0 0 0 0 0 3 -8 8 -8 10 -15 16 -23 24 -31 39 -43 50 -60 71 -81 94 -108 122 -140 160 -181 204 -233
31b33M93n53O22o95P72q60R61j067J182j311J452j606J778j970K184k424K692
$$ -233 260 -293 329 -366 406 -454 507 -560 622 -689 763 -843 935 -1035 1149 -1275 1417
48A417l001L357l768M254m841N563o477P682r348J1816j5903K4233p0834J96237
$$ 1417 -1584 1773 -1995 2259 -2582 2981 -3496 4186 -5162 6654 -9249 14984 -55850 140387
62A40387J19322l12862j79644J43951K21706k7730j35243m4847N5753K8539J6542
$$ 140387 259709 -53153 -232797 -88846 132860 105130 -30113 -74960 -19207 9332 25874
73B5874J9077j6486p3552k0091O8773O7022l3342p6779k9926M9024P4553K0905
$$ 25874 44951 28465 -45087 -65178 3595 70617 37275 -39504 -69430 -20406 54147 75052
85G5052p7226p9153M5780J24329Q983j28612o5200J02548R6134o5782j10911K5471
$$ 75052 -2174 -81327 -35547 88782 97765 -30847 -96047 6501 102635 36853 -74058 -48587
97d8587R9585m19p9256o687O1954O550m5313O839M2391j7073m8915J9386N7455
$$ -48587 50998 50579 -28677 -35364 26590 33140 -12173 -5334 37057 19984 -28931 -9545 47910
110D7910j3248p0339r426O5512K9666n0005m4717K6981M8002K099l0617j8959
$$ 47910 34662 -35677 -45103 20409 50075 70 -44647 -17666 30336 32435 1818 -17141
122a7141Q719K6635J7545k3244m1834N855N1036J0409n3886l1262M2491M3194
$$ -17141 -8422 18213 35758 12514 -29320 -23465 27571 37980 -15906 -47168 -4677 38517
134C8517k2416m1005Q906L0792k705j3696J4484P408l8161k2432M9217M7671m6512
$$ 38517 16101 -24904 -15998 14794 12089 -1607 12877 20285 -17876 -40308 8909 56580 10068
147A0068p8721J3989Q7624K8118o7775n9383L0405O7516J2736m4975l5313J1581
$$ 10068 -68653 -54664 32960 61078 -6697 -66080 -35675 31841 44577 -398 -35711 -24130
159b4130L0411J1896j3454j9176p139N632P822P473Q052n869k4118r077L4351
$$ -24130 6281 18177 4723 -14453 -21592 -15960 -8138 -665 7387 1518 -22600 -31677 2674
172B674L6958k1742n4383k894N6010K7204m6017m4421K5072M7221r607m4213J55
$$ 2674 39632 17890 -36493 -39387 16623 43827 -2190 -46611 -21539 25682 16075 -28138 -27983
185b7983M0376R048l2257j2528K6595J8326j5153j7600M174R428k232l179N057
$$ -27983 12393 21441 -10816 -23344 3251 21577 6424 -11176 -7002 2426 194 -2985 2072
198B072j109j3567n582J6719J8455n024k2179j0273J7708K6684K997k8369k4478
$$ 2072 963 -12604 -18186 -1467 16988 11964 -10215 -20488 -2780 23904 26901 -1468 -25946
211b5946J3556L2962O606k8583k1650J0252K1766O254p112p330n997n3J3694J7438
$$ -25946 -12390 20572 27178 -1405 -23055 -12803 8963 15217 8105 775 -5222 -5275 8419 25857
225B5857o116k7087j0580K4292K2878j3932l0340k710K5012J3648j4532j6162
$$ 25857 19741 -7346 -17926 6366 29244 15312 -15028 -17738 7274 20922 6390 -9772
237i772M281J6460M495r600q529K978R693K839q708j1210R48J0308O756p361j2312
$$ -9772 -5491 10969 15464 5864 -2665 313 10006 12845 4137 -7073 -6125 4183 10939 3578 -8734
252h734k157J0826J2449P56j2667j2070L677J9629J1737j5284k5865k133K5660
$$ -8734 -10891 -65 12384 13140 473 -11597 -7920 11709 23446 8162 -17703 -19836 5824
265E824J7215j4981k6405l381K1234J7550o377j8067o327J0075J2771K883r581
$$ 5824 23039 8058 -18347 -21728 -494 17056 10679 -7388 -13715 -3640 9131 12014 2433
278B433j1942j638J1165P582o764j2378j909R774P210l721r784j25J0991P180
$$ 2433 -9509 -11147 18 7600 836 -11542 -13451 -3677 3533 -188 -9972 -10097 894 8074
292H074q495j1520K312J3894M950j3256j4018K413J6598P658j0008j4782j646
$$ 8074 -421 -11941 -9629 4265 9215 -4041 -18059 -15646 952 8610 -1398 -16180 -17826
305a7826J5075J2701l25j4306j2325O753J8233Q529j3113j8728l931J6535J7287
$$ -17826 -2751 9950 9625 -4681 -17006 -10253 7980 16509 3396 -15332 -19263 -2728 14559
318A4559m317k0706j0100J3028J9138K495j3734j1866L637J3669O043p317r188
$$ 14559 10242 -10464 -20564 -7536 11602 14097 363 -11503 -7866 5803 11846 4529 -4659
331d659j765M046M375J403k783m618j98L935K717J249j3j475p11Q16M26j67K079
$$ -4659 -6424 -2378 1997 3400 617 -4001 -4199 -264 2453 3702 3689 2214 1503 2319 2745 2578 4657
348D657L88m477m526K081O570L592l698q231j694J0273J0025m476j1777k444P900
$$ 4657 5045 568 -3958 -1877 4693 8285 4587 -3644 -5338 4935 14960 10484 -1293 -3737 4163
363D163P270j580p738n397J986N242J366j079k498l144o3N686M084k663m847p89
$$ 4163 11433 9853 2115 -3282 -1296 3946 5312 4233 1735 -1409 -1472 4214 8298 5635 788 -1
379aK716J805o51k281j990M97m61l014J341N355Qm350m691L776P842K978o132
$$ -1 2715 4520 3869 1588 -402 95 -366 -3380 -2039 3316 3324 -1026 -5717 -1941 5901 8879 2747
396B747j0819J474R274N110n658p733l359L209P303M982m127j0491k805Q072J0821
$$ 2747 -8072 -6598 2676 7786 2128 -5605 -8964 -5755 1548 6530 2403 -8088 -10893 -2821 8000
411H000J008j2391r483M743J1290N626q143j0527k880O544J0151J890r133q773
$$ 8000 9008 -3383 -12866 -8123 3167 8793 650 -9877 -12757 -6213 3938 5828 -3305 -12078
425a2078M907Q687M044m048p316j389L208M557M30k680m547l154M191N505J554
$$ -12078 -7171 1516 5560 1512 -5804 -7193 -3985 572 1002 -1678 -6225 -9379 -5188 317 1871
440A871o962j427M706K920p46j461J752l47j446k305P45M719M79m021l558J780
$$ 1871 -5091 -6518 -1812 1108 362 -1099 653 306 -1140 -3445 -2700 2019 2498 -1523 -5081 -3301
456c301N350J707j258m743j338L642N547L88m233k903j118J358N061J246m653
$$ -3301 2049 3756 2498 -2245 -3583 59 5606 5994 1761 -1142 -2260 -902 4159 5405 752
471G52n976n10Q877N182l562r134Q85O948M027l391l821J413P2j82m0K439R63
$$ 752 -5224 -5734 3143 8325 4763 -4371 -3486 3462 7489 4098 277 1690 1762 1580 1540 3979 4942
488D942n016k222J748N651J115l416l235L73M198J361N67j245l484l589K545O194
$$ 4942 -74 -2296 -548 5103 6218 2802 -433 -60 4138 5499 6066 4821 1337 -2252 293 6487
504F487nm747o138Q7P554O226m030q222k897O422O990n02p129n625K383N455K135
$$ 6487 6482 1735 -4403 -4316 3238 9464 5434 -2788 -5685 737 7727 7225 96 -5529 -3146 2309 4444
521D444m089l060k413K171M047K462k431m199j039L737M107j299n268p72K918
$$ 4444 355 -2705 -5118 -2947 1100 3562 1131 -3068 -4107 -370 3737 2438 -2830 -3602 -684
536f84P92k664l81K260kk131j487J857K741N87j445k331j426J755M357J256m553
$$ -684 108 -2556 -2937 -677 -679 -2810 -4297 -2440 301 888 -557 -2888 -4314 -2559 1798 3054 -1499
553a499o812O67P766M140m326p862p90N368O660P37n852o916J095R109N380n780
$$ -1499 -8311 -7644 122 4262 -64 -7926 -8716 -3348 3312 4049 -1803 -8719 -7624 1485 6865 1085
569A085r610q37P368N506k511m071k376N72L428L662J309l842n013J770O190K005
$$ 1085 -8525 -9362 -1994 3512 1001 -3070 -5446 -4874 -1446 2216 3525 -317 -5330 -3560 2630 4635
585D635l085m885L72K168K443J5j633l77n42J219J785l79M05n99k32k161O59L867
$$ 4635 1550 -3335 -2963 -795 1648 1663 30 -347 -889 330 2115 1736 2141 1542 1310 -851 -192 3675
603C675K719n067o174J488Q041K199m341o269J111M630K961Q29l422m230k14M102
$$ 3675 6394 1327 -4847 -3359 4682 6881 2540 -3729 -2618 2012 4973 5802 2380 -1850 -2064 2038
619B038M995j007o516l475L178N298J380k159m691k006K435O662K836o451o194
$$ 2038 7033 6026 -490 -3965 -787 4511 5891 3732 -959 -2965 -530 6132 8968 2517 -3677
634c677J490P547J768m715n501J118K989K285p89j037j394j612J412K106J854
$$ -3677 -2187 5360 7128 2413 -3088 -1970 1019 3304 2515 1478 84 -1528 -116 1990 3844
649C844j841l216p54R95J714K533k688m446o61M089L837k976n035J239L398R35
$$ 3844 2003 -1213 -1967 -972 742 3275 587 -3859 -4520 -431 3406 430 -4605 -3366 32 967
665I67k744k35K493j33k270k375L046K768k268l338R4K010J536M39k100j044N81
$$ 967 -1777 -2012 481 348 -1922 -4297 -1251 1517 -751 -4089 -3995 -1985 -449 -10 -2110 -3154 -2573
682b573J063J023L51p59j242l12o2P68K181M74m606l759L852P026p2p251k984
$$ -2573 -1510 -487 -136 -895 -2137 -2449 -2511 -1743 438 912 -3694 -7453 -3601 3425 3353 -3898 -6882
699f882L606O137L70m620l816R56K878L752p84l227k592R56M015J351q86k241
$$ -6882 -3276 2861 3231 -1389 -5205 -4249 -1371 2381 1597 -1630 -4222 -3266 749 2100 1214 -1027
715a027j31j875J586N855O98o398l703K605P511R99n529n403K324M722J749k264
$$ -1027 -1158 -3033 -1447 4408 5106 -1292 -4995 -2390 5121 6120 591 -4812 -2488 2234 3983 1719
731A719k117J322r57J662J831J134k363l074j137L577J437K169l842m628J560
$$ 1719 -398 924 -33 1629 3460 4594 2231 -843 -1980 1597 3034 5203 1361 -3267 -1707
746a707N770K373l897m614L54M240K929k404j231j246j540O93K061K632n04n134
$$ -1707 4063 6436 2539 -2075 -1721 2519 5448 3044 1813 567 -973 -280 1781 4413 3909 -1225
762a225j929L546M712l43m301m214M63O362K703l253n917q2M764N001j816n563
$$ -1225 -3154 392 5104 4761 460 -3754 -3291 3071 5774 2521 -3396 -3478 1286 6287 4471 -1092
778a092k875K498L722R32k243k319j113M80M944o39j150l602q27K519K554j081
$$ -1092 -3967 -1469 2253 3185 942 -1377 -2490 -2010 2934 2295 1145 -2457 -3284 -765 1789 708
794G08l512J72J094K843R3k825j858O63L867J25m864P20K410J747k480j690p00
$$ 708 -2804 -2632 -1538 1305 1398 -1427 -3285 -2622 1245 1370 -3494 -2774 -364 1383 -1097 -2787 -3487
811c487L737J571k265l082R4L428M43p83r59n58j661K908J568j709o35l420K229
$$ -3487 250 1821 -444 -3526 -3432 -4 439 -344 -1303 -1861 -3522 -614 954 -755 -1390 -4810 -2581
828b581K147K509m50m107k698L080N516p79l427l317O77N036L42k251o22j771
$$ -2581 -434 2075 1625 -2482 -5180 -2100 3416 2637 -790 -4107 -3430 1606 1948 -303 -925 -2696
844b696P44K117J283L6k284k504J352M498J180k890l111K4L128K273k28l352k542
$$ -2696 -1952 165 1448 1484 -800 -3304 -1952 2546 3726 836 -2275 -2251 877 3150 2922 -430 -2972
861b972J738L111K423j433l571l95J184K788J433l083k018n4K674J181k31n6k799
$$ -2972 -1234 1877 4300 2867 -704 -1099 85 2873 4306 1223 -795 -849 1825 3006 2775 2719 -80
878h0N21J182J478j42k201j603J764J051Q00k57k016j300R46J171L56K75k426
$$ -80 441 1623 3101 2959 758 -845 919 1970 2770 2513 497 -803 143 1314 1670 1945 -481
895d81o24Q07J244Q32L72j676k129P21K659K305l245l215l2L391J925n16l740
$$ -481 -1105 -298 946 1778 2150 474 -1655 -934 1725 4030 785 -2430 -2462 929 2854 2338 -1402
912a402j294K865M91R33j432j486k21J215J259O01j565k097M30PK516Q7j956k598
$$ -1402 -2696 169 660 1593 161 -1325 -1546 -331 928 1529 -36 -2133 -1703 -1696 820 907 -1049 -3647
930c647R80L173N55j162j589j15J05Q70O7J077j614o01o12J352K216j558j35j536
$$ -3647 -2667 506 1061 -101 -1690 -1805 -1700 -830 -763 314 -1300 -1901 -2513 -1161 1055 -503 -638 -2174
948b174Q59q3N00j57j24j4n09J376P51p71j629J086p88n72K415L77j934q67J343
$$ -2174 -1315 -1398 -898 -1055 -1179 -1193 -1702 -326 425 -346 -1975 -889 -1677 -2249 166 543 -1391 -2258 -915
967i15n2J362l12o84j196Q67M47P93J694j027l934K324J319J628k718L02k614
$$ -915 -967 395 83 -601 -1797 -930 -483 310 2004 977 -2957 -633 686 2314 -404 -102 -2716
984b716M022K422j123k339j697J448J472K494j353k138l013K436K759K375l202
$$ -2716 1306 3728 2605 266 -1431 17 1489 3983 2630 492 -2521 -85 2674 5049 1847
999A847l034N05K583O80Q53k024l338Q79M080Q90j217k948j212J575J656J401
$$ 1847 -1187 -682 1901 2581 3434 1410 -1928 -1049 3031 3921 2704 -244 -1456 119 1775 3176
1015C176k005p98k483J496L575j47q82l375L30K781O61n10k883p77J998K157m6
$$ 3176 1171 373 -2110 -614 2961 2814 1932 -1443 -1113 1668 2329 1819 -1064 -1841 157 2314 2268
1032B268o39k385p24J060K221M32l069r76k32L337Q15J45l148n96J409n21J363
$$ 2268 1629 -756 -1480 -420 1801 2233 -836 -1812 -2044 1293 2108 2253 -895 -1491 -82 -603 760
1049G60o07p39o35O78K82R6Q8n29j036k23J289J97m81K71o40q21K09Q87O72l97
$$ 760 153 -586 -1221 -543 -261 -165 -77 -606 -1642 -1865 -576 -379 -860 -589 -1229 -2050 -1841 -954 -282 -679
1069f79j029o19N09J476J328j763j489L26J020J726m22j723j005L4J268J264K54
$$ -679 -1708 -2327 -1818 -342 986 -777 -2266 -1940 -920 806 384 -1339 -2344 -2310 -1042 222 476
1086D76j623j615M47K867R94j183j657j117R54K588P94j791k559J53K338J544
$$ 476 -1147 -2762 -2315 552 1546 363 -1294 -2411 -1457 1131 1925 134 -2425 -2272 66 1610
1102A610j95k188j661Q48K757J233j396k097n72R94K700O94k100k877Q16K238
$$ 1610 1415 -773 -2434 -1586 1171 2404 1008 -1089 -1661 -667 2033 2727 627 -2250 -1434 804
1118H04J725m94j500j661M71K228R74l92j830j219J080J871R18j887j503J99P78
$$ 804 2529 2035 535 -1126 -655 1573 2547 2155 325 -894 186 2057 2975 1088 -415 -216 562
1135E62J453K74q60j924L24J543Q90k35j072j377M59J432N42n86j078l92J76R07
$$ 562 2015 2289 1429 -495 -171 1372 2262 2027 955 -422 37 1469 2011 1425 347 -45 131 1038
1153A038O70n51j326j7P85N16j10l15o01n12M37M86O80m58q98p18N16Q59K7l89
$$ 1038 1708 1157 -169 -186 599 1115 1005 690 89 -423 14 500 1180 722 -176 -894 -378 481 508 119
1173A19J8p38l58J293N43p04j170l83P22J020j4p23j216j88Q49J261o9p75j576
$$ 119 137 -601 -959 334 877 173 -997 -1380 -658 362 348 -375 -1591 -1779 -930 331 262 -513 -2089
1192b089j35J902J093j098j108m00J11J394J063j011j462o96J204J338K34r35
$$ -2089 -2224 -322 771 -327 -1435 -1835 -1724 -330 733 -278 -1740 -2436 -1232 106 340 -595
1208e95j555L82J049O95k69k80q28k67Q41R60j85j099n02M62Q96Q67k33j202o46
$$ -595 -2150 -1768 -719 -24 -293 -573 -1401 -1668 -827 133 -52 -1151 -1653 -1191 -295 572 339 -863 -1509
1227a509J91J453J054q92j234n48R89J020K95l34r62p92P96J239J085j165j386
$$ -1509 -1318 135 1189 297 -937 -1485 -496 524 819 485 -477 -1269 -473 766 1851 686 -700
1244g00k89J230J640q3j462j334L01J505J392n98j673p93O87K051K85q05j341
$$ -700 -989 241 1881 1798 336 -998 -697 808 2200 1602 -71 -864 -177 1874 2159 1354 13
1261A3o27J006R78R76j038j787p23J637K166r5k272j352Q75K257P00j465j651
$$ 13 -614 392 1370 2346 1308 -479 -1202 435 2601 2506 234 -1118 -243 2014 2714 1249 -402
1278d02l79J083J933j01j380j147j27P68J483l01j029j205J00J191J360q53j270
$$ -402 -781 302 2235 2134 754 -393 -520 248 1731 1430 401 -804 -704 487 1847 994 -276
1295b76r83R76J819k00j516j237P21J071J03m28k77J1j03j35R7J89j75Q8k80m80
$$ -276 -1259 -283 1536 1336 -180 -1417 -696 375 478 50 -227 -216 -319 -454 -357 -168 -343 -255 -535 -1015
1315a015O43K14J92q10k59j4N45J50ml33n32j5J03P30P56p16j533K6J318J163
$$ -1015 -372 -158 34 -776 -1035 -1049 -504 -354 -358 -691 -1223 -1238 -1135 -405 351 -365 -1898 -1872 -554 609
1335F09n85j350j183J057K067J63j532j351M5J760J273r81j336n87J135J025j27
$$ 609 24 -1326 -2509 -1452 615 778 -754 -2105 -2060 -300 973 -8 -1344 -1931 -796 229 102
1352A02J85j178q41J23K052J195j205k293j57J500K541n16k332j253J307K260
$$ 102 287 -891 -1732 -1609 443 1638 433 -1860 -2017 -517 2024 1508 -824 -2077 -770 1490
1368A490M4j119j105k5J046Q36l32l51m50o78K72J559N86j023j285j80J233J652
$$ 1490 1534 415 -690 -715 331 1167 835 484 34 -644 -372 1187 1773 750 -535 -715 518 2170
1386B170j41k124r80J057J742l48o09m95J08j05O55M11j29l89p04J82R00N93l50
$$ 2170 2029 -95 -1075 -18 1724 1376 767 272 380 275 930 1341 1212 823 119 301 1201 1794 1444
1405A444j512oR68L66L99p03j243P65NP11n90p01J18j80N34K52n87P32j37j745
$$ 1444 -68 -74 894 1260 1659 956 -287 478 483 1194 604 -97 21 -159 375 627 40 772 635 -1110
1425a110N45J360N47p24j684j03P28J694l92j444m83M2J643m9r02k54m87n36J236
$$ -1110 -565 795 1342 618 -1066 -1169 -441 1253 861 -583 -1066 -1024 619 570 -332 -586 -1073 -1609 -373
1444c73N29k72l21p41m3J814m4r6k388l79J773J267Q2j717n51J26J315L90j194
$$ -373 156 -116 -437 -1178 -1221 593 549 453 -1935 -2314 -541 726 808 -909 -1460 -1334 -19 371 -823
1463h23n7n54N60O2J442o65j185M6M62M20J022j084j036j85J437J043j003q12
$$ -823 -880 -1434 -874 -812 630 -35 -1220 -1174 -712 -292 730 -354 -1390 -1575 -138 905 -98 -910
1481i10k93K14J032L32r23j78l22O27k9R40l7q10n74M03J015M97l96j483L02Q21
$$ -910 -1203 -989 43 375 -548 -726 -1048 -421 -450 490 453 -357 -931 -528 487 984 588 -895 -593 228
1501B28N32l89k80l21K85L55K74l03j94k45M83J62j93L99k5q43O51l67M58P40
$$ 228 760 371 91 -230 55 410 684 381 187 -58 425 587 394 793 768 -75 576 209 667 1407
1521A407p95n26M30J87P30p50j87o10J51Q84P93p16p66j93L28R16M5m97o01n55
$$ 1407 612 86 516 703 1433 683 496 -114 37 921 1714 998 232 39 367 1283 1328 831 230 -325
1541c25Q06P22K10p43r48N1K52Q77k26p39m89M49J106L35j586k10q45J026N17
$$ -325 481 1203 1413 670 -278 -227 25 902 676 -63 -552 -103 1003 1338 -248 -458 -1303 -277 240
1560B40K11k8j357l51Q42R48K8l24q59l28Q54K02N93j479j82N12RK83K02o85l91
$$ 240 451 423 -934 -1285 -443 505 533 209 -650 -978 -124 78 671 -808 -990 -478 -469 -186 16 -669 -1060
1581a060PO34N65J26j288q45J723j43P5L55j758m66J165J14Q72j051k42MK56J577
$$ -1060 -1053 -419 146 272 -1016 -1861 -138 -281 -206 149 -1609 -2075 -910 -796 76 -975 -1217 -1213 -957 620
1601F20q3j167p64O55M71N11M09j628k23M16J136Q66j302o86k51P4N52M99j65
$$ 620 537 -630 -1394 -739 -268 243 652 -976 -1199 -783 353 1219 -83 -769 -1020 -946 -394 105 -60
1620f0j034M31M78R77k79p25p56J35J595L09p19r94J94j04J308J66m59n37l45
$$ -60 -1094 -663 -185 792 513 -212 -968 -833 762 1071 352 -642 -448 -552 756 922 463 -74 -419
1639d19P75M39k93L3n61o61P74Q02L19j070J60O63k1l49N98l3j119M99N71O5J9
$$ -419 356 795 502 535 -26 -687 87 889 1208 138 298 961 940 591 1189 1156 37 536 1107 1172 1191
1660A191q05l82O2M21L25k2j98O0o30Q9K12M52r3n16M5J06L46jo80j50l00Q39
$$ 1191 386 4 66 487 812 790 592 652 22 111 323 775 682 166 211 317 663 662 -18 -168 -468 371
1682C71L00N35j310o41N00L84O84k1j084p13k61J879M07j052q64l07Q68J404m04
$$ 371 671 1206 -104 -745 -245 139 823 802 -282 -995 -1256 623 1030 -22 -886 -1193 -325 1079 675
1701F75o97j408O52J239K22k44j212j63M38O56l57m76o75n29J440J209n12r17
$$ 675 -22 -1430 -778 461 683 439 -773 -936 -498 158 -199 -675 -1350 -1879 -439 770 258 -659
1719f59r87L90Q54P24m6j371m99R62N10j91j14n48m98O94k8O06k79k22Q82l28
$$ -659 -1646 -1256 -402 322 276 -1095 -1594 -632 -122 -313 -427 -975 -1473 -779 -807 -201 -480 -702 180 -148
1739a48M44j90p52l41M56M39L55j039J75J163r03M35N59j306N08k28N07K41o01
$$ -148 296 106 -646 -987 -531 -92 263 -776 -601 562 -341 94 653 -653 -145 -373 134 375 -226
1758b26j63J023j507J120o8j52n39R36j89n22K12n33J292k84j500P67R63k64j392
$$ -226 -389 634 -873 247 179 27 -512 424 235 -287 -75 -608 684 400 -1100 -333 630 366 -1026
1777a026J338M45j465J383L73n39L56p90k64J315j52p46L9o21Q63J90m64l09j13
$$ -1026 312 757 -708 675 1048 509 865 75 -189 1126 974 228 267 -354 509 699 235 -74 -187
1796a87L25N57K81p00J60j147m06J294m7jo97o79J885Q11r70k74m67l34J180n05
$$ -187 138 695 976 276 436 -711 -1117 177 130 129 -568 -1247 638 1449 479 205 -262 -596 584 79
1816G9j14L32p22j491J980M49n68m41k49N08J27J139j915j159J117J599q09R0
$$ 79 -35 297 -425 -1916 64 513 -55 -496 -745 -237 -110 1029 -886 -2045 -928 671 -138 -48
1834d8J61j104N2l2R13k05j04r68K39J088L65p66o31R93l96o33R29q8J5j597M06
$$ -48 113 -991 -939 -971 -58 -263 -367 -1335 -1096 -8 357 -409 -1040 -47 -443 -1076 -147 -235 -220 -1817 -1411
1855a411J260o38J37p46Q74L14l26K04m61l00K84k34J346N9j175n7m21J535L8
$$ -1411 -151 -789 -652 -1398 -524 -210 -536 -332 -793 -1093 -809 -1043 303 362 -813 -870 -1291 244 282
1874B82l97J98n10k97R45n01L33k61q1q63J084k53L22r23J563j610J882K05q44
$$ 282 -115 83 -427 -724 221 -280 53 -208 -289 -1152 -68 -321 1 -922 641 -969 913 1118 274
1893B74O21k724J368Q53L7o80R12r86O35M40o72Q7K53r68J386k49K58j010K94
$$ 274 895 -1829 -461 392 429 -251 661 -325 310 750 78 165 418 -550 836 587 845 -165 129
1912A29l55O73m6R02j572J16K21P68J96m53r21K25N84K24L60n35m61n98J336M63
$$ 129 -226 447 401 1303 -269 -153 68 836 1032 579 -342 -117 467 691 1051 516 55 -543 793 1256
1932A256m25j030p3k96M96P46O37j434r21O10N31O38k43q84L5M24J54N09n05K65
$$ 1256 831 -199 -272 -568 -72 674 1311 -123 -1044 -434 97 735 492 -392 -357 67 221 730 225 490
1952D90n87J99J88p19J192r22k08P51O10j099K49r69o39J178N9N72p34j86J55
$$ 490 -97 102 290 -429 763 -159 -367 384 994 -105 144 -825 -1464 -286 -227 345 -389 -575 -420
1971d20O45j077J744j704K99J18n51P37k41j285R14N34J60r86MQ10N86ql88m31
$$ -420 225 -852 892 -812 -513 -395 -946 -209 -450 -1735 -821 -287 -127 -1113 -1109 -299 287 279 -109 -540
1991e40l02J052o81L25n30O71o68k64J644j090Q58L75j510M86P72L10q7j45p2
$$ -540 -842 210 -471 -146 -676 -5 -673 -937 707 -383 475 850 -660 -174 598 908 821 676 604
2010F04L2m12K64N56M9l26p50k68J183K54o61j479J475q20J368n19K42j083J55
$$ 604 636 224 488 1044 1093 767 17 -251 932 1186 525 -954 521 -299 1069 550 792 -291 -136
2029a36O35M15j657L51J619j943N04M95J672l9j473n66R17M26k14Nj433k99R10
$$ -136 499 914 -743 -392 1227 -716 -212 283 1955 1916 443 -123 794 1220 1006 1011 -422 -721 189
2048A89N96o98m11O4O06j59j97J245k077N57O36P9l35J09l23K87N09r6J107j488
$$ 189 785 87 -324 -260 346 187 -10 1235 -842 -285 351 430 95 204 -119 168 677 581 1688 200
2068B00r78N34Q46J55j061p55J624p04P75r29k4m42J120n52K16j81o14j40N03
$$ 200 -778 -244 602 757 -304 -1059 565 -139 636 -293 -317 -759 361 -191 25 -156 -770 -910 -407
2087d07j4O35l87N2J21L60j018J659j959R22o53O16J172j398k88j78L03n0K61
$$ -407 -421 214 -173 -121 0 360 -658 1001 -958 -36 -689 -73 1099 -299 -587 -765 -462 -512 -251
2106b51o82O80k86K07K08J77o40J94l36k71J292m07p58J80P05j16n77O62M13j224
$$ -251 -933 -253 -539 -332 -124 53 -587 -393 -729 -1000 292 -115 -873 -693 12 -104 -681 -19 394 -830
2126h30N53j83M80k91L44J9n67J04J45P71q21J42r78J164K09p2K75o47q51J142
$$ -830 -277 -460 20 -271 73 92 -475 -371 -226 545 -276 -134 -1112 52 261 189 464 -183 -1034 108
2146A08K04j08K46r20M64P08j057J157o52p83J31J364m18R9K21q02J65P11m21
$$ 108 312 204 450 -470 -6 702 -355 802 150 -633 -502 862 444 543 764 -38 127 838 417
2165D17J69j31q93R91R1M94r64m54O02K66N58j325q55L60M20R26L25k09j07j618
$$ 417 586 455 -438 553 644 1138 174 -280 322 588 1146 -179 -1034 -674 -254 672 997 788 681 -937
2185i37J787j005k27M90M19p41N50O62p32K03j587O84J25L5M04L14j074Q18n86
$$ -937 850 -155 -382 108 527 -214 336 998 266 469 -1118 -434 -309 -274 130 444 -630 188 -398
2204c98K63Q56o87J61K05k92k39r9K88j60Q3l22M09m38m4M96m93P02q60J161q40
$$ -398 -135 721 34 195 400 108 -131 -230 58 -102 -19 -341 68 -370 -414 82 -411 291 -569 592 -248
2225b48q05M72O45j392J015k21J28j67M90J92p33O93o51R1O65N88q78k94r03R36
$$ -248 -1053 -581 64 -1328 -313 -534 -406 -573 -83 109 -624 69 -582 -491 174 762 -116 -410 -1313 -377
2245c77M26k01q67O9J646o57o21J98k61R86j183J009J52l2Q4j668J289K30J15
$$ -377 49 -152 -1019 -950 696 39 -582 -384 -645 341 -842 167 319 287 371 -1297 -8 222 337
2264C37K80j264L63l3J88P86j590r65K434n83O30n16l96N10m97P31k62N88p94
$$ 337 617 -647 -284 -317 -129 657 -933 -1898 536 -47 583 67 -329 181 -316 415 153 741 -53
2283e3j140J093l31O66km84P50n83M70M42k85n13k89P7P83l51K53n76N49L11K79
$$ -53 -1193 -100 -431 235 233 -251 499 -84 386 828 543 30 -259 -182 601 250 503 -73 476 787 1066
2304A066l61n88o91O72K17R1K18M8j204R68l9M73n04n90n98J508P8P6p68J6Q39
$$ 1066 705 117 -574 98 315 406 624 672 -532 436 397 870 366 -224 -822 686 764 840 72 88 927
2325I27j06n48L01o78o05P21O60o96q67J47LN82R30p22J25Q5m7J26n20L01K38
$$ 927 821 273 574 -104 -709 12 672 -24 -891 -744 -741 -159 771 49 174 259 212 338 -182 119 357
2346C57j246J008j133R38L98m35L70j347O23Q88j117N04k25O4P17r51L43n3M25
$$ 357 -889 119 -1014 -76 322 -113 257 -1090 -467 421 -696 -192 -417 -353 364 -587 -244 -297 128
2365A28K31q54M92l44jL86K05r76J284j504N74j55p1R31l65l47J1m04L6l38K99
$$ 128 359 -495 -3 -347 -348 38 243 -733 551 -953 -379 -534 -605 326 -39 -386 -375 -779 -743 -1081 -782
2386g82L72n52P00L40n84P11j69o16j03J53K090k032L01k53n71J272L5P2n19L72
$$ -782 -410 -962 -262 78 -506 205 36 -580 -683 -530 1560 -472 -171 -424 -995 277 312 384 -135 237
2406B37n85Q97q66K85j078Q88J90n8j6p22M22N87M07N97j180r3r63J556n15J26
$$ 237 -348 549 -317 -32 -1110 -222 -32 -90 -106 -828 -406 181 588 1185 5 -88 -1051 505 -10 116
2426A16L91m72o37K001j122m66J039p59n08n1J063J91p25l94O35J20k35J30k68
$$ 116 507 35 -602 1399 277 -189 850 91 -417 -468 595 786 61 -333 302 422 187 317 49
2445D9L1j77J28q91K236p71p90o6M16n03R3n54J09N40Q05m70o71k4k16l14N35
$$ 49 80 -97 31 -860 1376 605 -185 -251 165 -338 -245 -799 -690 -150 655 185 -486 -510 -726 -1040 -505
2466e05N43j31J110j741O95K28p81K42M02n58P44p19K05R57j086L47K31k11J147
$$ -505 38 -93 1017 -724 -29 199 -582 -340 62 -496 248 -471 -266 691 -395 -48 183 -28 1119
2485A119j94j458J51k44R93o8J36p23M54M45l04j272J111j323J081M64q0k48l41
$$ 1119 925 -533 -382 -626 367 299 435 -288 166 611 307 -965 146 -1177 -96 368 288 40 -301
2504c01M13r45R28k35M78l92o87R50l57r6J85k34k70O03l06K87J30l13l61P43
$$ -301 112 -833 95 -140 338 -54 -741 209 -148 -244 -59 -293 -563 40 -266 21 151 -162 -523 220
2524B20m47O3kK46m06O41l42j9r3RK29j99j77j77L46K53j69M05k84n00N7N45L25
$$ 220 -227 -164 -166 80 -326 315 -27 -46 -139 -130 99 -100 -277 -454 -108 145 -24 381 97 -403 -346 199 524
2547E24k34p3j26k21O3K85K9k00J85L4m07O58K2m08k78J92k24P19n6l70k75K51
$$ 524 290 217 91 -130 -67 218 247 47 232 266 -141 517 539 131 -147 45 -179 540 484 114 -161 90
2569I0J52N78j91p34R0N31p06L36K4K52K63p27L38m13N8m61P62j98K2M6J59K00
$$ 90 242 820 629 -105 -15 516 -190 146 170 422 685 -42 296 -117 -59 -520 242 44 66 112 271 471
2591D71m65N64j39p6j02j117J387k75O75n14j51J454p42l43l82J540k299R1N51
$$ 471 6 570 431 355 253 -864 523 248 923 409 258 1712 970 627 245 1785 -514 -423 128
2610A28K45J53Nm5q43R29l11q84O59Q3j177J123j025J180N06m32p39K018j800
$$ 128 373 526 531 486 -357 572 261 -623 36 119 -1058 65 -960 220 726 294 -445 1573 -227
2629b27Q31p12K36n02m7L26j85L90q1NJJ061p67P5j106M89M73j896K324p87J382
$$ -227 604 -108 128 -374 -421 -95 -280 110 29 34 35 1096 329 404 -702 -213 260 -1636 688 -99 1283
2650A283j284l42O44P17k847J984K26J010p87N80q46m30N77j011J344r91J80n0
$$ 1283 -1 -343 301 1018 -1829 155 381 1391 604 1184 338 -92 485 -526 818 -173 7 -43
2668d3N73k56k77J302j124j26J90j58J61n32K57L10J74m97O0K08J52p56M46r4
$$ -43 530 274 -3 1299 175 49 239 81 242 -290 -33 277 451 -46 14 222 374 -382 64 -30
2688c0O00J83o74p60M78o92N59R29K95j04K24r43J01K07L31o29R16m44j743R25
$$ -30 570 753 79 -681 -203 -895 -336 593 888 784 1008 65 166 373 704 75 991 547 -1196 -271
2708b71n22J342K53q11k0J027j065P24j135J121N91j622L28j98J159j210K14L44
$$ -271 -793 549 802 -9 -29 998 -67 657 -478 643 1234 -388 -60 -258 901 -309 -95 249
2726B49m17o47O00o84Q76o87Q42r02O06N22j296O78j36L84j61r1m08K76L25J099
$$ 249 -168 -815 -215 -899 -23 -710 132 -770 -164 358 -938 -260 -396 -12 -173 -264 -672 -396 -71 1028
2746A028j189o02M53J209k56q5j247n36K415p93o92n92J145m38q0l08J032N23
$$ 1028 -161 -763 -310 899 643 558 -689 -1225 1190 397 -295 -887 258 -180 -260 -568 464 987
2764I87p31j025O87K21N32K63j130R9n10J349p86k56j06l22J682j460J67k94M00
$$ 987 256 -769 -82 139 671 934 -196 -97 -607 742 -44 -300 -406 -728 954 -506 -339 -633 -233
2783b33N15p80J248n74p00O09l38O77o70O81k83k3M93k33l69L91r84J061L5q04
$$ -233 282 -498 750 176 -524 85 -253 424 -246 435 152 129 622 389 20 411 -573 488 523 -281
2803b81N99p70P10J01J34l66o03J142r86L68N57r6p70J46m94O33L90R7o44J41
$$ -281 318 -452 258 359 493 127 -476 666 -320 48 605 509 -261 -115 -609 24 414 511 -133 8
2823HQ32m41r72R30K68q14K52q3J44K7j9j55O00p6K50j062N83r69R89o70N3M56
$$ 8 840 399 -573 357 625 -189 63 -20 124 151 132 -23 577 501 751 -311 272 -697 292 -378 -325 131
2845A31l02J179j303l01L98R10r01j99K43O91q09j28K15J64n97R78J32m16r17
$$ 131 -171 1008 -295 -596 -198 712 -189 -388 -145 546 -263 -391 -176 -12 -609 369 501 85 -832
2864h32Q2P96R21r67O73m94o00R00p31l1n45P06R11m54m50J78l79j21N55l1K4
$$ -832 -750 46 967 0 673 179 -421 479 -252 -283 -828 -122 789 335 -115 63 -316 -437 118 87 111
2885A11K46o41m06N47M84r73N52J25J75K81p05P37l28n10r5N89J74l58M84j297
$$ 111 357 -284 -690 -143 341 -632 -80 45 220 501 -204 533 205 -305 -400 189 363 5 489 -808
2905h08O77P80j97L34j679J658k46l21m35J426j424L32n51O64P39j096K26j318
$$ -808 -131 649 452 786 -893 765 519 198 -237 1189 -235 97 -454 210 949 -147 79 -1239
2923a239R30P09n35M02m44j050J168O91o13l48Q03o12R21L91j300N60j98J69k51
$$ -1239 -309 400 -135 267 -177 -1227 -59 632 19 -329 474 -138 783 1174 -126 434 236 405 154
2942A54M43j347L93L4M28L21r80J046o83l82n8J274K2l80n79J75N28r14N95j41
$$ 154 597 -750 -357 -323 105 426 -554 492 -191 -573 -631 643 665 285 -294 -119 409 -505 90 -51
2962e1J324o85j63J92o40j46J68r9P42om13m46m00J680l20p71p81J168J38J1O2
$$ -51 1273 588 425 617 -23 -169 -1 -100 642 636 223 -223 -623 1057 737 -34 -815 353 491 502 564
2983E64q89J141n59m19jJ039l84L86j189Q73j173q98J592j184J010K83k11l41
$$ 564 -325 816 257 -162 -163 876 492 878 -311 562 -611 -1509 83 -1101 -91 192 -19 -360
3001c60K11r4l67L26P9M97m66L76o08L82k9O74r07M73k81k53k99O13k61k58M73
$$ -360 -149 -243 -610 -284 -205 292 -174 202 -406 -24 -53 621 -286 187 -94 -347 -646 -33 -294 -552 -79
3022g9L25m09J49K21j167P82j67O74k86l32n8L93K93n22m92O45m41M72k99L68
$$ -79 246 -163 -14 207 -960 -178 -345 329 43 -289 -347 46 339 -183 -675 -30 -471 1 -298 70
3042G0k69p9o8L65L45q59K43N17j324J002P4L09l84o68R94j61k4K10K28m08l76
$$ 70 -199 -278 -346 19 364 -495 -252 265 -1059 -57 17 326 -58 -726 268 107 83 293 521 113 -263
3063b63N88m36M17j7k58l13O13M8K1o96L71J75l03P70r96K19k59J057o35M22p52
$$ -263 325 -111 306 289 31 -282 331 379 400 -296 75 250 -53 717 -279 -60 -319 738 103 525 -227
3084b27k80R85q55j16N99K4k7j54L55O07j113P48n87j2J064j162N97m49K0J088
$$ -227 -507 478 -377 -493 106 130 103 -51 304 911 -202 546 -41 -53 1011 -151 446 -3 17 1105
3104A105j200k74R90p65O99k53j387J851k146J965q50k48M55M99Ln75O09K2m22
$$ 1105 -95 -369 621 -144 555 302 -1085 766 -1380 585 -265 -513 -58 441 444 -131 478 500 78
3123G8l50k21N06k64N21n28R31q58j89R48q35k94N55l17L22K10k54k29J18K69
$$ 78 -272 -493 13 -251 270 -258 673 -185 -374 574 -261 -555 0 -317 5 215 -39 -268 -150 119
3143A19j77k67o31O68j6j11k0Q27n84L25l05k89K30k0J075l93j084Q28L83j144
$$ 119 -58 -325 -956 -288 -304 -415 -435 392 -192 133 -172 -461 -231 -251 824 431 -653 175 558 -586
3163e86O46j27n91j20J442n27O41n00j764K197q26Q6q6n1K87k78O02q73l41P50
$$ -586 60 -67 -658 -778 664 137 778 278 -1486 711 -115 -29 -115 -166 121 -157 445 -428 -769 -19
3183a9K27k42K01m89N15o35N30J66k99J12M96o86K83ok04J9K78k52K27m31P3J10
$$ -19 208 -34 167 -322 193 -442 88 254 -45 67 563 -123 160 154 -50 -31 247 -5 222 -209 -136 -26
3205b6L59K77R4K32q92M24m27P22q1k47N8K19q39N02j026Q85k18O9l53R73j147
$$ -26 333 610 704 936 44 468 41 763 682 435 493 712 -127 375 -651 234 16 85 -268 705 -442
3226d42M55J74M29p7l15j156N97N71r2k27k78L54K20j09Q99r16N01o61M28o15
$$ -442 13 187 616 539 224 -932 -335 236 144 -83 -361 -7 213 104 1003 87 588 -73 355 -260
3246b60Q42r03J060q13O73k30j21j47n30K57M4j49j196K327q10K47n43M49q5R7
$$ -260 582 -321 739 -74 599 369 248 101 -429 -172 -128 -277 -1473 854 44 291 -252 197 112 209
3266B09K18j49p55J080j462J192p54j75j00L01O22K82p68n20j82L09L1P88m06
$$ 209 427 278 -477 603 -859 333 -421 -596 -696 -395 227 509 -259 -779 -961 -652 -621 167 -239
3285b39R5p57Q27k29M0J95j47k82K68M15K39M88j042n36K80K09O60N98j365j58
$$ -239 -144 -901 -74 -303 -263 -68 -215 -497 -229 186 425 913 -129 -665 -385 -176 484 1082 -283 -441
3305d41K46J98J05L58P62o61l62j45k38K52L99j08k18P74K08r29N75j263K18n18
$$ -441 -195 3 108 466 1228 567 205 60 -178 74 473 365 147 921 1129 200 775 -488 -270 -788
3325g88L74R33l57K07mn47J27O37n70K74m22L45j22l1j17K66n79L05M7J49j68
$$ -788 -414 519 162 369 365 -182 -55 582 12 286 -136 209 87 56 -61 205 -374 -69 -22 127 -41
3346d1o01P31L9L7k96L06J71k42j0k32J15L29J00n88K70j52j35K47N97j67j13
$$ -41 -642 89 128 165 -131 175 346 104 94 -138 -23 306 406 -182 88 -64 -199 48 645 478 365
3367C65k79lj47L06j92j80P7j82J20P0l9J74n9p51P50k1J24j87l5n85M82K56k48
$$ 365 86 83 -64 242 50 -130 -53 -235 -115 -45 -84 90 31 -720 30 9 133 -54 -89 -674 -192 64 -184
3390a84K63j68k02J83K66k42o18N92oJ29K9K5l01k05M84k19j2J27j14K73k30r3
$$ -184 79 -89 -291 -108 158 -84 -702 -110 -116 13 42 67 -234 -439 45 -174 -186 -59 -173 100 -130 -223
3412b23J86m61O7Q02m8k55L65n32M12l49K7m03P39P1k76k43K9K44r17J000k35
$$ -223 -37 -498 -431 371 323 68 433 -99 313 -36 -9 -412 327 398 122 -121 -92 152 -765 235 0
3433@l18L36o22J49K9J07J23j58K28M32l83Q2q33Q92J57K50o15J04k47L66K06
$$ 0 -318 18 -604 -455 -426 -319 -196 -354 -126 306 -77 5 -828 64 221 471 -144 -40 -287 79 285
3454B85L77o24k72K15K38M2m5l07K04J48L6K9l59OM2j49M55m82J22k8R7J96J34
$$ 285 662 38 -234 -19 219 261 216 -91 113 261 297 326 -33 -27 15 -134 321 -161 -39 -67 30 226 360
3477C60l32J8J45k29K62j0k84J01P5K05j9m01J95m1o9l3L45k27J24j33J60J15
$$ 360 28 46 191 -38 224 214 -70 31 106 311 292 -109 86 45 -24 -57 288 61 185 52 212 327
3499C27j50j96m2P8O4m9J08l57J13O5J97q1RJ04p34M54j81Q5K30j05k40M85k48
$$ 327 177 -19 -61 17 81 32 140 -217 -104 -39 158 77 86 190 -544 -90 -271 -186 44 -61 -301 184 -64
3522f4mP7P4r84M16L23k0l65K26L63j16L26r6k25o69J97jM22l64K63L99l54K52
$$ -64 -68 9 83 -901 -485 -162 -182 -547 -321 42 -74 252 156 -69 -738 -541 -542 -120 -484 -221 178 -176 76
3545G6j40k7o11N22J14j71M80M9n47M30o20P21p68K73O8J66o6L16M69j152J149
$$ 76 -64 -91 -702 -180 -66 -237 243 292 -255 175 -445 276 -492 -219 -151 15 -51 265 734 -418 731
3566G31q77P2l35J148r94k8l55P61M5l97m84J367n47m97J7Q22o03N03k92k40L36
$$ 731 -146 -74 -409 739 -255 -283 -638 123 168 -229 -713 654 107 -390 -373 449 -154 349 57 -183 153
3587A53k14J850k166r2k83J777o82Rn63o92J498K47j530k34J581m09N02q57M66
$$ 153 -61 1789 -377 -469 -752 1025 343 352 -211 -903 595 842 -688 -922 659 250 752 -105 361
3606C61k65K63o51l69J400n08K90p80n7M30N49q87N6N47L30r27J283k58r70K98
$$ 361 96 359 -292 -661 739 231 521 -259 -316 114 663 -224 -168 379 709 -218 1065 807 -163 135
3626A35K18M20j588J542J24j050N91o24R09j060P25p16L94L85p65PO89o96J043
$$ 135 353 773 -815 727 851 -199 392 -232 677 -383 342 -374 20 405 -360 -353 336 -360 683
3645F83o99n18k63P58l12L16N82j38j96j25m24O60j098J117p01j02L89%k62j75
$$ 683 -16 -534 -797 -39 -351 -35 547 409 213 88 -336 324 -774 343 -358 -460 -71 -71 -333 -508
3665e08m2O28R4j11J115r31r61P03J19Q5j461J186k20J47Q09j037Q65l79K24j361
$$ -508 -550 78 172 61 1176 245 -716 -13 106 191 -1270 -84 -304 -157 652 -385 480 101 325 -1036
3685a036J010M88j954O87J747j845L30N4r7Q6R16j336P28j44P61q40j16m6J38
$$ -1036 -26 462 -1492 -805 942 -903 -573 -519 -616 -530 386 -950 -222 -366 395 -445 -561 -607 -469
3704d69K6K17Q68p39P9K68K03l03l33L53O74k36n55m04L18n5l1K87l33p62R21
$$ -469 -443 -226 642 -97 -18 250 453 150 -183 170 844 608 53 -351 -33 -88 -119 168 -165 -927 -6
3725fQ4J02l24L71M60p45K65N06j096N25j46o16J026k26k98j87P46p07M37J6l70
$$ -6 78 180 -144 227 687 -58 207 713 -383 142 -4 -620 406 180 -118 -305 441 -266 171 187 -183
3746a83K6r2L44J45k54j49K44M5o07P82l07J17M93q38L57k51K14K47L98o51Ml41
$$ -183 -157 -249 95 240 -14 -163 81 126 -481 301 -6 111 604 -234 123 -128 86 333 731 80 84 -257
3768b57j97j00m6R35n8o17l19P45n7L11m1o21K64p05J149q42L88n15J41m58O76
$$ -257 -454 -554 -600 335 277 -340 -659 86 29 340 299 -322 -58 -763 386 -456 -68 -583 -442 -900 -224
3789b24J7M00p19P85o13q5L39Jm73K36M15L5K49k21j121O91O60o55K34O0K80j62
$$ -224 -207 193 -526 259 -354 -439 -100 -99 -572 -336 79 114 363 142 -979 -288 372 -283 -49 11 291 129
3811A29O1m4o3m56L39o2O23l12n48L51J46j59K8k97J83k20M56k04J39j15j40L16
$$ 129 190 146 83 -373 -34 -96 527 215 -333 18 164 5 33 -264 -81 -301 155 -49 90 -25 -165 151
3833A51k82J2J62N5k74k0J0n2M4O5l5P3J53L9p7K41k53mJ15J2j14p3j4J10j18
$$ 151 -131 -119 43 98 -176 -196 -186 -238 -194 -129 -164 -91 62 101 24 265 12 8 123 135 21 -52 -66 44 -74
3858g4J68j4r4k8K09p5k63J48L4j31J77m1l06M64J97m83J38k48J42J8L78m9P04
$$ -74 94 80 -14 -42 167 92 -171 -23 11 -120 57 16 -290 174 371 -112 26 -222 -80 -62 316 267 971
3881I71l89j577R73m1K04l98Q84m50o6J79k5L6m23K79k2K40l45L93m42k90J92
$$ 971 582 -995 -22 -63 141 -257 627 177 111 290 265 301 -122 157 135 375 30 423 -19 -309 -117
3902a17M77q15L54j47P18k11J90l22n80R81l80K35m84j07L28m44J47j00q2M95
$$ -117 360 -455 -101 -248 470 259 449 127 -453 528 148 383 -101 -208 120 -324 -177 -277 -359 136
3922A36N8k26k16J03M9q1J26P6k99L23J04k53K6j21J12j45J03j18O0j43L70j41
$$ 136 194 -32 -248 -145 -96 -177 -51 25 -274 49 153 -100 -74 -195 -83 -228 -125 -243 -183 -326 44 -97
3944i7r3J99P8j84j3p0J6R4J55n3q8K18J0l06M9jp8K27q2L48q7k55j42K6J71J41
$$ -97 -190 9 87 -97 -110 -180 -164 -70 85 32 -56 162 172 -134 -85 -86 -164 63 -19 329 242 -13 -155 -129 42 183
3970A83n8j85O5p9N1J13n8o7M3M8k08K66r6R1n30K97K81q4n8qj03L25ll00J64
$$ 183 125 -60 5 -74 -23 90 32 -35 8 56 -152 114 18 109 -421 -124 157 73 15 7 -96 229 226 -74 90
3995I0J30k02J13j33Q0k76M15n1l09J41J46q6p5M15m29K5P5R1o5j92K26r9j88
$$ 90 220 18 131 -2 78 -198 217 166 -143 -2 144 58 -17 398 -31 -6 69 160 95 -97 129 30 -158
4018a58K00l1j47K21K1L26k10j57J71j71j2j41mO8l3N9l3J18J43k03L7l9p9m04
$$ -158 42 11 -136 85 106 432 222 65 236 65 53 -88 -92 -24 -57 2 -31 87 230 27 64 25 -54 -458
4042d58L89R1j89K68k40J27j01J7j55L80k81k31L67p3M24n08J46k1k41J69O1L6
$$ -458 -69 22 -167 101 -139 -12 -113 -96 -251 129 -152 -383 -16 -89 335 -173 -27 -48 -289 -120 -59 -23
4064b3l54N14j63j67P6j30L58k74J33j1J0j1j24J80r8J00j66j72K8K53LJ97l45
$$ -23 -377 137 -26 -193 -117 -247 111 -163 -30 -41 -31 -42 -166 14 -84 16 -150 -322 -294 -41 -38 159 -186
4087a86K24j41n0K12K15k20j0J93J66m05m9J77j85j99J52l5N2L55o9j94K9L28
$$ -186 38 -103 -153 59 274 54 44 237 403 -2 -51 126 -59 -258 -106 -141 -89 266 197 3 32 360
4109C60m67R9n1J62n47N24m53m0P5K73L03J96p45P8O9J26J00L4M51r54P13n73
$$ 360 -107 -8 -59 103 -444 80 -373 -413 -338 -65 238 434 -311 -233 -164 -38 62 96 547 -407 306 -267
4131b67Q78r71Q77L65o85m37K10R21j905R39n91P12N56l1l53R15p98J067j911
$$ -267 611 -360 517 882 197 -240 -30 891 -1014 -75 -666 46 602 571 218 1133 335 1402 -509
4150e09O60k85j56O9K20k96N90n79L72J03J44q21K10L49L34j57l22L08o35M07
$$ -509 151 -134 -290 -221 -1 -297 293 -286 86 189 333 -488 -278 71 405 248 -74 234 -401 6
4170Fn69R69j73j25J05n3j65l19j56O99l05K96o78P04r28J147L97k82p67K76k2
$$ 6 -563 406 233 108 213 160 -5 -324 -480 219 -86 210 -468 236 -692 455 852 570 -197 79 57
4191E7N07j014M06j17l71r2O54m54J045p86L75J25l22m88Q4L04l39r4O47m69J023
$$ 57 564 -450 -44 -161 -532 -624 30 -424 621 -165 210 335 13 -475 -391 -87 -426 -520 127 -342 681
4212F81n61q86J215q50J050o21o5j75P34p19L80n45L87K84l32q1K36K07m38J54
$$ 681 120 -766 449 -401 649 28 -37 -212 522 -197 183 -362 25 309 -23 -104 132 339 -99 55
4232E5K2M6j2J8k00O2n1p8N1j28K80j60R1j65M63l51q4M74k75Q9k44M00kL4k82
$$ 55 77 123 111 129 -71 -9 -60 -138 -87 -215 65 -95 -4 -169 294 -57 -141 333 58 147 -97 303 301 335 53
4257E3K1j1j49j43Q0P9J28lL85M42j205O54q9l0l59J82J45l4k77L9J2J81m8k01
$$ 53 74 63 -86 -229 -149 -70 58 55 440 882 -323 331 242 212 -147 35 180 146 -131 -92 -80 101 53 -148
4281a48J49K7m8J60r7j24j59M16k63P6l11N04l06J58l45mP9q6m90p1N79m73J033
$$ -148 1 28 -20 140 43 -81 -240 176 -87 -11 -322 182 -124 34 -311 -315 -236 -322 -812 -883 -304 -777 256
4304B56q44K21N28j11O9m6j71j03K21k18lK10q0q9J06k67k33N70M7m18j98Q3N47
$$ 256 -588 -367 161 50 119 73 -98 -201 20 -198 -201 9 -71 -160 -54 -321 -554 16 63 -355 -553 -470 77
4327G7O0m56N98k2k53k76o54R46m16K53k79Q11j068J029q60K80k13J68j69M77
$$ 77 137 -319 279 257 4 -272 -926 20 -396 -143 -422 389 -679 350 -510 -230 -443 -275 -444 33
4347C3m29m61J281o81O73m90K96k53L00r65M33o3Q51m03n35p4L88N44n08l0j97
$$ 33 -396 -857 424 -257 416 -74 222 -31 269 -696 -263 -326 525 122 -413 -487 -99 445 -63 -93 -290
4368b90O27l29n74L19K16l17N73K55o72K24J74N4n30K48j86o1J94J09L52l81L24
$$ -290 337 8 -566 -247 -31 -348 225 480 -192 32 206 260 -270 -22 -208 -269 -75 34 386 5 329
4389C29m53j62J159k057J579j98N72j209P5J38LQ71p01k53O49k04j18r0L98l57
$$ 329 -124 -286 873 -1184 395 197 769 -440 -365 -227 -224 647 -54 -307 342 138 20 -70 328 -29
4409b9j12J03r8N35n56J98k28K51oR7o85N65q2k43K84L72k45J09M7k36m69L74
$$ -29 -141 -38 -136 399 -157 41 -187 64 58 155 -530 35 -47 -290 -6 366 121 230 277 41 -428 -54
4431e4r7k5q2Q25n01j7J93j1m94O7j19K22M62o44JJ95j8l1J24R2l61j31J83j48
$$ -54 -151 -176 -258 567 66 49 242 231 -263 -196 -315 -93 369 -275 -274 -79 -97 -128 -4 88 -273 -404 -221 -369
4455c69j00J01M62M1m09K18k3q46O33P03m31k95l20K84N00m9m73R3K41O96m63
$$ -369 -469 -368 94 135 -274 -56 -79 -925 -292 411 -20 -315 -635 -351 149 100 -373 -280 -39 657 194
4476A94l70l91k43P11R38p08q12J392l21j93J41K52l55p6l75L88J15r4m21l04
$$ 194 -176 -567 -810 -99 839 131 -681 711 390 197 338 590 235 159 -216 172 287 193 -228 -532
4496e32K28P36O32j312K47N35m04r1N08m42N61m84n64L80J32L35n45k1L44m81
$$ -532 -304 432 1064 -248 -1 534 130 39 547 105 666 182 -382 -2 130 465 -80 -101 243 -238
4516b38M88K26j069M88L82k18MJ39n9K85K12j255O05m88N83J304j343N38j185
$$ -238 250 476 -593 -105 277 59 63 202 143 428 640 -615 -10 -498 85 1389 46 584 -601
4535f01p1N58J64N72j124Q13M14p86R88j204J61j97O93n3m88M48p65R95k57P5
$$ -601 -672 -114 50 622 -502 311 725 -61 927 -277 -116 -313 380 327 -161 287 -478 517 260 335
4555C35n72p5J62n86J008P56j81j011N03l61j65O65j00o43N73q24J40K21K47n01
$$ 335 -237 -312 -150 -736 272 1028 847 -164 339 -22 -187 478 378 -265 308 -516 -376 -155 92 -409
4575d09R26k12r89J164n17j249L63L78j9k75P18N62n37L71n49l99M9R23k61p94
$$ -409 517 305 -684 480 -37 -1286 -923 -545 -564 -839 -121 441 -96 275 -274 -673 -624 299 38 -756
4595g56J220N69j374N22n7J031m77p60N64Qm84N14j44j13N96o91r21K7R85j147
$$ -756 464 1033 -341 181 124 1155 678 -82 482 490 6 520 376 263 859 168 -753 -726 259 -888
4615h88L84M11o00Q64p26P4J666o78j083Q92M07j116K36R4M82m65k15J104j047
$$ -888 -504 -93 -693 171 -555 -481 1185 507 -576 316 723 -393 -157 -63 419 -46 -261 843 -204
4634b04l75O73m38l82N35r84R71L61n76K11J9n80N43J25Q0L14l65Q3N00o07P44
$$ -204 -579 94 -344 -726 -191 -1175 -204 157 -419 -208 -189 -769 -226 -101 -21 293 -72 11 511 -96 648
4655F48k39j210Q27k44N46o40J10O30q61J137q99m7J13N06M88j227o97Q25N48
$$ 648 409 -801 26 -218 328 -312 -202 428 -433 704 -195 -242 -129 377 865 -362 -1059 -234 314
4674C14k24j81J81j181J727k99j459M21J878j234L93r01P0M43M64J6m25o96J008
$$ 314 90 -91 90 -1091 636 337 -1122 -701 1177 -57 336 -565 -495 -52 412 428 3 -693 315
4693C15j575J10M54J260r4n12k37n38J302l7q0j065M55J44j10R03j081K29j041
$$ 315 -1260 -1150 -696 564 470 -42 -279 -817 485 448 368 -697 -242 -98 -208 695 -386 -157 -1198
4712a198L10J490j066l79J147K51r06K71j36k27J27Q83m14j93l3j18J47J26L49
$$ -1198 -888 602 -464 -843 304 555 -351 -80 -216 -443 -316 567 153 -40 -73 -191 -44 82 431
4731D31k87N51m10L4N16j159Q7L08R1K49m98Q39p95m30R67j52n29J33K81j14j36
$$ 431 144 695 285 319 835 -324 -237 71 162 411 -87 752 -43 -473 494 342 -187 -54 227 113 -23
4752b3p7P0o83N74j91O53J39k40j18rj47k13Q0J01j48M03O8k74l97O90k90M24
$$ -23 -100 -30 -713 -139 -330 323 462 222 104 95 -52 -265 -185 -84 -232 171 239 -35 -432 258 -32 392
4774C92n86O3j9P39q57O25n36j4l2K45L83o80M30m78Q28K25m23j465J639p36O01
$$ 392 -194 -131 -150 589 -268 357 -179 -193 -225 20 403 -277 153 -325 503 728 305 -1160 479 -257 344
4795C44j29r83J295J29q69j7j06K43l66J38K44l26M92Q6K31o65k62R22l86K32
$$ 344 215 -768 527 656 -213 -230 -336 -93 -459 -321 -77 -403 89 175 406 -259 -521 401 15 247
4815B47r5O0N10j59q46J702j630p37P77K11r02K75O18L76j121J053k1m05m19P30
$$ 247 152 212 722 563 -283 1419 -211 -948 -171 40 -862 -587 31 407 -714 339 318 -87 -506 224
4835B24o7n11J264r89n23M62N19m53kR19j228M40L04l08L65k40n61P50o04O7K57
$$ 224 157 -354 910 -79 -602 -140 379 -74 -76 843 -385 55 359 51 416 176 -385 365 -239 -172 85
4856H5p06J099o45K37k41R3N33l15O7o89p80P09R72o3n28P35j47j96K07j145O48
$$ 85 -621 478 -167 70 -171 -78 455 140 207 -482 -1262 -553 419 356 -172 563 416 220 427 -718 -70
4877g0K99j6r02J660p31k95k39M96o19J11O47O8o42N23o16P76l28q4r2M37l71
$$ -70 229 213 -689 971 240 -55 -294 202 -417 -306 341 409 -233 290 -326 450 122 38 -54 383 12
4898A2mK3K66l36J32j79k35N95j07l45r1O22l7j82J35pm57N73n11K11k85j6J29
$$ 12 8 31 297 -39 93 -86 -321 274 167 -178 -269 353 316 134 269 262 -195 378 -133 78 -207 -223 -94
4921i4J16o50O85j51L29n35j78L64K24l54M31j97NK56j085J465j017M40o89Q08
$$ -94 22 -628 57 -94 235 -300 -478 -114 110 -244 187 -10 -5 251 -834 631 -386 54 -635 173
4941A73l05j43o54Q29O37n67R08j008K87l62K9M03k79O9j03r6K59K93l08m09K99
$$ 173 -132 -275 -929 -100 537 -30 878 -130 157 -205 -176 227 -52 17 -86 -182 77 370 62 -347 -48
4962d8LN24n15K92k59o5n0J14K4L12m20l36O80l37O06m11K70r51L25L40l15J4
$$ -48 -45 479 -36 256 -3 -68 -118 -4 20 332 -88 -424 256 -81 525 114 384 -567 -242 98 -217 -203
4984b03L85n72l18O76j05l76P23m56J09j37M53k12o2n0j71Q08n19r9O7O0l44K67
$$ -203 182 -390 -708 -32 -137 -513 210 -246 -137 -274 179 -33 -95 -145 -316 492 -27 -126 -59 1 -343 -76
5006g6m9L32j55n0q8j21N83o40K14K15l33L01L3L7j67p1J40O8j82M7L5Qj17L6
$$ -76 -125 207 52 2 -86 -207 376 -264 -50 165 -168 133 166 203 36 -35 105 173 -9 38 73 81 -36 0
5030@J74j39k53m9L47k13m4j15J82L23j67m4O5K06j7j15m73K93n4K7LO9J6o2J15
$$ 0 174 35 -218 -267 80 -133 -177 -292 -110 213 46 2 67 273 256 141 -332 -39 -93 -66 -63 6 22 -40 75
5055G5R1j74J20L6Q0n8Q4J8o05K82K19k60J73Q8j73L87l70m24O31m33K52m30M88
$$ 75 166 -8 112 148 228 170 254 272 -333 -51 168 -92 81 169 -4 383 13 -411 220 -213 39 -391 97
5078I7j32k48J99J85n53M17K0m6l09J53J24M9L8O7m99K29K98m3K0j0J7j52J89
$$ 97 -35 -283 -84 101 -452 -35 -15 -61 -370 -217 -93 -44 -6 61 -438 -209 89 46 66 56 73 -79 110
5101A10k59K47n1N6K16n30j12L39J40k12K32jj88j31k75J61M15K7j58j27K64k63
$$ 110 -149 98 47 103 319 -211 -323 16 156 -56 176 175 -13 -144 -419 -258 157 184 26 -101 163 -100
5123a00R4o7J89j31J36j65J61j15m5N3J44j60J67m52O59k93J06j39k04L37l17
$$ -100 -6 -73 116 -15 121 -44 117 2 -43 10 154 -6 161 -291 368 75 181 42 -162 175 -142
5144a42J41M07l84K74n3j76%o5k08n3J23oL4J75R1j20k20JL87j90j86q7K95l1
$$ -142 -1 406 22 296 243 67 67 2 -206 -259 -136 -142 -108 67 158 38 -182 -181 206 16 -170 -257 38 7
5168Gqq2K63l92P6L85k05l03M41o6q6n4J29j45L40j50k71K64l87L20j39K51k1
$$ 7 -1 -83 180 -212 -136 249 44 -259 182 116 30 -24 105 -40 300 150 -121 143 -244 76 -63 188 167
5191A67j87K7J60j91j55K56O3j56L0j38L27j35r2K64k09J89Ll17K6K15J04j77
$$ 167 -20 7 167 -24 -179 77 140 -16 14 -124 203 68 -24 240 31 220 223 -94 -68 147 251 74
5213G4r8m1K09p8j95Q9J38J6l2j63K0J38j09k22K34J73R6l43J15l5M9j99K32j85
$$ 74 -24 -65 144 66 -129 -40 98 114 82 -81 -61 77 -32 -254 -20 153 249 -94 21 -14 35 -164 68 -117
5237a17K04k41J69nL3Ol28M29j61j8R0k55J32K08k81L90l03M3j66K36q3j07L42
$$ -117 87 -154 15 10 43 49 -279 150 -11 -29 61 -194 -62 146 -135 255 -48 -5 -171 65 -18 -125 217
5260B17m87J85j2n5J54j87L53k28l4L54m10k66K79LL93l46J18l56K86K0j18J33
$$ 217 -270 -85 -97 -152 2 -185 168 -60 -94 260 -150 -416 -137 -134 259 -87 31 -325 -39 -19 -137 -4
5282dP4p1L8j46J54j37L0L63l4l35j9J20j13J60q6P0K08k19J11K60n30K65j50
$$ -4 70 -1 37 -109 45 -92 -62 301 267 -68 -87 33 -80 80 -6 64 272 53 164 424 -106 159 9
5305Ij09L11k63J33J34m36L31k4r10J412n22J25l23M15Q5m35N02n78M09J95j32
$$ 9 -100 211 -52 81 215 -221 110 86 -824 588 66 191 -132 283 368 -67 435 -143 266 461 329
5326C29l69l6l4K09k77N19l62J51j79K49n15K79J49j19l92N44j30M1L57k23k34
$$ 329 -40 -76 -110 99 -178 341 -21 130 -49 200 -315 -36 113 -6 -398 146 16 57 414 191 -43
5347d3n4M74p20J49Q3k14K93k08J53K75j77j33j29K00J63j8k08O48j241P70P2
$$ -43 -97 377 -343 -194 -111 -325 -32 -240 -87 188 11 -122 -251 -51 112 94 -114 534 -707 63 135
5368A35l5l3J74o70J327r41j23J05K06K58p19M28n28L23J65m08RJ049n72j17n00
$$ 135 100 67 241 -429 898 -43 -166 -61 145 403 -316 112 -416 -93 72 -336 -327 722 150 33 -467
5389d67Q21L67o59j5n78J197M7p40N83k67o5l37R47j292O29K7j24J234k61p80
$$ -467 354 721 62 47 -531 666 713 -27 556 289 224 -113 834 -458 171 198 74 1308 1047 267
5409B67j87P95j243Q26l80O01r44M18k09K56j94P91n59q03P75n37r1Q64p61Q32
$$ 267 80 875 -368 458 78 679 -265 153 -56 200 6 797 238 -565 210 -327 -418 446 -315 517
5429E17m90L75m76m30M45k43K53P28j321N34j33N58k41K19m1n2p4l19M24J49l28
$$ 517 27 402 -74 -504 -59 -302 -49 679 -642 -108 -241 317 76 295 254 202 128 -191 233 382 54
5450E4K68j021R8N78O82m87j48o8K73l6J4m53j61N00n2J55l10K61l15L60m59K40
$$ 54 322 -699 -601 -23 659 172 24 -44 229 193 207 -246 -407 93 41 196 -114 147 -168 192 -267 -27
5472b7M45k56k37J02n58Q70n44M47K38n24k26K25k64K4J99M71m97J45k91N4J83
$$ -27 418 162 -75 27 -531 339 -205 242 480 -44 -270 -45 -309 -285 -86 385 -112 33 -258 -204 -21
5493b1k33J24j03K48J98N5m82J0L60j71k98K77j3j81L14l17K90m43j60O56k0j88
$$ -21 -254 -130 -233 15 213 268 -214 -204 156 -15 -313 -36 -49 -230 84 -233 57 -386 -546 110 90 -98
5515i8O6J26j45L97k90j90o5P2J58j6q5K6J41K6k57K74k97N60l52J65k06M2k29
$$ -98 -32 94 -51 346 56 -134 -199 -127 31 15 -70 -44 97 123 -134 140 -157 403 51 216 10 52 -177
5538a77O6m9L22m4P2R4k70K52j70L0l96J13L45l88L94k44J24J8R1K7o12M21Q1
$$ -177 -111 -160 162 118 190 284 14 266 96 126 -270 -157 188 -200 194 -50 74 92 183 210 -402 19 100
5561A00m3j82J03m1j74M32N1k2l74K74nQj70J68l36L87j05M9k29L72l8l18R1Q7
$$ 100 57 -125 -22 -63 -237 195 246 224 -150 124 119 127 -43 125 -211 176 71 120 -109 263 225 -93 -2 85
5585H5k24N24k34l41J22J47L0k92K23k03O2K02m8k16J46p4k46L98k49J60J21R5
$$ 85 -139 385 151 -190 -68 79 109 -183 40 -163 -101 101 53 -163 -17 -91 -337 61 -188 -28 93 188
5607A88l10L45r7l27L95k49L6K46k01l2m9n14O03L85q6k63k3L0J9k46K13l70J38
$$ 188 -122 223 126 -201 194 -55 -19 227 26 -6 -55 -569 34 419 333 70 47 77 96 -150 63 -307 -169
5630a69K05on40J48L70J60m11M26l10L94O0n24N54m86l07K40k25O86n96K31J46
$$ -169 36 30 -510 -362 8 168 -243 183 -127 267 327 -197 357 -129 -436 -196 -421 265 -331 -100 46
5651D6J68J3n05M15j48L34k59j11L98o62K7N92j01n89P09p9l6j98k33K97j89N6
$$ 46 214 227 -278 137 -11 323 64 -47 351 -311 -284 308 207 -382 327 248 212 14 -219 78 -111 -55
5673e5J31l6L07j39l02M64r06J064m29k87M8N9J8J38l80L66j02k43M02k58K67
$$ -55 76 40 347 208 -94 370 -536 528 99 -188 -140 -81 -63 75 -305 61 -41 -284 118 -140 127
5694A27l7r7k08j57L37J33q4R8k56K08j93L45n22K26NL02m27J53j66Q18l69m25
$$ 127 90 -7 -215 -372 -35 98 14 112 -144 64 -129 216 -306 -80 -75 227 -200 -47 -213 605 236 -189
5716a89K74j45K46k35M2K4N5j0k30L18k61o4rQ9P3k81M7J41j17J0K82l94M58k17
$$ -189 85 -60 186 -49 -7 17 72 62 -168 150 -111 -175 -184 -95 -22 -303 -256 -115 -232 -222 60 -334 124 -93
5740i3J10o1l31M02K04o8k42K21o51K68O34n01r0m45J047n33K46j14j37q1K6J9
$$ -93 17 -44 -375 27 231 163 -79 142 -509 -241 393 -108 -198 -643 404 -129 117 3 -134 -215 -189 -170
5762a70j34L72j25l16K43j9K13l62J74j02O8J8kL7J49J55o2k19O8n8j31p7L03
$$ -170 -304 68 -57 -373 -130 -149 64 -298 -124 -226 -158 -140 -142 -105 44 199 137 -82 -14 -72 -203 -280 23
5785B3l3j20M9r3L76j81q0pK73k40J70J6j61j15P1j7N8J81Kn3k16N44o25J56j73
$$ 23 -10 -130 -81 -174 202 21 -59 -66 207 -33 137 153 -8 -123 -52 -69 -11 170 172 119 -97 447 -178 -22 -195
5810a95M03m41L67j58J49l5J3k93K3LM33k08R3n1j2K8n20L86Nk2m2J74j15p4J60
$$ -195 208 -233 134 -24 125 90 103 -190 -167 -164 269 61 154 103 91 119 -401 -15 -10 -32 -74 100 -15 -89 71
5835G1j56N1O3lL6n4j27K21k07K77j40R0j66O3j04P9L0j66M0J61K79o04J87Rq5
$$ 71 -85 -34 29 26 62 8 -119 102 -105 172 32 122 -44 19 -85 -6 24 -142 -102 59 338 -266 -79 -70 -155
5860a55P8K68p75M60K04j17m7m0K58l8m52J35j14l0L83k38L44l75J38K48k25P9
$$ -155 -77 191 -584 -124 80 -37 -84 -124 134 96 -356 -221 -335 -365 18 -220 124 -251 -113 135 -90 -11
5882a1j32L5lN1rJ99k27L91r4k45o4L5KK88j70r3K26n14L11J5m1L0J08q6J6rL23
$$ -11 -143 -108 -111 -60 -69 130 -97 294 200 -45 -109 -74 -72 216 46 -47 179 -335 -24 -9 -50 -20 88 2 18 9 332
5909C32j090O22N40k15j014J435l76N9o81j43J900q73j27p94j28R03p19K39l60
$$ 332 -758 -136 404 189 -825 610 234 293 -388 -531 1369 496 369 -425 -553 350 -369 -130 -490
5928d90Q29l64j77m94M14N8N24l57K29l31j50M71j09N6O53r61k24J289m33j018
$$ -490 339 -25 -202 -696 -282 -224 300 -57 172 -159 -309 162 53 109 762 -199 -423 866 433 -585
5948e85J113j009Q73l86J91j26m95J31L43l19M28o0N56j75o12M21j10L87k44n98
$$ -585 528 -481 392 6 197 71 -424 -293 50 -269 159 99 655 480 -132 289 179 566 322 -276
5968b76L31p38L3O73n75M52k52J60K13Q28j191j27Q16k64n63n25P89N8J375k095
$$ -276 55 -683 -650 23 -552 -100 -352 -192 21 849 -342 -469 347 83 -480 -1005 -216 -158 1217 -878
5988h78j81J953o76p43J728j332P53j058j94R36m70K86K28J0k71K93m51l63J662
$$ -878 -1059 894 218 -525 1203 -129 624 -434 -628 308 -162 124 352 362 91 384 -67 -430 1232
6007A232p14j64j358Q96n98L10J026j227K73N1J18ro71j262J836n59K79Q11n61
$$ 1232 518 354 -1004 -108 -706 -396 630 -597 -324 -273 -155 -164 -835 -2097 -261 -820 -541 270 -291
6026b91O16m37R76m01o4p62O5K62k12k22J237r40O73k83m61J90K59N5l56O97o26
$$ -291 325 -112 864 463 399 -363 -298 -36 -248 -470 767 -173 500 217 -244 -54 205 260 -96 601 -25
6047b5n24J274j057L37n2J98p65P88r95R59L3J54n80O79j02n79N43l29m26P17
$$ -25 -549 725 -332 5 -47 151 -614 174 -821 138 171 325 -255 424 322 -257 286 -43 -469 248
6067B48L70j429N19J017r08l0L08l8RO82n38M91m51M40j454R65j085Q05N97k62
$$ 248 618 -811 -292 725 -183 -213 95 57 66 748 210 701 250 690 -764 201 -884 -79 518 256
6087B56M32n57p0L80J09n72m1m22M99k48j78q0K53N77j41M18L99q18l3j097r2
$$ 256 688 131 61 441 550 -22 -63 -485 14 -234 -412 -492 -239 338 197 615 1014 196 163 -934 -1026
6108a026J134p25J777j48j37J40q04p41n38R74r59J551k43j128J057n21J095o15
$$ -1026 108 -617 1160 1012 875 1015 211 -530 -1068 -94 -1053 498 255 -873 184 -337 758 143
6126A43L14p07O82m86O82r2M75o84J8o38J769j799j41m9N94j184J060m74R76r07
$$ 143 457 -250 432 -54 628 536 1011 327 345 -293 1476 -323 -464 -513 81 -1103 -43 -517 459 -448
6146d48lJ180n35q10Q95j161K50J372l46n4j320N45Q40R51k386J466Q86j761j092
$$ -448 -451 729 194 -616 279 -882 -632 740 394 340 -980 -435 405 1356 -1030 436 1322 -439 -1531
6165a531P63L26m21R60K51k27k42P19k63L63J58l44k15j089K97j81J119n81N29
$$ -1531 -768 -442 -863 97 348 121 -121 598 335 698 856 512 297 -792 -495 -676 443 -138 391
6184C91q75J028k183J675Q4n12O1m57Q46m68M7k60J6K19P31J00p92M54q44M53
$$ 391 -484 544 -1639 36 120 -392 -331 -788 58 -410 -363 -623 -607 -388 343 443 -349 105 -739 -286
6204b86L02k86j77K35M43J37j319R48K51o32P02O5p69N07n2j75ML3Q6P82n73k27
$$ -286 16 -270 -447 -212 231 368 -951 -3 248 -384 318 383 -386 121 69 -106 -102 -69 17 799 226 -1
6226aj68o7M05K47P95j205P31n54l29m78J684j774R85p6p17N2J093n42l77K97
$$ -1 -169 -236 169 416 1211 6 737 183 -146 -624 1060 -714 271 195 -522 -470 623 81 -296 1
6246Al72M28l06L72Q90l41j400K39J84M43j729J871J624k050o2n97O07K11n47
$$ 1 -371 57 -249 123 1013 672 -728 -489 -305 138 -1591 280 1904 -146 -208 -805 -198 13 -534
6265e34K317r97j140n67Q15j66J267j479J68K08J374J07j960N05j01k11L49O38
$$ -534 1783 786 -354 -921 -106 -272 995 -484 -316 -108 1266 1373 -587 -82 -183 -394 -45 593
6283E93k052J403j108J423K79j55J011j378J008j144L09n74J930j874j229R21
$$ 593 -1459 -56 -1164 259 538 383 1394 16 1024 -120 189 -385 1545 -329 -1558 -637
6299f37N10K11r7p45R23O03j004o80J222m87J09m10N53N41k65m95m1m84J32m4
$$ -637 -127 84 -13 -758 165 768 -236 -916 306 -181 -72 -482 71 612 347 -148 -189 -673 -541 -585
6319e85J063j539P31J21LN26J05P9j81q22J169l97K53k76j23n95P31m30k8L7K95
$$ -585 478 -1061 -330 -209 -206 320 425 504 323 -499 670 273 526 250 127 -468 263 -167 -195 -158 137
6340A37L27q62P15n83J85j58O77m74M7K43o31L87K73m69P8J332m79l39n13N29
$$ 137 464 -398 317 -266 -81 -239 438 -36 11 254 -377 10 283 -186 -108 1224 745 406 -107 422
6360D22J03l44m49Q24k30K3k556L617j956J361j530q41J796o62O69m20K97l87
$$ 422 525 181 -268 556 326 349 -2207 1410 -546 815 -715 -1556 240 -422 247 -173 124 -263
6378b63N57P28j739J010l41m4j69k04k80N06O01o67r02J543j61o29Q64n14o25
$$ -263 294 1022 -717 293 -48 -92 -261 -465 -745 -239 362 -305 -1207 336 175 -454 410 -104 -729
6397g29J45N36l04RL21J85l92Q01j360O03k29N38L7K2m46k37K92N63J00o62Q89
$$ -729 -584 -48 -352 -343 -22 163 -229 572 -788 -185 -414 124 161 183 -263 -500 -208 355 455 -207 682
6418F82q97K34J3K13o8N77q53K84r57N02M2M20K25o57L89l51L45O23j211L49N16
$$ 682 -215 19 32 245 177 754 -99 185 -772 -270 -228 192 417 -240 149 -202 143 766 -445 -96 420
6439D20j031M65L63J61k75L9m45L99m40P44o86O4N9P03l1j2j94p97N35k16m6M24
$$ 420 -611 -146 217 378 103 142 -303 96 -344 400 -286 -222 -163 540 509 497 303 -494 41 -175 -221 203
6461B03r59N69L27j32J71o78L38r7K12l3P3l54M92j28j10N67j86m88K78r4K72
$$ 203 -756 -187 140 8 179 -499 -161 -258 -46 -79 -6 -360 132 4 -106 461 275 -213 65 -29 243
6482B43o04K09k22L54j7N00o82M46M24j367M34R04j092N59L05l22n79J259q35
$$ 243 -361 -152 -374 -20 -37 463 -219 227 651 -716 -282 622 -470 89 394 72 -507 752 -83
6501h3L75q43O48J79n27N42K02O1j219L8O60n32R18M76q70l25M89m81K95o6N49
$$ -83 292 -551 97 276 -251 291 493 554 -665 -627 33 -499 419 895 25 -300 189 -292 3 -63 486
6522D86q82r67J01J559k75o2q49J107j95m87M52q7K39m38p06J58P26l8m80P62
$$ 486 -396 -1363 -1262 297 22 -40 -889 218 23 -464 -12 -99 140 -298 -1004 -846 -120 -158 -638 124
6542A24K34m93M62j035Q4J562j440j192R86J249J162j674J93r72J59P43m56L58
$$ 124 358 -135 327 -708 -624 938 -502 -1694 -708 541 1703 29 222 -750 -591 152 -304 54
6560E4M81j040j26J562n11J13m56M71l37l90n15J451p38N0Q91j406j60O12J57
$$ 54 535 -505 -631 931 420 533 77 548 211 -179 -694 757 19 69 960 -446 -606 6 163
6579A63j71M26j17l31m77K15O25m92l03M04J97J0P3N7Q72l03j489L40P63j393
$$ 163 -8 418 301 -30 -507 -292 333 -159 -462 -58 139 149 222 279 1151 848 -641 -301 462 -931
6599i31P7J510q78p50J586k97j227R52j31O3j71p16O67q61J438q67M63K77m93
$$ -931 -854 656 -222 -972 614 317 -910 42 -89 -26 -197 -913 -246 -1107 331 -536 -73 204 -289
6618b89N41q69Q05p75M26o3J231p73M00j198L54j601K690j358M61N36p96K29j47
$$ -289 252 -617 188 -587 -161 -224 1007 234 634 -564 -210 -1811 879 -479 -18 518 -278 -49 -196
6637a96P1J24r4j90M88k50J002j149l95J44O67K26n89K80p66N40N69k13l99j07
$$ -196 -125 -1 -95 -285 203 -47 955 -194 -589 -445 222 448 -141 139 -627 -87 482 269 -130 -237
6657b37M65J20n01k46M20J52P9l82j67K89K61n2l99J32n2P05j216M46N53n89m23
$$ -237 228 348 -153 -399 21 173 252 -130 -297 -8 253 201 -198 -66 -118 587 -629 -183 370 -219 -642
6678f42O48L61l94M04k95K34l00j44p4P99l45p92N54j05J01J26M17ok23j77M42
$$ -642 6 367 -27 377 82 316 16 -128 -202 597 252 -540 14 -91 10 136 553 547 324 147 589
6699E89P1q44q51K12M81M4N7K14K42m30L12l73P51o10m0m57Q56k03K9J31J1n4
$$ 589 660 -184 -1035 -823 -342 -298 -241 -27 215 -215 97 -276 475 -135 -175 -632 224 21 50 181 192 138
6721A38Qj00J73M94j071M66O9o2K71k65k46j0l32R04j215O89n84L33M22j0l65
$$ 138 146 46 219 713 -358 108 177 115 386 121 -125 -135 -467 437 -778 -89 -673 -340 82 72 -293
6742b93J51L73r8j99j19l99L29M5K71q7j41M25K33O15j75n97m6q71P73m28J437
$$ -293 -142 231 133 -66 -185 -584 -255 -210 61 -26 -167 258 491 1106 931 334 288 -583 190 -238 1199
6763A199j436M06m08J278j249R9P3Qm6Q37o07K88J75J48n04j44k76N38L6q10k83
$$ 1199 -237 169 -239 1039 -210 -111 -38 -30 -76 761 154 442 617 765 261 117 -159 379 415 -395 -678
6784f78O22Q51r28Q4K10P11j268n94J116J03q22Q31J94L88j173j67O53l22M75
$$ -678 -56 795 -133 -49 161 872 -396 -990 126 229 -593 238 432 820 -353 -520 133 -189 286
6803B86j65k76j04R53j08j002N36n3L08m80P18n45K59L57q25L50L68m11K40j219
$$ 286 121 -155 -259 694 586 -416 120 67 375 -105 613 68 327 684 -141 209 577 166 406 -813
6823h13P73j60J97o06J448r06k1M72j255Q03j164J47L33R96m28R25m99l54n87
$$ -813 -40 -200 -3 -609 839 -67 -88 384 -871 -68 -1232 -1085 -752 244 -184 741 242 -112 -699
6842f99l9Q98r04J565L42p65m2k90n7m49J288r55N9n24J224q07J071r05L0M97
$$ -699 -738 160 -744 821 1163 398 356 66 9 -440 848 -107 -48 -572 652 -155 916 11 41 538
6862E38j78J261j906Q0l69L09J256q73k31m36m9M00k44n57L81J07m3K81L55M49
$$ 538 360 1621 -285 -205 -574 -265 991 118 -113 -549 -598 -198 -442 -999 -618 -511 -554 -273 82 531
6882E31n87J182j517O51K08k75j172r2R91J5J01m3n70P15L79k063J107N15Q0j183
$$ 531 -56 1126 -391 260 468 193 -979 -1071 -80 -65 36 -7 -577 138 517 -1546 -439 76 156 -1027
6902a027J109J451k261P54o61J801o40r38P40k41m0L69j80m36k36r64O14R84k32
$$ -1027 82 1533 -728 26 -635 1166 526 -412 328 87 47 416 236 -200 -436 -1400 -786 198 -34
6921c4o2N16R12j647N05m47M43j023N41M70o65L44j09J074j012R1j112J356p8
$$ -34 -96 420 1332 -315 190 -257 186 -837 -296 174 -491 -147 -256 818 -194 -103 -1215 141 63
6940F3J4P32p72N01n64l29N88m12O98r58M54p34R14j21k48o91R27m77R15p50J32
$$ 63 77 809 37 538 -26 -355 233 -179 519 -439 15 -719 195 74 -174 -865 62 -415 500 -250 -118
6961a18k61J02p26J012p77Q85M21j022P79p37M90k37l50P83j271J098m2p96J323
$$ -118 -379 -277 -1003 9 -768 117 538 -484 295 -442 48 -189 -539 244 -1027 71 29 -767 556
6980E56r82k83L67R02p10J12m24Q55k8q47M88m67M62J36l84L69j95j08K32j37
$$ 556 -426 -709 -342 560 -150 -38 -462 393 365 -482 6 -461 1 137 -247 122 -73 -181 51 -86
7000h6l73K97M60n37M91m43k62L18L3Q1o21J03J80K44M25l68j51o6J77j23o1j59
$$ -86 -459 -162 298 -239 252 -191 -453 -135 -102 -21 -642 -539 -359 -115 310 -58 -209 -275 -98 -221 -282 -441
7022d41P5M74j15J08m05J79k0k17r1N30No1L64j33j33j23J43n09L81m39J87K88
$$ -441 -366 108 -7 101 -304 -125 -145 -362 -453 77 82 21 385 252 119 -4 139 -370 11 -428 -241 47
7044D7l8r2Lk19K93L9K75j31j50K90l87J01Q1k10M87M21n14l7r79J115r25J151
$$ 47 9 -83 -80 -299 -6 33 308 177 27 317 -70 31 112 -98 389 810 296 259 -720 395 -530 621
7066F21p07k91k2k70R84J89P3o83P06j33n10j1N35j001J147m90o94k73O45L52
$$ 621 -86 -377 -399 -669 315 504 577 -106 600 467 -43 -54 481 -520 627 137 -557 -830 -185 167
7086A67n46j65K0P23r89J372r93l64O03L91L11P9n22m85M66K99m59l55NL22J67
$$ 167 -379 -544 -524 199 -790 582 -411 -775 -172 219 530 609 87 -398 68 367 -92 -447 -442 -120 47
7107D7N06l30m13o29K08M87M49l42Q3o55K36J517j325m01M94N37n05J485j097
$$ 47 553 223 -190 -819 -611 -124 325 -17 66 -589 -353 1164 -161 -562 -68 469 -36 1449 352
7126C52J13n79l30o30J073k62L91J02l38n78J178o68N01K20K52j486K46K78K57
$$ 352 465 -114 -444 -1074 -1 -263 128 230 -108 -686 492 -176 325 545 797 -689 -443 -165 92
7145I2O7q22N25N61o08k65P95K78p51k85K33K40P00q42j56j049J083R57k30M70
$$ 92 159 -663 -138 423 -185 -450 345 623 -128 -413 -180 60 760 -82 -238 -1287 -204 753 523 993
7165I93j055n61J266N1m60q5k42k97N50k84m54m83P44J119j276J250q33l31J067
$$ 993 -62 -623 643 694 234 149 -93 -390 160 -124 -578 -1061 -317 802 -474 776 -57 -388 679
7184F79p8j290J193n20L77l39n2L03N59o05Q0o08L46M05n46L33k77K65r96J262
$$ 679 601 -689 504 -16 361 22 -30 273 832 227 307 -301 45 450 -96 237 -40 225 -771 491
7204D91p8r57J048p63M17m32K61k14m01rP92k28k41L82k47M85r80J181k88r4q33
$$ 491 413 -544 504 -259 158 -274 -13 -227 -628 -637 155 -73 -314 68 -179 306 -674 507 219 125 -708
7225g08O37p6O93o66Q2L85l18L45j91q16P71p94O60n05j60J047l90L87q31J51
$$ -708 -71 -147 546 -120 -38 347 29 374 183 -633 138 -656 4 -501 -661 386 -4 383 -448 -297
7245b97K38N35p38m8Q14Q1o86J29o5N58j142Q61j16o1l03J05M84k37o5K41k28
$$ -297 -59 476 -262 -310 504 585 -101 28 -37 521 -621 240 124 63 -240 -135 349 112 47 288 60
7266F0j73L4K97p51l36R79N25j671J148Q26n70r1j43j21k46j93M90j482J262M57
$$ 60 -113 -79 218 -533 -869 110 635 -1036 112 938 368 277 134 13 -233 -426 64 -1418 -156 301
7286C01M00p13K18J88m22N8j13L41O96p53Q42j674P18j03n40M41K23M61n91L0
$$ 301 701 -12 206 394 -28 30 -83 258 954 201 1043 -631 87 -16 -556 -115 108 569 -22 8
7306HK67o25Q58j166P76o32l85P77l25J238n77n57j249N96Q81L11r84J215j106
$$ 8 275 -350 508 -658 118 -514 -899 -122 -447 791 214 -343 -1592 -996 -115 196 -788 427 -679
7325f79M86n47J075L3j039M0N91J71l11O66j251M21l18R3M65p51M00J74N22o56
$$ -679 -193 -740 335 368 -671 -631 -40 131 -180 486 -765 -344 -662 -569 -104 -855 -455 -281 241 -415
7345d15q48M09J45R80l03j77p02O27N33p99J546j434K82O60j91J8LN41m08l50
$$ -415 -1263 -854 -709 271 -32 -209 -911 -284 249 -550 996 -438 -156 504 313 331 334 875 467 117
7365A17J71k7n06l63L13M85p2o33p81J900l80m51P55k12M2l06m02J083n57j47
$$ 117 288 261 -245 -608 -295 190 118 -515 -1296 604 224 -227 528 316 358 52 -350 733 176 29
7385B9J3l84K67l79Q55j293J075J66k21N67m42N68m78K62j95n35Q7k14Q26j605
$$ 29 42 -342 -75 -454 401 -892 183 349 128 695 253 821 343 605 410 -125 -38 -252 574 -1031
7405a031P41m5K66R92p60k69N3J29K50j173R60k49J54o63J523j540M8J274k82
$$ -1031 -290 -335 -69 923 163 -106 -53 76 326 -847 113 -136 18 -645 878 -662 -614 660 378
7424C78j81k50jp0l51Q37N68K79K6j437P15Q27j081L62o57m77N42l50K75K85j191
$$ 378 197 -53 -54 -124 -475 362 930 1209 1235 -202 513 1340 259 621 -36 -513 29 -321 -46 239 -952
7445i52M87K12N06n87J342p91r90J116n83J95J25o87q10J180O80o34j93o5K56
$$ -952 -465 -253 253 -334 1008 217 -773 343 -240 -45 80 -607 -1417 -237 443 -191 -384 -449 -193
7464a93K65l9M21p9M61r98L92j359QJ209k00R5q51L73O56r01L02O29k53K05l44
$$ -193 72 33 454 375 836 -162 230 -1129 -1121 88 -112 -17 -868 -495 161 -740 -438 191 -62 143 -201
7485b01L9j69k4j87k35J314p75k99L88L05J149j788K55Q60o22K3m08Q30k35J21
$$ -201 -162 -331 -355 -542 -777 537 -238 -537 -149 156 1305 -483 -228 632 10 33 -375 455 220 341
7505C41K28m55LJ83l57K12p4n1J67J73q4m58K06r2Q9M19n15l8M56m13L38m19N74
$$ 341 569 114 117 300 -57 155 81 30 197 370 286 -172 34 -58 31 450 -65 -103 353 -60 278 -141 433
7528D33n11J2p1L61L22m13J16k44k63M96P4j63q7L3l16j23M27p70N42k85j47k86
$$ 433 -78 -66 -137 224 546 133 249 5 -258 238 312 149 62 95 -221 -344 83 -687 -145 -430 -577 -863
7550h63O97j97L01K84r86K12l11O28Q00o10l81J085j195J045j44k87n91K93J00
$$ -863 -166 -363 -62 222 -764 -552 -863 -235 565 -45 -426 659 -536 509 365 78 -513 -220 -120
7569a20q83Q17R18j078Q80j109R55K47p77j38k84j87L84J18j13m7J046p23K90
$$ -120 -1003 -186 732 -346 534 -575 380 627 -150 -288 -572 -759 -375 -257 -370 -417 629 -94 196
7588A96o62J02N87n9K47n82oj7J55n34J181o42O56j299L47L53O26j004M82j85
$$ 196 -466 -364 223 164 411 -171 -177 -194 -39 -573 608 -34 622 -677 -330 23 649 -355 127 -58
7608e8l8j74o04J038k5j147R32k98j18J024m03n02M86K87q17l1K59m69M87R25
$$ -58 -96 -270 -874 164 139 -1008 -76 -374 -492 532 129 -373 113 400 -417 -448 -189 -658 -171 754
7628G54m64k76l15K03o0K39J45n99j55Q26K37n81K8M24l56J1o02Q93k10R0N8N63
$$ 754 290 14 -301 -98 -158 81 226 -373 -528 298 535 -46 -18 406 50 61 -541 352 142 232 290 853
7650H53r52o75P30nO26q1L55j506J445j849J278J507j305o1p2k76Qm44P96o13
$$ 853 -99 -774 -44 -49 577 496 851 -655 790 -1059 219 1726 421 360 288 12 20 -424 372 -241
7670b41P95j286O80L67n07O27r96n8K000j272L08n30L55K59k47m47kl71J247p05
$$ -241 554 -732 -52 315 -192 435 -561 -619 1381 109 417 -113 242 501 254 -193 -195 -566 681 -24
7690b4r9n54J036k37l21N43m75J530r85q07R1k88Q75j96M3n68L41L68j67J66N04
$$ -24 -123 -677 359 122 -199 344 -131 1399 414 -393 -302 -590 285 89 132 -436 -95 273 106 272 776
7711G76q75p30M23J38J007o40L10j93J1l5J38K59n87J56o36L25L50j46o04M42
$$ 776 -99 -829 -406 -268 739 99 409 216 227 192 330 589 2 158 -478 -153 197 51 -553 -111
7731a11j54J1L44n85N84K91r85J86J454q34j015R73O63j275O46o02R06j28q1N01
$$ -111 -265 -254 90 -495 89 380 -605 -419 1035 201 -814 159 822 -453 193 -409 497 369 288 789
7751G89m79r32R65r34R96N7r73O94m42L96P1n8l79k31O47k45j52K58N3j83K19
$$ 789 310 -622 343 -591 405 462 -511 183 -259 137 208 150 -229 -460 187 -58 -210 48 101 -82 137
7772A37L49j47m05m1k6J51K9k06M46p08K60KM09j50j27K9o4j55kk71R47q05J87
$$ 137 486 339 -66 -107 -133 18 47 -159 287 -421 -161 -159 250 100 -27 2 -62 -217 -219 -490 457 -348 -161
7795a61K30K11l65k1J31j98N49l25p0P4k89K46j94j09P45K54m83k88j00J06n17
$$ -161 69 280 -85 -106 25 -173 376 51 -19 55 -234 12 -182 -291 454 708 225 -63 -163 -57 -574
7816e74J067q37J81N1l57O14n33J64P5q0o53R97N66m68q34N22J65L08l76J13o65
$$ -574 493 -344 -163 -112 -469 145 -388 -224 -149 -229 -882 115 681 213 -621 -99 66 374 -2 111 -554
7837e54P33M89o06k63N32j144R15m8k82N03o13N50j25j05J44m70O93j123L96Q80
$$ -554 179 668 62 -201 331 -813 102 54 -228 275 -338 212 87 -18 126 -344 349 -774 -378 502
7857E02n20M27o20P2L8N8K79k09l28J29K34n50P27j72R0j79J91k28J07nQ36j204
$$ 502 -18 409 -211 -139 -101 -43 236 27 -301 -172 62 -488 239 67 157 -22 169 -59 48 43 879 -325
7879c25M59j34O42m06L8l07Q01p24J41J02k30R8K13n68l43P29L28l32m20N9k26
$$ -325 134 0 642 236 274 -33 768 44 185 287 57 155 368 -200 -543 186 514 182 -238 -179 -405
7900d05O41j42m79JP92K3n12J73K74l41O60j205J057l32r43R14n25J6L14L57j348
$$ -405 236 94 -385 -384 408 431 -81 92 366 25 685 -520 537 205 -738 176 -349 -333 -19 338 -1010
7921a010J199Q1r64M50p66Q93o91R67l79J64J86p79N20N57j498J159m66L22k2
$$ -1010 189 270 -694 -244 -1010 -117 -808 159 -220 -56 130 -649 -129 428 -1070 89 -377 -55 -77
7940g7Q06o40o2q6J16m70O6j63P37L23p78p11K41M2j08P5O89lO6j49k50P27o87
$$ -77 729 89 27 -59 57 -413 -347 -510 227 550 -228 -939 -698 -656 -764 -689 0 -3 63 -86 -336 391 -296
7963b96J069n93m69O21M52o80n20M42p21P92l24M05l57N22j32L76p02l59L11m3
$$ -296 773 180 -289 332 784 104 -416 26 -695 97 -227 178 -179 343 211 587 -115 -474 -163 -206
7983b06K00jM30lj196J115p52M90pj56l17M42L36j55L2o7m73o47N28K0P69m59
$$ -206 -6 -7 423 420 -776 339 -413 77 70 -86 -403 39 375 220 252 185 -288 -935 -407 -387 382 -77
8005g7nr22R62M51q03P88n00r03P22N60L29p50M57n50m71O42K59j115O06L27M34
$$ -77 -82 -1004 -42 409 -394 394 -106 -1009 -287 273 602 -148 309 -241 -712 -70 189 -926 -320 7 441
8026D41o81L26m83O68j67o51O11k02R1J48L89m07L28p65M49l15N43j04Qk36m81
$$ 441 -240 86 -397 271 104 -547 64 -138 -47 101 490 83 411 -354 95 -220 323 219 227 -9 -490
8047d90O15j25k01p51R41qP5J70m59J82J54K25m87M4m34J171o94n4O1J139j386
$$ -490 125 0 -201 -952 -11 -19 56 226 -233 -51 103 328 -159 -115 -549 622 -72 -126 -65 1074 -312
8068c12J081m2o43o93J140P87k61r41o61P2J36K350k252j114O41RJ177n87J126
$$ -312 769 727 84 -609 531 1318 1057 116 -545 -473 -337 2013 -239 -1353 -712 -703 474 -113 1013
8087A013r16m28q12M41Q56n04R47n15P68r35J92o5n26R72j185N75j020J786n39
$$ 1013 97 -331 -1143 -702 154 -350 597 82 850 -85 107 42 -484 488 -697 -122 -1142 644 105
8106A05O5o97P44k61L38J42j079N23m95O55k92L02j086J547l04k37n29P56m50
$$ 105 170 -527 217 -44 294 436 -643 -120 -615 40 -252 50 -1036 511 207 -30 -559 197 -253
8125b53N91p84J102j591J064J284l84j702O37n41J063n44M24J35j513J221m64
$$ -253 338 -446 656 -935 129 1413 1029 -673 -36 -577 486 -58 366 501 -1012 209 -255
8142b55L46N37r46r2J191K20p58j49n33J01M83p18J160j023N16O76m56q09O65
$$ -255 91 628 -318 -410 781 1001 243 94 -439 -338 145 -573 587 -436 80 756 300 -509 156
8161A56l2l11J09M70k73K80j59N2J9l96O81j075N27J22n43P02l36N58q96Q84j214
$$ 156 124 -187 -78 392 119 399 240 292 311 -85 596 -479 48 170 -373 329 -7 551 -345 539 -675
8182f75P69j74J38K3m21O29n7K20K28
$$ -675 94 -80 58 81 -340 289 232 452 680
8191F80
$$ Imaginary data points
##PAGE= N=2
##DATA TABLE= (X++(I..I)), XYDATA
0@%%%%%%Pj5J6j6K3l1L8m6N5p0Q5j00J17j35J58j85K15k48K84l25L72m24M80n44
$$ 0 0 0 0 0 0 0 7 -8 8 -8 15 -16 22 -24 31 -39 46 -54 63 -72 86 -99 116 -132 152 -173 199 -225 255 -289
30b89O12o87P72q64R64j076J199j330J474j634J810k004K220k458K723l020L353
$$ -289 323 -364 408 -456 508 -568 631 -699 775 -859 951 -1053 1167 -1291 1432 -1588 1765
47A765l733M168m673N266n972O838p922R324j1227J3963j8253K6010m4391J64553
$$ 1765 -1968 2200 -2473 2793 -3179 3659 -4263 5061 -6166 7797 -10456 15554 -28837 135716
61A35716J32083l76469j30495K06263K26247r3873j75697k7449J03476M0869l842
$$ 135716 267799 -108670 -239165 -32902 193345 99472 -76225 -103674 -198 40671 36829
72C6829r993j7483n1273N666P4801M7036o0118p7837l361O6939N2442j5804q3263
$$ 36829 26836 9353 -41920 -36254 38547 85583 25465 -52372 -55733 11206 63648 47844 -35419
85c5419n0277O5805J08917j7673j27221l6777J20987Q4213q4319j08223M3176
$$ -35419 -85696 -19891 89026 71353 -55868 -92645 28342 112555 28236 -79987 -36811
96c6811J04305j3634r2670p186O7901P434n2584Q38M4034j0010m2232K0970N4118
$$ -36811 67494 53860 -38810 -45996 21905 29339 -23245 -22407 21627 11617 -30615 -9645 44473
109D4473j7168o5149J742O7114J7643o1685m1722L7049M6716j2721m1113j0601
$$ 44473 27305 -37844 -36102 31012 48655 -13030 -54752 -17703 29013 16292 -24821 -35422
121c5422K1931K6574O481k4524k9404J6660M7758J292n6009k2831M7729L6383
$$ -35422 -13491 13083 19564 -4960 -34364 -17704 30054 31346 -24663 -47494 235 36618
133C6618l4610m4718J4980L6952k437k0206R251J0532k4040j0646M6582L3946
$$ 36618 2008 -42710 -27730 9222 6785 -13421 -4170 6362 -17678 -28324 18258 52204
145E2204n1756o5293L0874Q4251N188q2867m7030N0107O7784o132n7444k5736
$$ 52204 448 -64845 -33971 50280 55468 -27399 -74429 -24322 43462 37330 -20114 -45850
157d5850L0564L7875L596k2381j8084J129J2646Q200K04k942r916j7533l08L2023
$$ -45850 -15286 22589 26185 3804 -14280 -13151 -505 7695 7899 4957 -4959 -22492 -22800 9223
171I223K4260k8782m5265J2114N9462J7521n1640l7152L5194M6796j7922m8426
$$ 9223 33483 4701 -40564 -28450 31012 48533 -3107 -40259 -5065 41731 23809 -24617
183b4617L227M1111M161l6408j0486L1013J7287j9076j7037J0545J5120j389n661
$$ -24617 -21390 19721 23882 -12526 -23012 8001 25288 6212 -10825 -280 14840 13451 7790
196G790K171j503j1020k614J4460J0894j2996k2653j722K2342K0732p514k8026
$$ 7790 9961 8458 -2562 -5176 9284 20178 7182 -15471 -17193 5149 25881 18367 -9659
209i659j3268K3354L1344l721l3481j6614J8372K1959k259j6739r578n76N338
$$ -9659 -22927 427 31771 28050 -5431 -22045 -3673 18286 16027 -712 -10290 -10866 -5528
222e528J2043R901r859k2227p23K8048J8011k0108k8368M136K7875P395k1481
$$ -5528 6515 16416 6557 -15670 -16393 11655 29666 9558 -18810 -14674 13201 20596 -885
235h85j7120Q458J6272O18j2752o060P563J0506P29r036p134N363J0687J896j1131
$$ -885 -18005 -9547 6725 7343 -5409 -11469 -3906 6600 7329 -1707 -8841 -3478 7209 9105 -2026
250b026j1378J602J1271O958o032j3799o239J0123J7661N171j7757j9230P762
$$ -2026 -13404 -11802 -531 6427 395 -13404 -19643 -9520 8141 13312 -4445 -23675 -15913
263a5913K7454R889k2522k4336N230K4466J0631j4781j9220l46J5524J2416k673
$$ -15913 11541 21430 -1092 -25428 -20198 4268 14899 118 -19102 -19448 -3924 8492 5819
276E819j0943p709N618J3268M870r384j1273J436J0396M536q009r282J975J1109
$$ 5819 -5124 -12833 -7215 6053 10923 1539 -9734 -8298 2098 6634 -1375 -10657 -8682 2427
290B427L904r319q616P179J4819J178j4206q445P412J4295L484j4914j3815M045
$$ 2427 6331 -2988 -11604 -4425 10394 11572 -2634 -11079 -3667 10628 14112 -802 -14617 -10572
304a0572J6397O915q519j3516n798J3003J7626J811j6184j4177M945J9129J1509
$$ -10572 5825 12740 4221 -9295 -15093 -2090 15536 17347 1163 -13014 -8069 11060 22569
317B2569j2026k1875l956J7831J5752n755j7081q008J0163J5038K710j0580p863
$$ 22569 10543 -11332 -15288 2543 18295 12540 -4541 -12549 -2386 12652 15362 4782 -3081
330c081K663O862L635j634m465m741J28L768J293j482j497j547K68J548J797K9
$$ -3081 -418 6444 10079 8445 3980 -761 -633 3135 4428 2946 1449 -98 170 1718 3515 3544
346C544J077O6l670k627K959N105l26o790o676N47R737O064p438j1112J602J1023
$$ 3544 4621 4687 1017 -1610 1349 6454 6128 -662 -7338 -6791 2946 9010 1572 -9540 -7938 3085
362C085O336m368p687k955M973N315p04m320l330j903J418M371K438m434m751
$$ 3085 9421 5053 -2634 -5589 -616 4699 3995 -325 -3655 -5558 -4140 231 2669 -1765 -6516
377f516K127M279J625q42j701j265P45Q89k636J43L216k404n122l121O089N981
$$ -6516 -4389 -110 1515 673 -1028 -2293 -1548 -659 -3295 -3152 64 -2340 -7462 -10583 -4494 1487
393A487Oo086o683M162J0583L733q154q415J094N702N355J014o837r011J798J0016
$$ 1487 1493 -4593 -11276 -7114 3469 7202 -952 -9367 -8273 -2571 2784 3798 -3039 -12050 -10252 -236
409b36P793l568j1242o257J0349J1140K405j0668r425J875R308Q029l437j1553
$$ -236 7557 3989 -7253 -13510 -3161 7979 10384 -284 -9709 -7834 1474 9503 6066 -5487
423e487n815P225J0404K06p272m924R34O577M733j91n545m393J888M114M337k885
$$ -5487 -11302 -4077 6327 6533 -739 -5663 -4729 1848 6581 6390 845 -3548 -1660 2454 6791 3906
439C906p821l27N981J164j731j533J942J56p00j29K659K704L78n064m047L085
$$ 3906 -3915 -4242 1739 2903 1172 -361 1581 1737 1037 908 3567 6271 6649 1585 -2462 623
455F23N345K69n222l819k48N906M497j707n206j031K298J851L375L37n985m991
$$ 623 5968 6237 1015 -2804 -3052 2854 7351 5644 438 -593 1705 3556 6931 7268 1283 -3708
471c708L251O796J950o837p496K057Q574K996o193m138K842L109j479k70J514
$$ -3708 -457 6339 8289 1452 -6044 -3987 4587 7583 1390 -2748 94 3203 1724 1454 2968
486B968o36l457k686L067L842j021m133l492J639N282N53L09k924k088j016L769
$$ 2968 2332 -1125 -3811 -744 3098 2077 -2056 -5548 -3909 1373 1926 2235 -689 -2777 -3793 -24
502b4L796r85n777l240J698O512K738n819p677J109P106N284j964p856l351N666
$$ -24 3772 2787 -2990 -6230 -4532 1980 4718 -1101 -8778 -7669 -563 4721 2757 -5099 -8450 -2784
518b784O478l91n366l608RK596K955K50l126m068P18M488L269k143m079J01M332
$$ -2784 3694 3303 -2063 -5671 -5662 -3066 -111 139 -2987 -7055 -6337 -1849 1420 -723 -4802 -4701 -369
535c69R19k642o98K521l92k952p12K594K063o63k012j477O14L103L419l14m590
$$ -369 550 -2092 -2790 -269 -661 -3613 -4325 -1731 332 -331 -2343 -3820 -3206 -103 3316 3002 -1588
552a588m077L454P212J891o771o625J800O629M738k559o937l958M574Q925K958
$$ -1588 -5665 -2211 5001 6892 121 -6504 -4704 1925 6663 4104 -2833 -6791 -2217 6708 9666
567I666p682q119K098R401L244m841o076q58L196K842J678j070m236k821K904
$$ 9666 1984 -6135 -4037 5364 8608 3767 -2309 -3167 29 2871 4549 3479 -757 -3578 -674
582f74O343J533n516m419K873M447k24j421j620o95L30O37J646k64j488J31j17
$$ -674 5669 7202 1686 -2733 140 4587 4363 2942 1322 627 957 1594 3240 2976 1488 1619 1502
599A502j215J448L740N56n088m852L577O590P96o850n425J918N937J620k183m565
$$ 1502 287 1735 5475 6031 943 -3909 -332 6258 7054 204 -5221 -3303 2634 4254 2071 -2494
615b494j294J733M841L130m019o035q65M698M214m21m684l978k95L905M998N2
$$ -2494 -3788 -2055 2786 5916 1897 -4138 -5003 -305 3909 3488 -1196 -5174 -5469 -1564 3434 3486
631C486o865m500M022P603J273o230m764J720M617J000k033j423p39o07J242J731
$$ 3486 -3379 -7879 -3857 3746 5019 -1211 -5975 -4255 362 1362 -671 -2094 -2833 -3440 -2198 -467
647d67K4j365j552m34K206K507L59k475l501n94N190K804l978m403J352L873P24
$$ -467 -443 -1808 -3360 -3794 -1588 919 1278 -1197 -4698 -5292 -102 2702 -1276 -5679 -4327 -454 270
664B70k790l14J283J966k796j538M351J541k493k915P78J972J663q86k030j350
$$ 270 -2520 -2834 -1551 415 -2381 -3919 432 1973 -520 -3435 -2657 -685 978 92 -1938 -3288
680c288J689K588j35n56p20p64J039m37K856L54m51l497k373M579N386l051p137
$$ -3288 -1599 989 854 298 -422 -1186 -147 -584 2272 2626 2175 -1322 -3695 884 6270 3219 -3918
697c918j129O019N241j937n263k094L128M631N75k254l261j308Q00L260J341j966
$$ -3918 -5047 972 6213 4276 -987 -3081 47 4678 5253 2999 -262 -1570 -770 2490 3831 1865
713A865j914o60P43J902L408o63o317k918N787O162j430o803l451L878N084l78
$$ 1865 -49 -709 34 1936 5344 4681 -1636 -4554 1233 7395 5965 -838 -4289 -411 4673 4295
729D295l565k104M75J233J372K12Q94j540k122P32K092J706J502o029l948K956
$$ 4295 730 -1374 -899 334 1706 1918 2812 1272 -850 -118 1974 3680 5182 -847 -4795 -1839
745a839O085q0m291m008J89O628K8j444k853o64R32J47K120K393m059l517m6M544
$$ -1839 4246 4166 -125 -4133 -3944 2684 2712 1268 -1585 -2249 -1317 -1170 950 3343 -716 -4233 -4279 265
763B65K395j803m078l841L526O758J061n552m995L62N334L737k115n216k487N729
$$ 265 2660 857 -3221 -7062 -3536 3222 4283 -1269 -6264 -5902 -568 3169 1054 -4162 -6649 -920
779i20K326q60l393j077K47K367K292j482k93l511J049K721L448k787l530r93
$$ -920 1406 546 -2847 -3924 -3677 -1310 982 -500 -793 -4304 -3255 -534 2914 127 -3403 -4396
795d396L440O45P01j951j824J206K879J36l054p00L481K345l884k272J469L365
$$ -4396 -956 -311 390 -1561 -3385 -2179 700 836 -2218 -2918 563 2908 -976 -3248 -1779 1586
811A586O89l031k944J615L085R91j715j454J1J580P77R33m05j349j595Q03K205
$$ 1586 2275 -756 -3700 -2085 1000 1991 276 -1178 -1167 413 1190 2123 1718 369 -1226 -423 1782
828A782J954k277l716m81L948L262j521l437k194L252L946L7l660k450J605J856
$$ 1782 3736 1459 -2257 -2738 1210 4472 2951 -486 -2680 572 4518 4555 895 -1555 50 1906
844A906P92O26j831k410J3J806K946q22k115k986J173L479K241j690l625q08J351
$$ 1906 2698 3324 1493 -917 -904 902 3848 3026 911 -2075 -902 2577 4818 3128 -497 -1305 46
861D6L655P33l396l090O23L138K008o24l489j545O62L246N21k465q31q46J848
$$ 46 3701 4434 1038 -2052 -1429 1709 3717 3093 -396 -1941 -1279 1967 2488 23 -808 -1654 194
878A94M56R01k06k117n22J67J994l17M15k707j073J531K572P33k154p97r27K61
$$ 194 650 1551 1345 -772 -1294 -1127 867 550 965 -1742 -2815 -1284 1288 2021 -133 -930 -1857 -1596
896a596K364l00j349r89j527J196L270K23l274k214J588L271P06j424k652j701
$$ -1596 768 468 -881 -1870 -3397 -2201 1069 1292 -1982 -4196 -2608 663 1369 -55 -2707 -4408
912d408L132K358q70k099n22oJ632J235K82k518p70K81K215J477l59k716j211
$$ -4408 -1276 1082 212 -1887 -2409 -2415 -783 452 734 -1784 -2554 -2273 -58 1419 1060 -1656 -2867
929b867K094J395P4j966j197P02J789o83K324o47j111j128N00Q53P34p50j897
$$ -2867 -773 622 696 -1270 -2467 -1765 24 -659 1665 1018 -93 -1221 -721 132 866 116 -1781
946a781P36J58K081l46q85k99P04M7J135m32k29r72k74L90J673R20j499m99j453
$$ -1781 -1045 -887 1194 848 -37 -336 368 415 1550 1118 889 -83 -357 33 1706 2626 1127 628 -825
965h25J333J948r52m11j007J53R01N45Q13l99j374o38J226J318J207l602j854
$$ -825 508 2456 1504 1093 86 239 1140 1685 2498 2099 725 87 1313 2631 3838 236 -1618
982a618O57L829K07r23k580m72J604J360J093j079l216r93K705J734J57j825l042
$$ -1618 -961 2868 3075 2152 -428 -900 704 2064 3157 2078 -1138 -2131 574 2308 2465 640 -2402
999b402J772K215J091o58l270j240L099J517J04j867k928M70J814K255m0k107
$$ -2402 -630 1585 2676 2018 -1252 -2492 607 2124 2228 361 -2567 -2097 -283 1972 1932 -175
1015a75k134o10L242J808r47j968k358O87K856K281k867k773O59P56K185j288
$$ -175 -2309 -2919 323 2131 1184 -784 -3142 -2455 401 2682 -185 -2958 -2299 -1543 642 -646
1031f46L01j822j136O87K748N86k796j053J560J501L60n33j544K60P32k86J003
$$ -646 -345 -2167 -3303 -2616 132 718 -2078 -3131 -1571 -70 290 -243 -1787 -1527 -795 -1081 -78
1048g8j070o82l87J391M49M86p16k14k05q8Q45M82J0j086m03o62J458P20O22j167
$$ -78 -1148 -1830 -2217 -826 -377 109 -607 -821 -1026 -1114 -269 213 223 -863 -1266 -1928 -470 250 872 -295
1068b95l59m46P55J614M47k528j087J051J451J402q56j903n98J504J064J084j742
$$ -295 -654 -1100 -345 1269 1716 -812 -1899 -848 603 2005 1149 -754 -1352 152 1216 2300 558
1085E58q52j323J422K570K81k720j593J274J452K071j008j914j950J621K637K18
$$ 558 -294 -1617 -195 2375 2656 -64 -1657 -383 1069 3140 2132 218 -1732 -111 2526 2744
1101B744r71k049p14J472K420q1k079j554p5J911K034J21k461k354J653K431K62
$$ 2744 1773 -276 -990 482 2902 2821 742 -812 -887 1024 3058 3179 718 -1636 17 2448 2710
1118B710j324j963m41J210J799K79j343j639n52J675J792n8k118j419J032R26
$$ 2710 1386 -577 -1018 192 1991 2270 927 -712 -1264 411 2203 2145 27 -1392 -360 566
1134E66R12l29j624j092P21J570K06q25r48o45O42J684j01j157r95N02K74P89
$$ 566 1478 1149 -475 -1567 -846 724 930 105 -843 -1488 -846 838 737 -420 -1415 -913 -639 150
1152A50L12j266j086N43Q16N37n58J16j212L04P93N12l12o11k06q09J378K89Q
$$ 150 462 -804 -1890 -1347 -531 6 -552 -436 -1648 -1344 -551 -39 -351 -962 -1168 -1977 -599 -310 -302
1171c02q53m28r5L57Q91N62r60j292L06J303O05k56q33q05J30J432M86m9j234
$$ -302 -1155 -1583 -1678 -1321 -430 132 -828 -2120 -1814 -511 94 -162 -995 -1800 -1670 -238 248 199 -1035
1190a035o71N02J730M09j128j243K19P32J159O76j536j258M9J749J067l93j676
$$ -1035 -1706 -1204 526 935 -193 -1436 -1217 -485 674 1350 -186 -1444 -1395 354 1421 1028 -648
1207f48m98Q91J339L07o42q19k53L11P64O72m42q08p76J065P86L5j61j232q4P32
$$ -648 -1146 -255 1084 1391 749 -70 -323 -12 752 1424 982 174 -602 463 1249 1284 1123 -109 -193 539
1227E39J505j8j089j123j29J235J226m28q77q85j14P45J195K24j372j290K84J500
$$ 539 2044 2026 937 -186 -315 920 2146 1718 841 -44 -158 587 1782 2006 634 -656 -372 1128
1245A128J228p42j590o43P03J853K65j264j654o5J249J325k84j369n61k40Q61
$$ 1128 2356 1614 24 -619 84 1937 2202 938 -716 -781 468 1793 1509 140 -421 -661 200
1262B00J225J87j540j442K52J830J382r25k426j268K058K038l16j953j462O80
$$ 200 1425 1612 72 -1370 -1118 712 2094 1169 -1257 -2525 -467 1571 1255 -698 -2160 -1480
1278a480J656Q94n12j260r94P27J076N53o02j412n20M88J374N45q74j794J04J501
$$ -1480 176 1070 558 -702 -1696 -969 107 660 58 -1354 -1874 -1386 -12 533 -341 -2135 -2031 -530
1296e30J243m68j879k38P70J119j77q39k93J79K55K92n6R4k08m25M57m85N06K28
$$ -530 713 245 -1634 -1872 -1102 17 -160 -999 -1292 -1113 -858 -566 -622 -528 -736 -1161 -704 -1189 -683 -455
1316d55J7Lo34J07Q48O3l07j13k7k5M8M41M38p31r53M88J747M39j293j116k81
$$ -455 -438 -435 -1069 -962 -114 -51 -358 -471 -498 -523 -475 -34 404 -327 -1280 -792 955 1394 101 -1015 -1296
1337a296J475J718l25j968j026R03J980K60r09j585k2J495J106l35n57r45o90
$$ -1296 179 1897 1572 -396 -1422 -519 1461 1721 812 -773 -795 700 1806 1471 914 -31 -721
1354g21Q73J889J90j690j508J39K050J887j356k659m31K228J639q82j400j047
$$ -721 152 2041 2231 541 -967 -828 1222 3109 1753 -906 -1337 891 2530 1648 248 -799
1370g99J046Q64N33p22p21j7j55M96R74K60j474q44L35J337P19o36j857k46J393
$$ -799 247 1111 1644 922 201 184 29 525 1499 1759 285 -559 -224 1113 1832 1196 -661 -907 486
1389D86J368p28j384k52L26M55L83q7o50k45k63J26J044K16q31j036J33Q73N60
$$ 486 1854 1126 -258 -510 -184 271 654 567 -83 -328 -591 -465 579 795 -36 -1072 -939 -66 494
1408D94k17p24j642J107J610n80p32k12k41O71R4L01n12m36M38L50j597P09J042
$$ 494 277 -447 -2089 -982 628 48 -684 -896 -1137 -466 -372 -71 -583 -1019 -581 -231 -1828 -1119 -77
1427g7j149q07O25J307L06l68j949k91J064K129j204j011J25J45K10O49K26q55
$$ -77 -1226 -2033 -1408 -101 205 -163 -2112 -2403 -1339 790 -414 -1425 -1300 -1155 -945 -296 -70 -925
1445i25l23j52Q48O39M77j532p8J61J027J817j457j869N3Q65J418o39j074N96
$$ -925 -1248 -1400 -552 87 564 -968 -1046 -885 142 1959 502 -1367 -1314 -449 969 330 -744 -148
1463a48n55Q79L02K97j015k69O79L3Q24j1o68j380O98J504N26j085r34k24J212
$$ -148 -703 176 478 775 -240 -509 170 203 1027 1016 348 -1032 -334 1170 1696 611 -323 -547 665
1482F65J79Q4k39r01N86L24J92M8o5q06l19R25N03P5p08j148O54J112N24p30o14
$$ 665 844 928 689 -212 374 698 890 938 873 67 -252 673 1176 1251 543 -605 49 1161 1685 955 341
1503C41j88O07K43j9k60l95k56P3O77k63P55j342o11N67J503j130j03m32kP02
$$ 341 153 760 1003 984 724 329 73 146 823 560 1315 -27 -638 -71 1432 302 199 -233 -235 467
1523D67o24J003n17j31r63M50J108J46p87j393N85N25N54m11m07j021M40R08L70
$$ 467 -157 846 329 198 -765 -315 793 939 152 -1241 -656 -131 423 12 -395 -1416 -976 -68 302
1542C02p4q63q01N23Q12P19r77j165J0J172P74n02o85q39N19K19N66M0m29j27
$$ 302 228 -635 -1436 -913 -101 618 -359 -1524 -1514 -342 432 -70 -755 -1594 -1075 -856 -290 -250 -679 -806
1562h06n7L40M87j21p40k91N95M48M3k74o82O8k16J205K33r25o70N69N5R06j1
$$ -806 -863 -523 -36 -157 -897 -1188 -593 -145 -102 -376 -1058 -990 -1206 -1 232 -693 -1363 -794 -739 167 156
1583A56l57o71m12J131M72P08j430L18l17N23R27k74r59K80r66J110M48q3p86
$$ 156 -201 -872 -1284 -153 319 1027 -403 -85 -402 121 1048 774 -185 95 -871 239 687 604 -182
1602a82n69Q51N31M15n72m21n90R02J251n75m49m21p11J661l13l62r6q74M81J071
$$ -182 -751 100 631 1046 474 53 -537 365 1616 1041 592 171 -540 1121 808 446 350 -524 -43 1028
1622A028J18M04k038O16L29P99j05q79n41k97J275P78k50p08j013L01R88J09L07
$$ 1028 1146 1550 -488 128 457 1256 1151 272 -269 -566 709 1487 1237 529 -484 -183 805 914 1221
1641A221r64j394J263N62Q9j68l97j047J332l66O53k68n88j24L01J26l43N76l33
$$ 1221 257 -1137 126 688 777 609 212 -835 497 131 784 516 -72 -196 105 231 -112 464 131
1660A31l8o46K78J04K95k82k41m22R18j1k76j52p14N99O48P3l09l83p09P5J128
$$ 131 93 -553 -275 -171 124 -158 -399 -821 97 86 -190 -342 -1056 -457 191 264 -45 -428 -1137 -1062 66
1681F6k30K36q31k97O15N10J12m51p89m17O49J284k29q65j046N19P88J044q31
$$ 66 -164 72 -759 -1056 -441 69 181 -270 -1059 -1476 -827 457 228 -637 -1683 -1164 -376 668 -163
1700a63j506K02Q13J461m55m48r42j6O96J182l64q36q70l6J831R2m95r13j512
$$ -163 -1669 -1467 -654 807 352 -96 -1038 -1054 -358 824 460 -376 -1246 -1282 549 641 146 -767 -2279
1719b279K185Q83j29r78q24L79P85Q67j003l2l07m39J102J76K31q74n66P15J02
$$ -2279 -94 789 660 -318 -1142 -763 22 889 -114 -146 -453 -892 210 386 617 -257 -823 -108 -6
1738fJ124k17o37l16J17L82J18kn87N14k95M68q2J1l96K07n66J433j098M26j7
$$ -6 1118 901 264 -52 65 447 565 563 -24 490 195 663 581 592 196 403 -163 1270 172 598 581
1759E81n53l5O58J67l46n03R04r53J96L12N17k051R26Q94O0K39n87o66P72n06
$$ 581 28 -7 651 818 472 -31 873 -80 116 428 945 -1106 -180 714 774 1013 426 -240 532 26
1779B6O5O65j896J354n66R3R47j06j568m76J262O48j81q26J218j834K87J867q28
$$ 26 91 756 -1140 214 -352 -259 688 582 -986 -1462 -200 448 267 -559 659 -1175 -888 979 151
1798A51n9j866R96Q07N61J35r98j87j165J269Q21j404K26q01R52R17Q5j258j95
$$ 151 92 -1774 -778 29 590 725 -273 -460 -1625 -356 465 -939 -713 -1514 -562 355 440 -818 -1013
1817a013R6o68J810L43j267k43M36p47J326M65q53r51J25J914m95p67j81m85N80
$$ -1013 -917 -1585 225 568 -699 -942 -506 -1253 73 538 -315 -1266 -1141 773 278 -489 -670 -1155 -575
1836e75j70J222j835N81l2J621j484J757j716No44R79J234j677k43K79k29J145
$$ -575 -745 477 -1358 -777 -809 812 -672 1085 -631 -626 -1270 -291 943 -734 -977 -698 -927 218
1854B18J10M18m92o1l07L40J60K97j235N05L5N52N22m69j03q97R65o71N79Q56
$$ 218 328 746 254 193 -114 226 386 683 -552 -47 -12 540 1062 593 490 -407 558 -113 466 1322
1874A322p62l42L21l19P46p08L70n72M57L50r1p26M45K2k12J063j305Q20q20J093
$$ 1322 560 218 539 220 966 258 628 56 513 863 772 46 491 513 301 1364 59 879 59 1152
1894A152j114Q25n40l93P64r70P91k55O13o03j62j45O76L1k49p79m0K61O71M22
$$ 1152 38 863 323 -70 694 -276 515 260 873 270 108 -37 639 670 421 -358 -398 -137 534 956
1914I56o82j052N64L86L66k16j37p63m19J621q51J149o58p59N11o42P25m38k50
$$ 956 274 -778 -214 172 538 322 185 -578 -997 624 -227 922 264 -495 16 -626 99 -339 -589
1933e89M64m0M66k92j41l37o78j20J411N03p31n94j3R46K80r55l1j126N87Q49
$$ -589 -125 -165 301 9 -132 -469 -1147 -1267 144 647 -84 -678 -691 255 535 -420 -451 -1577 -990 -141
1953a41P84p84l19l71m93O30J6J366k447J355L6J037m85q46o10J013j33N89R44
$$ -141 643 -141 -460 -831 -1324 -694 -678 688 -1759 -404 -368 669 184 -662 -1272 -259 -392 197 1141
1972A141m70j968K34M43J242j10j623J337q64P20M96q64O81J13j342J989r35m98
$$ 1141 671 -1297 -1063 -620 622 512 -1111 226 -638 82 578 -286 395 508 -834 1155 220 -278
1990b78L53J180j217n70J752l87L88j675J092M92j479M7K20Q41o26P79m77M98
$$ -278 75 1255 38 -532 1220 833 1221 -454 638 1130 -349 -302 -82 759 133 912 435 933
2008I33l40j604J287J43L68n81q75J030j007J635j90j063M62n9Kj87K87M1l19
$$ 933 593 -1011 276 419 787 206 -669 361 -646 989 799 -264 198 139 141 -46 241 282 -37
2027c7n9J676j702K294k486j77n94J576J001k013J201l535L123L22M64o95m4r91
$$ -37 -96 1580 -122 2172 -314 -491 -1085 491 1492 -521 680 -2855 268 590 1054 359 315 -676
2045f76J081J370j507j242L88J93N01J019j054j079Q1J206N35j062o94j36L45
$$ -676 405 1775 268 -974 -586 -393 108 1127 73 -1006 -925 281 816 -246 -940 -1076 -731
2062g31J99M48K46j529j68J113K08N57O4r73j23Q88k19O44o00o42P02m19O16k23
$$ -731 -532 -84 162 -1367 -1535 -422 -214 343 407 -566 -689 199 -20 624 24 -618 84 -335 281 58
2082E8l67l47K48j03K37J20m48R40q93K24J138q7o86j666J865J50m85p49O06P22
$$ 58 -309 -656 -408 -511 -274 -154 -602 338 -555 -331 807 720 34 -1632 233 383 -102 -851 -245 477
2102D77j95r77K98k70J153q03M96K20K12N2p27p61P48M94l44J009p98p02N2N79
$$ 477 282 -695 -397 -667 486 -317 179 399 611 663 -64 -825 -77 417 73 1082 284 -418 -366 213
2122B13Q20j244l70J344j136M20K37k92J48j31Q9J159l10p48j91r1O91M58m47
$$ 213 1033 -211 -581 763 -373 47 284 -8 140 9 98 1257 947 199 8 -83 608 1066 619
2141F19K33k90p23P56L20j154J045m30N15m84P19q74p1r5O16KL80r79k7o80J238
$$ 619 852 562 -161 595 915 -239 806 376 891 407 1126 252 181 86 702 704 1084 105 78 -602 636
2162F36o4j461J651n11J1J55Q24j19j740L13M75L72o48N47q19k95J128r3k17J85
$$ 636 572 -889 762 251 262 417 1241 1122 -618 -305 170 542 -106 441 -378 -673 455 362 145 330
2182C30l27m40L61K47P5k10L58r23Q65K66j578P92o87R82m46J34q48n5J050m49
$$ 330 3 -437 -76 171 246 36 394 -529 336 602 -976 -184 -871 111 -335 -201 -1049 -1104 -54 -503
2202e03J053R8j349M53K0k79O10n45l24N98j68p5M96j63p00n09J262n93J85l96
$$ -503 550 648 -701 -248 -228 -507 103 -442 -766 -168 -336 -411 85 -78 -778 -1287 -25 -618 -433 -829
2222h29Q26m86q70J303n33L69j25J25n15J649o73q63N91k92P69j403J265k87o63
$$ -829 -3 -489 -1359 -56 -589 -220 -345 -220 -735 914 241 -622 -31 -323 446 -957 308 21 -642
2241f42J357l17q21P07l13L37m40K40N05j31j296M54P0J01j07m8N6J685j669J97
$$ -642 715 398 -423 284 -29 308 -132 108 613 482 -814 -360 -290 -189 -296 -344 -288 1397 -272 -75
2261g5J460o40m20p7J94k24O27o22k55q64J301L84j804J772n44q26M49J039q27
$$ -75 1385 745 325 248 442 218 845 223 -32 -896 405 789 -1015 757 213 -613 -164 875 48
2280D8j63q14M99J69P04K28n53n04M85j9L67m73K24l32k4N2O30k78Q1p56N23J5
$$ 48 -115 -929 -430 -261 443 671 118 -386 99 80 447 -26 198 -134 -158 -106 524 246 327 -429 94 109
2302A09l20O77j501J540q4l10N80j092m56M6O86R72r65l07j20R1R61l10p63N76
$$ 109 -211 466 -1035 505 421 111 691 -401 -857 -811 -125 847 -118 -425 -545 -454 507 197 -566 10
2322A0o91J506p48l76Q49j370P40k98J26n53O08m62j71J753p08r3kk93n64P37
$$ 10 -681 825 77 -299 550 -820 -80 -378 -252 -805 -197 -659 -830 923 215 122 120 -173 -737 0
2342@l25o91Q99l19K16l11M76k41k20J029p1n14l0k48k24M37J9M66M25o72q6l46
$$ 0 -325 -1016 -117 -436 -220 -531 -55 -296 -516 513 442 -72 -102 -350 -574 -137 -118 348 773 101 15 -331
2364c31J12K72O16q61n52R97p7k60m7J13n24k2O6P75J63n21L48l77K90P84J72
$$ -331 -219 53 669 -192 -744 253 176 -84 -131 -18 -542 -564 -498 277 440 -81 267 -110 180 964 1136
2385A136j401o18J476o96J20K52Jq00N40P31n43K04l99k66N26R53n65r30oK53
$$ 1136 -265 -883 593 -103 17 269 270 -530 10 741 198 402 3 -263 263 1216 651 -279 -285 -32
2405c2R58N88j407N80j090J07O05R74j56j393m25J355j310J783j028J73M62m03
$$ -32 926 1514 107 687 -403 -296 309 1283 1127 -266 -691 664 -646 1137 109 282 744 341
2423C41M8L13j037j6J215l30K28p79m30o0rJ147K2n66o99M64N07O62j023n65K84
$$ 341 389 702 -335 -351 864 534 762 -17 -447 -507 -516 631 653 87 -612 -148 359 1021 -2 -567 -283
2444b83K77O00q27L11n36M14J03M6r55N48l68J8J268j198K40p87J166n75K19M72
$$ -283 -6 594 -233 78 -458 -44 59 105 -850 -302 -670 -652 616 -582 -342 -1129 37 -538 -319 153
2464A53O44j425Q12J31n24j62l53J445j271k72J14K71m89P62N83O27k56j086J386
$$ 153 797 -628 184 315 -209 -371 -724 721 -550 -822 -708 -437 -926 -164 419 1046 790 -296 1090
2483A090m08j137L52m4O22m22J93o58n7J069k64j03o36j09M74j215O62J128k38
$$ 1090 682 -455 -103 -147 475 53 246 -412 -469 600 336 233 -403 -512 -38 -1253 -591 537 299
2502B99o30J52l08J260o76r07R14l18L64J199j377o72n73J117J337j619N66q26
$$ 299 -331 -179 -487 773 97 -810 104 -214 150 1349 -28 -700 -1273 -156 1181 -438 128 -698
2520f98J39J304j09n58Q5j59L7N72k64R00j553L20l5L05K78k74m41k79R57n57
$$ -698 -559 745 636 78 163 4 41 613 349 1249 -304 16 -19 286 564 290 -151 -430 527 -30
2540c0K76m5Qj45M01Rrl04j0l71L54K08l29P8J82j8l5J02o1l33k05j7L73O31q01
$$ -30 246 201 209 64 465 474 465 161 151 -220 134 342 13 91 273 255 220 322 261 -72 -277 -294 79 710 -91
2565i1M44o15j24L11M55l48p90J117m09J42k99m6j47k24Q62K57n0j232J00j12
$$ -91 353 -262 -386 -75 380 32 -758 359 -50 92 -207 -253 -400 -624 238 495 445 -787 -687 -799
2585g99J195J11q64R55j427O32n17J075k5n54L95j92K70l96L89j2k03P48n24k47
$$ -799 396 507 -357 598 -829 -197 -714 361 336 -218 177 -15 255 -141 248 236 33 781 257 10
2605A0n68j51K83K352o41j816O45j009J442J09j899J107M90o67j46J345k93r60
$$ 10 -558 -709 -426 1926 1285 -531 114 -895 547 656 -1243 -136 354 -313 -459 886 593 -367
2623c67j597J890p84J202Q27j473J267j316K25L85M30j12q22J522j895J149o86
$$ -367 -1964 -74 -858 344 1171 -302 965 -351 -126 259 689 577 -245 1277 -618 531 -155
2640a55Q13l92j008R79m27J133q6j232L81n17J072m1m20Q96r77P79k48q73J060
$$ -155 658 266 -742 237 -190 943 857 -375 6 -511 561 520 100 996 19 798 550 -323 737
2659G37P11n33o52n65J521o24p85M5J286j024j58r68J814m77M23n38L2O7q16J179
$$ 737 1448 915 263 -302 1219 595 -190 -145 1141 117 -41 -1009 805 328 751 213 245 312 -504 675
$$ [...]
8191c09
##END NTUPLES=NMR FID
##END=
