##TITLE=1H_Pr 4687-C6-2
 CDCl3, 8 sc, 
 26.3.2020
##JCAMPDX= 6.0         $$ Bruker NMR JCAMP-DX V2.0
##DATA TYPE= NMR FID
##DATA CLASS= NTUPLES
##ORIGIN= UXNMR, Bruker Analytische Messtechnik GmbH
##OWNER= root
$$ XWIN-NMR		Version 3.5
$$ Thu Mar 26 16:09:52 2020 Russian Standard Time (UT+4h)  she@DPX200
##.OBSERVE FREQUENCY= 200.1315
##.OBSERVE NUCLEUS= ^1H
##.DELAY= (6, 6)
##.ACQUISITION MODE= SIMULTANEOUS
##.ACQUISITION SCHEME= undefined
##.AVERAGES= 8
##.DIGITISER RES= 18
##SPECTROMETER/DATA SYSTEM= spect
##.PULSE SEQUENCE= zg30
##.SOLVENT NAME= D2O
##.SHIFT REFERENCE= (INTERNAL, D2O, 0, 15.7039)
##AUDIT TRAIL= $$ (NUMBER, WHEN, WHO, WHERE, WHAT)
$$ ##TITLE= Audit trail, XWIN-NMR		Version 3.5
$$ ##JCAMPDX= 5.01
$$ ##ORIGIN= Bruker BioSpin GmbH
$$ ##OWNER= she
$$ F:/spectra/data/she/nmr/H-F/1/audita.txt
$$ ##AUDIT TRAIL=  $$ (NUMBER, WHEN, WHO, WHERE, WHAT)
(   1,<2020-03-26 16:07:52.53 +0400>,<she>,<DPX200>,
      <created by zg, POWCHK disabled, PULCHK disabled
       configuration hash MD5:
       00 E9 B6 7A A2 85 ED C7 34 08 36 98 17 FE 4E 26
       data hash MD5: 16K
       1D 4D BD A0 83 AA 4C 7D 38 1E BA 30 3F 0D 77 7E>)
$$ ##END=
$$ 
$$ hash MD5
$$ 69 2D 0B BA 1E BF 72 E7 CF 0F 20 2B 9F 6C C8 4F
##$RELAX= 
##$RELAX= 
##$RELAX= 
##$RELAX= 
##$RELAX= 
##$RELAX= 
$$ Bruker specific parameters
$$ --------------------------
##$DU= <F:/spectra>
##$EXPNO= 1
##$NAME= <H-F>
##$PROCNO= 1
##$TYPE= <nmr>
##$USER= <she>
##$AMP= (0..31)
100 100 100 100 100 100 100 100 100 100 100 100 100 100 100 100 100 100 
100 100 100 100 100 100 100 100 100 100 100 100 100 100 
##$AQSEQ= 0
##$AQ_mod= 1
##$AUNM= <au_zg>
##$AUTOPOS= <>
##$BF1= 200.13
##$BF2= 200.13
##$BF3= 200.13
##$BF4= 200.13
##$BF5= 200.13
##$BF6= 200.13
##$BF7= 200.13
##$BF8= 200.13
##$BYTORDA= 1
##$CFDGTYP= 0
##$CFRGTYP= 5
##$CHEMSTR= <none>
##$CNST= (0..31)
1 1 145 1 1 1 1 1 1 1 1 1 1 1 1 1 1 1 1 1 1 1 1 1 1 1 1 1 1 1 1 1 
##$CPDPRG= <>
##$CPDPRG1= <>
##$CPDPRG2= <>
##$CPDPRG3= <>
##$CPDPRG4= <mlev>
##$CPDPRG5= <mlev>
##$CPDPRG6= <mlev>
##$CPDPRG7= <mlev>
##$CPDPRG8= <mlev>
##$CPDPRGB= <>
##$CPDPRGT= <>
##$D= (0..31)
0 1.2 0 0 0 0 0 0 0 0.06 0 0.03 0 0 0 0 0.0002 0 0 0 0 0 0 0 0 0 0 0 0 
0 0 0 
##$DATE= 1585224471
##$DBL= (0..7)
120 120 120 120 120 120 120 120 
##$DBP= (0..7)
150 150 150 150 150 150 150 150 
##$DBP07= 0
##$DBPNAM0= <>
##$DBPNAM1= <>
##$DBPNAM2= <>
##$DBPNAM3= <>
##$DBPNAM4= <>
##$DBPNAM5= <>
##$DBPNAM6= <>
##$DBPNAM7= <>
##$DBPOAL= (0..7)
0.5 0.5 0.5 0.5 0.5 0.5 0.5 0.5 
##$DBPOFFS= (0..7)
0 0 0 0 0 0 0 0 
##$DE= 6
##$DECBNUC= <off>
##$DECIM= 24
##$DECNUC= <off>
##$DECSTAT= 4
##$DIGMOD= 1
##$DIGTYP= 9
##$DL= (0..7)
0 120 120 120 120 120 120 120 
##$DP= (0..7)
150 150 150 150 150 150 150 150 
##$DP07= 0
##$DPNAME0= <>
##$DPNAME1= <>
##$DPNAME2= <>
##$DPNAME3= <>
##$DPNAME4= <>
##$DPNAME5= <>
##$DPNAME6= <>
##$DPNAME7= <>
##$DPOAL= (0..7)
0.5 0.5 0.5 0.5 0.5 0.5 0.5 0.5 
##$DPOFFS= (0..7)
0 0 0 0 0 0 0 0 
##$DQDMODE= 0
##$DR= 18
##$DS= 0
##$DSLIST= <SSSSSSSSSSSSSSS>
$$ [...]
##$SUBNAM2= <"">
##$SUBNAM3= <"">
##$SUBNAM4= <"">
##$SUBNAM5= <"">
##$SUBNAM6= <"">
##$SUBNAM7= <"">
##$SUBNAM8= <"">
##$SUBNAM9= <"">
##$SW= 24.9337058887773
##$SWIBOX= (0..15)
0 0 2 0 0 0 0 0 0 0 0 0 0 0 0 0 
##$SW_h= 4990.01996007984
##$TD= 16384
##$TD0= 1
##$TE= 0
##$TE2= 300
##$TE3= 300
##$TEG= 300
##$TL= (0..7)
0 120 120 120 120 120 120 120 
##$TP= (0..7)
150 150 150 150 150 150 150 150 
##$TP07= 0
##$TPNAME0= <>
##$TPNAME1= <>
##$TPNAME2= <>
##$TPNAME3= <>
##$TPNAME4= <>
##$TPNAME5= <>
##$TPNAME6= <>
##$TPNAME7= <>
##$TPOAL= (0..7)
0.5 0.5 0.5 0.5 0.5 0.5 0.5 0.5 
##$TPOFFS= (0..7)
0 0 0 0 0 0 0 0 
##$TUNHIN= 0
##$TUNHOUT= 0
##$TUNXOUT= 0
##$USERA1= <user>
##$USERA2= <user>
##$USERA3= <user>
##$USERA4= <user>
##$USERA5= <user>
##$V9= 5
##$VALIST= <valist>
##$VCLIST= <CCCCCCCCCCCCCCC>
##$VD= 0
##$VDLIST= <DDDDDDDDDDDDDDD>
##$VPLIST= <PPPPPPPPPPPPPPP>
##$VTLIST= <TTTTTTTTTTTTTTT>
##$WBST= 1024
##$WBSW= 4
##$XGAIN= (0..3)
0 0 0 0 
##$XL= 0
##$YL= 0
##$YMAX_a= 212157
##$YMIN_a= -190024
##$ZGOPTNS= <>
##$ZL1= 120
##$ZL2= 120
##$ZL3= 120
##$ZL4= 120
##$ABSF1= 10
##$ABSF2= 0
##$ABSG= 5
##$ABSL= 3
##$ALPHA= 0
##$AQORDER= 0
##$ASSFAC= 0
##$ASSFACI= 0
##$ASSFACX= 0
##$ASSWID= 0
##$AUNMP= <proc_1d>
##$AZFE= 0.1
##$AZFW= 0.1
##$BCFW= 1
##$BC_mod= 2
##$BYTORDP= 1
##$COROFFS= 0
##$CY= 11.3945322036743
##$DATMOD= 1
##$DC= 2
##$DFILT= <>
##$DTYPP= 0
##$F1P= 16.9975609425685
##$F2P= -3.02152046262296
##$FCOR= 0.5
##$FTSIZE= 0
##$FT_mod= 4
##$GAMMA= 1
##$GB= 0.15
##$INTBC= 1
##$INTSCL= 1
##$ISEN= 128
##$LB= 0.24
##$LEV0= 0
##$LPBIN= 0
##$MAXI= 10000
##$MC2= 0
##$MEAN= 0
##$ME_mod= 0
##$MI= 1.114404
##$NCOEF= 0
##$NC_proc= 0
##$NLEV= 6
##$NOISF1= 3.799351
##$NOISF2= 2.8
##$NSP= 1
##$NTH_PI= 0
##$NZP= 0
##$OFFSET= 15.70392
##$PC= 1
##$PHC0= -9781.629
##$PHC1= 8.200825
##$PH_mod= 1
##$PKNL= yes
##$PPARMOD= 0
##$PSCAL= 0
##$PSIGN= 0
##$REVERSE= no
##$SF= 200.130013532006
##$SI= 16384
##$SIGF1= 3
##$SIGF2= 2
##$SINO= 400
##$SIOLD= 16384
##$SREGLST= <1H.CDCl3>
##$SSB= 0
##$STSI= 0
##$STSR= 0
##$SW_p= 3612.71676300578
##$SYMM= 0
##$S_DEV= 0
##$TDeff= 0
##$TDoff= 0
##$TI= <>
##$TILT= no
##$TM1= 0
##$TM2= 0
##$TOPLEV= 0
##$USERP1= <user>
##$USERP2= <user>
##$USERP3= <user>
##$USERP4= <user>
##$USERP5= <user>
##$WDW= 1
##$XDIM= 8192
##$YMAX_p= 0
##$YMIN_p= 0
$$ End of Bruker specific parameters
$$ ---------------------------------
##NTUPLES= NMR FID
##VAR_NAME=  TIME,          FID/REAL,        FID/IMAG
##SYMBOL=    X,             R,               I
##VAR_TYPE=  INDEPENDENT,   DEPENDENT,       DEPENDENT
##VAR_FORM=  AFFN,          ASDF,            ASDF
##VAR_DIM=   8192,          8192,            8192
##UNITS=     SECONDS,       ARBITRARY UNITS, ARBITRARY UNITS
##FACTOR=    0.0002004,     1,               1
##FIRST=     0,             0,               0
##LAST=      1.6414764,     0,               0
##MIN=       0,             -190024,         0
##MAX=       1.6414764,     212157,          0
$$ Real data points
##PAGE= N=1
##DATA TABLE= (X++(R..R)), XYDATA
0 0 0 0 0 0 0 0 0 0 -8 8 -8 8 -8 16 -16 23 -24 32 -36 40 -48 56 -67 78 -88 102 -118 134 -150 172 -194 217
32 217 -242 273 -305 338 -376 419 -464 514 -570 633 -699 772 -857 949 -1055 1172 -1309 1466
50 1466 -1650 1870 -2137 2469 -2896 3466 -4277 5519 -7679 12481 -47466 107784 205123 -38193
64 -38193 -179815 -72478 104716 84976 -20274 -56481 -14594 3915 21255 40404 24347
75 24347 -37724 -54075 4094 56843 27707 -36142 -56124 -13412 42901 54408 -5879 -62677
87 -62677 -24758 68681 72928 -29465 -76354 6561 83530 26707 -64370 -41751 43065 41856
99 41856 -25104 -32493 17641 25996 -7237 -4678 29768 17002 -26595 -10570 41483 34074 -30929
112 -30929 -46175 14176 49507 8234 -41515 -26105 22903 36034 8572 -18034 -17365 13820
124 13820 36086 14084 -26989 -25376 20744 34763 -10550 -41217 -7727 31214 13560 -22539
136 -22539 -13860 15312 10895 -7378 7838 22228 -7181 -37022 -2333 46253 18277 -49270
148 -49270 -52152 18543 54632 5618 -50902 -36351 21969 42135 7156 -27664 -23481 4340
160 4340 19360 6918 -13252 -18687 -9851 -3262 -3759 2926 5149 -12027 -26360 -4661 31176 22079
174 22079 -24289 -36398 7030 37877 5186 -39130 -23737 19700 17664 -21026 -27302 6616
186 6616 20275 -3927 -20320 -3110 16157 10979 -5127 -7724 -1864 -474 506 4413 1303 -12579
200 -12579 -17417 -1416 15539 11829 -7381 -18394 -5902 18932 26067 3096 -23066 -15607 14444
213 14444 24963 3470 -19585 -15488 3328 13285 9077 1660 -5416 -8513 3207 22046 20804
226 20804 -5375 -19795 1023 25055 15876 -11770 -18519 2030 17072 6839 -8526 -6503 7600
239 7600 13176 5443 -2212 -312 7059 11514 4670 -6395 -7496 3047 9858 4273 -6182 -10093
253 -10093 -2408 8895 13589 4401 -9666 -10368 7394 22869 12740 -13430 -22282 339 21383
266 21383 11768 -13984 -23172 -4682 14289 13155 -3014 -14140 -7566 6619 13774 5555 -7576
279 -7576 -12039 -2797 7713 4591 -8085 -13774 -6133 4136 3797 -4650 -9742 -3282 6185 5638 -6493
294 -6493 -9648 -522 8283 2921 -11610 -15352 -3424 7443 3498 -10251 -15222 -5722 7082 10538
308 10538 -220 -10682 -12030 2124 12146 7104 -9337 -17885 -8071 8099 10256 -4241 -16239
321 -16239 -9361 5732 11911 5429 -7429 -7858 1302 7865 5275 -1975 -5682 -2592 -1294 -462 824
336 824 -714 -1877 -2104 -387 1750 3983 5054 2470 -564 -648 680 5306 6540 30 -6110 -5219
352 -5219 3099 9632 5614 -4961 -8692 1329 13229 12814 213 -7270 -2518 9441 11533 4005
366 4005 -5267 -5886 430 6783 6251 923 -3917 -3613 3374 9753 6735 -230 -3060 1327 6758 6035
382 6035 813 -3270 -1702 1081 -44 -1663 341 2400 931 -2710 -1594 3165 6780 3323 -3925
397 -3925 -5307 558 5350 2808 -2706 -6326 -5709 -1227 4073 3420 -3061 -8281 -4939 4108 8638 2650
413 2650 -7741 -8781 -539 6518 3928 -5025 -10898 -7954 1298 5175 -292 -7704 -7609 -1705 3041
428 3041 3263 -798 -4656 -4940 -2397 794 1317 -2177 -7073 -6767 -1081 1215 -971 -3799 -2130 -1487
444 -1487 -1483 -117 2267 2538 -1494 -5237 -3941 2008 4942 -256 -7192 -7248 -779 5169 4933 -1887 -6507
461 -6507 -2314 5159 6824 2751 -2045 -4362 -2060 3261 6668 1958 -6087 -7868 888 9224 7269
476 7269 -3215 -6236 1317 8723 6387 420 -931 828 1412 2237 2849 2882 -50 -2301 -1192 3420
492 3420 6239 3420 -351 4 2959 4425 4942 3639 1114 -1302 -955 2348 5661 3433 -2670 -5515
508 -5515 -76 7271 7140 -86 -5007 -2328 5063 8304 3105 -3892 -4318 308 3831 2848 -1197 -3724
524 -3724 -3913 -359 3137 2862 -1170 -3588 -1651 2810 3616 -492 -3554 -1515 410 -1551 -3355 -1477
540 -1477 -40 -1325 -3799 -3371 -340 1665 690 -1799 -3905 -3084 -162 3601 1540 -5606 -9032 -3201
556 -3201 4035 3015 -3873 -8800 -6447 1273 5928 2345 -6521 -9279 -2050 5983 5576 -3749 -10167
571 -10167 -5029 1889 2965 -1831 -4926 -4836 -3047 936 4486 992 -3425 -5186 -501 4491 3947 -989
587 -989 -4725 -2323 969 1102 1103 39 -1804 -1705 129 2355 2410 2573 1815 -1968 -2545 2758 6343 3812
605 3812 -3378 -6142 -199 7457 5718 -1990 -5069 -860 4869 6923 4358 -625 -4366 -562 6542
620 6542 7844 1680 -4294 -4171 1688 6773 5852 420 -4218 -3000 3712 9331 6249 -3035 -6281 1378
636 1378 8463 6347 -1537 -4456 -1061 2656 3807 2051 -944 -1951 -1056 1599 3502 2738 -365 -2375
652 -2375 -1168 973 2943 2100 -2631 -5737 -1644 3733 2692 -3403 -5205 -313 2929 427 -3180
667 -3180 -1909 1328 778 -2936 -2994 -250 688 -1873 -2948 -2617 -1585 -502 89 -1279 -1975 -2160 -747
684 -747 -72 266 -54 -1940 -3980 -3482 310 3605 -41 -7066 -8021 626 6606 1966 -6501 -7397 -1194
701 -1194 5594 3702 -2345 -6576 -4696 1288 4103 669 -4351 -5398 -2266 2220 3650 1543 -2488
716 -2488 -4573 -2448 3945 7561 2248 -6680 -6525 2967 8429 3853 -4964 -6476 -104 5831 4345
731 4345 -214 -1736 -807 1506 3522 4393 1703 -489 -1153 115 2726 4569 2424 -2205 -3169 1490
747 1490 5657 4116 -809 -2424 1172 4580 3938 1075 681 1014 -242 68 2677 4401 1440 -2532
763 -2532 -2442 1547 5536 4381 -899 -4087 -599 5214 6202 952 -4570 -3370 2280 5459 1902 -2758
779 -2758 -3434 -311 2152 2630 983 -1267 -2777 -1042 1910 2877 452 -3351 -3830 -806 2565 735
795 735 -2787 -4113 -2163 1219 1565 -1815 -3473 -1397 1576 -90 -2708 -1971 691 420 -2973 -4412
811 -4412 -1471 1563 627 -3722 -4434 -993 1016 666 -1428 -2372 -2538 -622 519 112 -934 -2681 -3579
828 -3579 -2344 827 1816 -1095 -4434 -3751 616 3744 1612 -3420 -4248 -454 3165 1730 -1016 -2844
844 -2844 -2114 -595 1343 2092 726 -1701 -2747 -253 3465 4028 -80 -2977 -1748 2185 4197 2517
860 2517 -1558 -3619 -714 3828 3889 1003 -1933 -1825 1487 4529 3651 219 -1597 -96 2501 3399
876 3399 2280 -329 -1383 314 2154 2714 1766 560 -917 -15 2517 3538 2110 -654 -1246 995
892 995 2921 2496 883 -719 -656 75 1402 2878 1821 -1226 -2480 289 3543 3727 244 -3360 -2428
909 -2428 2525 3803 1264 -2464 -3098 -754 2051 2192 -3 -2194 -2052 -75 1653 1593 -346 -2702
925 -2702 -3007 -396 1965 381 -2004 -3648 -1940 175 1076 -958 -2281 -1812 -1558 -788 130 680 -1199
942 -1199 -2965 -2357 -487 567 -125 -2449 -3055 -1415 57 201 -862 -1467 -2098 -1512 -97 685 -326
959 -326 -1820 -2746 -1933 568 1445 -762 -2463 -2410 -323 1174 890 -309 -1654 -1426 -41 1286 1435
976 1435 122 -2145 -2171 415 2858 1988 -1247 -2872 -1202 2131 3025 1224 -1422 -1546 746 2539
992 2539 3156 1268 -1371 -2269 975 3621 3157 35 -2041 -937 2544 3715 2125 -623 -1094 931
1008 931 2651 3016 1506 -172 -431 714 2223 2342 1318 -67 -1083 506 2655 2618 535 -862
1024 -862 -750 1388 3157 2265 -72 -1031 -390 746 2050 2002 -628 -2336 -879 2006 2359 900 -1402
1041 -1402 -1723 31 1834 1498 -500 -1393 -1329 -368 673 801 -738 -2099 -1829 -420 588 590 -762 -2193
1059 -2193 -1713 -392 841 169 -1347 -2484 -2252 -738 126 -130 -1417 -2438 -2565 -615 1435 136
1075 136 -2125 -3326 -1809 367 706 -677 -2632 -2786 -939 290 732 -487 -2319 -2936 -678 1608
1091 1608 842 -919 -2036 -1488 23 1591 1150 -1301 -2737 -1247 693 1481 600 -1515 -2167 -638
1107 -638 1306 1816 717 -1129 -1706 -218 2287 2139 -70 -1460 -1033 819 2201 1878 295 -1191
1123 -1191 -603 1335 2526 1985 98 -1160 26 2193 2636 1505 -342 -734 248 1881 2672 1408
1139 1408 -416 -579 773 2735 2547 1041 -681 -375 1549 2398 1980 -104 -930 -499 1559 2505 1384
1156 1384 -396 -934 -154 1688 1921 702 -597 -937 -53 1128 1572 251 -1351 -1280 280 1054 775
1173 775 45 -1045 -1030 -306 1147 757 -611 -1332 -1880 -112 869 251 -1235 -2008 -1198 -220 593 125 -1330
1192 -1330 -2495 -1583 389 971 -187 -1597 -2380 -1285 248 734 -969 -2768 -2637 -934 667 383
1208 383 -1591 -2448 -1298 -130 75 -110 -744 -1711 -1518 -431 697 248 -1199 -1971 -1381 371 834 106
1226 106 -1135 -1524 -830 505 1290 210 -1605 -1518 -163 688 1146 151 -923 -1071 -15 1291 1586 512
1244 512 -1085 -1366 283 1937 1786 101 -1220 -450 819 2252 1345 -673 -1352 365 1529 2073 1566
1261 1566 237 -692 193 1361 2719 2005 -635 -1380 68 3101 2710 196 -1538 -285 1547 2574
1277 2574 1847 -66 -1016 264 1769 2154 1084 -597 -1018 -388 1939 2313 611 -1152 -1233 172 2526
1294 2526 2239 -546 -1738 -588 1617 2007 425 -1215 -1271 168 937 406 -15 -1149 -1472 -520 352
1311 352 669 -631 -1160 -1507 -627 325 392 -514 -1493 -1183 -309 381 -330 -992 -1383 -1273 -221 -778 -316 117
1331 117 -719 -1831 -1579 -196 495 -230 -1973 -1813 -894 849 694 -1351 -2241 -1579 193 1098 -620 -1424
1349 -1424 -1648 -478 270 40 -83 -514 -1593 -1170 332 1823 587 -1473 -1945 -209 1914 1488 -868
1366 -868 -1988 -448 1603 1210 -86 -798 -718 116 523 439 678 436 -433 -969 538 2154 1765 -443
1384 -443 -1497 -114 2096 2028 297 -1129 -427 1145 1685 897 927 48 14 869 1246 1851 1424 -383 -636
1403 -636 784 2356 1512 -410 -525 -25 1499 2349 386 -690 -580 914 1977 1122 344 -1107 -403
1420 -403 1290 1337 914 -226 -551 -7 585 1509 688 131 -1858 -894 548 1125 798 -912 -2610 -376
1438 -376 1511 323 -808 -826 -1247 -650 783 -37 -315 -952 -489 -603 81 959 224 -1856 -1808 -563 833
1457 833 350 -2235 -2138 -550 396 28 -1154 -997 -1288 -695 -781 120 -854 -1310 -1509 -1713 -435 1286 -489
1476 -489 -1370 -1337 -293 407 626 -654 -1207 -1721 -59 156 244 47 293 -1339 14 -641 170 -383 -1710
1495 -1710 112 952 1988 40 -669 -953 66 820 1468 368 -233 -430 87 1486 1103 374 -380 -647
1513 -647 250 1996 1598 252 223 577 1167 1417 637 -361 461 74 606 1684 2065 28 -525 -169 787
1532 787 1272 1526 121 -569 129 915 1826 1246 400 -239 655 734 2309 664 -945 -1121 1198 2076 1325
1551 1325 168 -1666 -658 1088 1136 773 -279 -1326 -310 277 1158 658 -720 -1234 -65 703 123
1568 123 -676 -1389 -1298 492 1192 1003 -535 -1001 -1208 274 587 635 -892 -1011 -646 -220 880 611 -1468
1587 -1468 -1499 58 748 609 -1596 -1254 -810 -335 604 252 -409 -1058 -1553 -1040 106 177 -537 -1937 -1521
1606 -1521 -472 13 959 -754 -1214 -669 507 1458 388 -577 -1143 -214 762 750 114 -365 -684 -240 490
1625 490 1141 117 -944 -670 274 886 802 -17 -644 -235 530 1051 1101 292 -603 -214 1210 1328 508 -92
1645 -92 -544 244 1111 1518 676 121 -210 417 1053 1349 877 -243 -208 634 901 1534 443 -127 -434 1012
1665 1012 1236 1144 219 -9 -104 941 1261 1038 129 -399 -173 818 1358 814 -149 -812 -118 723 870 382
1685 382 -213 -823 -1 522 662 -277 -403 -1079 -885 520 536 -147 -1185 -1099 -400 683 451 -682 -1473
1704 -1473 -939 155 338 -99 -659 -1352 -620 -30 535 15 -1083 -1422 -732 120 403 -392 -1529 -1355 -376
1723 -376 351 -3 -800 -1465 -971 -46 185 37 -273 -1288 -885 -108 609 64 -1077 -1301 -712 514 637
1742 637 199 -1036 -873 44 346 92 10 -611 -860 289 373 571 88 -545 -421 142 1053 711 -274 -277 -189
1763 -189 425 747 436 26 -467 -191 482 884 1051 3 -417 23 860 1244 726 88 -124 364 902 1055
1783 1055 453 -119 -95 421 1408 1407 573 -395 -157 766 1212 1006 274 -375 -82 743 1294 683 -120 -206 -312
1804 -312 822 1009 642 -387 -579 11 623 1020 90 -654 -504 310 1072 482 -391 -536 -654 307 582
1823 582 185 -444 -571 -692 -158 725 346 -831 -1073 -458 135 362 -243 -833 -1217 -126 337 226 -285
1842 -285 -794 -1169 -507 252 100 -877 -1003 -918 -523 289 42 -1085 -1398 -444 -160 -26 50 -794 -1154 -372
1862 -372 212 124 -368 -385 -1063 -371 479 367 91 -921 -448 -319 298 252 -163 -620 -268 -42 562 359 74
1883 74 -742 -741 658 818 605 -511 -509 -167 384 794 374 -319 -491 271 386 976 301 306 -542 207 1107 770
1905 770 423 -632 -665 517 331 475 626 -366 24 196 1263 302 -839 -965 -124 959 914 597 -64
1924 -64 -193 861 448 1188 1447 -227 -203 332 1120 287 -210 -619 -119 264 828 810 351 -423 -25 201
1944 201 798 907 -334 -1046 -531 346 294 347 292 -947 -111 647 552 -252 -993 -1200 -676 720 389 -96
1964 -96 -1018 -817 147 112 609 -958 -819 -922 90 308 -635 -480 -912 -1291 -411 -348 -413 -1241 -1109 -640 -423
1985 -423 47 -676 -1208 -1914 -323 -75 63 -476 -636 -686 -625 182 384 -619 -418 -716 -650 835 843 -347
2005 -347 -697 -486 616 763 186 -236 -403 204 611 543 241 -67 -418 -126 456 876 277 116 -361 143
2025 143 949 1048 385 -397 -102 371 644 836 183 -238 -101 393 751 965 346 -130 -218 638 1050 897 -142
2046 -142 -480 -226 639 1413 430 -8 -165 544 951 677 276 -183 108 394 632 805 344 -389 -196 225
2066 225 1189 582 -314 -871 -494 400 898 207 -392 -666 -63 469 697 3 -496 -589 136 -14 302 -330
2086 -330 -597 -801 -315 498 334 27 -886 -611 -208 341 -140 -741 -904 -245 56 14 -140 -834 -949 -588
2106 -588 -104 -204 -451 -727 -773 -848 -277 73 -127 -683 -976 -516 459 254 -508 -1016 -546 -151 325 226 -558
2127 -558 -510 -226 126 209 -24 -209 -465 -768 -16 662 76 -298 -395 -496 584 890 207 -420 -279 25 392
2148 392 542 377 -165 -320 402 588 340 172 -555 -128 476 1039 609 -38 -186 184 617 684 510 -185
2168 -185 -60 470 515 1000 520 -178 -424 812 1017 555 222 -339 -38 278 802 376 13 -413 89 401
2188 401 713 676 -148 -310 135 425 566 424 -183 -181 34 436 312 -298 -254 -253 -59 408 484 198 -657 -385
2210 -385 -26 574 184 -230 -739 -704 -43 144 266 -322 -690 -504 -95 45 144 -584 -770 -792 112 241 -373
2231 -373 -646 -1097 -379 -66 267 -443 -896 -636 -319 -216 -88 -486 -749 -683 -299 29 -92 -347 -693 -561
2251 -561 -289 380 -14 -716 -512 -346 62 -90 -225 -565 -421 -361 215 419 -71 -383 -574 -55 676 683 -206
2272 -206 -219 -100 265 398 503 50 -292 -325 372 549 417 362 -411 40 601 576 567 -202 -137 357 443 840 160
2295 160 35 -71 512 686 875 153 -231 -78 437 780 535 133 -249 45 420 823 693 81 -166 -83
2315 -83 328 834 -43 -115 -927 -333 304 994 109 -327 -473 10 393 746 234 -149 -579 -364 290 -96 77
2336 77 -764 -429 615 -181 244 -338 -340 -465 20 352 -322 116 -263 -398 455 -36 -88 -532 -266 -155 -41
2357 -41 -241 -3 -243 -458 -255 89 -235 -695 -719 -538 -361 -94 20 -481 -347 -721 -271 -142 -84 -415 -701
2378 -701 -475 109 41 -134 -520 -678 -334 82 407 47 -455 -465 -159 265 375 -271 -484 -320 20 335 145
2399 145 97 -403 -625 50 483 359 -360 -506 -118 539 715 407 15 -271 202 613 472 500 -229 -250 395
2420 395 856 582 156 -64 -35 572 1003 831 -157 -26 159 193 1034 623 122 79 229 629 485 294 35
2441 35 -339 270 577 683 310 110 -256 7 413 593 -54 -250 -390 338 311 252 -77 -313 -145 226 303
2462 303 121 -15 -539 -90 104 184 71 -124 -510 -277 1 311 -81 -581 -338 55 -275 128 163 -512 -441
2483 -441 -477 -173 143 -337 -381 -568 -443 -40 -225 -303 -618 -616 47 19 -142 -553 -571 -293 -67 157 -61 -332
2505 -332 -596 -247 205 114 -70 -221 -554 -384 392 -261 -324 -512 -230 29 285 195 -320 -241 -366 -51 257
2526 257 235 -233 -449 -46 333 401 127 63 -278 72 307 464 324 -17 208 469 434 111 12 -259 -106 461
2548 461 202 331 -86 -74 536 666 411 817 80 -270 104 555 33 577 -273 -436 -81 117 1056 822
2568 822 501 440 855 -119 324 141 299 24 -95 573 552 -162 259 -53 60 -678 354 -497 -386 -344 130
2589 130 483 283 -1143 -460 -82 14 71 -576 -126 -1142 -83 489 497 380 -247 33 -36 -185 -47 -255 -897
2610 -897 -365 -92 -164 260 -389 -313 -411 79 123 193 -583 -1115 -180 401 189 -123 -353 -476 -855 -106 -123 -135
2632 -135 -98 -529 -454 -388 332 36 -906 -580 -401 268 97 -67 -538 -693 -252 239 -379 -6 -957 94 199
2653 199 493 -41 -538 -232 -402 112 301 74 -154 -224 354 752 540 109 -233 -284 56 519 77 167 48
2674 48 74 19 863 409 204 -117 349 546 651 153 -231 59 145 474 371 401 -288 80 307 413 694 -34
2696 -34 62 84 120 484 530 242 -52 217 236 254 433 48 -351 -220 217 256 259 -55 53 -257 230 372 116
2719 116 -478 -290 17 86 241 -136 -250 -266 -31 202 290 111 -197 -206 -196 -38 -99 -404 -288 -391 156 101 -117
2742 -117 -437 -230 -358 -23 -33 -279 -527 -436 -261 148 2 -324 -258 -684 -204 52 96 -106 -585 -471 90
2763 90 94 -32 -666 -447 -277 66 71 -74 -17 -248 -348 -23 380 -20 -256 -667 -102 36 170 -373 -357 -420 81
2786 81 391 47 -78 -139 -139 220 123 195 71 -8 -12 152 445 428 -196 41 -71 241 471 203 38 65 250 494
2810 494 296 179 257 171 -44 394 454 215 -5 -208 496 642 406 -16 121 60 167 263 198 -268 -148 274
2832 274 270 436 422 -176 -58 379 381 288 164 240 -168 -250 296 307 34 -126 -123 -3 546 183 -125 -356 5 -218
2856 -218 290 3 3 -400 -544 -304 -81 -9 -294 -537 -219 252 -49 42 -503 -332 -169 -229 -123 -117 -518 -261
2878 -261 -231 -395 -32 -156 -462 -267 26 -109 -225 -522 -455 -117 -433 29 -24 -344 -293 -395 257 134 -144
2899 -144 -259 -567 -418 -319 -122 -490 -9 -233 -159 -76 -142 -62 -422 -528 115 64 -78 337 -303 -387 -40 107
2921 107 726 -44 -170 150 377 -78 447 -178 -420 302 493 203 170 -93 -231 125 675 1166 -67 115
2941 115 74 -404 344 150 48 -1 -65 -37 495 131 204 -312 564 426 249 44 158 -78 -176 160 876 374
2963 374 206 176 146 359 -1 68 -314 22 274 244 135 371 -21 96 315 460 402 -42 -373 -133 -39 206
2985 206 86 -538 -67 -87 -69 136 -335 -105 -179 -111 -50 277 208 -97 -682 -424 -176 177 -136 -340 -609 -426
3007 -426 66 44 -229 -625 -395 -44 9 -126 -276 -416 25 -181 -46 -314 -166 -512 -367 283 254 -361 -521
3028 -521 -270 30 352 226 -11 -595 -250 -5 -184 -239 -152 -811 337 -116 849 107 400 -220 -703 4
3048 4 323 -141 -625 386 -352 213 -427 332 -425 124 -2 140 389 188 -171 -406 200 259 311 16 -307
3069 -307 -169 270 -438 -547 -969 -745 -445 266 531 -4 -253 206 197 721 -150 868 -211 -668 269 -48
3089 -48 212 584 948 -288 526 160 109 -404 875 77 -117 183 456 -40 -478 -131 -143 -29 41 72 144
3110 144 168 -128 215 -772 -521 -578 -466 168 70 -383 82 -200 -24 384 -17 -431 -314 -254 -5 138 -272
3131 -272 -345 -302 -464 42 190 -88 -141 -579 -358 128 -114 -220 -273 -343 -398 -65 -31 -196 -366 -398 -62 64 369
3154 369 -418 52 -264 -238 -12 -245 211 -313 -271 -382 44 -124 -171 79 -14 140 162 120 -420 -140 -156 244
3176 244 65 344 -75 -104 200 369 90 -177 174 232 265 171 331 29 201 -147 424 137 220 -5 -32 318
3198 318 120 182 167 157 84 285 253 106 36 355 462 180 49 472 -11 -125 0 265 511 272 -128 -70
3220 -70 -386 284 147 37 264 26 -23 337 170 186 -181 -23 79 74 60 144 187 -15 -120 -166 101 244 -113
3243 -113 184 35 130 89 8 -502 -380 302 -173 -88 -110 -428 55 87 -17 -125 -155 12 -537 -191 160 -356
3265 -356 -359 -145 -459 -158 1 -138 8 -222 141 -174 86 -184 -362 90 60 206 -295 -4 -523 -25 -239
3286 -239 -268 -226 -332 -263 -196 -215 -124 149 -194 -347 -361 120 222 -94 -321 -290 67 201 77 -160 -149 55 132
3309 132 473 7 115 10 36 152 309 -55 -35 156 150 77 408 67 83 10 -34 394 273 17 -96 142 290
3332 290 234 -17 420 46 108 -62 220 431 68 -161 198 226 360 347 29 37 231 264 4 260 -95 47
3354 47 162 -42 449 -9 299 11 31 117 154 31 -9 -206 160 271 314 78 -215 -201 -103 137 305 -121 -216
3377 -216 -22 -52 -105 184 103 -58 -81 -320 12 -475 -228 -452 160 40 -49 -185 -278 -376 7 43 -302 -309 -192
3400 -192 -523 -266 -86 -266 -79 -354 -2 -101 163 -103 231 -185 -363 193 -200 129 -97 -201 -262 101 75
3421 75 -218 -203 -368 -168 155 -90 231 -5 13 -76 -103 26 -372 -75 -111 277 -304 244 -75 -68 353 408 276
3444 276 57 -9 -133 115 214 186 338 4 5 211 68 134 111 -195 -391 73 52 205 -332 -366 -100 300 459
3467 459 147 141 25 -46 128 445 93 10 23 93 205 -109 300 52 -82 160 -76 114 219 -244 -55 105
3489 105 438 -89 -161 -226 311 24 198 78 107 -81 96 -45 172 -60 149 -449 -18 -201 -144 -125 -171 -355
3511 -355 -73 127 -75 -136 -61 -189 -71 173 -173 -140 -186 -112 -181 -201 -258 -70 -194 -116 -105 -181 -11 -17 92 -422
3535 -422 -16 -52 -167 -8 -192 -9 95 -28 -381 -11 -70 -224 191 134 -52 12 -94 232 -196 49 -274
3556 -274 -30 -173 65 40 363 21 19 -710 -114 303 83 281 -23 156 349 21 260 193 -491 539 344
3577 344 245 310 38 165 193 58 397 502 235 364 210 480 435 141 497 -285 70 -228 602 162 -295
3598 -295 130 460 164 30 451 178 -313 394 9 256 -349 -179 -10 -118 -642 128 -60 -526 759 -45
3618 -45 326 -7 -155 -500 299 -190 68 -184 -361 93 -55 232 271 -323 -279 -77 135 134 -43 101 114 11
3640 11 6 -6 -524 -759 -253 -217 -367 26 -94 265 -607 518 -160 135 8 -489 -210 91 400 -28 -187
3661 -187 102 -40 28 -87 170 8 -492 -415 44 -2 281 350 27 -21 -99 -667 -471 245 -108 -220 -235 686
3683 686 48 243 -52 126 276 430 473 -168 276 1 -39 390 467 221 175 79 202 475 201 -110 645 428
3705 428 -21 15 -183 460 -161 14 -39 546 171 206 394 284 30 342 125 -259 189 -353 -137 -76 -356
3726 -356 353 -492 -157 26 201 142 136 308 -194 285 -111 194 -69 391 -73 -117 122 143 623 371 287 158
3748 158 -331 73 -125 895 -79 117 -110 -50 423 340 -428 199 -105 244 -492 -73 469 -534 428 -241
3768 -241 -625 -74 -300 -227 144 -519 51 -290 -213 -33 232 -171 -417 -24 814 -375 298 -947 1308 -350
3788 -350 762 -181 -870 -390 -126 -180 611 -458 89 142 1217 -148 -822 -776 -311 171 -213 218 -518 -49
3808 -49 -667 -288 -450 -815 -1258 -48 -28 -132 410 -234 43 241 1 593 -378 15 -283 -571 -183 165
3828 165 453 -158 -928 -145 -303 -1467 495 414 -354 439 -428 192 -493 158 265 -113 269 64 154 -127
3848 -127 20 227 73 75 -120 -168 370 220 316 81 -286 61 370 50 108 49 158 104 -242 331 -11 -32 -54
3871 -54 284 92 -381 98 185 381 453 138 333 -26 21 221 -80 504 -56 -221 91 -203 -145 182 9 132
3893 132 -211 30 132 116 216 38 -307 -262 27 18 -11 -173 -257 115 267 17 -64 -204 -315 -253 -208 -326 -311
3916 -311 -438 -71 49 220 -73 -333 255 -141 -211 -5 83 -171 -288 -98 151 -123 23 -43 -433 -163 -226
3937 -226 -220 -68 -38 -167 -414 157 96 -392 -18 -294 219 261 -25 168 175 -303 -145 279 54 -14 40 126 168 315
3961 315 167 124 155 -315 119 271 1 -100 175 -17 130 102 61 -84 129 -53 407 240 -243 -411 -88
3982 -88 97 352 -360 376 -179 203 346 460 -28 -338 665 418 385 585 -211 -88 438 -160 -381 277
4002 277 41 1425 377 -386 477 148 573 154 586 464 -291 183 -315 -176 -247 -77 626 -366 524 376
4022 376 828 -733 552 -86 -477 1406 589 719 -21 -1130 -212 914 83 -656 64 176 -1219 -346
4040 -346 1152 -207 -389 220 -1605 224 990 341 726 -506 540 -483 -391 119 -145 -246 -615 862
4058 862 218 281 579 18 451 933 -132 261 150 -258 -137 -70 -392 245 -71 84 -382 -325 192 663 167
4079 167 -201 -9 -202 -11 239 -331 -82 -22 334 384 119 398 -68 -84 7 46 114 -50 190 238 220 297 -171
4102 -171 -119 -101 -51 148 37 152 -23 85 118 245 -148 53 145 186 167 131 190 2 158 -156 -14 288 352
4125 352 190 167 -143 281 -229 274 -84 191 -346 244 -71 364 -338 -143 -254 -236 61 157 -12 -337 -68
4146 -68 -169 844 -231 -392 -42 -144 -439 -30 41 -543 595 -145 -246 -355 115 -765 -421 682 -270
4165 -270 -117 -208 -184 -68 -145 115 408 -758 111 77 -957 -204 19 -269 148 22 -780 -777 -325 482 837
4186 837 4 -263 55 1140 38 -120 114 -502 324 119 329 353 -651 327 -285 92 263 -100 -296
4205 -296 281 120 -271 320 -69 -223 -93 -291 -424 -112 -5 274 172 271 -26 54 166 54 -64 174 211
4226 211 172 140 -180 61 202 138 185 186 -91 254 30 147 313 -50 -204 -129 121 208 150 178 217 -116 187 181
4250 181 40 43 -280 144 238 -16 71 71 86 1 -281 -81 49 -103 -76 -49 -139 331 -10 77 -71 -184 61 -55
4274 -55 2 55 -152 -186 285 182 71 52 18 -178 114 191 24 36 -222 8 54 -120 96 -85 -431 -388 126
4297 126 470 -614 41 -545 -444 297 -488 463 52 -65 -17 -5 147 30 -2 -242 318 -332 -510 -388 -24
4318 -24 -168 -71 -54 324 -629 -267 36 -322 531 455 281 -874 -277 657 246 580 511 -141 -166 -445 973
4339 973 402 -782 -683 1110 577 94 313 -505 274 -5 -55 -512 429 74 335 -341 1189 870 637 -243
4359 -243 908 4 -237 -413 -961 4 -267 133 -89 -382 -449 31 598 459 186 931 -801 277 170
4378 170 75 433 -529 -107 109 526 -705 204 451 228 -289 -405 198 236 -226 510 -321 -96 -161 -522 270
4399 270 -704 -415 -241 61 444 397 115 10 618 -36 72 131 -85 236 59 -49 88 -377 126 153 79
4420 79 -184 -56 317 359 204 155 -45 -25 271 33 -64 195 193 -107 -358 257 -50 -240 -81 -235 -106 -229
4442 -229 16 -125 188 -25 1 -135 -85 115 91 -75 -63 149 -226 -363 345 -115 -39 297 -141 153 -135 -95
4464 -95 152 137 -2 351 -76 196 -243 400 5 66 -320 156 113 -119 451 1 246 -15 164 -216 182
4485 182 237 -90 -151 -187 181 207 -131 -154 357 136 197 -82 -89 -94 219 467 201 192 264 -4 -259 277 -20 -2 289
4510 289 -234 -32 316 47 -31 111 -97 134 121 212 -257 -281 173 -167 -357 -189 628 -307 179 -40 398
4531 398 -333 -319 -461 341 79 -41 287 169 -133 -162 231 -107 -20 -134 20 6 437 362 -393 -580 -238 -24
4553 -24 -287 530 433 -238 -521 95 6 -262 -60 365 787 -106 799 -322 220 171 165 -82 162 141 -312 -61
4575 -61 -150 25 349 -293 353 -156 142 -99 -193 347 246 504 545 -631 200 686 -683 282 230 81 -374
4596 -374 829 -224 27 852 -161 816 -144 -421 -337 563 -49 207 -710 537 -78 45 -321 291 -4
4615 -4 300 -480 409 666 -97 341 539 -41 225 202 351 -172 93 338 -165 -101 -351 340 -229 426 -604
4636 -604 -44 221 -120 616 46 341 -38 -503 23 270 353 68 1084 -12 16 175 259 147 102 34 -172
4657 -172 93 51 27 -71 153 68 -45 48 -80 138 128 163 13 -146 10 -25 -55 92 -79 29 37 -130 8 102
4681 102 -142 -7 0 -55 -87 -46 137 -183 -231 125 92 -214 82 97 -208 31 -199 -127 -44 -21 -355 171 -750 -140
4705 -140 -160 129 30 -342 221 -195 -109 -72 160 -314 -84 -257 -3 156 153 -192 236 337 90 51 -139 28
4727 28 254 -17 -136 194 -251 -134 99 294 -190 -160 -141 -132 -468 -172 309 -187 -57 242 181 -124 -320 -148
4749 -148 64 -362 354 -312 -84 -337 -224 145 749 32 333 -82 -395 -477 -182 -93 585 -427 -234 1211
4769 1211 820 1 36 -205 -1004 -51 58 -216 -195 -681 -110 -253 23 -185 219 94 257 -200 164 -39
4789 -39 -133 78 94 180 -240 236 206 36 34 -249 40 -351 -224 293 -1 -140 -359 85 146 4 -31 -212 129
4812 129 30 63 291 -175 -247 -101 -243 231 -174 -268 -136 -188 -7 197 -279 111 -109 31 35 -52 206 -110 -783
4835 -783 -99 -208 236 -302 -212 -95 -241 -152 188 16 -65 186 -335 74 -284 -372 57 -96 -442 238 215 329
4857 329 120 137 -176 280 -10 260 943 290 163 464 94 -664 492 723 -48 21 -9 1290 278 730
4877 730 424 167 -105 502 167 463 -401 -255 75 -21 124 32 -492 105 68 161 369 -545 287 98 744
4898 744 95 64 -47 -384 -187 -56 -372 -266 124 -204 406 5 -273 -94 -82 699 -51 196 15 1113
4918 1113 45 -328 -48 577 -693 218 910 47 1101 480 -54 181 -218 520 1081 -337 -83 383
4936 383 84 68 274 221 46 -505 -78 -26 50 6 -24 94 -69 -51 -282 -199 127 -30 -151 -87 91 -18 -385
4959 -385 268 173 -122 -231 -10 -24 283 -121 -199 111 -63 -21 42 -106 83 -70 -104 3 175 21 360 -197
4981 -197 87 -47 37 294 -155 -71 -218 -12 251 -216 88 281 -175 -29 -156 -30 208 -63 -103 -91 -88 28
5003 28 62 -59 249 239 -250 -59 75 166 69 -1 150 -179 225 310 -154 83 87 200 -88 -122 -65 191 -73 271
5027 271 -472 167 102 158 -243 99 33 137 7 -60 -228 -110 -105 503 192 181 -9 -340 61 -28 276 -204 373
5050 373 -388 -402 87 -145 206 -89 -448 -209 -103 -201 -511 1 75 -402 -158 45 275 -113 15 -72 108
5071 108 211 -199 116 258 82 100 208 -76 95 38 -220 305 -178 184 264 688 -197 -39 -119 -230 -54
5092 -54 530 -189 -449 -393 246 -375 -461 -223 257 -497 -391 642 -577 -43 195 -428 -387 404 -871 -383
5112 -383 -11 364 -673 -224 44 -160 -405 806 -307 388 209 -198 -269 15 413 97 -616 922 338
5131 338 546 -16 -55 53 -57 39 -654 107 1642 150 436 -306 591 -61 324 921 323 301 -99 1059
5151 1059 790 -297 760 7 -721 -253 576 106 -408 525 365 189 78 264 -510 -407 146 -510 -186
5170 -186 -406 -497 350 -342 -339 -195 126 498 -360 -297 185 -19 79 -204 104 27 -77 -17 -144 67 -46 -94 164
5193 164 278 143 -320 217 -22 258 -779 -423 -96 -3 218 -619 531 -845 -187 -271 -508 -578 305 -217
5213 -217 202 1905 -79 -89 -402 -77 -728 -303 -123 216 -461 320 -277 455 -280 -394 96 -348 665
5232 665 -423 -161 -122 -41 228 -152 7 555 637 -4 402 -169 142 -19 -78 -148 966 -322 708 986
5252 986 137 -142 -755 284 190 -821 -491 444 -312 243 -188 415 507 -278 -462 116 279 161 665 251
5272 251 -7 -214 186 808 -184 624 435 2 -293 -120 30 -109 -383 674 -572 -119 560 478 1346 563
5292 563 1045 -470 146 567 -1158 697 370 653 1006 333 45 -185 323 317 44 793 110 326 -882
5311 -882 254 161 999 -101 -501 933 -410 375 -191 -134 -460 -81 342 106 -57 240 521 -258 240
5330 240 57 -137 -219 -23 21 299 11 366 154 -188 88 -206 -24 186 -59 65 -132 -77 10 -346 -252 214
5352 214 115 126 519 -811 -358 84 194 393 -130 70 -171 -354 252 -203 359 53 -75 23 -44 223 -111
5373 -111 -390 556 -579 564 -525 223 -305 -99 122 -383 -179 -523 68 208 287 -136 -118 -116 -233 -36
5393 -36 -283 102 229 83 688 409 48 1149 600 329 -758 547 302 -308 -117 -272 -637 -318 -211
5412 -211 -66 637 -1262 -635 335 90 452 413 343 45 -720 -144 -168 -890 -203 -894 -146 775 339 406 -301
5433 -301 -345 936 179 170 -354 1013 476 289 200 -1 -402 132 -601 -1 -134 703 200 -34 156 -41 -66
5454 -66 162 181 -76 313 80 168 -586 347 -209 -329 -594 691 -114 363 -54 229 -52 30 15 -82 -128 260
5476 260 88 7 -225 -268 -92 121 -88 72 -26 260 -574 -335 538 -291 -733 732 411 -450 -860 44 -547
5497 -547 -545 -102 -30 -283 -181 554 588 22 -398 -456 -1698 556 -122 618 -940 403 497 -897 -439 477
5517 477 189 -234 475 701 -1 -502 -97 452 421 -903 387 59 513 259 -139 340 -100 -44 328 -402
5537 -402 -89 -513 -90 17 189 -49 60 -215 213 68 -214 207 -446 -458 345 -48 -62 19 330 -53 -302
5558 -302 129 -248 217 65 -47 305 -269 -485 -1131 429 405 -64 394 -362 972 672 583 -220 40 678
5578 678 135 -600 -281 -743 193 -413 103 128 439 -444 233 -365 -1136 392 434 -164 291 -210 -622 -51
5598 -51 -948 551 -91 -1176 658 -1190 665 737 -660 493 500 -1773 -688 -206 -100 -623 -957 550
5616 550 -1027 -878 549 347 336 146 -261 -819 -667 -698 189 219 -225 -416 75 -375 936 -1291 -407 -916
5636 -916 64 37 -364 -449 -639 -976 -160 -863 -1107 190 352 84 -225 -294 -274 405 426 227 90 -246 -506
5657 -506 693 -163 799 106 427 1393 531 -144 -404 -490 -384 -45 535 -816 347 539 643 257 112
5676 112 -351 122 277 -22 268 1430 -514 150 -346 -413 45 -397 -370 -259 -513 -174 221 441 819 -473
5696 -473 681 109 52 442 -1180 -396 -1008 623 37 99 659 -237 -148 -110 -5 -258 278 489 184 -350
5716 -350 -350 -554 -347 65 -844 -363 828 -243 169 -182 247 -151 -372 -108 719 406 255 -242 -335 453
5736 453 -584 230 461 165 -2162 -28 -169 -438 628 228 -85 90 -184 272 500 148 -103 966
5754 966 -168 419 369 499 71 87 282 -46 -601 213 -333 431 -115 1614 -2 -330 -314 450 -99 717
5774 717 -300 551 -34 -937 634 571 289 385 342 -843 555 322 910 10 -329 631 -582 -13 -1167
5793 -1167 476 -21 330 -331 -41 984 -427 278 -38 849 375 114 -588 -102 106 68 -161 353 977
5812 977 1027 -480 -297 209 780 31 -1050 -603 317 374 -599 -11 -193 -941 -689 38 -473 181 37 455
5832 455 211 190 -564 495 -474 -216 -711 -387 -712 -335 11 424 667 768 -472 7 -1000 -806 749
5851 749 -99 -354 -704 558 718 -424 -276 -72 541 476 -312 -82 448 -411 -58 -574 -651 -318 584 209
5871 209 -338 -14 408 150 -495 439 195 285 -198 168 821 632 180 -356 -37 555 -660 4 -574 -179
5891 -179 -990 -411 -373 160 -152 201 -597 -324 551 -544 45 -1264 776 -968 -810 616 -493 497
5909 497 -286 -53 353 -501 1017 589 137 -1051 212 9 -475 -807 -389 181 -326 -278 113 -151 -1455
5928 -1455 234 -599 -647 405 268 710 448 695 229 1214 537 -566 -436 367 -225 174 359 -213 481
5947 481 -337 -637 168 -381 537 492 -360 -282 133 443 948 -184 258 813 42 -438 595 -648 230 892
5967 892 -297 526 -350 -804 -287 -571 399 67 287 429 421 371 169 29 830 -334 -308 -520 -324 -969 384
5988 384 -791 -376 -546 -288 816 953 568 486 196 -32 -216 -28 -336 487 -540 261 528 223 -317
6007 -317 -239 326 287 -39 295 201 -48 474 -612 -189 -287 -283 3 158 995 225 463 224 709 54 56 -335
6029 -335 64 -187 88 128 350 824 -612 -595 229 135 -85 539 -357 449 -347 -30 652 -268 -589 241 669
6050 669 877 352 195 668 243 256 -130 741 -98 339 -84 343 683 -1233 -382 -475 -391 -498 546 387
6070 387 602 373 481 -132 -388 -573 -371 538 224 665 362 -161 751 -268 666 -329 -372 672 1218 -544
6090 -544 163 -128 394 -53 -613 -180 -1380 166 -879 337 -198 539 116 -520 559 -154 254 220 614
6109 614 603 163 522 -416 -234 -7 -43 -76 -289 162 152 32 -68 -39 -296 -293 -436 -55 200 186 23 32 22 -69
6133 -69 24 -24 63 -184 215 218 149 101 -21 -65 16 -163 137 -152 -221 -169 -18 75 246 69 35 255 -349 98 165
6158 165 -47 -80 -48 78 -83 7 185 -139 -15 -35 -46 -159 -161 350 -194 -70 -271 60 15 -32 -614 -27 -514
6181 -514 169 -240 164 494 491 93 -644 56 -162 -465 107 103 286 468 -52 -206 -372 -296 726 -1024 -1283
6202 -1283 113 -477 -159 -538 -523 -660 -211 726 223 -345 -55 631 20 -366 986 652 -208 -286 77 -584
6222 -584 -192 88 539 -402 -991 8 -380 -197 778 -233 -495 -347 -445 -148 -614 183 51 -87 585 502
6242 502 221 -228 260 316 172 1513 466 -405 106 1054 84 563 -465 757 215 -250 142 -134 -508
6261 -508 1237 588 1228 -24 508 407 456 506 -928 609 -1421 376 748 -228 93 -623 -426 -12 32
6280 32 391 147 -49 -626 -41 161 283 249 259 24 -281 -146 -615 124 -1 -118 -234 208 -930 481
6300 481 888 248 -266 -133 242 -205 699 -747 -505 254 25 259 -1 -554 326 105 226 -183 107 -219
6320 -219 155 316 -581 -60 138 664 -995 -74 -667 -80 17 211 425 374 -1007 143 -1103 380 -204
6339 -204 -749 -111 418 -1486 412 -132 -111 411 -299 20 127 191 115 188 -211 317 577 -715 -204 -563
6359 -563 -313 188 497 228 -232 86 -285 41 -87 43 2 514 -398 478 -186 -54 -350 162 -118 739
6379 739 565 31 -44 -67 -163 16 1079 -93 -33 -1070 265 956 276 -23 -753 649 1091 -907 -1239
6398 -1239 -798 -374 -130 227 450 77 -225 99 -235 -17 -571 -218 105 653 -19 -16 -1564 -315 621 -952
6418 -952 180 -896 -572 552 305 -104 296 424 -271 -1523 -880 -33 -751 463 -130 -538 323 -56
6436 -56 -538 51 -693 -415 -56 967 -539 -266 566 153 -619 288 -89 377 231 348 651 -161 -141 -15
6456 -15 269 -80 -356 -196 -188 41 67 23 67 59 158 -143 -189 71 -7 96 -21 181 119 -26 -51 -42 42 -371 -262
6481 -262 -17 116 -64 -162 48 43 41 -37 -319 -234 -24 -308 -147 141 -93 -182 -40 149 63 -75 461 -139 -84
6504 -84 222 -107 -74 -40 222 39 -308 -145 -204 27 -59 -167 -68 270 -98 -2 1 -41 -152 -97 -17 111 48 -109
6528 -109 143 -19 154 357 -114 -65 -81 56 296 126 -27 -134 -50 250 271 98 -131 9 -100 -30 -175 -44
6550 -44 279 87 58 -144 70 -13 -81 -18 153 -160 -121 280 316 -130 10 -38 138 260 -26 -402 17 -111 0
6573 0 -14 -111 -3 -138 334 142 142 -349 -151 -28 322 -59 163 -333 -325 -102 123 -61 139 268 339 -232 -36
6596 -36 114 -83 456 -63 -10 10 143 -120 114 -236 -47 -101 -121 -104 -1 -32 150 -153 -3 -39 71 18 -88
6619 -88 -54 -48 85 -28 75 27 108 20 53 -174 216 -74 65 114 -218 40 -63 -169 -140 15 375 63 409
6642 409 238 -258 -10 -47 -4 -190 -314 -7 -5 109 -44 -157 668 218 -433 -150 372 144 -307 -72 -150 33
6664 33 85 2 -101 -113 -295 -256 132 76 186 -94 95 -114 48 22 -178 -75 -114 88 -24 -49 -10 412 -160
6687 -160 -62 144 -99 179 185 -134 -177 -191 238 -91 -36 -638 -214 45 874 -322 131 766 -189 -52 -76 36
6709 36 47 267 -155 -224 252 -677 -105 -359 -13 -239 -127 749 -762 -1430 -240 -72 334 -347 -354 178 -411
6730 -411 151 512 -95 -316 279 -215 3 -178 15 -114 -103 444 -144 0 -53 20 -64 136 -292 280 90
6751 90 -143 -152 -39 251 1 12 -388 -82 -30 119 68 -80 139 163 71 -21 168 -265 -92 -236 -427 316 -318
6774 -318 -274 521 -238 -159 12 -459 -816 242 503 763 -697 -273 356 -104 198 19 -413 -23 277 -270
6794 -270 -60 170 475 498 -321 638 -89 420 718 195 613 -331 -23 -180 -33 462 48 205 402 160
6814 160 -373 435 -199 151 -128 366 668 156 429 -254 -172 -452 -207 552 -121 267 270 -4 -208 -522 207
6835 207 -536 -615 508 464 -375 -486 994 173 -486 -737 617 257 304 35 -220 446 868 -991 1615
6854 1615 -925 -938 480 183 263 111 611 -317 216 -388 -226 -644 376 249 -766 -504 -87 286 -520
6873 -520 -6 529 396 437 207 587 9 -610 80 71 -286 356 223 150 235 20 -46 -316 -98 10 33 111 56
6896 56 18 112 -126 -21 55 36 114 110 133 -306 -121 14 79 130 120 -587 68 116 -45 -88 -9 24 183 184 -94 70
6922 70 -232 86 -17 -258 -197 -115 -177 195 77 1 51 120 -189 -68 200 71 -25 -1 -95 45 197 -83 135
6945 135 -45 49 72 269 -153 -53 88 93 -11 152 204 -158 50 5 -253 -104 -54 -149 -9 29 346 126 -47
6968 -47 -217 -103 119 194 65 73 -6 106 -298 20 153 -210 -92 336 192 -183 46 -92 -72 -160 125 0
6990 0 256 19 -174 -452 280 125 -55 24 -39 -206 -162 63 27 291 283 86 -39 -7 72 166 -43 201 18 -119
7014 -119 3 -44 275 -274 154 -64 -10 -26 2 -152 53 116 -99 80 -108 -156 169 165 84 366 -120 14 -518
7037 -518 -99 170 -21 247 25 -66 18 -133 56 -137 30 41 38 -6 190 18 26 -28 218 86 308 212 -140
7060 -140 -212 219 -240 196 -66 -164 216 -239 -194 12 -57 367 43 -41 -154 56 61 -231 138 -100 89 -107
7082 -107 78 24 54 -96 -159 -64 55 -82 172 -98 168 -211 -136 111 -163 -47 -51 149 -81 143 134 -28 66
7105 66 317 -324 -29 -49 -90 12 -93 -32 -124 340 86 -71 -141 -3 -337 111 -281 -147 -94 -327 251 316 -199
7128 -199 291 -196 165 103 -308 -667 -157 -8 -314 186 163 231 -257 123 298 237 -738 -286 -209 -156 262 218
7150 218 1 195 -4 -176 -27 23 451 228 84 414 28 -31 163 -140 2 -278 126 -290 -303 279 -325
7171 -325 39 14 226 149 -324 192 -83 32 241 14 -242 117 214 198 378 -161 -408 19 -99 -305 380
7192 380 -97 299 -152 -345 -527 -416 -455 148 -315 164 -261 134 272 -132 -140 53 420 -98 253 -350 -268
7213 -268 -509 -93 425 120 -140 -596 113 -125 -301 329 470 378 -194 327 101 8 -231 208 122 30 108 109
7235 109 260 -110 -149 773 -274 776 792 -270 -548 327 -365 -195 1159 94 122 -583 -123 220 -553
7254 -553 178 413 -162 384 -52 -334 313 -357 241 -109 514 19 97 812 660 -97 -564 80 -156 692
7274 692 787 741 312 1172 50 260 105 47 966 841 -56 -384 967 938 -70 191 -1110 485 904 66
7294 66 516 264 396 430 714 632 -238 -258 -3 -778 -572 565 137 -145 428 795 430 -594 -162 547 -15
7315 -15 472 353 -622 -679 -5 177 -17 49 422 -196 679 -15 118 417 837 162 -872 460 598 -363
7335 -363 -38 531 -867 -556 835 473 -199 -303 822 -287 -867 308 -1020 837 14 -283 103 670
7353 670 295 237 -149 -150 -48 -225 330 -711 -472 843 102 195 710 74 -484 -370 547 -43 -539 145 385
7374 385 -657 2 -717 561 745 144 -171 130 27 -809 -2 -252 -19 618 409 -1094 -23 -163 672
7393 672 -21 389 -79 482 402 145 205 -501 -330 -909 371 543 528 588 -232 -594 73 585 -186 -383 30
7414 30 -212 -258 1227 108 -71 497 636 161 47 25 -22 -187 -464 857 345 535 -202 -75 440 -154
7434 -154 -238 -630 269 285 -687 854 1381 972 459 708 467 -347 -412 -863 -105 -90 408 1453 -940 761
7454 761 426 274 -414 -278 -118 -24 -356 108 1147 220 1016 155 -177 1055 412 301 -1240 -119 -915
7473 -915 -121 -79 173 -453 100 375 376 -89 814 278 -114 350 579 965 -168 1292 1241 489 388 -19 212
7494 212 371 24 -24 874 356 547 -441 141 -278 -131 -487 -610 398 78 573 106 283 -31 205 97
7514 97 -196 -133 152 -505 570 -129 -965 312 300 60 -267 356 743 0 31 -1035 -109 -152 -208 316 -227
7535 -227 406 9 726 278 334 -624 -45 195 375 84 -236 156 146 658 -283 206 -4 -386 206 -66 -376
7556 -376 -46 -527 78 -47 -78 153 -395 -381 -28 -303 -240 479 -253 52 400 170 -295 -46 -115 -66 -54 574
7578 574 485 70 417 -145 -136 -301 -464 155 -202 -288 -262 -174 204 475 26 34 -45 455 5 -22 219 -91 -898
7601 -898 -395 156 -174 89 -250 169 -138 -90 66 -146 196 -605 598 50 152 -199 187 -312 560 647
7621 647 -1136 530 430 107 40 226 -30 -605 -117 -36 -237 250 -264 -20 -321 299 -276 -415 331 -492
7641 -492 432 -305 107 1013 700 633 -54 -57 -303 31 -765 282 95 -790 45 302 191 669 183 -430 -481
7662 -481 352 617 -104 -242 -333 -369 291 663 -512 426 28 542 74 -180 608 -610 24 -292 -261 375
7682 375 -220 -245 -133 39 -173 99 -359 -539 95 603 592 -241 -653 547 -962 -426 -203 -230 721 318
7702 318 630 259 308 185 -682 1301 -413 410 -812 106 43 -297 85 -235 633 343 407 152 -167 -148
7722 -148 1131 -32 -175 -460 -18 -366 -152 424 -290 -131 -319 -54 149 90 -147 -679 105 -55 137 151
7742 151 -141 -186 -179 -251 397 52 329 469 1 360 -74 -188 -8 -211 -444 -92 133 41 -73 55 -98 187
7764 187 105 45 226 275 130 -45 35 -89 -81 -98 132 10 -294 -37 2 -161 -19 -319 149 -5 219 26 -106
7787 -106 1 0 -72 -119 42 -178 -231 -59 -232 192 -133 78 -92 -315 126 -10 -56 -210 88 43 -25 -144 -111
7810 -111 40 76 -409 -327 -29 -172 180 -340 321 132 -152 -128 -149 -146 -45 79 -176 -227 -111 -286 -222 -222 -157 -218
7834 -218 243 213 -304 713 -83 -5 171 -728 -734 423 5 92 146 -216 -200 183 -15 32 -89 189 283 132
7856 132 -55 15 225 -201 -150 -209 -35 -29 32 -138 40 69 -76 -44 -53 -151 -16 158 242 5 92 96 -67 878 311
7881 311 -100 -752 -600 -597 326 -480 737 249 -242 60 -176 831 -702 -466 176 -10 413 304 -299 160
7901 160 241 101 -36 -110 244 -85 -151 115 -372 -41 -26 2 114 -138 -142 29 55 224 -244 -155 -2 154 -158
7924 -158 -197 -14 -56 187 113 -273 134 128 -65 4 10 -184 90 19 25 -50 -112 11 -100 194 -245 -20 -312 60
7948 60 59 -131 80 95 -101 -20 -191 91 87 41 -104 112 123 -160 -60 45 6 -117 -270 78 -51 -239 175
7971 175 44 14 155 141 -249 219 -79 15 0 -119 -233 174 -9 -29 136 402 -247 183 -71 58 144 -69
7993 -69 117 104 52 -48 -178 17 162 150 -211 43 -185 59 -31 -102 96 -116 -85 -215 -110 123 66 -74 130
8016 130 254 -114 -289 -715 -803 -635 345 357 -344 -426 -211 -708 609 -94 -480 -423 -388 -645 -98 -4 51 -5
8038 -5 -7 197 170 -11 203 151 44 3 -38 12 257 79 -276 188 -110 99 -5 145 -174 251 -130 -69 -43 -437
8062 -437 -23 90 88 -166 29 358 -240 -191 424 -409 244 -569 -82 136 -108 248 -107 -212 -44 -34 -221
8083 -221 -47 -26 168 -45 100 186 148 56 -3 -29 172 31 -191 -266 161 -130 -64 46 114 -304 -168 -1 191
8106 191 -142 -153 -89 -282 -88 15 -46 187 -24 -36 -133 -242 -158 -167 152 -123 -79 194 221 -8 64 97 142 113 -67
8131 -67 64 -52 -308 46 -49 -223 244 60 22 -63 -239 120 19 -46 159 -46 66 -112 -148 220 -27 194
8153 194 -208 62 89 -118 75 4 -136 98 92 -91 148 -148 -56 -158 182 159 69 -46 -175 91 -124 -209 21
8176 21 -53 -318 190 306 122 28 137 -233 200 -89 0 64 115 236 69
8191F9
$$ Imaginary data points
##PAGE= N=2
##DATA TABLE= (X++(I..I)), XYDATA
0 0 0 0 0 0 0 0 0 -8 8 -8 8 -16 16 -21 24 -30 35 -40 48 -58 68 -78 92 -105 121 -139 157 -179 202 -231 257
31 257 -289 325 -363 405 -449 502 -556 617 -684 756 -839 926 -1027 1137 -1261 1404 -1564
48 -1564 1748 -1965 2220 -2528 2907 -3388 4025 -4902 6201 -8317 12367 -22902 106277 212157
62 212157 -84416 -190024 -31016 150245 80147 -59334 -82678 -3290 29611 29078 25565 8208
74 8208 -35064 -29666 31819 69018 18053 -43769 -42588 13224 49559 34398 -31776 -65397 -11545
87 -11545 70400 52548 -44671 -71694 26048 90937 19882 -67879 -29058 56627 43192 -36358
99 -36358 -40873 16943 25887 -16966 -19977 15696 7675 -25875 -9545 39617 26822 -34124 -37470
112 -37470 24943 49945 -3746 -51900 -23021 25500 25346 -14742 -35888 -19177 13076 27625
124 27625 1055 -32108 -19166 26761 32800 -15867 -40376 -1971 31934 4627 -34443 -22687
136 -22687 9877 6116 -15694 -4989 12283 -8417 -27425 6754 44751 11030 -49786 -37600
148 -37600 33140 51388 -11780 -62162 -29426 31493 36798 -10752 -39786 -18971 18081 25758
160 25758 5795 -13944 -12410 2224 8680 3281 1570 -477 -13821 -20522 1282 26272 11001
173 11001 -28835 -28467 19648 43483 4984 -34136 -10435 33286 24491 -18900 -22954 12873 22200
186 22200 -7011 -21880 -451 20113 9880 -7206 -4937 7325 10801 8777 9334 4849 -5885
199 -5885 -7173 7720 17839 6307 -13577 -17336 1181 21308 19446 -5754 -21839 -4069 25610
212 25610 27450 -286 -19922 -8244 13503 16633 2931 -7776 -10630 -7280 4057 16410 9572
225 9572 -13021 -18568 7588 28005 12997 -15493 -15293 8084 19072 2293 -15428 -10617 4582
238 4582 6970 -3825 -9735 -3899 5045 6622 93 -8142 -4529 5760 9713 -524 -10808 -10843 -1873
253 -1873 5900 3339 -8431 -17549 -10584 6800 15914 1723 -19925 -18069 8326 23212 6467
266 6467 -21276 -21238 877 15724 5185 -14265 -19289 -6895 7078 9165 -2439 -11638 -8906 2912
280 2912 11473 4723 -7854 -10423 -758 7368 2829 -7216 -9986 -2324 6267 1876 -7619 -8611 3261
295 3261 10549 3575 -8119 -6824 6663 13523 3146 -10531 -11556 126 10077 6267 -4135 -11654
309 -11654 -5232 8702 15646 5252 -8341 -9277 4361 16934 12024 -4833 -14380 -4235 12122
322 12122 11886 -164 -9166 -5671 5872 11527 6118 -320 -1193 3921 6736 5594 4380 1176 -413
337 -413 -955 236 2377 2929 2380 -958 -1649 552 3674 6446 5151 979 -4093 -660 6777 9860
353 9860 1786 -9164 -9360 2379 10429 5382 -7943 -11415 -1273 10327 9363 -598 -7576 -4444
367 -4444 4385 8148 2332 -4309 -7301 -5116 1185 4039 -7 -7156 -7030 37 4830 3292 -2234
382 -2234 -4221 -1442 1713 91 -3169 -2264 -1313 -3704 -6532 -4741 -293 1708 -2820 -7992 -6204 1679
398 1679 5631 1071 -4833 -6203 -2804 1395 3018 -284 -7547 -10092 -3926 3762 5117 -2498 -10062
413 -10062 -6628 4116 9020 2983 -5193 -7817 -1758 6184 6136 -1997 -9034 -5735 1865 4928 1632
428 1632 -2415 -3907 -1393 2733 4984 4001 -275 -3085 -1205 3978 4887 237 -3021 -1432 488 575
444 575 1443 3283 2884 -2 -1469 1935 7148 7775 1803 -3828 -2242 4925 7722 3630 -3659 -6045
460 -6045 657 7513 6952 1261 -2357 -1109 3390 7808 8223 2053 -5100 -3640 5019 9786 3551 -6412
476 -6412 -7407 2446 8758 3732 -2594 -2065 1382 3088 3250 2594 1435 -775 -2561 -962 2542 2757
492 2757 -1739 -5006 -3160 749 2148 1114 -134 -2021 -2245 -654 2887 3459 195 -5732 -6426 -261
508 -261 4927 1743 -6449 -8878 -3102 3781 4642 -1921 -7081 -4686 1904 3959 555 -3654 -5608 -3644
524 -3644 -682 1247 -1333 -5494 -6483 -2991 1621 1187 -2808 -4665 -1194 1312 -672 -2416 -1170 170
540 170 -1991 -3909 -2930 -479 473 -1266 -3580 -3352 -1208 2465 3699 1171 -4246 -4574 1979 7648
556 7648 3450 -4961 -6641 -1235 5034 6242 189 -6803 -6299 3096 9548 5701 -3741 -6680 620
571 620 8032 6188 126 -3547 -1362 956 2650 5209 1217 -3248 -2429 2520 6916 4483 -617 -1476
587 -1476 1910 4403 4249 1803 826 -362 -185 1882 3007 1804 1388 1045 -643 154 4347 7365 2637
604 2637 -4346 -4155 3511 8716 3042 -5300 -6030 763 5553 4288 -252 -3860 -4251 709 6946 5746
620 5746 -1759 -6134 -2922 3616 5620 1932 -4518 -6836 -3184 3426 5373 88 -7908 -7600 1766
635 1766 7634 2585 -5749 -6329 -954 2999 2110 -1906 -4218 -4394 -2161 385 438 -1059 -3853 -4159 -1224
652 -1224 1160 1642 -325 -3939 -4528 -764 3418 693 -5387 -6277 -514 2071 -1366 -4778 -2595 939
668 939 322 -2858 -2464 823 1636 -1426 -2754 -1230 -174 -207 -200 -1171 -2403 -1527 -450 822 935 406
686 406 -663 -1516 -349 3038 4771 167 -5676 -3404 4217 7659 1536 -6851 -4960 2834 7799 3577
702 3577 -2613 -4437 10 5086 7135 1345 -2725 -3243 1723 4964 4017 193 -2885 -2473 488 5791
718 5791 6981 324 -5786 -2634 7201 10016 2530 -5465 -4406 3789 7532 3287 -2551 -3010 -80
733 -80 2867 3786 2859 35 -1667 -407 1666 3615 3703 521 -3166 -2591 2408 4843 1266 -3881 -4134
750 -4134 533 3314 1419 -1887 -1712 -154 -677 -563 1738 2061 -1248 -4536 -2952 1230 3102 309
766 309 -4921 -5844 -768 4135 2784 -3133 -6520 -3394 3164 4160 -1230 -5961 -4223 29 1303 141
782 141 -2135 -4008 -3695 -974 1482 1163 -1790 -4259 -3041 760 2478 -377 -3554 -4015 -632 1315
798 1315 428 -2900 -3992 -1039 1542 -224 -2749 -1038 1475 1018 -1954 -2515 478 3330 935 -3313
814 -3313 -2908 749 2806 1006 -1156 -1764 -354 1369 2508 1490 151 -562 -494 1197 3432 2851 -656
831 -656 -3064 -1020 3371 4355 1382 -2728 -2211 2904 5511 2631 -413 -797 815 2417 3206 2094
847 2094 261 -1203 -898 1875 4461 2652 -933 -2432 686 4345 4738 1665 -1727 -1975 1545 4762
863 4762 3379 -755 -2884 -962 2553 3727 1535 -1726 -2394 239 2636 3318 866 -1838 -1758 777
879 777 2114 1604 -283 -1754 -2043 -628 1467 2030 -851 -2660 -2251 165 1683 574 -1412 -2218 -1327
896 -1327 -349 386 492 -1177 -3204 -3439 -641 1629 709 -2947 -4699 -2196 2125 2492 -1108 -4306 -3231
913 -3231 -36 1634 500 -2433 -3935 -2673 94 921 352 -1947 -3281 -2334 703 1681 -101 -2722
929 -2722 -3020 -892 1525 735 -1339 -2898 -1114 -533 -122 321 347 -962 -1845 -661 1439 1810 254
946 254 -1676 -1362 351 2025 1108 -325 -1071 -863 805 1917 1765 480 -343 -248 1198 2727 2434 506
964 506 -1238 -97 2001 2560 1899 -152 -627 189 2066 2812 2019 300 -638 -82 2534 3903 1929
981 1929 -1333 -1700 1010 3726 3227 68 -2078 -1072 2008 3258 2448 -128 -1403 -605 2190 3826
997 3826 1787 -1460 -2406 -117 2721 2867 23 -2228 -1411 920 2199 1269 -220 -1621 -1157 494
1013 494 1733 1212 -652 -1753 -1946 73 1494 284 -2052 -2861 -1461 392 1064 -25 -2362 -2361 -1119
1030 -1119 468 486 -144 -2452 -3220 -1613 1155 831 -1865 -3318 -2538 -160 1063 59 -2116 -2572 -1242
1047 -1242 161 311 -154 -1762 -2519 -1548 47 450 -234 -1710 -2453 -1516 352 1181 -75 -1577 -1866
1064 -1866 -1047 555 1164 2 -1345 -1681 -972 832 1628 -84 -2011 -2047 357 2303 1733 158 -1706
1081 -1706 -896 1217 2038 1559 -204 -1418 -583 1552 2860 1390 -728 -970 175 2463 2605 1564
1097 1564 -824 -828 1519 2748 2557 593 -741 -485 1208 3083 2081 472 -621 -460 1750 3217
1113 3217 2264 -52 -1267 310 2148 2808 1115 -474 -960 183 1824 2164 1109 -793 -1335 423
1129 423 2355 2094 158 -1516 -985 346 1595 1507 -583 -2070 -852 586 1759 879 -1067 -2022 -499
1146 -499 882 1393 208 -1460 -2006 -861 1026 1126 -927 -2305 -2066 -311 616 56 -966 -2261 -1708
1163 -1708 -177 719 -275 -1237 -2547 -1798 -103 547 -692 -1595 -2037 -1603 -251 276 -111 -1847 -2178 -1106
1181 -1106 356 569 -569 -1679 -2194 -430 108 288 -283 -1637 -2059 -764 977 659 -478 -1442 -1253
1198 -1253 -70 1668 899 -710 -1807 -641 897 1686 608 -1121 -1655 251 1593 1150 594 -26
1214 -26 -698 25 1450 1645 666 -615 -745 554 1823 2228 228 -669 -205 911 1801 2154 865 -832
1232 -832 -20 1545 2210 1468 374 -262 37 1387 1931 1604 338 -984 -43 1727 2922 1454 -592
1249 -592 -680 387 1778 2115 761 -896 -1025 527 2051 1446 -253 -739 -1043 158 1429 1699 188
1266 188 -1337 -1810 688 2520 1448 -1631 -2923 -736 1508 1329 -425 -2105 -1889 -158 1385 705
1282 705 -680 -2073 -1846 -727 885 685 -1171 -2144 -1955 174 1291 304 -2393 -3188 -959 1210 729
1299 729 -1566 -2293 -1812 -24 746 -220 -1477 -1808 -1378 -429 240 -157 -1196 -1608 -1345 -230 468 116
1317 116 -769 -1354 -865 167 124 211 -1056 -1458 -394 289 346 -108 -190 -697 -595 -157 891 1007 -7 -1071
1337 -1071 -729 484 1812 1052 -996 -1315 286 2177 1500 -155 -1051 -84 1390 1645 781 215 589
1354 589 342 400 1612 1763 974 -1253 -642 1479 3135 1688 -1439 -1415 1045 2436 1688 114 -690 603
1372 603 1212 1219 689 802 533 -311 -334 1419 2115 808 -908 -855 656 2551 1208 -933 -1013 571 1771
1391 1771 1313 -145 -234 -774 -663 510 800 748 -450 -1069 -618 529 1617 -145 -1763 -1301 -133 1270
1409 1270 947 -832 -2358 -1393 486 767 -303 -985 -1340 -1198 -185 803 -103 -1203 -1494 -943 -186 522
1427 522 -311 -1131 -1387 -1041 686 1051 -863 -2223 -1962 -331 603 458 -1180 -2043 -908 -292 915 -200
1445 -200 -1550 -1296 -314 -429 371 678 -579 -1291 -840 1246 738 89 -1917 -1635 39 1095 1382 -257
1463 -257 -701 298 860 779 313 270 205 -365 -181 644 1320 472 -482 -499 1895 1413 931 -1290 378 924
1483 924 1033 1697 -83 393 216 -86 529 1726 948 -817 -517 287 1609 2230 500 -475 98 1781
1501 1781 2476 1068 23 81 585 725 1653 597 -100 -344 -203 872 546 1218 4 -522 -326 462
1519 462 694 623 -652 -472 71 1619 490 298 -887 -1184 -154 755 988 -587 -899 -141 -202 1230
1537 1230 778 -426 -911 -923 488 995 297 54 -1879 -627 1462 -258 -786 -1112 -1818 -682 -251 429
1555 429 -1501 -1896 -1373 -528 254 -640 -339 -2012 -1198 -249 -462 303 -225 -1830 -920 -703 379 85 -945
1574 -945 -1006 -231 50 721 601 -788 -1218 -809 684 -101 -296 -399 -1575 165 1659 1329 -331 -695
1592 -695 -747 365 1136 -178 -639 -734 129 444 1692 979 -875 -661 -65 1231 1498 1197 -264 -222 695
1611 695 2159 1244 363 -32 241 1152 1276 471 755 -352 553 342 1557 1678 233 121 383 906 1536
1630 1536 484 14 -178 -26 1115 1375 857 -207 -379 469 1289 1571 666 -321 -304 343 1306 1040 111
1649 111 -861 -27 493 782 326 -52 -822 -648 391 560 411 -456 -1106 -795 370 1021 -372 -997 -1148
1668 -1148 -199 309 289 -71 -1116 -1103 -629 -148 184 -486 -1206 -1024 -243 164 -31 -652 -1527 -1103 -498 147
1688 147 159 -857 -1116 -1068 -383 209 138 -888 -1761 -1056 240 703 -65 -1227 -1677 -342 610 471 -417
1707 -417 -925 -1293 -241 850 502 -360 -1026 -1042 -92 838 528 -559 -1110 -200 608 993 581 -565 -817
1726 -817 101 929 925 219 -172 -439 295 897 1360 522 -223 -182 355 1397 1238 124 -367 275 1047 1142 565
1747 565 181 -148 172 1019 1285 789 312 -201 -84 1123 1529 656 -214 -167 613 805 1134 466 -85 -366
1767 -366 470 1082 1061 419 -289 -518 173 838 963 183 -566 -210 294 1011 307 -167 -461 -353 9 476
1787 476 565 -534 -1035 -643 159 434 -109 -696 -942 -575 656 572 -613 -931 -823 -609 335 457 -472 -1205
1807 -1205 -1295 -58 710 -163 -788 -1412 -994 354 633 -316 -1001 -1278 -375 7 -178 -367 -919 -977 -457 115
1827 115 460 -316 -914 -1143 -416 468 163 -697 -1123 -947 101 562 95 -336 -1006 -458 171 587 292 -813
1847 -813 -750 -60 376 809 225 -757 -930 -93 755 752 236 -155 -467 315 944 949 208 -473 -345 554 1163 943
1869 943 31 -239 73 713 923 700 -22 -134 358 778 877 587 164 -338 201 905 982 431 -330 23 384
1890 384 1303 945 143 -73 -201 268 766 867 144 -456 -679 393 1021 413 -239 -236 -591 491 796 -78
1910 -78 299 -487 312 582 477 613 -718 -988 -228 477 571 -970 -1080 -873 -233 544 737 -821 -549 -986
1930 -986 -213 1155 -1 -531 -1450 -542 -193 796 -89 -887 -1622 -738 557 749 -826 -1346 -1331 -717 273
1949 273 -30 -866 -530 -1104 -38 827 778 -365 -1735 -1257 -848 684 367 -1034 -849 -328 -33 -213 392
1968 392 -29 -1269 -505 263 270 -393 -796 -1018 577 835 1039 -603 -1071 -986 263 1059 136 26 -197 235
1988 235 210 581 262 498 -124 384 934 355 565 193 -82 -205 1020 1293 421 -395 -94 270 1154 964
2008 964 461 -500 263 597 759 689 472 21 -10 450 913 453 121 -135 -32 284 918 609 115 -411 271
2029 271 791 908 93 132 -82 1 629 639 271 -205 -378 -595 499 724 422 -688 -498 -247 393 491 -451
2050 -451 -1122 -559 339 305 33 -519 -688 -854 -262 172 265 -664 -1175 -533 -94 471 -130 -666 -964 -459 300
2071 300 417 -633 -1351 -1098 -113 277 -48 -576 -1163 -622 -157 136 -44 -780 -662 -636 -289 494 -95 -741
2091 -741 -719 -412 161 407 -185 -778 -731 146 446 309 109 -642 -452 305 136 340 -196 -260 -325 -1 541
2112 541 611 230 -409 -622 112 699 699 -54 -208 215 761 865 362 89 -45 332 695 700 560 42 6 206
2134 206 742 1072 138 -165 62 502 728 1172 46 -111 242 601 732 216 90 -121 219 554 935 582
2154 582 159 -12 -65 437 1031 313 -471 -152 287 424 563 242 -270 -126 370 402 193 -143 -205 -448 191
2175 191 354 166 -658 -898 -328 191 467 69 -835 -659 -198 56 162 -338 -673 -820 -208 139 134 -743 -849
2196 -849 -803 -179 203 -90 -349 -720 -566 -90 -63 57 -775 -601 -505 -283 168 -225 -750 -774 -269 140 -1
2217 -1 -297 -544 -698 -308 131 34 -92 -647 -667 -341 202 500 -116 -732 -166 -17 401 119 -412 -366 -226 191
2239 191 663 226 -205 -145 -221 192 606 173 -265 -576 59 670 478 105 -362 -156 434 852 545 217 -90
2260 -90 624 315 688 452 152 -168 -73 599 955 584 25 -219 414 645 766 687 23 -167 320 911 618
2281 618 444 65 -300 73 530 602 152 -220 -65 221 594 367 -155 -447 -125 210 582 337 -45 -874
2301 -874 -213 617 267 -34 -249 -499 -359 300 21 -307 -557 -438 148 -34 200 -14 -467 -461 6 174 -153
2322 -153 -240 -1421 -814 205 120 -674 -766 -412 -1011 14 50 -1116 -596 -450 20 -622 -171 247 -579 -242
2342 -242 104 297 -171 -771 -218 -948 -110 -40 -389 -279 -280 -646 418 -21 459 -323 -539 -710 343 592
2362 592 321 -370 -297 19 155 124 260 -227 -158 -38 378 605 -59 -109 -179 -11 627 787 131 -117 -372 294
2384 294 778 784 98 -34 -22 563 506 614 70 -47 -43 564 1058 699 104 -192 389 521 814 374 64 61 135
2407 135 616 747 341 -610 -30 285 865 665 -19 -235 -362 588 546 169 -91 -263 -4 393 494 241
2427 241 -425 -342 -106 294 443 129 -501 -315 33 257 263 -282 -579 -158 -29 259 56 -311 -559 -223 -219 19
2449 19 -209 -394 -406 -319 23 -252 127 -478 -574 -317 -16 -152 -474 -439 -662 -509 -137 74 -199 -514 -727 -521
2471 -521 -236 423 -277 -512 -485 176 139 203 -183 -458 -604 -41 272 4 -307 -545 -503 241 157 -23 -568 -70
2493 -70 -387 331 107 106 -333 -401 309 253 240 314 -180 -258 115 494 302 -65 -50 55 199 647 239 11 -217
2516 -217 -50 370 635 336 -358 109 -44 657 533 329 101 116 354 770 305 78 -26 47 455 801 682
2537 682 245 -25 297 38 351 665 -206 -150 154 581 305 378 268 -179 -67 753 -11 177 -484 -171 -18
2558 -18 156 173 547 136 24 61 -684 143 -990 473 -144 728 -86 252 -360 -253 -161 -447 28 72 19
2579 19 448 -118 -748 232 -573 -1068 -1162 -48 263 1001 -1038 -851 -1544 -157 146 318 -529 -710 -26 -336
2599 -336 -264 190 -390 -161 112 -406 -772 -769 -513 -762 -87 -658 -211 -661 -320 -1016 -34 -322 296 174 -590
2620 -590 -561 256 318 -178 -134 -279 -235 -44 -434 594 -277 -284 -45 17 479 25 -63 -368 52 698 866 486
2642 486 184 -60 209 886 479 92 53 -143 289 979 801 441 237 -34 382 958 532 400 -169 -172 686
2663 686 626 549 -112 32 421 447 508 183 105 27 491 139 -119 443 -7 -379 266 535 406 -225 -134 8
2685 8 -156 315 -34 266 -133 92 401 283 182 -220 -110 -339 17 140 -53 -132 -477 95 306 -50 -266
2706 -266 -453 -458 -406 407 -91 -162 -735 -588 -187 56 250 -316 -388 -458 -105 -59 51 -522 -300 -545 -268 -22
2728 -22 -201 -102 -726 -574 -251 -197 -112 -637 -238 -376 -8 -30 -42 -298 -164 -113 15 146 -274 -404 -575 84
2750 84 98 109 -221 -45 -159 238 450 306 -330 -338 -43 68 343 -77 -77 -118 308 469 368 66 119 -93 262
2773 262 277 463 70 -103 -112 458 631 291 321 -130 307 587 262 180 146 -108 151 544 407 530 177 -312
2795 -312 43 476 437 261 67 -8 -50 447 410 -38 -159 -216 302 480 130 107 1 -128 373 377 189 94 -90
2818 -90 -136 176 427 -269 -81 -137 -121 155 55 96 -331 88 -130 171 -33 -87 -279 -517 -174 -288 -223 -37
2840 -37 -509 -518 -225 79 -158 -266 -284 0 -200 -186 -195 -358 -667 -456 -49 -177 9 -299 -377 -17 -48 -313 -345
2863 -345 -136 -552 -382 53 283 -260 -480 -413 -58 293 145 -353 -155 -196 152 -145 132 -86 -114 58 198
2884 198 469 152 -111 -420 -8 77 526 470 33 -212 228 247 550 70 314 168 123 728 19 -43 386 111
2906 111 275 232 159 -393 -176 37 647 261 172 -145 236 417 733 278 215 205 -249 257 317 660 -141 242
2928 242 257 499 401 153 20 106 -29 100 327 409 -28 -98 -41 122 -164 55 133 113 -161 26 28 -283 -405
2951 -405 -786 -150 185 164 -171 -19 291 -637 553 22 -651 -796 -98 -135 -64 432 -414 -172 155 -123 374
2972 374 -361 -390 -232 -628 -316 176 20 -283 -515 -140 96 287 -365 -707 -498 -340 -76 -11 -37 -462 -289
2993 -289 -258 13 84 -274 -179 -274 232 32 34 -255 -371 -82 -236 480 -136 -840 -393 -523 474 -52 57 -310
3015 -310 -205 225 392 156 -286 76 248 205 117 462 -401 -146 -439 50 573 218 -386 -189 348 127 188
3036 188 -117 -360 -95 -361 254 -351 35 -24 -219 217 496 782 97 21 407 344 752 241 251 -479 206
3057 206 348 -487 634 346 -62 5 359 87 -686 -184 -233 242 -63 -42 -412 -33 -453 37 -14 645 585
3078 585 117 392 -845 97 -11 -170 -84 -702 -1485 -95 308 -129 -1196 -299 243 -140 103 -178 205
3097 205 -928 -180 118 -132 84 -376 -468 555 695 -289 7 -107 -685 141 -55 -316 -118 -50 367 -581
3117 -581 28 -150 -555 -1 -207 260 -205 -166 -420 86 78 -115 -160 -541 -574 -422 128 138 -255 -136 -192 208
3139 208 155 168 33 131 -122 20 231 -125 -63 -86 44 291 123 -14 -37 49 -8 305 180 190 90 129 -147
3162 -147 158 285 366 247 -125 44 -20 263 42 209 282 -21 169 36 238 69 46 246 197 204 126 22 45
3185 45 357 183 317 103 -9 273 257 253 255 182 242 148 300 17 236 -212 -7 -66 238 233 -206 -140 -224 162 -129
3210 -129 233 -294 -228 90 82 240 -30 -48 -218 -257 -389 173 21 -464 -260 1 307 151 -426 -488 -10 -201
3232 -201 -73 -154 -131 -536 -86 -86 24 -180 -245 -548 -407 21 -105 184 -391 -178 -282 -432 74 -147 -148 -200 -55
3255 -55 -279 193 -560 -171 -276 13 89 15 -236 -311 -39 -193 50 -176 -261 43 -175 63 182 160 85 99 -184
3278 -184 216 228 -7 -167 -162 8 376 192 235 -66 224 334 239 143 170 105 -90 139 370 252 -52 325 215
3301 215 208 30 503 28 -39 146 416 282 131 132 229 337 618 250 -276 173 155 151 134 237 33 -161 -5
3324 -5 351 257 71 150 -276 55 -36 -181 -33 -106 -38 -99 120 125 219 -277 -333 -285 150 49 44 -113 -235 -125 330
3349 330 186 48 -3 -356 80 -22 -76 -107 -106 -154 -128 -180 -25 -264 -210 -169 -86 -1 40 -274 -207 -123 -90 70 -221
3374 -221 -468 -279 -136 21 -180 -472 -310 -31 -4 -141 -120 -9 -40 -410 371 3 -36 -199 -326 -73 -84 -163
3396 -163 -19 74 12 -9 270 54 -15 -116 -179 -6 -228 12 45 -114 -207 167 74 -110 145 98 -227 266 -32
3419 -32 131 625 30 77 89 209 164 118 -34 124 0 242 414 -121 31 118 77 335 482 -87 -289 309
3441 309 106 444 459 57 -18 92 454 283 104 186 211 46 135 275 -102 -208 142 30 27 -14 83 102 -140
3464 -140 -164 146 -96 -39 -151 -176 188 -25 -15 -430 -270 -120 86 -122 -128 -126 -409 -50 361 -49 32 -111 -414
3487 -414 303 35 -77 -427 -323 62 115 -150 -206 -215 138 -221 321 -14 -181 38 62 1 203 -24 86 -261
3509 -261 -197 -41 -71 6 -140 -75 -296 -415 65 -225 -201 -350 6 419 20 -21 -139 -165 194 81 204 230 -16
3532 -16 111 -18 125 40 70 -31 5 187 221 81 -6 -102 17 84 110 399 124 3 71 276 -6 328 -261
3555 -261 134 48 501 110 207 8 151 149 120 -54 384 -103 355 236 13 268 -346 -53 -136 411 -262 154
3577 154 186 -813 -685 400 252 267 452 301 551 67 -875 245 -81 89 512 88 -240 -83 -700 14
3597 14 -144 -179 64 -16 -200 -568 -206 259 -149 -32 -187 -234 401 34 53 -3 -314 -564 -265 266 16 -121
3619 -121 -196 -29 545 -499 199 -259 -155 438 439 37 -49 335 -247 377 -377 -470 -19 -405 -114 -309 503
3640 503 209 -67 -1024 -338 308 268 -150 -210 -289 -266 -37 -550 169 179 -694 64 193 54 -68 -149 -1 472
3662 472 417 81 399 434 63 -79 267 -59 158 114 -392 80 -322 -380 162 3 -240 479 734 -343 115
3683 115 242 -105 162 -37 -187 -268 -42 421 559 -43 -125 628 192 403 -609 298 1076 -321 783 322
3703 322 581 286 164 7 -163 493 434 -15 94 -422 168 14 424 374 146 -209 326 -28 93 90 -328
3724 -328 654 8 209 -505 37 -34 43 282 -46 -109 -265 262 -556 -656 346 -460 -11 94 396 26 645
3745 645 -153 -22 -132 -412 -275 342 422 -176 58 202 698 -950 -352 -237 -255 612 -154 -149 268 -1180 111
3766 111 159 -999 -358 -504 80 232 515 16 -431 -112 527 248 -162 5 -197 580 17 160 -57 274
3786 274 -3 -13 1386 -74 288 864 245 157 -92 747 247 -429 571 59 -115 -399 -201 240 63 671
3806 671 589 946 22 -405 1278 580 -382 212 146 657 707 -58 383 48 -165 -291 546 177 -104 -198 -34
3827 -34 -955 -117 -272 -895 359 -157 -114 116 417 116 -187 -308 272 374 -391 525 359 175 -129 503
3847 503 -109 108 97 240 421 -156 30 111 37 -39 23 -138 -18 -42 -33 -99 -212 87 261 -137 289 -84 -125
3870 -125 -91 -32 -60 92 -269 24 -165 3 -12 -490 -387 -173 -28 -195 -158 -438 -327 -488 -35 234 131 -126
3892 -126 -161 -49 243 -239 16 103 -22 12 -37 1 -71 -23 5 -3 -89 -261 128 -308 218 5 -136 -244 52 -11
3916 -11 -107 27 35 136 -266 -287 63 -23 -84 -189 143 159 304 136 -151 54 97 2 564 60 104 175 -48 -13
3940 -13 168 118 -83 111 -104 33 260 309 -77 102 306 -88 58 337 303 100 223 -131 132 82 -61 75
3962 75 -296 217 121 -283 211 -235 -236 -183 183 98 254 -204 241 -142 -28 221 100 -401 -51 -39 337 215
3984 215 -193 116 -468 506 -51 103 -130 -247 -307 -183 234 -235 -371 -203 7 212 -48 174 15 -780
4004 -780 713 193 -691 -122 -240 -295 246 5 -98 -6 -439 124 -748 -62 317 1096 413 596 -1093 -1625
4024 -1625 -279 -19 -238 -1288 1068 -768 1167 89 787 -1019 -88 -800 -400 -82 93 -1 1377
4041 1377 -107 -128 321 125 211 289 -86 -47 -478 34 412 333 1079 -564 -31 1105 213 297 367 342 262 294
4063 294 241 166 -553 146 92 -60 -296 -175 50 -187 91 -469 562 55 -98 504 345 297 589 445 -317
4084 -317 -14 -81 41 55 304 393 -51 462 -85 -117 -239 80 215 117 4 37 -84 177 -47 257 -90 170
4106 170 -42 -45 -88 -89 117 -51 -27 -309 181 -32 -114 -191 140 -43 9 -171 21 -121 -74 -159 -72 -436 83 -250
4130 -250 125 -168 -130 410 53 -47 533 -374 -165 -146 -100 -446 -366 272 -88 27 -706 -309 -581 -36 -137
4151 -137 14 25 -188 249 -364 -394 238 -137 -131 -310 -252 -68 -856 -366 144 79 323 552 58 -214 225 233 925
4174 925 604 -190 -781 335 693 -108 -241 -12 596 284 -405 1048 -301 -513 260 -166 -329 780 -281
4193 -281 686 -1094 -72 818 946 -23 511 -337 750 175 328 613 419 -313 -451 -342 -113 166 -908
4212 -908 189 -122 346 561 270 189 -34 83 35 -22 326 -122 219 186 48 22 -56 242 -115 318 127 53
4234 53 -28 55 165 360 183 -55 276 -193 108 -44 14 -235 167 42 5 13 -264 -136 -306 7 -106 -162 -56
4257 -56 -264 -110 74 -50 193 93 132 56 2 -97 134 -98 98 -91 -247 -207 41 -256 31 -220 -28 242
4279 242 -181 98 10 -2 198 75 -250 92 -142 -283 -207 156 629 -422 174 88 -63 -120 484 -85 -198
4300 -198 7 782 427 355 629 -141 -661 102 74 386 -37 -383 246 302 198 -310 173 250 49 80 234 -87
4322 -87 -253 81 -336 -477 643 1103 -714 329 31 345 1074 754 -147 104 -171 -1 482 99 787
4341 787 130 -311 898 217 157 -419 1099 60 -526 -62 6 -541 -543 378 366 193 -581 162 -702 268 358
4362 358 -424 -296 -508 389 348 -22 283 371 563 121 -246 13 -204 1057 333 26 -85 -729 33 336
4382 336 -632 103 310 -299 144 -131 -535 402 289 -374 -41 -407 -87 -196 -560 -221 -82 -308 -306 187 -203
4403 -203 -445 -79 -64 -100 44 -230 -31 -6 -276 -224 -565 -276 -140 165 381 141 23 -119 251 286 -356 21
4425 21 -330 -234 -21 -52 51 -114 -257 101 -177 -151 -333 190 139 259 111 -118 281 -93 -33 177 39 -268
4447 -268 84 -151 -85 23 -193 -29 342 -58 85 -44 164 124 125 262 -213 -68 94 -58 281 -18 116
4468 116 296 -107 173 444 15 143 -20 -140 -31 -386 -41 280 123 167 112 191 -79 1 162 -259 -38
4489 -38 -5 -295 193 126 106 -47 117 481 -115 -77 -121 35 21 130 99 -69 -31 73 -330 57 -192 132 42
4512 42 -419 22 -80 -219 34 132 -365 13 144 -107 -207 543 -18 -716 -151 100 337 548 425 -239 -418
4533 -418 -467 257 416 785 28 -506 294 -406 -406 -426 -125 -81 203 -457 -399 -151 -176 -165 353 9 -664 -145 -209
4556 -209 455 -325 -223 -202 51 87 402 133 72 191 -148 359 -292 58 230 619 -543 151 327 350 868
4577 868 -24 -117 359 520 -554 424 -211 212 886 -320 410 714 98 485 552 -133 247 430 699 40
4597 40 298 349 -214 453 232 198 68 934 74 -419 165 787 -947 150 199 -1010 792 759 -1218 -643
4617 -643 -358 -617 -487 200 181 149 91 -100 231 -1 -111 -265 123 257 229 73 11 113 -518 -101 514 238
4639 238 -110 576 -30 434 -30 133 -262 -48 -90 -308 -147 -228 66 -148 -237 56 -125 -229 223 -228 -26
4660 -26 429 311 -340 -109 -373 57 408 152 229 158 -290 -14 -76 112 -134 -303 -23 11 -237 -36 150 -32
4682 -32 146 -9 59 16 19 -91 -239 -90 -52 390 -119 -233 -316 -176 -149 48 80 177 -322 -164 392 651 -102
4705 -102 -305 49 145 391 547 -95 -128 -110 -75 -126 51 18 114 241 -283 36 57 68 -200 100 -491 200 162
4728 162 -163 -60 47 140 284 217 -99 150 153 371 93 39 -119 156 -28 102 -20 -111 107 52 242 -211
4750 -211 137 291 143 471 242 -300 130 690 -691 184 -398 -298 130 -59 419 581 266 209 -746 -632
4770 -632 -254 263 -531 -140 366 -473 114 -69 -211 -73 -573 84 136 -141 -597 309 106 47 262 -95 160
4791 160 -242 199 -263 -108 -141 -77 -57 -430 -94 78 -1 135 94 -196 194 -133 -235 -185 89 -18 -182 -51
4813 -51 -248 194 124 -258 -253 -119 -272 -43 170 44 -27 216 138 42 -123 -257 136 -15 -149 -8 233 41
4835 41 -185 -107 -33 116 193 -329 -80 115 197 40 -113 -93 255 172 235 313 -353 241 354 -268 217 149 -344
4858 -344 319 -827 -368 -680 220 -389 -224 1301 -294 -20 618 314 -563 -316 -539 882 964 -90 507
4877 507 -40 -441 -974 406 96 -299 -169 -67 309 -3 190 -119 -336 -284 291 540 -138 100 134 -326
4897 -326 13 -254 -229 22 229 -75 -132 -184 -277 278 -159 -305 16 278 -189 -515 300 489 561 -155 -607 141
4919 141 -377 -520 -429 229 272 -516 -255 -301 1125 524 648 1 -406 -333 251 208 -82 218 274 -519 -63 259
4941 259 -231 424 354 170 -8 451 359 -123 -84 48 341 -67 -106 -146 -76 280 173 -11 -118 116 318 -90
4963 -90 -187 83 95 153 -24 -81 91 36 -83 -33 77 204 101 -11 -270 -6 -212 92 80 13 -60 152 54 46
4987 46 134 261 -184 -23 126 206 -385 -177 59 291 351 90 -390 190 -209 -308 76 -234 256 -180 139 -295
5009 -295 229 -335 -191 -102 106 -86 370 448 138 216 88 -139 -74 -187 182 -148 137 181 -316 -63 78 -1
5031 -1 4 -126 -89 99 -338 145 -39 177 -315 -49 -393 -440 -184 -9 338 -208 -176 -4 -420 531 180 -83
5053 -83 -363 -390 431 -53 -25 -163 -202 -377 -40 -310 -220 -446 -55 -625 77 -630 258 -136 -172 -270 243 662
5075 662 -28 269 90 479 -299 -336 -630 -672 232 -232 -89 -57 -565 -233 -522 -27 -127 -380 -252 -33 287
5096 287 -596 153 -104 472 -57 -410 -80 -525 -33 470 -425 339 -146 -271 321 285 -386 131 631 -1192
5116 -1192 -45 163 227 166 -85 624 89 128 -41 -5 637 963 -491 -646 194 -41 639 330 393 -541 -641
5137 -641 685 -254 253 1215 -420 -137 54 237 -211 133 -101 683 -561 -290 102 357 138 321 -51
5156 -51 772 603 329 -443 -854 252 -443 256 199 244 324 -104 260 -349 -661 -196 -365 -616 -96 -547 312
5177 312 -37 495 -134 108 370 -110 300 -51 -59 -542 18 15 4 -37 97 56 -401 79 -489 -264 -36 108
5199 108 -411 218 -322 -630 670 406 -431 592 576 -588 459 -424 615 -243 -165 -77 600 907 -456
5218 -456 -578 -529 707 110 203 -101 256 474 -87 58 -908 113 43 427 60 50 -438 -614 241 501 907
5239 907 916 -37 -106 414 -90 268 313 -237 -282 -796 -206 228 72 118 246 -572 44 265 -636 221 -23 0
5261 0 -364 81 -435 -152 239 596 -246 31 -391 -133 616 459 -139 33 -90 -504 -218 -908 137 155 130
5282 130 439 -120 -375 -219 -621 625 -676 -852 410 -495 583 -1095 -129 -130 372 694 -46 -98 640
5301 640 295 -392 -375 -527 294 283 310 710 439 -342 392 391 -425 465 565 -617 -181 203 121 429 -211 -233
5323 -233 661 -479 -423 -302 121 688 47 16 -21 -357 271 -292 -276 213 249 -283 120 -13 108 -140 -53 -486
5345 -486 24 75 264 14 -123 61 138 -203 -206 177 -206 23 165 287 -35 -32 211 137 -282 -252 -74 -275 5
5368 5 -6 63 -34 395 -157 143 -70 0 319 -798 -225 -221 -117 -409 133 -232 -134 58 -154 137 481 836 -325
5391 -325 783 -282 371 -617 -579 -309 -3 -63 -63 -55 775 807 -72 -338 -187 -993 514 320 235 362 -805
5412 -805 -887 227 547 655 2397 9 -427 -517 -180 -915 278 -620 362 -405 137 241 -150 207 -141
5431 -141 652 -387 -289 -31 -780 -308 253 432 -603 -389 -512 -159 334 -707 461 -158 -498 452 597
5450 597 497 189 192 -388 -145 -285 -173 76 424 118 -42 693 -639 -322 708 -556 228 -93 -405 -64
5470 -64 -386 151 -93 -103 42 48 180 -104 285 -214 23 155 15 60 -60 -120 32 -274 12 184 -572 -671
5492 -671 22 578 -100 407 -917 -178 263 -235 262 313 -630 -254 -381 -185 -519 867 512 337 -347 222
5512 222 3 -742 312 180 -43 521 -111 751 -582 795 178 -9 290 -31 -44 214 590 34 394
5531 394 -333 302 78 -97 -430 -3 -534 81 19 87 -227 -299 111 135 142 -47 130 -178 -129 754 -97 -29 74
5554 74 -98 449 106 -499 -53 -123 -554 -447 249 -258 296 154 -191 -378 64 288 -466 134 2 -92 -131
5575 -131 9 483 -5 -912 -241 -151 901 -243 466 544 56 -56 -68 -63 -563 -407 29 501 917 -90 -425
5596 -425 -251 413 723 -568 -705 -411 -364 142 -232 -70 713 -811 -628 513 148 -278 572 -430 -418
5615 -418 -323 325 262 -373 -791 18 -43 -552 -62 47 -272 -992 197 -570 -8 514 -261 57 84 317 37
5636 37 15 913 624 -1204 -602 102 -301 -537 -487 388 896 -7 386 525 470 136 159 -200 366 -231 7
5657 7 -613 -1484 -291 -694 -422 -20 -218 -502 -537 337 -561 -463 394 -1066 -611 502 408 -451 455 -52 -235
5678 -235 -18 486 -407 -414 -831 356 5 230 -767 -787 -313 257 -430 -214 370 -47 1313 -765 1338 380
5698 380 -494 -301 593 879 399 -535 -429 201 -480 -815 55 -446 358 890 -129 249 -824 203 -432
5717 -432 -58 -838 202 -1165 54 472 89 264 -819 -87 400 178 -164 -267 -615 333 49 728 233
5736 233 75 358 -15 493 -1074 -1235 638 -315 111 -596 -291 167 -328 356 651 -822 -247 689 411
5755 411 -237 -285 903 382 269 115 699 378 -616 -178 -1148 250 1035 -287 -34 -692 173 -879 524
5774 524 337 463 142 624 -98 832 120 415 -124 146 170 -75 -152 71 -679 -393 321 -634 69 111 531
5795 531 605 -507 120 393 -614 986 51 462 286 -91 -691 241 -559 338 -770 466 -259 -359 -853
5814 -853 1125 -1208 142 -376 -385 445 424 575 131 395 133 530 77 153 473 -169 -832 675 355 -664
5834 -664 143 603 -225 -1093 466 -1290 -156 308 -1032 612 320 -464 -345 1434 486 -534 304 83
5852 83 -49 34 246 -425 150 -293 594 -87 47 -556 36 644 -118 536 -722 715 -776 263 211 -347
5872 -347 -596 159 202 115 1194 68 -430 360 -35 -111 -277 -67 -1105 186 289 -291 -938 476 -10
5891 -10 -148 937 -731 164 32 -371 713 -408 -210 427 38 -95 -328 796 970 711 203 -230 -422
5910 -422 -814 493 162 585 643 -558 -852 -47 -942 -260 30 504 -369 486 53 -252 222 -367 412 -245
5930 -245 722 673 -303 -396 460 691 567 -125 -202 -189 -369 -188 -84 -24 -570 -750 -546 274 92 24 661 -527
5952 -527 -441 864 837 927 349 230 259 650 251 1027 440 -528 591 394 -281 -404 627 1036 -853 801
5972 801 529 -494 -311 -459 -521 703 214 567 144 -443 -50 -159 125 -296 83 -113 715 232 -231 -870
5992 -870 872 431 -658 473 651 1178 357 234 -180 -619 95 -593 -238 46 -114 691 -365 507 -126
6011 -126 251 49 -301 -83 -234 54 -465 447 -353 -70 -137 -135 325 300 774 318 310 -157 117 696 211 278
6033 278 -20 755 -576 849 72 -22 -38 395 11 -34 114 -400 378 165 -338 30 508 -817 -157 -1012
6053 -1012 -118 623 252 510 -278 654 -31 -669 -145 -382 236 54 292 379 1401 610 1237 167 -505
6072 -505 353 744 717 688 -657 -178 -231 -344 -136 -201 90 -178 -148 133 -77 -4 317 198 -473 79 -391 -10
6094 -10 -1121 -104 -355 -291 -593 -200 196 38 109 -205 21 440 262 -162 -280 416 390 -495 427 -197 313
6115 313 348 162 -334 -422 -144 -14 -681 -52 426 116 437 348 323 -21 -184 76 181 -80 48 -269 45
6136 45 345 118 96 -18 123 -271 249 444 142 11 145 35 216 65 9 118 143 110 225 -197 -72 221
6158 221 -337 70 -59 303 -196 195 102 61 -133 -260 198 108 66 42 -41 28 -124 137 154 143 -98 -135 -768
6181 -768 -202 501 197 267 -250 133 -39 446 -143 113 574 528 -420 71 -96 286 215 -618 492 220 -453
6202 -453 66 -193 -1009 -1591 135 -946 -928 153 72 -1326 -172 187 37 -295 -463 -15 63 242 -455
6221 -455 187 238 106 -73 -335 -562 -101 -782 -452 -322 -559 -184 8 -230 -285 -874 665 -312 -30 -197
6241 -197 8 17 -206 197 -454 744 1 -181 712 599 -146 47 -500 -251 -171 -404 -561 131 -121 302 -27
6262 -27 455 -132 -354 -533 387 -204 339 -398 81 138 208 -319 397 -583 -160 773 -135 392 -179 -172 703 -429
6284 -429 -302 -268 734 200 95 316 7 -260 -287 227 438 991 -88 329 1072 70 309 370 -20 -83
6304 -83 98 438 181 306 316 589 71 295 -424 160 16 91 425 -435 548 -591 -100 352 -720 493
6324 493 -580 396 1356 153 452 567 278 110 190 -172 0 -661 -287 304 376 661 -132 1179 -431
6343 -431 -333 -212 11 102 354 60 -185 429 173 -223 388 479 38 -152 -385 -616 -79 -1230 -212 -120 -329
6364 -329 -776 333 13 -656 585 604 444 -287 -535 20 -38 59 -576 217 -249 -308 -506 -275 -336 437 519
6385 519 -499 455 540 180 -532 -359 437 -705 -4 -375 647 47 674 891 -293 -300 -332 -111 225 -912
6405 -912 229 765 -357 -591 -237 36 -685 711 -572 -932 -163 -533 337 742 675 -417 -317 683
6423 683 336 -153 494 -107 -114 -231 443 238 -717 70 67 127 240 -914 -921 490 -419 -267 -381 -124 -473 -266
6445 -266 41 -603 214 324 613 147 83 226 50 -49 255 94 189 -118 -221 -113 -78 360 -51 4 -70 -444
6467 -444 -249 -231 61 187 -202 -330 -142 45 46 -19 -354 -8 112 64 51 -165 -79 201 -101 -92 -50 -201 -217 158
6491 158 -206 7 18 -137 -20 85 146 269 -111 -96 131 194 -101 -32 -172 -160 -93 13 -283 -240 59 -181 -95
6514 -95 233 17 -88 87 276 -133 -84 -120 49 -141 -128 -67 -44 -192 165 -109 19 78 157 -103 -55 186 -82
6537 -82 -18 260 -28 13 60 -140 -204 -3 -93 -60 260 -63 378 -6 -144 -37 11 -167 13 -28 -96 -73 -162 3
6561 3 122 74 -202 -242 -129 -50 181 -24 186 96 -189 4 -93 -100 -125 227 50 -42 55 -103 -78 -32 112 -114 -117
6586 -117 12 -54 -91 239 228 114 80 -11 1 -80 352 -102 40 -105 146 -110 113 -142 -78 301 -194 -135 33
6609 33 69 134 90 -87 306 168 -126 -45 -59 -73 -120 -62 -7 -95 -232 -199 -110 59 -179 -9 -174 -23 -150 -251
6633 -251 -5 -401 41 -148 -142 -107 -442 293 -119 233 -47 156 412 -29 -27 -48 388 -149 54 88 17 -234 -271
6656 -271 84 91 118 357 -295 168 -143 -208 51 90 115 -165 17 -202 62 218 29 -27 207 -116 176 -7
6678 -7 158 49 152 90 -300 157 -260 -57 -93 -56 11 -15 -2 203 -61 119 188 223 417 -82 39 268 -155
6701 -155 -335 -69 336 -205 190 -526 441 392 -76 -201 66 -428 141 -57 49 161 -240 280 -714 -97
6721 -97 245 38 149 -108 -211 324 225 -155 38 180 -590 310 657 148 32 -106 36 -232 -245 -118 -120 290
6743 290 107 80 -23 18 50 185 -190 -46 100 -193 211 180 -16 119 -375 34 -156 243 -15 -67 -88 -3
6765 -3 -384 104 116 -598 44 205 106 -509 -452 201 -627 -469 -349 146 -323 -691 -438 -169 -534 -720 152 152
6787 152 -130 115 -10 -62 -27 -592 -7 -525 1 214 196 396 -9 -171 -24 -469 370 -794 151 -136 -46
6808 -46 273 -128 310 -288 -431 189 -41 -228 270 230 -140 -490 285 -349 -535 -745 -44 -162 -18 -188 -145
6829 -145 51 -41 -147 126 398 229 -107 50 137 358 36 -41 -559 689 -646 -645 351 112 11 -1716 -882
6850 -882 352 -198 -806 1198 -822 -803 684 956 615 -473 -1516 -172 526 -434 186 238 419 -463
6868 -463 -65 -129 -641 -195 394 516 187 0 -20 117 18 34 -229 38 -4 537 -19 2 188 -338 90 78
6890 78 93 -233 169 -71 -161 198 -229 7 46 -261 -329 -284 -164 544 41 78 -34 -26 22 -94 -129 27 -89 180
6914 180 36 -253 16 106 -26 -107 215 115 227 -93 -62 88 80 -24 94 54 -349 -156 136 -309 122 -199
6936 -199 23 -15 -227 354 -92 195 136 -28 -64 -138 -82 -13 -3 25 98 48 83 158 153 -344 -134 -252 -106 26 -164
6961 -164 -283 -183 -30 42 424 -44 -62 -159 183 44 260 118 186 180 -20 -71 219 102 -135 196 -34 -16 -62
6984 -62 -73 43 160 -16 -240 47 -52 -84 88 -41 304 -70 13 6 148 37 313 -285 263 -193 -12 117
7006 117 168 -244 -55 217 -216 80 -123 -303 99 162 -32 55 -93 -1 -216 172 188 109 208 -344 -81 259
7028 259 220 -151 396 -136 -42 -245 -25 179 85 -153 -195 -125 -117 -221 -29 -77 -35 59 -116 21 -313 172 210 236
7052 236 -118 31 -137 -103 50 242 260 -170 -33 -202 -18 -84 -229 163 55 -114 64 53 40 -132 382 135
7074 135 -22 -88 14 -42 46 -121 101 -60 31 -24 208 18 142 119 -190 286 29 -72 102 -20 -169 -174 22
7097 22 -1 179 29 -253 32 73 24 -15 -380 -156 31 -207 -123 -239 -50 -5 -155 -207 -271 -55 111 146 248
7120 248 39 -506 -634 116 39 139 -52 -89 -3 -63 172 275 -137 -93 -3 -59 -327 -5 -75 -115 -69 228 185 41
7144 41 155 273 217 -464 -93 -268 -313 378 -297 -168 108 466 -120 -41 49 170 140 415 -95 -75 -58 177 -65
7167 -65 304 311 -23 45 -9 -162 -44 356 104 91 75 -160 -789 -323 -187 -145 -256 40 -249 208 -57 -354 102
7190 102 -98 -20 312 63 49 118 435 -322 -75 163 -15 -73 155 120 -39 55 151 -186 -426 400 148 -310
7212 -310 -78 -39 141 954 87 128 144 -215 -293 56 -115 -79 111 363 -398 -83 -5 -183 653 270 -482 -194
7234 -194 190 -156 -325 -874 -94 -196 -108 401 -819 88 102 229 79 -6 133 1013 195 -579 458 -621
7254 -621 332 -294 775 -256 93 216 -661 1451 -567 414 -258 -368 -775 529 407 -97 -349 871
7272 871 450 166 742 596 946 -95 222 381 186 -47 170 -59 750 239 -260 -342 -170 790 255 541
7292 541 -554 41 -16 479 -510 -629 -400 -116 -561 1108 -28 295 570 -32 -166 -627 383 -1044 198
7311 198 463 135 -115 598 184 -268 -66 -301 432 -273 138 336 -210 858 736 -52 -547 -127 1587
7330 1587 -795 -108 -418 971 627 -734 322 114 32 642 328 176 -666 408 -151 666 -406 641
7348 641 491 -491 -39 -78 -366 -613 29 436 897 -1075 42 505 16 -558 141 861 1004 -95 681
7367 681 540 548 333 -219 668 18 318 -677 -71 118 145 -101 75 237 117 -602 244 -155 -974 442 -539
7388 -539 227 -432 -20 -412 -593 -317 251 629 1097 -138 -119 -38 763 744 1091 571 -1025 427 770 -17
7408 -17 -395 166 -315 293 123 173 -82 1056 451 -312 -452 429 1 672 -118 -590 -280 225 348 -58
7428 -58 144 -445 -207 -530 503 -775 57 359 30 829 629 1263 381 -963 -25 128 -489 306 262 -658
7448 -658 -423 -425 80 415 -252 359 -545 -149 334 544 -100 -700 -770 -211 172 -750 -223 1007 -1108 706
7468 706 -145 -559 -62 216 -188 419 -238 -1137 1589 652 632 160 38 737 -8 82 -255 -7 -876 413
7488 413 17 613 447 94 -48 -1343 913 480 -402 693 622 1479 85 -435 120 35 -87 112 670
7507 670 -431 -27 -8 35 -109 134 132 89 433 20 306 294 99 40 -75 -60 589 -808 692 556 95 -422
7529 -422 -673 23 -11 -16 -433 447 665 21 -122 -567 132 395 -85 272 121 -353 -283 -354 361 -572 966
7550 966 -154 -100 -215 -259 184 -199 122 -237 697 431 -343 -407 133 14 618 556 -464 181 -137 -2 146
7571 146 681 27 -282 159 -634 668 -166 -330 457 -614 -286 -5 528 48 79 -188 -472 -1135 219
7590 219 -11 25 290 345 -316 -223 -35 28 157 -746 400 69 -225 732 123 187 -588 353 -112 -164 -73 69
7612 69 -709 311 -246 200 32 -183 -123 -220 -365 -8 310 -113 72 -203 -650 -471 71 47 99 268 303 -552
7634 -552 1070 -599 686 -42 -647 -548 -715 141 -204 -534 94 1066 990 470 -568 -233 -433 -267 399
7653 399 390 317 -619 -398 117 -410 189 448 174 640 700 -436 53 -180 864 147 98 522 466 -324 534
7674 534 1098 280 -216 361 258 -397 -142 -498 210 -117 -287 771 994 745 -250 367 339 587 421 792
7694 792 -222 658 -144 279 -58 -239 560 -54 -220 720 502 -153 -220 558 702 -227 -726 -388 -12 -797
7714 -797 51 -599 133 -85 -273 640 -636 215 -147 340 412 94 -601 123 207 -159 220 -596 167 23
7734 23 604 169 140 -386 448 -214 144 608 71 -95 -36 101 236 -19 56 154 -564 436 -94 -132 159 99
7756 99 -254 153 -343 162 114 363 210 7 -357 33 -34 -271 -106 -229 -307 56 93 67 -75 -29 -62 54 -92
7779 -92 65 44 -261 -32 -156 -117 12 140 -29 -29 -133 -60 213 171 53 -217 -213 286 194 237 115 -133 -145 -183
7803 -183 81 -63 -183 -153 -142 -185 188 -654 163 -223 -371 -396 -152 -355 -39 -378 -814 41 211 -148 -153 -106
7825 -106 -288 -167 -137 -112 -100 -388 -233 170 -59 812 -1092 -410 -80 -215 -394 -67 -256 24 152 -285 -166
7846 -166 170 94 -383 266 14 78 -97 -25 -230 -55 -224 -285 -185 -104 -29 -66 -126 -2 -110 -185 365 70 -7
7869 -7 67 36 -258 -26 218 -79 -21 -177 31 37 90 469 -279 -217 282 -129 705 670 45 95 301 59 443 55
7893 55 -153 -467 -10 -472 112 -211 -37 -95 229 28 -117 -130 152 197 -296 74 -39 -8 9 84 -236 -54
7915 -54 36 -154 -162 68 -161 196 32 -80 -130 201 -85 315 249 131 111 -78 316 -196 -163 11 -65 -212 201
7938 201 13 5 -103 -194 -122 101 127 71 268 22 -150 -211 2 116 -188 49 42 -192 -337 102 187 -173 -112 170
7962 170 212 59 -133 179 -124 56 246 -56 -12 -304 75 -167 -106 123 166 73 216 -146 -182 -75 139 -139
7984 -139 48 214 250 -129 -30 -97 -129 42 99 -74 170 -188 -388 138 -82 -192 45 38 -113 -80 -163 241 107
8007 107 21 -68 -61 101 -27 -125 53 243 191 100 -276 204 1437 -243 -246 -172 21 545 -689 296 -333 -77
8029 -77 -211 160 -588 292 219 -208 -89 498 206 30 126 228 330 -20 56 219 -226 156 -187 424 -232
8050 -232 -320 -200 -227 189 36 51 169 256 -288 21 -29 -327 -194 580 -784 -171 235 223 -39 -591 -240 486
8072 486 449 324 225 -134 -306 -313 153 172 -251 113 175 95 21 -82 -99 253 216 -343 187 20 -83 237 66
8095 66 70 -125 19 -73 35 208 83 30 4 -442 -89 119 -127 -145 -225 73 -42 171 44 -211 -50 -207 -111
8118 -111 35 -117 -57 31 -24 113 40 -42 23 47 -202 40 -253 56 -142 -69 151 7 42 16 -2 -332 35 370
8142 370 -143 53 -61 -46 1 -86 43 -113 359 89 -179 420 -56 68 20 -29 158 -159 8 -67 -76 -96 -648
8165 -648 -79 35 -153 54 -116 319 -209 60 78 -7 127 20 -49 140 22 -237 -12 28 -161 -99 -214 6
8187 6 114 -18 29 13
8191A3
##END NTUPLES=NMR FID
##END=
