##TITLE=1H_Pr 4687-Ac2
 CDCl3, 8 sc, 
 26.10.2020
##JCAMPDX= 6.0         $$ Bruker NMR JCAMP-DX V2.0
##DATA TYPE= NMR FID
##DATA CLASS= NTUPLES
##ORIGIN= UXNMR, Bruker Analytische Messtechnik GmbH
##OWNER= root
$$ XWIN-NMR		Version 3.5
$$ Mon Oct 26 13:13:57 2020 Russian Standard Time (UT+4h)  she@DPX200
##.OBSERVE FREQUENCY= 200.1315066352
##.OBSERVE NUCLEUS= ^1H
##.DELAY= (6, 6)
##.ACQUISITION MODE= SIMULTANEOUS
##.ACQUISITION SCHEME= undefined
##.AVERAGES= 8
##.DIGITISER RES= 18
##SPECTROMETER/DATA SYSTEM= spect
##.PULSE SEQUENCE= zg30
##.SOLVENT NAME= CDCl3
##.SHIFT REFERENCE= (INTERNAL, CDCl3, 0, 15.7039)
##AUDIT TRAIL= $$ (NUMBER, WHEN, WHO, WHERE, WHAT)
$$ ##TITLE= Audit trail, XWIN-NMR		Version 3.5
$$ ##JCAMPDX= 5.01
$$ ##ORIGIN= Bruker BioSpin GmbH
$$ ##OWNER= she
$$ F:/spectra/data/she/nmr/H-F/1/audita.txt
$$ ##AUDIT TRAIL=  $$ (NUMBER, WHEN, WHO, WHERE, WHAT)
(   1,<2020-10-26 13:12:21.39 +0400>,<she>,<DPX200>,
      <created by zg, POWCHK disabled, PULCHK disabled
       configuration hash MD5:
       00 E9 B6 7A A2 85 ED C7 34 08 36 98 17 FE 4E 26
       data hash MD5: 16K
       09 3A A2 B7 C3 CD F1 1F 5B CB E6 64 E7 20 FF 04>)
$$ ##END=
$$ 
$$ hash MD5
$$ 91 40 57 02 96 BC 51 19 5C 29 1D C9 1F 70 0F B2
##$RELAX= 
##$RELAX= 
##$RELAX= 
##$RELAX= 
##$RELAX= 
##$RELAX= 
$$ Bruker specific parameters
$$ --------------------------
##$DU= <F:/spectra>
##$EXPNO= 1
##$NAME= <H-F>
##$PROCNO= 1
##$TYPE= <nmr>
##$USER= <she>
##$AMP= (0..31)
100 100 100 100 100 100 100 100 100 100 100 100 100 100 100 100 100 100 
100 100 100 100 100 100 100 100 100 100 100 100 100 100 
##$AQSEQ= 0
##$AQ_mod= 1
##$AUNM= <au_zg>
##$AUTOPOS= <>
##$BF1= 200.13
##$BF2= 200.13
##$BF3= 200.13
##$BF4= 200.13
##$BF5= 200.13
##$BF6= 200.13
##$BF7= 200.13
##$BF8= 200.13
##$BYTORDA= 1
##$CFDGTYP= 0
##$CFRGTYP= 5
##$CHEMSTR= <none>
##$CNST= (0..31)
1 1 145 1 1 1 1 1 1 1 1 1 1 1 1 1 1 1 1 1 1 1 1 1 1 1 1 1 1 1 1 1 
##$CPDPRG= <>
##$CPDPRG1= <>
##$CPDPRG2= <>
##$CPDPRG3= <>
##$CPDPRG4= <mlev>
##$CPDPRG5= <mlev>
##$CPDPRG6= <mlev>
##$CPDPRG7= <mlev>
##$CPDPRG8= <mlev>
##$CPDPRGB= <>
##$CPDPRGT= <>
##$D= (0..31)
0 1.2 0 0 0 0 0 0 0 0.06 0 0.03 0 0 0 0 0.0002 0 0 0 0 0 0 0 0 0 0 0 0 
0 0 0 
##$DATE= 1603703540
##$DBL= (0..7)
120 120 120 120 120 120 120 120 
##$DBP= (0..7)
150 150 150 150 150 150 150 150 
##$DBP07= 0
##$DBPNAM0= <>
##$DBPNAM1= <>
##$DBPNAM2= <>
##$DBPNAM3= <>
##$DBPNAM4= <>
##$DBPNAM5= <>
##$DBPNAM6= <>
##$DBPNAM7= <>
##$DBPOAL= (0..7)
0.5 0.5 0.5 0.5 0.5 0.5 0.5 0.5 
##$DBPOFFS= (0..7)
0 0 0 0 0 0 0 0 
##$DE= 6
##$DECBNUC= <off>
##$DECIM= 32
##$DECNUC= <off>
##$DECSTAT= 4
##$DIGMOD= 1
##$DIGTYP= 9
##$DL= (0..7)
0 120 120 120 120 120 120 120 
##$DP= (0..7)
150 150 150 150 150 150 150 150 
##$DP07= 0
##$DPNAME0= <>
##$DPNAME1= <>
##$DPNAME2= <>
##$DPNAME3= <>
##$DPNAME4= <>
##$DPNAME5= <>
##$DPNAME6= <>
##$DPNAME7= <>
##$DPOAL= (0..7)
0.5 0.5 0.5 0.5 0.5 0.5 0.5 0.5 
##$DPOFFS= (0..7)
0 0 0 0 0 0 0 0 
##$DQDMODE= 0
##$DR= 18
##$DS= 0
##$DSLIST= <SSSSSSSSSSSSSSS>
$$ [...]
##$SUBNAM2= <"">
##$SUBNAM3= <"">
##$SUBNAM4= <"">
##$SUBNAM5= <"">
##$SUBNAM6= <"">
##$SUBNAM7= <"">
##$SUBNAM8= <"">
##$SUBNAM9= <"">
##$SW= 16.880792210976
##$SWIBOX= (0..15)
0 0 2 0 0 0 0 0 0 0 0 0 0 0 0 0 
##$SW_h= 3378.37837837838
##$TD= 16384
##$TD0= 1
##$TE= 0
##$TE2= 300
##$TE3= 300
##$TEG= 300
##$TL= (0..7)
0 120 120 120 120 120 120 120 
##$TP= (0..7)
150 150 150 150 150 150 150 150 
##$TP07= 0
##$TPNAME0= <>
##$TPNAME1= <>
##$TPNAME2= <>
##$TPNAME3= <>
##$TPNAME4= <>
##$TPNAME5= <>
##$TPNAME6= <>
##$TPNAME7= <>
##$TPOAL= (0..7)
0.5 0.5 0.5 0.5 0.5 0.5 0.5 0.5 
##$TPOFFS= (0..7)
0 0 0 0 0 0 0 0 
##$TUNHIN= 0
##$TUNHOUT= 0
##$TUNXOUT= 0
##$USERA1= <user>
##$USERA2= <user>
##$USERA3= <user>
##$USERA4= <user>
##$USERA5= <user>
##$V9= 5
##$VALIST= <valist>
##$VCLIST= <CCCCCCCCCCCCCCC>
##$VD= 0
##$VDLIST= <DDDDDDDDDDDDDDD>
##$VPLIST= <PPPPPPPPPPPPPPP>
##$VTLIST= <TTTTTTTTTTTTTTT>
##$WBST= 1024
##$WBSW= 4
##$XGAIN= (0..3)
0 0 0 0 
##$XL= 0
##$YL= 0
##$YMAX_a= 115071
##$YMIN_a= -127029
##$ZGOPTNS= <>
##$ZL1= 120
##$ZL2= 120
##$ZL3= 120
##$ZL4= 120
##$ABSF1= 10
##$ABSF2= 0
##$ABSG= 5
##$ABSL= 3
##$ALPHA= 0
##$AQORDER= 0
##$ASSFAC= 0
##$ASSFACI= 0
##$ASSFACX= 0
##$ASSWID= 0
##$AUNMP= <proc_1d>
##$AZFE= 0.1
##$AZFW= 0.1
##$BCFW= 1
##$BC_mod= 2
##$BYTORDP= 1
##$COROFFS= 0
##$CY= 11.3945322036743
##$DATMOD= 1
##$DC= 2
##$DFILT= <>
##$DTYPP= 0
##$F1P= 16.9975609425685
##$F2P= -3.02152046262296
##$FCOR= 0.5
##$FTSIZE= 0
##$FT_mod= 4
##$GAMMA= 1
##$GB= 0.15
##$INTBC= 1
##$INTSCL= 1
##$ISEN= 128
##$LB= 0.24
##$LEV0= 0
##$LPBIN= 0
##$MAXI= 10000
##$MC2= 0
##$MEAN= 0
##$ME_mod= 0
##$MI= 1.114404
##$NCOEF= 0
##$NC_proc= 0
##$NLEV= 6
##$NOISF1= 3.799351
##$NOISF2= 2.8
##$NSP= 1
##$NTH_PI= 0
##$NZP= 0
##$OFFSET= 15.70392
##$PC= 1
##$PHC0= -10688.12
##$PHC1= 9.200881
##$PH_mod= 1
##$PKNL= yes
##$PPARMOD= 0
##$PSCAL= 0
##$PSIGN= 0
##$REVERSE= no
##$SF= 200.130013532006
##$SI= 16384
##$SIGF1= 3
##$SIGF2= 2
##$SINO= 400
##$SIOLD= 16384
##$SREGLST= <1H.CDCl3>
##$SSB= 0
##$STSI= 0
##$STSR= 0
##$SW_p= 3612.71676300578
##$SYMM= 0
##$S_DEV= 0
##$TDeff= 0
##$TDoff= 0
##$TI= <>
##$TILT= no
##$TM1= 0
##$TM2= 0
##$TOPLEV= 0
##$USERP1= <user>
##$USERP2= <user>
##$USERP3= <user>
##$USERP4= <user>
##$USERP5= <user>
##$WDW= 1
##$XDIM= 8192
##$YMAX_p= 0
##$YMIN_p= 0
$$ End of Bruker specific parameters
$$ ---------------------------------
##NTUPLES= NMR FID
##VAR_NAME=  TIME,          FID/REAL,        FID/IMAG
##SYMBOL=    X,             R,               I
##VAR_TYPE=  INDEPENDENT,   DEPENDENT,       DEPENDENT
##VAR_FORM=  AFFN,          ASDF,            ASDF
##VAR_DIM=   8192,          8192,            8192
##UNITS=     SECONDS,       ARBITRARY UNITS, ARBITRARY UNITS
##FACTOR=    0.000296,      1,               1
##FIRST=     0,             0,               0
##LAST=      2.424536,      0,               0
##MIN=       0,             -127029,         0
##MAX=       2.424536,      115071,          0
$$ Real data points
##PAGE= N=1
##DATA TABLE= (X++(R..R)), XYDATA
0 0 0 0 0 0 0 0 0 0 0 0 0 0 0 0 0 0 8 -8 8 -8 8 -16 16 -16 24 -24 32 -32 40 -48 54 -61 70 -80 89 -100 113
37 113 -126 142 -159 178 -198 221 -245 270 -299 331 -363 403 -443 487 -537 592 -652 719 -797
56 -797 880 -976 1086 -1214 1363 -1544 1762 -2037 2390 -2864 3537 -4577 6404 -19941 115071
71 115071 6091 -112677 47630 14717 -61061 16599 18233 -23024 -3706 -37957 26737 58604
83 58604 -60691 -37355 86190 -9116 -42586 66222 1892 -45109 45595 35198 -12676 7189
95 7189 -9153 13562 49938 -24633 -18348 33539 -8374 -10143 32233 -14010 -27015 9447 489
108 489 15910 -9493 -46785 17633 33305 -41041 -3977 30710 -44364 -2331 50716 -21783
120 -21783 -28890 21154 -1092 9281 16826 -32660 6963 23437 -20448 14674 16490 -48276 7152
133 7152 44467 -36648 -10830 20165 -34264 -1178 36987 -35731 -30701 27111 -11445 -10583 13067
146 13067 -20238 -16566 16623 1484 -228 -1194 -25185 19711 27673 -22991 -1141 22120 -15718
159 -15718 7757 36642 -17249 -15641 21546 13355 1685 1136 -7010 3536 12355 -895 7774
172 7774 -7639 -16654 17929 15501 -19320 -4163 7338 -12026 14208 11595 -23058 -4393 15759
185 15759 -431 3475 2820 -16374 7784 14176 -1949 1098 -5289 -8134 16185 12077 -18440 -1819
199 -1819 3073 -5237 9834 2780 -21978 -5219 11647 -7092 -204 -6081 -19865 2710 12396
212 12396 -10260 -12473 -1946 -6031 6199 2563 -9310 -5565 -3121 4893 13040 -4973 -18561
225 -18561 11024 13208 -5045 2784 3697 -9162 3805 19270 -1681 -9747 -2436 8928 11154
238 11154 -3425 -7148 2550 1828 114 13298 -4436 -15916 7420 13527 -800 -4235 -1431 -2513
252 -2513 10074 7426 -2969 -3741 -1073 6278 10823 1865 -11029 1525 7429 5480 3450 -6870
266 -6870 -6583 6217 7533 -3885 -1798 -8239 -4490 9928 2023 -11805 -8575 1397 430 2573 -5911
281 -5911 -10704 -3640 2558 4251 -3593 -10212 -7064 8269 4229 -5479 -4388 -4531 312 7683 3766
296 3766 -10295 -3741 3349 6361 4116 -5714 -6101 1364 7813 2216 -1880 -6796 -1169 7780 5121
311 5121 -2077 -6412 -498 4887 8955 -365 -6807 -319 5698 7053 2267 -2095 -5169 5969 9817
326 9817 3589 -3021 -4238 4791 8079 4967 -3670 -3183 106 6520 6255 -3223 -6583 -2513 6481 3657
342 3657 -1940 -7867 -4577 4277 3981 -2408 -7783 -4288 -904 5188 733 -7999 -7566 -151 6577 -311
358 -311 -6434 -6709 880 2605 1582 -1422 -7766 -3962 4642 7271 -5523 -8395 -825 3848 3121 -1600
374 -1600 -4510 -5334 2368 5141 2628 -6586 -6468 4101 6875 1654 -5200 -2456 865 6306 4606
389 4606 -1144 -4392 -262 8475 5587 65 -4645 753 6512 6968 1218 -5026 -111 5247 7233
404 7233 548 -1842 -3382 1471 8162 2546 -4726 -5637 2611 5637 2976 -5677 -5347 2238 1919 1747
420 1747 -182 -4983 -7929 5519 8298 -6469 -9366 43 4025 -348 -442 -4851 -3985 -1155 2666
435 2666 4739 -6144 -10991 1527 11333 -4697 -10131 1218 676 -4276 3300 4181 -11309 -5436
449 -5436 8360 6225 -5721 -7972 1605 6207 1402 -3584 2420 -1664 -3698 8304 9220 -8566
463 -8566 -8762 12331 8029 -4441 -849 2839 -1534 4028 8217 -1782 -3834 -812 6875 7318 -1710
478 -1710 -7463 2416 8768 -668 -127 651 -3687 -631 9791 651 -8209 -460 1772 3308 2981 -4497
494 -4497 -7874 4695 5145 -4016 -809 -2442 -5565 2497 7728 -6595 -8297 657 1842 2257 -1668
509 -1668 -7666 -3708 5965 -1443 -3181 328 -7039 -3521 8128 2869 -11801 -3339 5229 2083 -687
524 -687 -2087 -2825 -766 3556 1663 1951 -4752 -5544 8204 9118 -6891 -6799 8640 2595 -2586 5344
540 5344 2029 -8021 2043 12874 -75 -6480 -1024 5765 4784 484 -2388 781 1402 -113 7456
555 7456 1676 -9114 -638 11551 1165 -6632 1588 11 -661 4865 1994 -7179 -1988 4284 1572
570 1572 961 -4866 -4644 2033 4678 -2338 -3645 -3026 -2273 3575 1242 -4768 -6213 505 1569 699
586 699 -1794 -6496 -3033 3153 3155 -4715 -4424 -1563 1140 2854 -502 -3722 -3979 2719 3185 777 -3103
603 -3103 -4547 1688 6622 760 -5572 912 1263 1140 4750 1697 -5700 -1255 8017 3234 -2250 -3341
619 -3341 2017 4421 2498 690 -254 -1335 -591 8322 3359 -6797 -2260 7181 3379 -1582 784
634 784 -1851 -699 3665 4440 -2205 -5580 366 5167 2263 -4721 -2699 -669 1428 1712 -506 -4449
650 -4449 -4059 2338 2833 -837 -5886 -3318 1738 2438 -1283 -4295 -3155 -1162 3256 179 -3255 -4383
666 -4383 -1599 3575 2436 -3678 -5432 1403 1712 1039 -291 -3510 -2736 2371 4546 -1355 -3368 -1841
682 -1841 3357 3902 -48 -2407 -1723 1879 3679 3841 -2895 -3106 2897 4534 2432 -846 -1773 -236
698 -236 5288 3306 -615 -2267 -175 3831 3692 761 -3630 -477 2783 3990 940 -3386 -1874 1999
714 1999 3457 -198 -1678 -3849 231 4091 859 -3751 -3744 531 1336 1716 -2475 -4177 -1892 1962
730 1962 2944 -2572 -4580 -2570 2493 1029 -1494 -3308 -3503 636 2625 600 -5038 -2708 410 2720
746 2720 364 -3043 -2715 -644 3385 1562 -1546 -3860 54 3658 1995 -521 -3120 -283 2648
761 2648 3929 -135 -2357 -575 2563 4535 762 -1759 -2044 2716 4243 1969 -1448 -2119 2245 3801
777 3801 2671 -1345 -1986 -106 4129 3257 -1657 -2275 -436 3204 2405 85 -3346 -1751 2393 2685
793 2685 -271 -4002 -1869 792 2904 -370 -2955 -2869 -564 2623 809 -2995 -4484 -6 2087 856
809 856 -2624 -4152 -1166 819 1884 -2105 -3457 -2387 1567 2604 -1330 -3718 -2146 2284 1500 406
825 406 -2521 -2583 788 3043 2037 -2569 -2608 543 4620 1586 -1946 -1156 502 2496 2812 1164 -3150
842 -3150 -337 4048 3667 -34 -2049 -265 2544 4100 15 -862 -865 1061 3951 1923 -1913 -3101
858 -3101 2656 2943 1467 -1536 -2477 -303 2599 2298 -2331 -1982 -1132 1799 2279 -831 -4215 -2074 2441
875 2441 1034 -816 -3556 -2017 154 1943 -155 -3557 -2463 -751 2018 403 -2389 -4502 226
890 226 3275 -1395 -1779 -2203 -1483 431 3047 -1249 -4223 -537 1688 2464 -534 -3043 -1511 3180
906 3180 1354 -778 858 -2459 -823 5104 3029 -4568 -676 2928 2016 1905 -507 -1361 533 3646
922 3646 1657 1051 -1686 -2097 4095 4439 -1770 -2673 2502 1123 1520 1992 -1537 -2914 1319 4098 -153
939 -153 -2190 -2167 626 2652 495 -2470 -2260 564 387 1544 -887 -3805 -2207 3053 1590 -3578
955 -3578 -1892 -1407 120 1681 8 -4447 -2012 1782 -91 484 -1847 -3912 -118 4160 -1437 -3098
971 -3098 -261 -1668 1630 2385 -2105 -3349 1719 1221 723 1457 -3380 -1634 3919 3143 -2497 -405
987 -405 138 190 3680 1133 -2077 -1021 2617 2344 2298 -1189 -2528 2584 3552 1079 -1172 7 -64 2321
1005 2321 3197 -693 -2752 -310 3847 1256 -756 -1310 -604 1096 2247 409 -2817 -1028 222 2093
1021 2093 816 -2810 -3086 1849 1767 -1799 -520 -2547 -1893 2136 1779 -3489 -2821 165 36 1723 -1654
1038 -1654 -4133 -1180 2100 -124 -736 -1393 -3247 1517 2642 -1048 -3059 -649 -205 1507 2095 -3072
1054 -3072 -1620 1067 2140 1135 -253 -2007 -128 3378 1469 -306 -1580 229 2257 2815 23
1069 23 -2129 322 1925 3307 650 -1063 -969 1685 2676 1023 -1062 -1856 1752 2150 1171 -709 -1617
1086 -1617 277 2350 1701 -1762 -1477 -734 1872 1871 -1154 -2489 -711 1419 751 410 -3014 -2119 1018
1103 1018 1287 -870 -2474 -1797 -798 2261 -202 -2340 -2336 -642 1109 1076 -2004 -3660 150 836 976
1120 976 -907 -2741 -1202 1428 1986 -1191 -1292 -1637 1178 2355 406 -1924 -959 1457 1893 1677 -1726
1137 -1726 -1405 1286 2511 1253 -371 -701 17 3281 1579 -376 -1118 113 2525 2411 471 -1869
1153 -1869 251 1690 2390 462 -1526 -766 1368 2313 215 -1057 -1968 784 2205 188 -1496 -1847
1169 -1847 230 1289 1399 -2063 -2078 -700 938 1096 -1390 -2602 -1788 1206 438 -613 -2307 -2197 899
1186 899 1243 -342 -2741 -1607 -843 1859 181 -2591 -1901 -9 1513 215 -864 -2709 2 1833
1202 1833 741 -526 -2001 -610 1572 2376 -791 -1333 -267 1117 2632 717 -1124 -1099 2049 1899
1218 1899 1179 -736 -1078 1445 2525 1574 -860 -325 124 2640 2004 -651 -905 161 1969 1546 506
1235 506 -1959 -64 1479 1494 387 -1799 -784 618 1984 -467 -1252 -1598 -289 1589 81 -1885
1251 -1885 -1981 205 811 931 -1618 -2564 -545 664 608 -1334 -2056 -1576 1010 1148 -1036 -1823 -1511 739
1269 739 1103 157 -2164 -1238 492 1306 735 -1581 -1305 33 1854 769 -523 -1612 73 2483 1370
1286 1370 -81 -1365 356 1600 2096 -44 -1295 462 1451 2681 448 -871 -601 1748 2010 654
1302 654 -126 -1290 999 2351 1235 -1190 -852 591 1687 1841 -1143 -1311 -244 1536 756 -219 -1936
1319 -1936 -1139 1288 1091 -467 -1915 -896 242 1165 -172 -2285 -1769 -96 1146 -208 -1352 -2064
1335 -2064 -494 896 239 -1658 -2152 -122 338 816 -1019 -2128 -708 938 1156 -691 -1164 -1067 1026
1352 1026 1665 -42 -1587 -875 1127 1218 1054 -1339 -1123 812 2116 841 -796 -517 -108 2302 1511
1369 1511 -178 -1209 568 1781 1361 769 -1369 -315 1640 2221 -193 -1055 -354 745 2352 635
1385 635 -1190 -1215 1316 985 796 -637 -2026 207 1927 586 -1523 -672 -898 455 1521 -1088 -2456
1402 -2456 -817 1151 15 -281 -1724 -1939 966 1015 -690 -1780 -920 -1081 1506 492 -2237 -1624 204
1419 204 991 -13 -392 -2206 -106 1602 855 -872 -1363 28 704 1846 -392 -1498 -418 1683
1435 1683 1498 -147 -288 -1021 1039 2209 923 -946 -263 1157 1030 1774 -667 -1253 960 2027 374
1452 374 183 -493 -842 2315 1605 -521 -1258 364 736 1454 840 -2166 -481 1453 1156 103 -509 -1738
1470 -1738 -78 2125 -554 -1404 -1092 -270 397 1355 -1491 -2414 -166 340 718 -971 -1752 -1587 1091
1487 1091 465 -1258 -1462 -1443 492 734 -127 -1968 -1008 329 946 320 -1823 -1090 132 1482 590 -802
1505 -802 -1469 201 1648 640 108 -1363 100 1809 1470 -263 -690 39 1016 2558 -37 -1018 -187
1522 -187 1166 1550 926 -714 -1315 1359 1570 669 -367 -726 272 1904 1244 -1151 -392 -293 1111 1320
1540 1320 -116 -1787 -244 1183 340 250 -1663 -1410 731 848 -463 -1356 -1112 -324 1315 -298 -1523
1557 -1523 -1353 -203 577 188 -1322 -2054 200 309 364 -844 -1511 -1004 517 789 -1299 -1113 -1044 716
1575 716 1041 -35 -1320 -680 749 1006 866 -1317 -825 808 1577 955 -295 -911 202 2139 688
1592 688 132 -741 44 1630 1319 98 -1159 516 807 1640 572 -1138 -249 1225 1640 -85 -414
1609 -414 -1155 474 1494 358 -907 -846 193 912 966 -1028 -969 33 677 752 -630 -1481 -828 1137
1627 1137 415 -384 -1466 -992 601 841 -525 -1708 -849 -412 1020 -110 -1483 -1614 -114 612 237
1644 237 -833 -1885 -211 1115 330 -561 -1491 -264 1003 1072 -553 -1078 -394 792 1426 134 -418
1661 -418 -654 1091 1259 853 -295 -746 1085 1571 933 -585 -288 295 1739 1004 -359 -434 -103 1335
1679 1335 998 205 -1116 54 1278 865 197 -991 -456 527 1518 -182 -753 -774 333 1035 70 -894
1697 -894 -1381 394 433 448 -1190 -1548 -341 529 703 -1260 -1234 -1123 499 698 -930 -1425 -1303 528 395
1716 395 -327 -1388 -1001 -34 921 124 -1473 -716 -201 878 222 -463 -1094 124 1062 733 -29 -959 14
1735 14 1074 1260 -264 -811 -56 590 1487 210 -518 -471 1163 1301 677 -529 -531 805 1275 1032 -443
1754 -443 -528 518 1166 1102 -709 -843 -111 1591 506 -359 -1110 -346 773 521 -60 -1082 -598 307 915
1773 915 -207 -1334 -697 -320 899 -219 -936 -1346 -147 733 -30 -745 -1672 -94 614 357 -1008 -1019
1791 -1019 -883 422 739 -727 -998 -763 542 452 -15 -1105 -817 531 692 111 -828 -404 286 1348
1809 1348 696 -596 -434 90 1559 679 193 -838 357 1153 689 95 -665 196 856 1525 87 -670
1827 -670 -108 1048 1354 364 -228 -933 846 1334 385 -485 -567 111 711 727 -852 -896 16 807 561 -144
1847 -144 -829 -947 959 581 -739 -1134 -758 -176 277 -189 -1672 -1066 144 400 -548 -877 -1394 -305
1865 -305 1129 -232 -1139 -1037 -322 406 572 -635 -1488 -33 681 512 -285 -400 -742 847 894 -309
1883 -309 -385 -139 533 730 956 -1088 -518 965 894 847 -196 -192 212 1633 934 -268 57 68 942 922 237
1904 237 -833 387 853 668 304 -561 -251 717 1234 -110 -673 -470 -149 819 38 -564 -1108 207 514
1923 514 183 -831 -924 -402 392 381 -1155 -567 -1067 248 324 -604 -1287 -744 524 121 -250 -1073 -846 -224
1943 -224 798 -84 -1271 -488 -357 894 136 -428 -956 75 841 269 -211 -901 -237 792 1263 -335
1961 -335 -346 216 537 1219 63 -388 -431 752 984 191 9 -654 747 988 911 -327 93 170 1170 844
1981 844 -269 -273 55 1055 530 18 -569 -161 991 636 -140 -1035 -196 259 782 -63 -770 -458 -505 757
2001 757 -533 -583 -813 9 424 252 -671 -1346 -19 29 403 -816 -1007 -804 402 507 -789 -978 -1027
2020 -1027 276 520 -181 -866 -637 386 333 11 -741 -463 407 824 422 -533 -471 45 1048 434 -90
2039 -90 -715 171 936 614 195 -490 269 752 1227 -40 -294 -94 796 1049 192 -179 -559 841 568 349
2059 349 -506 -544 189 625 588 -667 -269 -37 591 441 -462 -866 -472 665 307 -298 -916 -862 257 436
2079 436 -345 -1062 -519 -539 497 -338 -894 -1022 102 371 -123 -231 -1437 -39 356 332 -475 -907 -236
2098 -236 65 663 -534 -453 -300 264 415 54 -501 -809 764 648 525 -421 -268 443 784 722 -248 -174
2118 -174 102 1051 612 -88 -416 296 1011 735 74 -710 33 486 900 -27 -548 206 639 1064 21 -379
2138 -379 -294 415 938 19 -404 -865 -162 415 513 -602 -843 -161 363 611 -466 -878 -579 487 116 -606
2158 -606 -1020 -909 350 34 -360 -1092 -627 -55 487 -11 -1009 -794 -71 671 129 -386 -824 20 498 515
2178 515 -274 -630 109 434 744 -97 -556 -87 325 710 -158 -137 -246 660 827 294 -204 -409 680 550
2198 550 622 -240 -124 129 902 782 -177 -249 96 835 598 -54 -270 -15 581 622 199 -641 -227 33 687
2219 687 -190 -580 -232 59 547 -304 -537 -972 142 99 -27 -543 -840 -355 25 199 -730 -680 -444 54
2239 54 147 -613 -733 -548 238 334 -209 -819 -643 157 378 130 -711 -450 119 606 277 -368 -617 -20 982
2260 982 287 -94 -347 147 596 758 -42 -540 317 546 1018 352 -294 -393 660 1112 -16 -69 -253 363
2280 363 891 477 -366 -493 690 367 592 -272 -487 -371 847 350 -323 -636 -577 315 360 -194 -965 -211
2300 -211 376 265 132 -1033 -708 -5 510 -351 -729 -706 -311 131 -110 -651 -998 -7 158 46 -472 -709
2320 -709 -494 183 318 -401 -543 -217 170 426 -43 -682 -390 576 584 323 -150 -446 205 566 382 -276 -10
2341 -10 -376 1004 749 -158 -185 288 1067 471 210 -426 198 633 681 78 -480 -51 279 930 -94 -376
2361 -376 -336 208 685 191 -205 -307 103 286 411 -447 -617 -35 254 207 -653 -547 -495 511 75 -549 -534
2382 -534 -595 80 18 -184 -921 -415 -151 86 -79 -827 -561 -91 415 -209 -474 -726 -49 383 -6 -99 -714
2403 -714 47 53 403 -99 -308 146 371 759 9 -321 -132 589 693 411 -176 -67 411 512 680 -91 -117
2424 -117 153 984 569 -234 -65 116 558 495 -23 -670 270 747 433 56 -669 -40 300 657 -272 -348 -548
2445 -548 -11 408 34 -531 -845 445 120 43 -181 -1048 73 352 257 -484 -508 -253 93 337 -391 -669
2465 -669 -734 314 59 -170 -791 -389 -111 202 192 -814 -241 -3 440 248 -124 -384 -49 761 202 116
2485 116 -430 74 387 562 -167 -405 201 264 724 -32 -227 -17 755 708 379 134 -232 563 483 397 -244
2506 -244 -87 5 558 738 -229 -116 175 668 360 -86 -275 -224 588 186 -79 -727 -493 -19 554 -76 -930
2527 -930 -340 -98 331 -74 -761 -736 -5 275 1 -364 -864 -287 400 -17 -381 -630 -233 199 153 -445 -253
2548 -253 -373 92 385 -35 -475 -412 537 321 -39 -440 -60 178 782 313 -149 -78 28 788 447 154 -281
2569 -281 88 577 570 97 -293 248 233 490 86 -406 -40 147 670 -284 -244 -52 491 659 270 -334 -377 203
2591 203 421 389 -185 -390 -220 430 213 -300 -308 -380 513 -106 -485 -166 -347 86 245 -52 -888 -187 122
2612 122 -32 -26 -544 -744 -53 176 -185 -320 -533 -114 142 -145 -238 -500 -29 335 367 -176 -506 -33 130
2633 130 420 75 -200 -134 635 584 265 -90 7 627 769 417 -113 382 193 539 530 -54 -163 84 522 12
2655 12 173 -160 -184 695 282 230 -402 296 188 644 -32 -172 -162 271 327 35 -135 -504 24 268 3 -389
2677 -389 -747 2 211 165 -453 -394 -171 138 115 -496 -548 -622 44 66 9 -843 -188 77 322 134 -342 -266 -148
2700 -148 475 -164 -146 -395 -51 411 112 -137 -276 240 453 442 54 -120 81 524 499 141 -47 70 140
2721 140 624 -58 -64 -197 477 378 436 -291 -139 305 346 444 -12 -147 -122 636 364 -123 -132 -211 313 -96 -97 -551
2745 -551 56 281 326 -64 -476 -364 72 303 -158 -594 -138 -119 146 -144 -325 -673 -428 259 99 -565 -358
2766 -358 -177 -140 203 -419 -481 -13 218 -164 -69 -412 -457 81 240 -355 -373 -131 392 658 280 -270 -131 160
2788 160 416 69 142 -71 135 561 472 -59 -278 179 407 556 89 40 17 231 607 -6 -220 -16 451
2809 451 488 295 -117 -324 410 459 274 -363 -95 -80 163 112 -416 -356 -394 60 -22 -336 -606 -280 164 8
2831 8 76 -580 -129 -100 -59 -144 -496 -261 -136 410 29 -587 -640 125 133 124 -169 -482 -404 69 159 -332 -424 -3 167
2856 167 365 -267 -473 -209 233 414 191 17 -217 500 340 389 166 -42 330 444 514 167 -226 226 551
2877 551 183 378 -265 0 499 339 -69 -232 -54 210 524 244 -443 -177 253 247 -155 -274 -331 322 311
2898 311 39 -180 -305 -226 318 145 -381 -297 -217 60 -164 -170 -185 -589 68 100 -18 -519 -368 113 87 170 -619
2921 -619 -403 -48 200 -142 -331 -257 -48 389 212 -21 -351 157 209 409 -82 -179 5 326 666 -12 -103
2942 -103 28 348 424 204 110 -86 290 242 248 -158 -414 248 386 563 -258 115 139 475 537 -34 -234 -263 432
2965 432 71 95 -56 -173 -90 377 6 -525 -26 150 514 -3 -476 -454 -87 111 -184 -355 -403 -183 57
2986 57 43 -254 -570 -228 199 252 -185 -417 -201 143 121 -177 -172 -291 -53 -25 75 -275 -347 -175 33 -43 -47 -76
3010 -76 103 416 169 -16 -223 178 156 263 148 -256 168 340 690 -39 -57 -166 190 421 -144 139 30
3031 30 319 445 186 -189 -126 389 71 162 -62 -7 10 499 315 -250 -345 -378 127 -128 -209 -489 -347 56 -16
3054 -16 -292 -586 -186 -5 290 -2 -678 -142 -47 231 95 -253 -321 -289 165 -92 -118 -604 -110 38 113 -334
3076 -334 40 -172 71 294 -326 -32 -149 385 292 -10 -307 93 256 580 174 -71 78 162 397 -15 -9
3097 -9 -122 33 499 166 77 -377 159 218 141 11 -183 45 474 444 14 -258 -177 -28 323 149 -82 -250
3119 -250 165 349 283 -348 -265 19 113 66 -256 -254 -316 11 333 -180 -391 -333 21 82 -142 -373 -289 -18 -53 13
3143 13 -271 -3 -116 200 -206 -314 -386 -126 184 112 -62 -441 119 310 299 -135 -137 -48 119 307 -59 -100 172
3166 172 330 359 182 19 -485 351 30 158 49 106 189 335 299 -183 23 79 458 285 85 -101 -55 248
3188 248 210 -151 -320 -2 118 352 -87 -120 -102 74 383 -301 -461 -240 256 258 -267 -299 -387 -16 78 -313 -235
3211 -235 -348 -334 -55 302 -525 -344 -298 29 -10 -159 -443 -376 -70 156 329 -321 -134 -148 324 332 -192 -191 202
3234 202 310 -6 12 -174 -40 394 161 23 -29 40 340 233 208 119 -32 63 508 231 18 -56 530 203
3256 203 214 124 -81 270 236 84 -205 -53 118 355 242 -80 -217 -86 314 313 29 -314 -178 277 17 -61
3278 -61 -481 5 -191 12 108 -327 -344 -182 -92 -73 -445 -422 162 136 -82 -225 -295 -52 -26 -21 -116 -149 -228 131 135
3303 135 -112 -186 -279 76 -119 233 -88 -41 244 203 113 -297 197 26 260 162 -128 -36 -42 366 16 99 -283
3326 -283 76 294 174 174 -252 6 93 178 58 -57 17 398 306 -158 -165 -254 229 217 -166 -157 -405 35 -97 144
3350 144 -155 -79 -215 -134 80 -198 22 -142 236 -38 -92 -433 -127 -115 -65 -73 -488 -224 -126 225 -27 -172 -599
3373 -599 -57 82 -39 -194 -225 -38 280 -110 -275 -112 -205 -143 331 -342 -93 -251 116 262 29 303 -51
3394 -51 135 227 387 -211 -77 315 312 121 -73 -47 -41 186 113 69 -48 250 235 222 -155 -349 59 131 501 109
3418 109 -167 -104 17 149 -202 -414 -75 -69 279 163 -274 -272 14 -68 -89 -96 -91 -266 -56 16 -351 -83 -774 -19
3442 -19 90 -59 -321 -102 -74 8 29 -143 -62 -38 141 -145 -115 -21 -20 347 -181 -63 -136 266 266 305 200 -440 317
3467 317 148 125 37 -8 166 93 95 224 134 215 289 501 63 19 -78 311 282 73 -88 -88 235 311 216 -356 -109
3492 -109 -59 355 -9 182 -150 19 194 79 -143 -652 -36 -34 110 -303 -489 -287 -37 -204 -155 -199 -123 -57
3514 -57 -53 -234 -240 -340 -4 -165 -12 -288 -129 220 -59 209 -185 -177 -248 147 57 61 -319 -81 -5 294 196 -267
3538 -267 118 -2 478 128 -130 94 143 566 164 232 218 260 20 303 48 -183 -104 -20 251 -120 -116 112 -6
3561 -6 73 72 -147 -100 50 127 88 101 -178 -192 112 -149 -292 -278 -204 -170 -242 -232 -298 -232 93 62 -260 -305 -52 22 -15
3588 -15 138 -524 -90 -251 120 -83 -208 -243 150 141 -156 -417 -224 82 -122 439 -109 -117 220 85 291 -87
3610 -87 -6 -49 302 239 31 37 22 108 197 390 -101 -185 22 276 328 118 -327 -95 577 130 -70 -27 205 227
3634 227 355 -76 -341 52 114 8 196 -282 -80 123 247 -22 -68 -194 -31 81 -91 -17 -283 -69 53
3655 53 1 -308 -152 -253 -68 234 -178 -296 -230 -14 -204 -212 68 136 78 -17 121 -250 -206 -306 218 -206 -101
3678 -101 136 -101 215 50 -111 -114 130 59 -31 -114 -368 271 75 287 -164 40 75 90 127 -11 -310 81 147
3701 147 152 -2 -11 64 125 309 118 -137 46 -28 222 163 -34 -28 7 317 -163 -156 -263 60 73 218 262 -228 -42
3726 -42 -45 -13 -106 -122 -36 -10 87 -22 -285 -390 -22 -13 -104 -132 76 117 199 -140 -360 -112 -32 -42 117 -92 -159 -60
3752 -60 235 216 -141 -177 -76 89 -19 -54 -158 -153 -101 445 144 171 461 49 391 15 181 98 110 128 385 233
3776 233 180 256 -125 232 180 -193 103 296 176 64 22 -311 121 371 -56 -6 103 141 -172 -54 -150 -46
3798 -46 -124 369 -194 -207 -344 -203 -95 -20 -71 -256 -363 -316 152 0 -275 -3 147 141 -160 -378 -345 -10 266
3821 266 -58 -71 -38 47 47 201 130 -366 109 255 150 104 78 -255 -60 160 221 -88 -145 78 64 128 -304 -36
3845 -36 -107 99 141 9 14 112 423 64 -36 -19 72 -14 207 250 -39 87 289 287 -57 -36 -185 -120 311 78 -121
3870 -121 246 62 49 -95 -55 -206 -258 25 -181 -144 -146 -189 -119 61 -350 -94 -292 125 -16 -138 -75 14 -104
3893 -104 103 101 -530 13 78 -203 370 -282 -85 6 106 169 -170 83 148 106 61 83 -162 268 -10 91 -192
3916 -192 272 -97 157 286 191 134 -96 147 127 19 -71 6 189 406 280 2 15 -1 141 541 187 64
3938 64 19 281 -42 -173 -31 48 -20 281 82 -81 168 25 44 -280 -110 -49 -275 204 -255 -210 -163 258 -110
3961 -110 -30 -306 -297 -180 5 -8 183 160 -294 190 3 51 -149 -58 46 165 223 -104 -103 -84 87 14 -182 -62
3985 -62 -182 181 -16 36 -326 50 438 93 -13 -133 111 226 112 53 176 81 257 -39 71 120 107 215
4007 215 10 360 31 -7 442 207 -203 -50 -182 55 114 -120 -300 -338 107 200 -128 -188 -16 46 140 35
4029 35 -114 -219 -115 -200 207 116 -276 -139 -70 55 87 -36 -337 -161 -253 -156 57 -329 -154 6 194 30
4051 30 -194 -118 229 219 -81 36 -60 127 -62 33 -122 -181 298 112 126 -50 78 231 216 -33 24 107 171 128
4075 128 99 331 -71 153 284 128 92 -145 -61 109 -74 254 -135 -149 202 178 104 -22 -55 -48 48 103 -34 -240
4099 -240 33 73 52 -6 -215 -72 -81 55 -125 -337 -118 -227 -268 -107 -212 -260 29 6 -279 -118 -116 193 274 105
4123 105 -69 87 307 -165 28 28 -252 242 138 111 109 -155 192 22 202 144 11 -94 44 -83 172 32
4145 32 -47 367 143 138 -196 44 172 174 152 76 9 -32 77 -134 60 138 30 302 -39 122 -48 28 -105 -31
4169 -31 -3 -48 176 47 131 -226 -187 -245 -5 169 -101 -90 -218 77 -286 149 -519 -165 89 -97 -106 -202 -341
4192 -341 -223 155 -104 -14 -106 -73 -39 -239 -10 -72 17 83 191 55 71 -248 -61 116 91 61 -233 82 97 -53
4216 -53 76 -160 205 62 321 76 -4 51 94 194 -112 99 49 -78 133 35 293 -43 126 199 -54 153
4238 153 14 67 167 99 -110 24 -4 236 -55 51 -274 -177 -78 -121 -181 -84 -50 199 0 -262 -238 -169 -261 30
4262 30 -152 -40 -299 -116 -74 -66 -120 -197 -126 -48 -128 -192 83 182 188 68 -64 -223 -235 -112 124 -68 -194 -226 -98
4287 -98 165 44 -68 -79 -67 107 -13 -111 86 387 75 243 360 -58 239 242 -98 -155 -117 -28 27 443 -151
4310 -151 -61 -54 197 207 -86 -43 -197 129 194 138 -40 -169 110 139 130 97 -197 -35 -53 58 -5 -120 -155 -82 131
4335 131 -215 -116 87 118 104 -178 34 149 108 152 -225 106 128 16 135 -52 191 -261 200 -223 133 -36
4357 -36 96 69 178 225 -106 99 -104 116 181 -67 37 27 314 -70 419 211 121 178 197 -47 -16 -252 212
4380 212 285 -37 -228 -116 184 149 125 231 -271 44 -46 104 -211 -39 -27 207 148 -57 -67 -93 48 -61 108
4403 108 68 -9 47 -107 30 -187 324 -166 -197 -110 -337 387 -221 12 224 14 87 -374 59 -157 -220 -153 58
4426 58 55 -133 -36 26 24 -38 93 -99 -105 -63 12 194 115 -125 -193 336 57 -154 45 61 196 181 420 -135 271
4451 271 40 -44 25 69 -34 20 252 13 193 48 24 81 -187 138 -25 -31 -87 7 87 40 -160 125 337 -53
4475 -53 -75 -295 -205 -157 -190 -75 -166 -196 -97 267 110 -103 -302 -28 -189 -71 -151 -71 39 10 172 -97 -252 163
4499 163 -191 -145 12 -108 34 -31 106 59 119 -187 8 44 -99 6 -216 -87 125 -48 5 -99 17 189
4521 189 62 -24 -133 151 -40 276 155 -174 207 102 159 -34 -97 -88 184 -19 259 264 -26 -28 89 274 -142
4544 -142 -185 -81 77 184 -200 -41 -51 262 -114 -257 -102 -165 76 -115 -62 -230 -180 214 -115 -103 -184 -172 261
4567 261 186 -289 -83 -247 -227 -219 -69 -139 -115 208 -127 19 173 -62 -27 -91 -184 -79 -149 28 12 66 -26 -6 -22
4592 -22 -220 -33 72 262 -63 136 230 29 61 -153 17 260 -11 115 109 67 167 -72 -271 92 245 37
4614 37 -12 -11 4 -191 -181 45 -72 -283 -154 17 83 -87 186 -157 8 -41 -84 -78 -2 -2 58 33 -257 -32 -114 -74
4640 -74 -8 83 -96 -182 -79 38 -131 -114 41 141 202 -38 -208 -272 19 -60 -135 64 -28 154 120 129 -143 16
4664 16 -65 108 125 120 -67 82 -267 463 0 -68 -39 -164 44 -12 -218 10 221 158 290 -20 -37 111 184 -100
4688 -100 10 -138 45 180 112 -66 -288 216 -62 -103 -87 54 -35 165 -71 37 86 -95 30 18 -64 -156 -291
4711 -291 131 97 -34 -138 -379 92 19 -28 71 -109 -107 241 -45 -38 -136 -163 62 74 114 -85 5 208 -6 -61 -134
4736 -134 33 -19 234 93 -295 -50 148 219 -91 -75 141 -202 70 -111 -13 -131 -68 182 124 -24 114 130
4758 130 71 -122 121 91 -38 174 -10 12 -39 -338 110 91 -24 -72 -43 -126 141 25 -74 167 213 -133 -49 -154
4782 -154 -97 -42 43 89 61 -61 -132 1 54 -87 -130 93 94 57 -3 -18 89 58 -161 11 53 -186 -60 22 -200
4807 -200 68 -57 79 -3 90 -287 8 -147 169 86 77 -176 95 256 -25 1 86 -18 -86 113 192 -195 142
4830 142 94 81 -32 -40 -185 155 117 130 -40 -124 188 -33 -17 -267 65 91 34 56 113 -132 -208 138 8 -4 -319
4855 -319 -143 184 -12 -121 -20 -44 -6 121 -102 146 68 107 258 75 -141 -47 49 88 -8 -96 -152 8 319
4878 319 -1 177 -11 104 32 219 98 15 151 -104 78 200 -134 118 -195 190 -72 -136 -21 -53 212
4899 212 242 284 5 -30 99 -71 11 26 24 7 141 25 -122 -137 105 90 -186 -104 -111 147 33 -149 153 28
4923 28 -141 95 143 -59 191 -78 -191 108 -28 93 -238 -175 72 18 7 -81 -285 -164 11 -197 52 144
4945 144 50 -36 156 116 -122 -12 -99 -37 -258 -157 -422 -61 36 -221 107 191 292 8 -8 -188 224 6 135
4968 135 241 -168 139 239 -46 -197 -11 -42 217 2 257 156 -5 116 -18 -95 154 149 -24 20 -174 -81
4990 -81 153 -3 28 126 123 -107 -283 -45 -143 -46 3 -67 -13 -82 -19 -347 -236 -49 132 122 -109 73 65 -287 -149
5015 -149 -74 -112 35 53 259 -241 99 31 -43 -178 -81 -127 -120 -1 -153 -171 81 43 93 248 -56 -129 107 77 13
5040 13 44 54 37 232 -207 -71 29 -124 253 345 33 53 -90 269 -20 -45 261 194 -59 -1 82 41 -172 -61
5064 -61 -124 -116 -14 -167 -62 154 42 -34 129 -244 -116 -117 -57 3 -257 11 -106 -49 -382 54 -202 -118 -59 124
5088 124 -268 -196 38 -257 -317 -168 -168 17 153 134 -12 -52 24 4 4 78 -157 -154 214 70 -32 -329 -153 -363
5112 -363 -111 252 -24 70 170 -32 -145 -38 106 15 161 -14 -249 81 -77 -71 -18 -284 23 195 8 180
5134 180 -79 -170 98 194 91 183 138 -155 -14 -19 50 113 115 177 38 -151 28 -72 -84 59 -157 -337 -434 -174
5158 -174 96 -139 -37 -8 -113 37 -58 -68 43 -202 100 -105 -419 -153 -20 183 -133 -59 97 -105 -57 -36
5180 -36 211 115 123 156 245 -289 202 45 66 226 163 231 -78 47 154 110 -45 9 10 -100 18 12 47 -243 74
5205 74 -24 -203 -125 71 36 -190 -45 -23 251 155 91 23 -67 -1 -14 9 -86 3 4 -43 -4 -182 45 -61 -106 -275
5231 -275 305 -163 -45 22 -250 27 -144 -70 -105 84 -9 -63 -22 -207 60 171 0 -52 29 261 21 -34 125
5254 125 -20 -91 -34 94 -168 12 -139 65 2 -95 96 63 90 180 82 -116 -13 12 -167 59 -262 140 29
5277 29 -278 265 -148 340 52 -12 73 13 26 148 101 2 -27 -40 -147 -47 16 -41 75 -170 70 -18 21 73 -164
5302 -164 -224 -14 118 -46 -157 179 -160 76 -194 -251 126 109 -125 -231 -85 -172 19 99 -147 39 -108 -279
5324 -279 44 209 -84 -95 12 21 -131 -12 -110 28 -231 -89 64 189 -77 -100 19 -163 -200 -15 -229 118
5346 118 -172 164 110 -213 75 67 69 -44 113 -71 -2 -105 -202 165 -245 149 167 -8 25 109 -350 190 6
5369 6 -109 70 228 -23 139 -85 117 -123 4 -21 -294 -241 -96 -191 -255 -144 10 158 130 -188 -46 -198
5391 -198 5 -48 -105 -377 -87 58 -252 -77 -137 48 -79 30 -106 -178 25 224 -60 -102 -240 104 160 71
5413 71 -131 24 59 -47 -86 265 78 -86 45 113 -50 -9 -22 -71 -53 63 -20 -132 208 -218 -167 165 0
5436 0 -39 -191 292 238 -197 179 -86 20 127 -126 19 53 -101 -160 180 10 -239 -125 -97 -29 -242 -3 12
5459 12 344 -192 -8 -140 119 -139 -151 -123 -245 -183 12 -113 20 -66 -118 -173 -45 26 116 21 -143 95 166 20
5483 20 -119 -20 -1 27 155 -161 160 114 -216 90 217 15 -254 23 102 -143 -140 106 204 -74 -24 -23 -42 -129 288
5508 288 121 126 28 -74 151 -170 257 76 -217 -54 255 -264 35 -185 122 -93 18 -14 169 24 -209
5529 -209 -68 -119 -15 -46 -86 -132 -57 -197 75 -1 -165 19 -8 -177 -281 -152 102 35 -61 -173 43 -105 53
5552 53 -137 154 -26 -75 -217 88 167 228 -48 -320 -39 -66 68 51 -76 268 10 -235 -181 181 269 244 -12
5575 -12 48 61 30 293 39 56 111 128 266 74 -59 118 270 88 -38 -32 29 128 -109 206 -26 18 -77 -156 48
5600 48 -240 -249 -330 -35 -241 -27 -229 -39 178 152 6 -10 -81 -97 16 -250 -94 -106 -13 62 41 -259 -141 -79
5624 -79 69 323 -77 196 -229 -265 125 -84 -109 61 -47 -219 39 -18 13 73 176 71 -157 -89 20 -172
5646 -172 -25 -60 99 -19 -19 43 -139 238 158 -56 17 -148 168 -15 151 84 154 -74 -43 105 -112 248 -121
5669 -121 -26 -366 -19 330 54 71 206 -226 86 -111 -128 44 117 -109 -224 16 -76 -179 -19 37 -163 -220
5691 -220 192 -213 -56 -148 198 253 -23 -137 -157 38 -108 -236 2 53 -45 284 124 -36 21 231 128 -78
5713 -78 -193 157 89 264 -20 154 -59 -223 -173 -262 -61 99 96 -229 80 122 17 -44 99 73 -67 -53 -76 -28
5737 -28 -222 9 -6 119 -4 135 3 15 386 7 -220 118 93 77 -72 100 21 74 -27 -94 -136 0 135
5760 135 75 -4 -141 -207 -170 170 -142 56 -151 380 -55 -109 36 83 77 72 -14 -137 217 31 -161 -77 -116 -158 -50
5785 -50 293 125 -69 -140 74 66 -306 -167 53 -17 141 163 92 165 -209 -52 255 -147 11 -30 232 -47 326
5808 326 55 64 162 -95 200 -81 -61 81 -35 -85 67 -32 -14 -93 -218 -234 13 0 -1 -46 -140 2 15 -54 -129 79
5834 79 -124 -186 100 -102 -119 -214 40 -84 -152 37 -32 113 -29 31 -22 137 -53 174 168 85 158 188 184 137 54 -192
5860 -192 -62 102 180 -27 82 -5 94 83 76 -44 125 -43 121 167 42 -33 -214 52 189 -4 -33 -160 96
5883 96 73 50 -25 -138 61 4 -218 224 -54 20 182 -127 0 82 131 199 -76 138 -251 -163 -16 -203 67
5906 67 -107 -17 108 -42 163 35 -167 -369 153 119 -361 -110 -20 -207 -20 0 48 -56 -200 3 -223 -91
5928 -91 18 35 68 202 -127 63 -199 206 -5 -197 43 209 -21 87 -138 91 13 32 21 -366 60 -366
5950 -366 22 -119 134 -56 148 -133 229 -80 -12 40 8 -227 99 -253 48 122 124 -27 433 222 117 76
5972 76 -61 107 190 318 -67 70 25 1 139 -83 -134 -246 51 -3 60 167 -58 -114 -225 85 98 138 -92
5995 -92 13 70 135 140 -58 -36 58 296 -36 -121 -6 -71 22 -76 -200 -49 276 -112 72 -110 11 222 -97 -132
6019 -132 -39 230 -49 -177 -176 28 262 187 91 -69 -43 51 20 252 14 46 86 28 -29 -47 -121 184 219 -202 95
6044 95 38 113 14 47 112 -22 240 -54 42 102 47 -190 -55 47 109 117 -160 109 -209 -164 143 122 -6 102 -76
6069 -76 63 -72 -105 151 -93 183 112 -181 -97 -185 136 -223 109 -59 19 49 2 -5 64 -77 164 137 -53 41
6093 41 -36 -100 4 24 30 -1 213 42 324 94 108 72 5 -267 207 119 -121 93 101 17 29 -9 -36 -177 45 -227
6119 -227 34 98 52 -159 -8 -33 151 -144 220 109 -241 -8 127 -142 109 -72 127 29 80 -17 112 -172
6141 -172 34 98 -77 118 35 -208 -58 -99 -138 -370 -174 44 364 -103 -80 34 209 49 53 92 63 -68 -39
6164 -39 -117 -237 -21 -31 73 -39 213 -180 -37 -36 -26 175 -53 -72 288 -26 49 -98 -11 39 -15 125 122 -94
6188 -94 -67 -19 245 -107 -195 -76 -1 9 -219 -219 210 -73 -101 -24 157 226 -41 -238 156 -131 -155 166 -77 136
6212 136 -91 34 3 -79 128 66 -176 -10 14 -91 15 185 -97 -195 -125 -43 -69 -46 37 214 -263 -157 -251 30
6236 30 274 20 -78 -106 -97 -26 20 90 53 -194 -32 -69 -44 59 -49 -80 -49 -45 -11 -221 -27 -184 151 71 29 -34
6262 -34 -227 -164 42 188 181 -69 42 189 -27 83 127 -55 -22 26 -39 205 67 105 -62 11 -192 -84 -24 -8
6286 -8 -208 -29 -141 19 93 -174 -85 -23 -347 -106 -125 -102 23 -95 -16 -264 -123 208 -94 -80 -192 42 63
6309 63 -10 66 -98 -85 -64 168 82 224 -189 10 -100 263 56 -94 -150 50 -185 -10 7 -47 38 132 56 10
6333 10 229 -116 -3 89 -299 5 -74 132 -133 -159 -99 58 -58 107 -79 3 153 125 -86 50 82 11 -68
6356 -68 210 -193 93 64 -7 34 -319 -235 -89 205 -81 -5 104 86 -87 -121 92 35 -122 -154 -103 10 117 -195
6380 -195 253 137 105 221 -171 50 -51 229 -171 -115 139 31 -172 12 103 122 18 129 170 -99 87 117
6402 117 198 38 35 10 175 -3 -113 206 70 116 -145 -193 -112 85 39 -205 -80 19 98 193 -81 -25 261 59
6426 59 306 -42 -90 61 -129 98 116 -118 -302 -175 -213 188 -112 -174 -131 -121 -89 131 -156 141 142 -38 -71 -4
6450 -4 147 -166 323 38 29 142 -58 -6 -43 -101 122 7 57 147 -132 -130 140 51 294 110 -39 26 48 47 -21 15
6476 15 128 89 -96 -150 -35 184 -49 -111 -115 -192 -37 -62 -13 25 101 -32 58 94 -165 63 331 150 -174 14
6500 14 18 -59 29 -174 -55 185 -100 213 49 -104 -219 -193 23 -38 285 142 -82 -152 71 -128 -10 115 -234
6523 -234 -130 -33 6 384 -50 -200 -30 173 -7 -77 -65 -177 -165 -185 -166 -207 88 161 -150 140 134 -275 -23 -147
6547 -147 -133 53 -1 112 -52 -149 174 116 -317 1 -242 -1 242 -41 -133 92 21 -34 202 -128 -36 100 156
6570 156 -17 169 50 -284 -50 -165 279 14 -91 70 -103 267 -160 -2 9 57 -102 -20 46 -185 174
6591 174 214 29 0 -87 -6 -283 -167 66 292 27 -119 145 126 113 -282 -24 -34 -60 125 -175 84 -14 85
6614 85 132 -38 22 76 171 45 192 117 117 56 -148 -43 7 33 171 -71 -138 178 -50 48 -127 -64 6 19 105 -137
6640 -137 217 390 21 80 109 101 -94 -74 137 -247 110 -228 183 69 -226 130 143 438 -46 -7 -231 -117
6662 -117 -95 -69 -203 154 -59 -91 244 87 -129 -76 9 92 -227 212 -33 -278 -183 -224 85 285 -93 -126 -30
6685 -30 -105 -15 -139 -43 256 -67 -187 23 -189 109 132 50 -148 162 -69 -136 41 8 166 -32 114 -117 -49
6708 -49 -42 14 -11 -27 -167 -51 -30 60 -21 60 149 120 44 -242 117 -88 154 -70 -77 107 3 39 45 176 115 -114
6734 -114 -50 -101 -108 -85 -187 116 -115 78 -416 72 -66 80 -241 14 -92 -173 401 -4 -114 71 71 -72 -239
6757 -239 -134 -52 -93 -38 122 -56 75 36 147 3 -20 139 -170 37 68 15 127 -56 -54 138 217 54 119 -128
6781 -128 216 -16 -31 -61 21 150 -79 -65 -72 -38 -47 -67 -114 -189 -115 -151 10 -189 -288 -164 -235 -74 -39 72 -177 54
6807 54 -65 168 188 -100 -242 -93 200 -102 29 -75 62 -74 -134 -89 175 -150 4 -32 -30 37 59 182 101
6830 101 -243 -42 64 142 8 153 -6 -140 -87 193 -54 -188 -177 65 -67 163 79 47 305 67 173 177
6852 177 121 8 64 16 160 122 -38 -27 355 -22 159 144 -14 240 -146 21 37 -165 72 107 -161 -8 -176
6875 -176 39 -190 120 -81 -189 -28 -26 111 66 -24 -90 135 -40 243 57 -92 81 -118 54 -131 -17 275
6897 275 -361 91 8 -247 60 23 -3 4 13 -88 117 -277 232 -48 -160 -57 -246 -181 -67 -122 -1 174 -72
6920 -72 -91 -43 -3 -229 60 73 -102 -13 23 -218 -149 44 -232 82 114 -26 28 -46 -220 -93 29 -44 -195 -102
6944 -102 -63 118 -27 -3 -135 7 -169 204 78 125 185 -73 -148 91 201 -75 10 -225 -60 9 -123 41
6966 41 -76 149 31 -21 -136 33 26 -94 208 53 40 81 17 144 -43 -12 177 -186 131 -32 -61 89 275
6989 275 128 -359 15 42 -136 -151 103 43 -78 -191 -27 85 -107 -2 198 -183 94 -149 -126 -72 35 32
7011 32 5 -333 223 -239 -110 -126 131 -1 -135 124 138 -248 -128 87 64 -56 60 271 -20 -43 -22 132
7033 132 -196 -134 -195 75 -116 -152 133 -17 -57 5 -36 137 103 -52 -122 -2 210 29 -96 -41 361 -142 397
7056 397 289 -11 52 122 239 -57 127 -69 162 -339 57 -53 -194 -58 -325 -95 30 73 -306 103 1
7077 1 -81 -104 113 -115 35 42 -15 -6 109 -60 -176 66 -104 -70 -68 53 -61 58 -25 -155 -57 80 35 284 -33
7102 -33 -71 150 43 -100 206 37 -42 -11 85 -72 -180 4 -71 -171 -99 -202 129 135 250 -115 102 -76 -49
7125 -49 -63 -130 108 36 158 -21 -47 29 -2 123 -223 -39 213 263 -177 -251 -98 192 120 -108 88 340 -150
7148 -150 109 28 60 63 20 105 131 27 -142 247 99 249 -96 98 155 -121 107 88 -99 3 338 -24 -16 17
7172 17 136 99 -63 -63 -82 -46 -114 -162 86 -35 -241 -24 -37 -193 -79 19 -137 -165 -141 -17 -37 -130 -116 237 165
7197 165 78 103 -28 186 -2 -6 -22 -4 -131 164 158 51 -153 111 189 -182 -205 -16 25 -242 74 -151 51 -7
7221 -7 -194 360 245 216 -168 -120 12 -28 -104 133 -73 101 -144 -7 207 -267 -102 -258 -227 244 -45 -213
7243 -213 45 -130 61 74 -36 -13 -95 -25 -42 66 -3 -246 -200 -87 -40 -37 -372 52 -113 149 -118 -73 -120 -225
7267 -225 -22 282 -61 129 266 161 -147 105 -13 -61 -120 81 56 159 141 -157 357 -169 84 97 -37 74
7289 74 50 -139 8 98 -61 -46 -9 154 53 108 22 80 -273 101 98 16 -191 79 -10 -86 89 1 -44 125 114
7314 114 183 -78 158 -14 -119 -113 -150 150 119 -59 213 -289 271 40 -287 7 -87 152 -169 -29 -232 61
7336 61 -62 -77 -178 155 -20 -88 110 207 -99 201 197 111 67 -16 93 -71 198 48 -76 125 -224 -71 65
7359 65 -104 99 -81 -259 134 -162 13 -19 94 15 -98 -176 90 -8 -138 -213 129 -145 -210 16 119 45 -61
7382 -61 110 -108 182 142 -127 203 159 68 8 -53 305 -40 27 -178 86 -121 -142 -127 -46 113 -13 74 -279 70
7406 70 -207 -163 -136 20 63 -31 91 21 139 94 -28 50 -69 361 -306 -126 -163 -147 -150 -120 181 -160 47 -138
7430 -138 18 -50 -91 71 -44 163 -74 138 224 28 33 305 0 -135 62 -237 107 259 -215 -94 -85 0 218
7453 218 -120 -48 -7 -133 -77 -120 -5 -150 96 -69 -189 282 65 35 79 169 29 209 140 183 192 -119 -88 221
7477 221 198 96 -94 -4 -180 -12 -53 102 18 161 -17 268 -73 42 -172 -60 50 -182 -53 -207 -113 52
7499 52 51 -284 387 -41 -11 19 168 -92 82 124 -27 94 160 -88 -14 40 286 187 52 -133 -166 31 -3 -18
7523 -18 39 149 126 -289 -157 84 -3 32 -57 148 -41 28 17 96 -172 -78 -53 -19 -96 101 -5 -6 33 -107 43
7548 43 -46 -94 12 18 -76 69 152 -44 -176 -204 102 -167 282 -115 -121 87 20 64 -100 105 99 -294 71 126 195
7573 195 -43 -156 151 -78 295 81 171 363 115 35 32 171 190 -17 47 -27 -59 277 -80 -3 35 -6 136 -20
7597 -20 281 -99 -290 1 19 -14 79 -256 5 84 136 -35 -10 76 194 24 90 4 193 72 62 62 74 -136 10
7622 10 -82 -84 -74 -189 -40 19 -365 -271 -36 101 62 6 63 -125 -1 160 24 186 -51 -62 -31 -145 -86 -114 -21
7647 -21 91 121 -10 222 -59 -70 -17 179 -56 -44 59 -87 105 -59 142 47 -94 2 -17 68 -33 180 198
7670 198 101 -97 6 86 122 167 -218 -117 -60 -119 5 -150 -42 -198 3 -22 -97 -41 -181 149 -30 360 -105
7693 -105 -230 -126 27 -69 -153 185 78 226 -263 126 -31 -202 87 -148 -62 -5 102 30 45 63 -138 130
7715 130 -127 -67 -43 -43 -23 80 -346 -159 -72 24 25 -45 282 -171 -176 -229 -96 -143 -176 -107 -9 33 -70 65 26 246
7741 246 -41 -196 -80 -62 272 -63 -30 -48 81 -45 -55 134 118 -162 -61 71 -115 171 16 185 60 25
7763 25 -97 -96 189 -179 -16 -21 -205 200 -104 258 -62 36 -81 -135 -33 32 -7 -35 79 -78 -165 -186 -135 180
7787 180 124 -14 113 -2 49 -191 -146 89 150 190 -129 8 49 25 53 222 109 -14 -265 182 -19 221 110
7810 110 -167 -90 -199 143 -49 -77 19 -22 -4 -61 -141 -242 -18 65 0 -207 -237 25 136 -229 19 -84 184
7833 184 150 -43 -89 -163 -129 39 4 155 -24 192 34 -152 -100 -247 112 20 -137 -49 84 -245 -79 -39 -3
7856 -3 229 56 55 275 -12 -10 83 -76 -38 -235 -96 -162 216 -13 212 -215 -2 -180 -84 -54 197 352 -33 -246
7880 -246 190 -26 98 54 -52 134 66 -59 -15 1 -66 -8 26 26 -87 58 -110 13 107 -114 -25 175 -47 -181
7904 -181 235 -24 -143 125 -2 291 -117 74 -148 120 -28 101 44 122 165 157 -61 65 -91 -178 270 157
7926 157 226 -48 0 -183 -82 -153 207 -122 -126 99 62 171 -43 278 -307 239 -57 28 260 -126 92 -37
7948 -37 128 -191 -13 -11 204 -157 -235 81 -50 -74 50 94 -222 42 -111 18 312 -39 173 -5 -76 82
7970 82 57 76 20 198 322 85 -63 -110 -18 -79 -84 -68 105 -226 -75 31 64 43 -39 123 97 11 -123 177 128
7995 128 -22 -13 -32 37 -62 0 163 88 -27 99 25 -59 1 -239 87 -80 91 -33 -80 -8 76 158 -84 -36 15
8020 15 -144 3 38 -42 -168 -251 -243 3 6 29 -158 295 -35 50 42 14 40 73 114 96 -277 117 64 76 -59 -31 14
8047 14 -217 -50 29 259 108 61 -94 114 72 -48 -185 47 -125 -11 58 -183 33 -7 -122 47 -114 -23
8069 -23 -198 -151 -41 76 -204 -22 -128 69 19 -15 161 -54 -174 30 176 -19 24 -85 29 90 -109 -238
8091 -238 22 171 367 -65 173 -69 -11 -22 121 68 -158 267 26 77 -41 -130 16 87 97 120 -160 -123 -67
8114 -67 -12 13 82 189 28 -14 -310 -227 196 -175 63 53 0 -19 -123 18 -93 170 31 241 290 -110 215
8137 215 101 -124 102 -91 46 16 -16 -21 108 -146 -218 131 61 -30 106 -105 129 -253 -89 242 183 -131 -61
8160 -61 331 -44 46 -35 30 -228 -17 -98 -62 82 -247 19 -190 110 -128 195 70 -90 -18 -108 9 93 1
8183 1 41 132 43 34 -16 12 176 370
8191C70
$$ Imaginary data points
##PAGE= N=2
##DATA TABLE= (X++(I..I)), XYDATA
0 0 0 0 0 0 0 0 0 0 0 0 0 0 -1 8 -8 8 -8 8 -16 16 -24 24 -32 32 -40 48 -56 64 -72 82 -96 107 -122 138 -155
35 -155 177 -196 219 -247 275 -306 340 -378 418 -459 509 -562 620 -681 750 -827 911 -1004
53 -1004 1107 -1226 1357 -1508 1679 -1881 2120 -2406 2761 -3209 3796 -4604 5787 -7680 11202
68 11202 -19905 86632 72076 -127029 43428 63908 -51449 5941 46913 -31756 -4194
79 -4194 -11966 8793 47680 -48340 -60422 73887 10913 -74673 38163 19508 -63343 27065
91 27065 40455 -32011 -10508 7024 1917 40031 -15279 -33039 38180 9829 -18978 27402
103 27402 558 -30925 18000 12729 221 -3554 -38020 8628 38215 -36661 -29572 32408 -30961
116 -30961 -26360 43897 -20731 -50035 17590 7446 -14055 9059 -27479 -9205 32610 -16012
128 -16012 -4011 23203 -30555 -3072 56625 -19928 -25329 37951 -9294 -6488 43563 -14200
140 -14200 -34265 38627 10987 -18658 16020 -6717 -16002 20322 8276 -12285 -209 -15657
152 -15657 8204 29604 -24488 -16044 24356 -6706 -7574 31168 -12541 -25251 25751 17094 -6139
165 -6139 -1712 -1139 4069 15813 222 -8 182 -12250 15323 17721 -19717 -12253 13530 -7614
179 -7614 195 10416 -25600 -12011 15959 -2581 -12151 -2134 -16585 -1960 13765 -10431 -9791
192 -9791 -4501 -6903 9217 10658 -19896 -7825 12630 -2701 5184 5366 -15431 -3324 20681
205 20681 26 -5300 2766 -10268 6469 17578 -6525 -13809 5100 2274 4355 5082 -10183
218 -10183 -3822 2613 5323 8113 -3842 -16566 8781 18827 -7563 -2570 5982 -3060 2845 18573
232 18573 -415 -12104 4092 12298 11531 -3456 -6903 4622 7560 4 7178 -1106 -16071 6957
246 6957 14395 -5064 -11188 -1724 -1557 3674 3528 -10501 -7870 -1937 3015 3067 -4363 -14184 -2566
261 -2566 8400 -626 -2934 -8331 -6178 5828 7468 -5919 -5534 -2155 -2549 10204 2406 -11414
275 -11414 -6292 6573 4068 -34 -3756 -8855 1276 5508 3738 -4358 -7946 -2898 8756 6540
289 6540 -8140 -3913 163 3779 7216 3240 -8304 -2432 9760 6536 3345 -4163 -2399 6329
303 6329 10480 3231 -2968 -1959 1996 10774 4626 -3124 -5242 1934 6873 5106 -1917 -8970 693
318 693 5722 3340 -2920 -5706 -5060 2847 7469 -3280 -7404 -5574 3063 5175 -563 -7157 -5847
333 -5847 1584 3610 3185 -6667 -7352 -833 6036 2428 -5971 -6957 -3378 5718 2851 -4569 -7770 -2187
349 -2187 2087 3227 -42 -8967 -4946 2546 6760 -909 -7447 -3986 3508 5755 -373 -1323 -4909
364 -4909 -222 7260 7139 -3731 -7209 4910 7950 4691 -1088 -1895 -279 5919 7570 1137 -4125
379 -4125 -3617 7506 8085 136 -5288 -1506 4543 5107 2904 -4000 -3908 635 7480 2765 -4420 -5288
395 -5288 -37 6347 3059 -2634 -7016 -965 4810 3509 -3110 -5501 -2277 772 5834 -862 -7551
410 -7551 -5417 2454 5009 -1239 -7100 -6673 3157 1955 -1733 -3182 -5342 -5064 3596 7303 -8153
425 -8153 -10096 1950 6356 -806 -2895 -2923 -2754 2508 3044 3350 -4421 -7299 4292 12563 -1778 -10733
441 -10733 4658 6536 -1401 2352 5612 -6858 -3693 12066 6482 -5733 -6328 5054 8163 1640
455 1640 -4432 1128 2318 -2288 6614 7280 -7745 -9286 12144 9529 -8216 -3613 3636 299 745
470 745 6118 -3702 -6119 985 5231 4074 -4948 -7830 917 8506 -2171 -5343 -667 -3043 -1772
485 -1772 5783 -243 -11687 -1830 3684 329 -674 -5641 -7434 3123 6312 -6316 -3856 -483
499 -483 -3254 1801 6054 -5241 -9465 3989 4601 776 -1713 -5321 -969 7664 1936 -5080 1817
514 1817 -1778 -1045 8690 4243 -9699 -2484 9774 3303 -1532 -1705 222 1710 5114 2254 -309
529 -309 -1523 -2960 8243 8529 -6421 -7838 9347 6182 -4987 2526 2426 -5830 180 11829 -1018
544 -1018 -9391 -265 6368 3016 -3052 -3796 -959 2231 -1013 2280 167 -9662 -1808 9570 384
559 384 -11324 -919 2179 -2216 1532 -155 -7660 -3823 5478 462 -2349 -4796 -4137 2974 3959
574 3959 -2989 -5226 -592 -179 3268 1358 -4756 -4193 2386 4448 -349 -1451 -3722 -219 5362 3806
590 3806 -3957 -3798 2646 3369 3537 -445 -2572 -1037 4763 5131 17 -2076 -2207 4146 6604 966
606 966 -5445 1239 4869 830 3396 784 -4187 -929 8151 2967 -4542 -3167 2284 4521 172
621 172 -1973 -2213 -980 -471 4741 1852 -8864 -3206 6371 2359 -5803 -2128 -1291 -1365 1971 1472 -3744
638 -3744 -6734 554 4275 395 -6556 -3611 984 1240 603 -2749 -3905 -2946 3035 2945 -2267 -4966
654 -4966 -2187 3810 2627 -1386 -3945 -868 1611 3492 1249 -3330 -1858 958 4996 2474 -2961
669 -2961 -3403 3309 5021 757 91 -1909 312 3971 5059 -1004 -3405 1023 4258 4487 -1278 -2168
685 -2168 -253 3336 3083 1566 -2584 -3525 3942 4006 127 -3097 -1924 11 3830 1803 -3741 -2881
701 -2881 -653 2934 1626 -2097 -4592 -1252 2783 1243 -1684 -5106 -2156 1650 2371 -2105 -3719
716 -3719 -2916 -508 3868 -814 -5088 -3393 1597 1675 -199 -2600 -3849 27 2164 2597 -2959 -4165
732 -4165 -158 3621 2038 -2372 -2115 -1155 2882 3420 739 -3736 -1283 3944 3524 1035 -2823 -791
748 -791 2049 4059 2083 -1664 -1824 1524 5529 1615 -798 -2189 1230 3946 2944 -732 -3020 790
764 790 2864 3539 -825 -2662 -1172 2340 3670 -949 -2913 -2574 2139 2458 -148 -3268 -3124 593
780 593 2335 1295 -4218 -3148 -390 2257 521 -2857 -3728 -2222 2229 1336 -1940 -4753 -1708 1408
796 1408 1477 -1119 -4483 -1919 62 2554 135 -3479 -2760 1099 3379 -230 -2381 -2843 1080 2527
812 2527 2007 -1366 -2685 633 2877 3575 -1273 -2622 158 4124 2679 -438 -947 -1139 2723 3407
828 3407 1573 -2152 -1229 2168 4374 1672 -2994 -305 1840 3151 1510 -158 -2654 -742 4181
843 4181 1904 -1538 -3115 173 2331 2125 -1520 -3443 -173 471 2172 -26 -3830 -3601 1945 2507
859 2507 -1474 -2681 -3133 241 1715 798 -3483 -3130 -156 824 1234 -2447 -4089 -1734 2823 793
875 793 -2337 -3071 -1159 1733 1575 -63 -3458 -1038 1323 2469 1006 -2517 -2513 1481 4764 -293 -1857
892 -1857 -109 587 2026 2942 -175 -3551 1738 3802 2524 -323 -2456 -94 4180 2702 -2100 740
908 740 -291 -19 4310 2544 -4447 -1529 4522 1269 18 -1071 -1721 426 2797 840 -1641 -1616
924 -1616 -2053 2998 3048 -3407 -4174 1870 1457 -1086 576 -2683 -3070 784 2890 -1631 -3710 -1734 601
941 601 2179 -1176 -3123 -2681 1034 670 -12 -1165 -3525 -1083 2947 1870 -4102 -2007 710 819
957 819 1580 -185 -3318 -1314 3951 767 -307 -592 -1917 1451 4738 -26 -3698 1487 1174 1792
973 1792 3067 -1478 -2470 2705 3808 -89 1144 -1495 -858 4475 3038 -2597 -1209 2265 554 2851
989 2851 657 -2770 -944 2623 2212 137 -1357 -2493 2510 2778 -1158 -2730 -863 229 538 1496
1005 1496 -2216 -3462 -607 2932 154 -3377 -1930 -893 973 451 -985 -3884 -1485 872 818 -179
1021 -179 -3521 -2571 1722 2618 -2479 -1827 -489 -973 2244 1415 -2845 -2781 2094 1146 1064 -301 -2801 487
1039 487 3161 1265 -1441 -17 -1207 2034 3920 -774 -2367 764 2418 1841 1779 -2086 -1086 2797
1055 2797 2550 860 -742 -1235 390 3944 1102 -1268 -1217 655 2644 1457 -738 -2485 393 1933
1071 1933 1785 -235 -2397 -620 1216 1880 -763 -2440 -2428 1491 1760 -909 -1739 -2426 143 1416 313
1088 313 -3256 -2314 -356 1195 938 -2608 -2591 -492 1383 360 -1002 -2446 -1843 1962 1313 -959 -2623
1105 -2623 -722 417 2277 159 -2792 -502 769 2193 933 -963 -2176 1627 3017 413 0
1120 0 -1454 607 2652 2727 -1010 -968 860 1757 2936 -335 -1484 -267 2700 1927 955 -1203 -1429 2390
1138 2390 2471 601 -1426 -706 407 2725 1220 -1927 -1083 -28 1869 852 -1177 -2543 -389 1649
1154 1649 419 -614 -2667 -897 916 1360 -1519 -2382 -1685 348 1747 -1186 -2302 -2133 180 964
1170 964 211 -2243 -2538 486 911 756 -1614 -2372 -444 1876 972 -1309 -1564 -961 1729 1463 -322
1187 -322 -1859 -256 1338 1587 1102 -1958 -483 1706 2170 887 -532 -1072 601 3091 787 -602
1203 -602 -1017 678 2373 2171 -594 -1515 1086 1508 2551 -61 -1349 -590 2138 1908 -580 -774 -1333
1220 -1333 1361 2189 -40 -2116 -1309 384 1304 956 -2152 -1496 -286 1280 98 -1432 -2462 -991
1236 -991 1662 -49 -995 -2385 -1282 800 988 -1278 -2482 -1023 40 1570 -294 -2298 -1614 864
1252 864 1358 -259 -1413 -2377 646 1637 449 -1043 -1441 -99 1709 1804 -1379 -1208 -70 2044 1879
1269 1879 -34 -1306 -545 2088 1452 571 -1055 -429 1267 2398 655 -933 -476 698 2564 929
1285 929 -893 -870 644 2013 1385 -426 -1758 409 1367 1239 -466 -1991 -376 1372 1625 -1069 -1280
1302 -1280 -1177 496 1498 -219 -2044 -1808 632 532 512 -2135 -2122 147 778 19 -1680 -1766 -1074 1207
1320 1207 647 -1623 -2338 -777 1057 498 -467 -2233 -741 645 1426 -277 -1573 -750 475 2207
1336 2207 321 -1363 -1194 1258 1562 596 -354 -1594 386 2024 1860 -765 -711 419 1858 2349 -381
1353 -381 -1372 -29 1929 1321 657 -771 -795 1816 1805 869 -1500 -306 808 1590 1129 -1232 -1203 314
1371 314 1828 302 -345 -1846 -803 1339 948 -1478 -2265 -228 339 935 -489 -2214 -1903 1077 910
1388 910 -1301 -1306 -2047 133 1530 -427 -2207 -1223 -67 -26 1264 -1289 -2445 -303 1819 233 -1070
1405 -1070 -1125 -1486 1795 1375 -807 -1612 -176 594 1380 768 -2089 -466 1443 1693 140 -287 -575 459
1423 459 2400 974 -613 -750 1011 1667 1468 -13 -1419 607 2003 1608 -545 -451 -111 769 2077
1440 2077 -76 -1446 -470 1848 666 349 -1096 -1588 1066 1501 116 -1501 -290 -702 1248 950
1456 950 -1726 -1974 150 316 -209 -57 -2552 -923 1459 486 -1269 -1324 -1216 -282 1822 -988 -2061
1473 -2061 -680 244 528 230 -1299 -2271 852 956 200 -888 -1212 -52 1292 1362 -1319 -566 -157 1234
1491 1234 1287 94 -925 -418 1774 1405 639 -1323 1 1353 1718 932 -881 -469 907 2016 555
1508 555 -252 -491 263 1996 1138 -682 -979 615 805 1788 -16 -1762 88 1282 882 -393 -887
1525 -887 -1405 1020 1394 -628 -1110 -1024 58 1015 449 -2117 -1173 35 102 535 -1442 -2099 -472 1173
1543 1173 -159 -918 -1207 -1171 842 384 -1021 -1602 -460 -25 1060 160 -2050 -484 541 936 110
1560 110 -799 -1546 734 1324 542 -449 -929 356 1429 1295 -594 -323 307 1106 1765 -303 -1142 -87
1578 -87 1524 979 472 -638 -685 1532 1484 643 -895 -127 240 1871 556 -942 -473 245 1198 601 -342
1597 -342 -1750 397 1034 339 -433 -1612 -553 643 753 -900 -1405 -1059 152 1154 -494 -1620 -997
1614 -997 308 244 203 -1513 -1877 136 439 -11 -1368 -1732 -622 1061 683 -954 -958 -551 931 734 -311
1633 -311 -1393 -536 886 901 359 -1282 -468 1027 1418 271 -387 -602 395 2099 449 -269 -677 801
1651 801 1350 1282 -247 -611 724 1048 1529 -388 -751 -70 1522 1310 -33 -512 -665 1157 1379 316
1669 316 -1021 -467 480 964 553 -1529 -639 233 1001 211 -1032 -1456 -529 1048 114 -665 -1896 -470
1687 -470 436 678 -774 -1807 -542 -143 1135 -726 -1377 -1404 185 845 -439 -876 -1425 287 639 165
1705 165 -1088 -1232 -51 1097 917 -680 -992 -335 1151 757 -151 -831 -207 1281 993 339 -851 164
1723 164 1234 1209 376 -521 -130 803 1873 496 -343 -481 295 1386 964 -175 -1049 542 855 837 -38
1742 -38 -897 -501 782 895 -603 -661 -790 702 956 -23 -1120 -915 641 502 339 -1102 -1347 182
1760 182 659 -102 -1340 -1017 -713 679 120 -945 -1251 -675 339 392 -343 -1470 -671 212 784 -162 -1213
1779 -1213 -984 386 971 -311 -552 -1125 533 1187 463 -788 -795 373 909 1100 -507 -731 333 1305
1797 1305 1107 113 -401 -138 1436 1218 147 -594 -202 1043 1167 902 -728 -278 668 1474 562 -332
1815 -332 -404 -7 1531 474 -313 -647 97 905 476 -333 -1197 -66 664 720 -462 -918 -840 -195 873
1834 873 -516 -1219 -1133 238 456 -45 -998 -1612 29 210 -39 -980 -1274 -659 632 382 -865 -1006 -315
1853 -315 393 437 -150 -1086 -368 719 736 -159 -793 -531 194 1137 278 -877 -262 369 1030 720 25 -873
1873 -873 903 1331 500 -268 -320 131 878 1511 -263 -429 221 1002 906 390 -522 -551 1216 1054 144 -327
1893 -327 -396 149 1331 440 -1115 -333 -86 382 180 -538 -1363 -475 930 11 -430 -942 -564 369 500
1912 500 -848 -1309 -624 131 491 -283 -1028 -1212 335 434 -427 -757 -1281 35 552 453 -929 -653 162
1931 162 445 451 -771 -784 -311 911 539 -237 -837 -210 591 1124 251 -828 53 878 855 479 -76 -287
1951 -287 448 1563 335 -313 -416 347 1143 850 -311 -685 513 741 918 7 -668 99 915 892 -331
1970 -331 -509 -646 580 712 -28 -632 -676 410 527 350 -969 -625 56 429 116 -1164 -875 -554 721
1989 721 -54 -661 -1077 -421 298 20 -436 -1297 -493 159 573 -638 -1026 -573 8 542 -205 -748 -914 417
2009 417 675 343 54 -641 209 398 530 -328 -727 178 980 932 -326 -291 -45 1167 600 279 -299 -458
2029 -458 875 1296 615 -486 -56 261 1317 522 -386 -292 381 929 494 44 -557 -6 676 541 -235
2048 -235 -824 54 383 805 -468 -795 -563 230 671 -595 -583 -948 360 499 -70 -977 -1053 -22 92
2067 92 -111 -1094 -922 -431 663 136 -757 -554 -561 528 466 -433 -758 -299 322 300 198 -764 -444 295 776
2088 776 -49 -456 -272 444 1352 108 -268 -152 295 789 605 -259 -443 454 903 967 59 -167 -10 898
2108 898 833 -22 -132 120 741 1000 367 -895 -252 449 762 261 -781 -315 119 414 187 -557 -663 -155
2128 -155 536 -81 -163 -919 -93 167 373 -369 -1014 -389 -110 325 -459 -879 -893 -8 206 89 -571 -1074 313
2149 313 185 220 -850 -635 -122 727 190 -594 -606 -204 557 456 -76 -626 -110 855 343 191 -545 -50
2169 -50 490 914 82 -333 -58 340 1208 597 -241 -149 772 828 462 204 -532 478 1079 822 -222 -553
2189 -553 31 568 1027 -82 -108 -286 508 482 -5 -833 -510 332 380 136 -774 -569 -201 489 106 -667 -702
2210 -702 -335 601 -56 -298 -876 -572 399 117 -329 -1158 -389 89 284 -211 -718 -750 -69 378 -328 -452
2230 -452 -855 260 729 101 -554 -827 189 449 513 -403 -591 -62 653 829 -111 -210 -60 1140 452 199
2250 199 -583 -144 821 424 414 -241 -108 338 1206 484 -313 -201 189 719 505 -132 -791 228 788 291
2270 291 26 -497 -50 214 682 -336 -525 -189 188 189 16 -584 -756 415 405 -41 -539 -772 -223 503
2290 503 -96 -875 -549 -308 348 -11 -604 -933 -507 451 -175 -82 -923 -406 333 350 57 -962 -87 -63 602
2311 602 263 -193 -255 351 949 155 -44 -318 325 729 623 -320 -294 491 550 819 -44 -258 -50 1107 546
2332 546 -103 -107 -118 735 525 406 -480 20 574 606 570 -316 91 262 768 78 -275 -523 -304 580 -57 -178
2354 -178 -759 -114 272 237 -462 -952 -258 -3 370 -396 -559 -758 -53 149 -141 -495 -1094 -128 138 157 -896
2375 -896 -640 -189 252 278 -376 -326 -294 440 379 -118 -712 -283 596 304 167 -336 -525 253 743 255 -439
2396 -439 39 260 915 553 42 -241 575 844 541 74 -378 183 678 925 -266 -463 108 535 452 -142
2416 -142 -211 -289 522 584 90 -183 -213 266 408 119 -874 -375 -238 241 228 -766 -479 -136 476 -233 -651 -554
2438 -554 -419 309 254 -334 -878 -460 -80 326 -105 -853 -646 55 204 -206 -466 -532 -80 403 79 -341 -674
2459 -674 108 283 419 -309 -196 181 406 499 -168 -223 -97 763 587 332 -391 176 498 452 396 -557 -97
2480 -97 581 616 329 48 -33 163 713 449 -279 -529 352 733 346 -144 -397 165 401 544 -127 -347 -267
2501 -267 455 432 -209 -343 -316 135 251 -15 -378 -567 106 348 140 -623 -545 -437 197 2 -495 -558 -312
2522 -312 3 -26 -248 -730 -354 20 -158 45 -574 -278 233 465 -59 -195 -517 151 754 -18 -330 -500
2542 -500 285 282 673 -202 -288 89 418 485 37 -59 -193 795 467 -100 -133 4 570 569 312 -422 77 429 515
2565 515 199 -94 -253 1 693 1 -240 -437 259 621 -182 -82 -297 -37 44 502 -476 -476 -50 -167 209
2586 209 -336 -605 -778 167 167 -437 -417 -809 167 237 -62 -356 -186 -102 144 182 -446 -293 -33 416 247 -151
2608 -151 -566 -247 402 113 101 -671 -193 433 232 115 -160 39 -209 521 217 -172 -129 621 386 495 118
2629 118 -582 507 578 301 68 45 288 536 591 -318 -161 -261 569 653 -42 -485 -52 358 89 310 -453
2650 -453 -279 180 341 96 -189 -386 -323 484 -97 -80 -439 -241 183 79 -269 -995 -208 -54 322 -403 -690
2671 -690 -466 -159 242 -110 -462 -222 -122 168 65 -239 -499 -29 106 112 -457 -33 -53 293 433 32 -209
2692 -209 79 579 340 83 -330 -132 460 807 210 -487 79 166 636 214 69 -222 455 855 194 411
2712 411 -532 282 371 588 -27 -213 40 -51 759 -221 -371 -88 83 460 -17 -544 -499 3 231 -16 -462
2733 -462 -305 228 278 90 -561 -525 -229 -128 65 -389 -497 -159 144 41 -325 -541 -105 163 62 -209 -576
2754 -576 -207 41 345 -215 -129 -435 102 452 13 -553 -287 280 253 277 -25 -138 90 517 141 -44 -110
2775 -110 -63 600 485 -163 20 -122 428 524 349 -198 -34 428 546 175 -49 19 142 374 147 -25 -329
2796 -329 331 247 203 -163 -343 188 178 300 -321 -299 -145 125 581 -379 -294 -270 203 -83 -237 -275 -716 -30
2818 -30 153 23 -728 -256 141 -47 24 -655 -654 -362 464 128 -196 -267 -299 184 177 -22 -532 166 89 394 41
2841 41 -260 -158 181 351 87 222 -89 217 679 194 120 -66 307 409 617 20 -74 349 387 392 -220 197
2863 197 -63 572 178 151 -438 -75 316 213 152 -259 -197 -2 386 -143 -177 -252 -189 301 138 -508 -205 -30
2885 -30 378 149 -81 -782 -189 -31 279 -429 -486 -594 -255 -66 -97 -450 -601 128 -158 -101 -210 -70 -11 157
2907 157 195 -228 -328 -410 148 388 -228 -241 -159 329 191 50 -156 -86 207 299 -115 -207 15 155 388 24
2929 24 -76 -225 204 550 137 -115 -303 299 255 493 60 66 88 167 483 -136 -171 -157 169 139 -191 -237 -305 197
2953 197 226 14 -314 -240 36 15 176 -315 -199 -303 71 -213 -420 -479 -53 135 -48 -350 -446 28 174 -8
2975 -8 -4 -568 -182 194 266 -461 -215 -358 218 322 29 -241 -400 315 219 124 -66 -116 70 387 513 -150 61
2998 61 -70 282 376 274 -103 120 683 495 450 -198 10 114 518 196 212 250 -53 277 178 265 -44 44 271
3021 271 -67 10 -397 32 248 350 -377 -387 -78 207 232 -287 -368 -283 30 76 -78 -261 -392 183 99 -121
3043 -121 -432 -314 -203 132 91 -576 -206 -450 570 -12 118 -427 -256 117 64 -235 -483 -76 269 344 -343
3064 -343 -30 -169 417 294 -20 -165 -61 298 166 524 42 -111 149 203 376 -303 -27 353 108 295
3084 295 0 -158 -34 192 359 160 -255 -112 350 247 298 -85 -62 71 438 47 -403 -199 18 127 -172
3105 -172 -223 -500 -15 66 177 -307 -460 -121 -44 370 -147 -420 -318 70 -47 -297 -387 -477 196 58 -236 -307
3127 -307 -370 -88 137 190 -362 -27 -323 74 -29 117 -15 -300 410 254 207 -334 164 151 275 66 -287
3148 -287 162 41 568 285 -111 55 49 370 343 29 -189 238 356 473 10 -121 144 183 326 -17 195
3169 195 40 123 425 65 -52 -375 162 26 146 -526 -201 194 34 110 -694 -185 -171 214 -109 -141 -255
3190 -255 -349 211 36 -197 -407 -90 -27 165 -180 -233 -202 -98 279 -149 -251 -212 -16 28 24 176 -102 262 120
3213 120 -4 -178 -7 -46 237 297 -158 1 78 531 307 62 -423 -71 358 631 -6 -11 136 294 350 12
3235 12 -135 90 -92 147 173 16 -310 -114 413 79 48 -169 -133 231 87 -292 -267 -36 18 228 21 -511
3257 -511 -248 -69 136 -23 -141 -384 -191 -8 11 -366 -391 -34 16 -77 -303 -271 -151 261 50 -390 -292 -160
3279 -160 -46 268 -179 -257 -80 146 158 -186 -34 -226 92 537 -15 -295 -181 286 8 239 93 -381 -4
3300 -4 330 402 -3 -39 -248 371 246 -78 -122 -156 511 234 179 -99 112 273 50 128 -164 -396 -40 408 -41
3323 -41 -135 -197 -89 220 -35 -120 -284 129 146 288 -136 -173 38 42 199 -165 -234 -462 -158 67 65 -508 -430 32
3347 32 -292 -96 -265 -47 56 -22 83 -358 -548 -166 224 217 40 -52 -216 434 116 -111 -325 -90 214 295
3369 295 274 -272 274 254 361 26 -183 -110 68 368 357 145 -305 336 214 56 168 -9 111 252 305 -198
3391 -198 -34 -27 400 49 73 -142 -9 325 152 207 -115 -205 103 111 142 -260 -1 -144 402 65 -161 -332 -79
3414 -79 -114 -216 60 -71 -67 -289 19 -460 -256 -261 -4 -181 -210 -251 -203 162 -9 -82 -375 -348 2 -78 197 -111
3438 -111 201 130 178 152 -57 -26 -7 360 440 109 -71 -98 358 231 245 -237 257 192 345 246 -1 59 234 369
3462 369 -243 73 -300 108 342 153 293 -172 208 308 426 -125 -149 -125 -245 200 -188 -64 -123 205 96
3483 96 -45 -230 -100 -22 -73 -30 -520 -101 -307 43 45 -509 -302 151 -204 -153 -223 -202 -155 201 -121 -8 -257
3506 -257 -175 65 190 65 -426 -135 22 276 42 53 -28 232 344 302 21 -97 183 230 446 42 111 60
3528 60 253 205 -1 52 -205 207 196 188 -123 -143 86 266 165 -71 -42 -99 150 47 -81 -157 245 172 290 -138
3552 -138 -262 -116 90 138 -113 -174 -123 3 204 25 -190 -296 -6 -238 -374 -191 -207 -19 -98 -94 -600 -125
3574 -125 -182 -77 122 -198 -37 -164 51 -93 -181 -206 -242 159 86 26 -187 101 289 59 156 -165 -95 99 228
3597 228 16 -26 79 223 453 235 -128 -163 198 238 284 -16 -205 -46 166 592 38 208 92 88 19 -152
3619 -152 -283 -308 416 177 -111 -78 -96 -39 50 11 -254 -169 -431 156 -45 -170 -84 -427 245 -128 -304 -392 -214
3642 -214 215 194 -353 -460 -69 56 -112 -98 -338 -327 45 -124 -94 -146 -304 52 -49 225 -34 -78 184 249
3664 249 -76 -49 -136 -71 151 78 57 -92 30 234 56 111 131 175 117 366 196 -177 -42 37 300 -111 4
3687 4 -336 252 156 235 -161 43 142 440 161 31 -152 -144 238 84 119 -191 -137 -66 -116 -324 -353 -278 -207 -179 24
3712 24 2 -106 -253 -206 -46 -214 -361 51 34 -193 -322 -322 145 168 80 -89 -461 -135 69 -118 -353 55 -279
3735 -279 15 36 81 -86 -379 140 90 50 -144 99 331 136 218 79 -4 81 134 -37 -13 -186 273 156 263
3758 263 254 -91 199 -92 201 147 75 -135 -76 246 18 -62 -61 378 370 -54 -254 -140 -44 -70 -10 2 -197 37 259
3783 259 -23 -1 -96 -304 223 -82 34 -278 -207 -10 -24 -202 -210 -171 147 58 -141 -149 5 4 177 104 -98 -43 -46
3808 -46 278 -5 -87 -283 50 112 42 125 -420 38 159 400 282 -78 42 160 -21 -37 56 96 115 215 426
3831 426 184 -94 67 354 483 64 43 -65 230 216 101 14 -176 166 98 -265 -98 75 137 177 301 -460
3853 -460 -223 -66 31 128 -62 -173 77 108 -30 -169 -385 31 -27 152 -73 -345 -173 -99 91 -322 78 -105
3875 -105 107 286 -162 172 -244 95 336 -257 -172 -191 -11 67 296 46 -107 53 185 86 111 -151 0 -13
3897 -13 -63 -11 -142 241 38 27 157 -36 76 58 134 146 41 10 321 156 -14 -32 10 270 17 40 -41 36
3921 36 -245 104 76 2 -252 -288 165 -45 48 -160 -192 27 -153 173 -47 -243 65 -139 -57 -331 -124 -3
3943 -3 111 122 -276 -211 -411 26 314 -243 -413 13 19 268 -47 -72 -341 -41 73 37 -150 -150 219 25 26 13
3967 13 98 91 193 -89 -14 -32 -27 259 -70 164 47 131 267 332 75 21 336 73 325 32 -336 14 -9 237
3991 237 -138 -315 205 -115 204 -171 -111 87 -23 -144 3 -105 -279 25 -245 62 -286 123 -8 92
4011 92 144 -108 -96 -46 134 17 -15 -285 -50 46 15 -165 -126 -356 121 238 46 -82 -275 -142 198 -13 -15
4034 -15 -156 -37 110 152 193 -84 -191 136 99 -16 24 -5 -23 -17 62 40 -52 288 181 198 -7 156 295 49
4058 49 363 102 -37 -184 197 145 127 350 47 123 192 230 -300 -10 -44 -87 -37 -187 -163 -64 161 -324 -262 -148
4082 -148 58 9 -112 -18 -90 38 -290 -77 -165 83 -10 43 215 -420 -131 -267 233 -60 10 -142 -312 166
4104 166 143 -223 -257 -80 -150 -277 115 -75 -1 56 104 -66 -128 95 -127 144 -13 29 -279 285 36 -5 29
4127 29 140 149 97 229 90 56 -59 297 163 -177 70 -4 307 -3 247 0 12 -98 262 183 35 -197 -300
4150 -300 -28 215 157 -153 -258 -201 -72 -11 10 -160 -160 148 -216 -14 -57 -66 61 -10 -4 -168 59 -285 27 -52
4174 -52 -148 -129 140 -36 -28 144 33 -67 208 -39 -216 -165 -122 100 46 71 -206 65 114 47 -148 -87 -112 198
4198 198 121 70 111 130 33 -9 106 -21 206 256 223 -68 -18 54 59 254 70 60 60 150 263 124 -27 -50 -47 2 -68
4225 -68 -303 -110 92 59 71 -271 84 -101 -9 -149 -122 -222 -117 -19 -308 -58 -254 -133 159 6 205 -100
4247 -100 -127 -102 347 -24 -169 -260 -151 145 -67 -126 -174 18 20 68 -40 56 -245 90 73 25 19 -20 85 -94 109
4272 109 58 -34 10 -121 34 28 57 159 156 4 -82 -108 -62 191 12 194 35 171 196 161 125 -149 -53 90 -114
4297 -114 -56 28 1 -2 9 32 16 -313 -116 114 -26 -164 -24 -104 -24 64 -22 -17 269 18 -89 -144 -15 -63 195
4322 195 -57 90 104 -556 22 198 -1 -132 125 23 -40 220 -15 239 68 -120 155 20 -65 250 122
4343 122 69 -28 -116 133 6 202 -50 -94 124 -251 118 210 -66 -308 10 104 70 191 -119 26 69 190 68
4366 68 -115 33 160 254 -85 21 85 6 157 83 5 -1 163 -109 163 45 142 -30 227 -263 -184 -48 -123 61
4390 61 -89 91 7 127 6 132 -203 -207 188 195 -51 -350 223 -74 126 293 -10 -105 53 -65 -327 219
4412 219 15 -40 17 252 -31 -213 332 -69 17 86 93 -194 165 225 443 26 -107 -26 294 129 58 190 -138
4435 -138 240 175 -123 20 -120 255 18 -58 135 -36 200 -52 37 -232 144 176 75 178 -132 51 -71
4456 -71 316 267 159 102 -78 181 18 -60 -288 -190 78 11 -273 -43 -326 21 282 24 -130 -223 44 -174
4478 -174 88 -69 -97 -18 -19 -138 -7 13 198 -66 172 123 218 -53 168 17 42 -50 123 214 76 151 53 143
4502 143 -22 169 142 24 48 -50 145 115 276 28 156 -28 95 -157 -186 45 194 342 82 248 69 42
4524 42 190 -233 -281 -170 4 -88 -92 -43 33 61 -115 187 -226 -103 98 36 -116 -12 -14 -181 81 -368 -141 -55
4548 -55 -79 120 -69 144 -95 7 -168 -128 334 -387 -252 99 100 89 -90 -20 23 199 117 275 36 -7 -83 -69
4572 -69 18 -178 199 135 34 250 0 -275 67 153 79 -69 -140 286 35 170 103 -310 99 170 164 47 184
4595 184 91 349 -182 48 90 -9 -238 266 41 -252 -279 92 -124 -100 -36 -245 203 -5 -104 -26 -253 55 -58
4618 -58 165 33 -179 221 14 151 -126 -18 -222 235 131 -107 -46 180 -4 13 152 92 -18 127 -19
4639 -19 -174 -91 98 72 216 -46 161 132 -82 71 200 -18 332 -174 194 27 -86 56 128 -87 -25 -102
4661 -102 -57 -22 -143 51 233 -324 19 22 130 -24 44 44 -40 127 121 -215 200 -96 117 -57 63 -35 -152 108
4685 108 148 -128 -232 9 -254 -48 -223 -35 61 33 134 -225 182 -381 162 -8 23 -135 79 215 78
4706 78 201 -267 249 152 -17 -97 64 195 -309 46 209 154 189 -126 -25 -93 57 30 28 178 132 76 80 110 115
4731 115 83 172 -92 46 -43 46 48 49 1 287 3 157 -20 8 -140 -264 67 -108 -15 -54 131 -254 -143 -89
4755 -89 -70 28 -199 8 -14 -93 31 216 -91 16 42 -30 -189 -322 -24 -171 -123 128 -330 212 -213 -299 -2
4778 -2 140 82 29 -31 -169 -121 -74 67 -65 403 140 27 -96 -184 -62 99 -32 93 115 -118 205 139 -132
4801 -132 -24 -34 -6 144 108 -348 -170 208 213 163 29 64 -249 241 73 -18 42 -39 44 46 -86 -23 -10 77 -30
4826 -30 -41 91 80 117 -92 -159 32 52 -122 -92 -57 3 -56 -31 -208 60 -60 -70 -20 -222 -2 -177 -95 -118 -111 14
4852 14 -34 25 -166 -225 -161 -197 124 -8 7 96 48 -118 -196 -330 108 -159 26 4 74 46 88 -205 72 -182 39
4877 39 43 -246 66 371 292 66 94 -201 -114 -161 392 -170 343 -288 152 126 71 274 -117 -72 13 169 -213 16
4901 16 16 25 -208 13 166 -258 23 11 64 -96 -139 -165 342 -34 31 -96 162 50 -33 -83 -215 139 -79 137
4925 137 59 -19 181 146 71 -33 -234 -358 -215 109 83 -8 -27 183 212 -94 76 230 140 150 123 20 45 294
4949 294 34 -126 290 184 35 -84 92 136 7 -39 13 84 67 59 23 -70 26 172 51 25 -45 -97 -122 6 -29
4974 -29 -16 -91 -34 -84 -59 -109 133 116 -94 87 -198 -56 287 -39 -177 -172 -242 -128 -173 -87 -131 -18 396 -235 24
4999 24 -135 -217 -55 -63 221 46 -26 -218 139 -115 -58 -84 -40 3 -217 -105 214 101 38 2 96 -76 118 -30
5023 -30 275 50 -94 179 91 115 185 48 172 -125 21 127 -151 -14 -4 294 63 88 18 123 227 -60
5045 -60 14 -112 90 -101 -140 78 -135 -323 10 -97 -17 -147 163 16 -6 -99 128 -77 56 -10 -126 -185 3
5068 3 -211 15 -19 -155 -82 -33 15 24 -219 -9 -173 181 88 35 41 -57 -117 206 -72 -219 -151 36 -31 161 10
5093 10 74 -1 88 -100 50 156 168 -134 150 256 49 -83 -90 -98 -130 -78 -108 42 67 102 -53 -58 203 228 29 -6
5119 -6 -214 -195 -119 190 -162 50 87 -94 -73 -110 -51 12 61 -13 57 -121 150 -16 47 -56 -219 59 23 61 -231
5144 -231 -158 -64 271 128 137 -67 264 24 135 7 -136 0 1 243 -58 -264 250 -71 4 -74 135 62 11
5167 11 -76 13 43 28 -83 25 -45 90 252 -44 170 3 150 28 -278 276 -6 7 83 191 -139 192 132
5190 132 50 119 -74 -59 -79 -224 -81 -191 0 53 -47 -136 -85 -7 -68 58 35 -127 -114 10 62 -99 -252 112
5214 112 -155 -64 -53 -84 -24 -95 -36 -138 312 -160 140 32 -135 -188 118 -18 -146 17 -117 -27 -83 119 47
5237 47 113 140 4 53 263 83 67 83 81 99 243 -173 126 82 126 -107 8 -73 32 30 57 1 -58 363 231 235
5263 235 50 -21 126 45 34 -142 -65 32 -162 -16 -8 52 -117 -58 39 8 -187 42 32 -161 -27 -25 -78 60 5
5288 5 27 -100 -132 120 -63 138 -313 -8 -157 83 -220 45 29 29 74 26 45 -39 -133 -116 63 -40 -22 -52 -198
5313 -198 37 172 12 -2 -196 -30 136 180 59 4 27 -88 328 216 64 412 175 205 24 -7 -19 116
5335 116 -186 -157 -222 12 -36 202 92 -115 -134 17 -39 114 -192 -210 -249 -385 21 -132 -172 149 23 -19 21
5358 21 -14 47 -87 62 -285 -62 -9 -157 133 -123 -22 152 -166 -176 -341 -18 -188 52 -4 -137 129 -34
5380 -34 -7 -75 -90 49 -48 -3 136 -110 -33 207 212 45 -99 -165 -55 131 137 -163 228 6 -345 153 115 -90
5404 -90 153 -35 -150 185 -188 29 -79 142 46 -54 91 -3 166 -82 1 48 97 96 -18 57 -23 -69 -71 -19 186
5429 186 -252 -146 133 -205 -16 -124 -348 -121 -26 -193 -388 148 -80 25 69 -59 87 -27 -31 -53 -106 -227
5451 -227 -149 -12 -149 138 -9 136 251 -83 -207 -14 11 165 344 -44 -209 -79 96 -172 -361 257 -178
5472 -178 177 -26 190 -18 153 -67 93 -86 -60 -35 -227 21 -34 137 113 -92 -31 -203 -68 148 24 -154
5494 -154 257 -44 -205 -35 -5 54 -143 272 18 153 268 -19 -61 -320 -234 164 118 -160 -215 137 101 -32
5516 -32 18 -251 -177 1 -332 -180 59 -184 -163 -108 10 -25 28 50 14 -244 188 58 19 -12 15 -35 -68 55 34
5541 34 -3 90 -110 61 -52 218 -33 119 131 -234 133 32 -194 -114 -122 116 164 -56 21 -141 111 123 46 15
5565 15 88 93 -59 4 -31 90 -40 212 -124 -199 88 -89 57 -92 42 -84 61 7 80 114 -215 -75 -45 199
5589 199 -104 -43 16 163 -49 -215 -30 -11 -143 143 143 -415 -270 62 -168 82 105 7 176 135 -299 -235 109
5612 109 11 -125 -76 -174 -24 88 -210 57 17 -258 -84 48 -112 42 -203 15 159 -120 70 -74 19 51
5634 51 165 26 -229 139 32 62 257 -108 28 126 119 -196 345 -6 34 148 47 -158 -44 22 -216 72
5656 72 90 -104 -174 37 10 54 212 -112 -121 -82 79 78 -278 -164 -24 -163 103 42 -124 -154 -152 -202 -29 62 -181
5681 -181 -12 104 -320 71 1 121 21 88 56 167 -13 -71 42 138 174 -23 228 -21 -26 -144 -91 275 -148
5704 -148 89 78 243 -144 191 15 -181 202 -70 143 102 122 83 58 -25 49 190 51 -142 -95 324 -117 -177
5727 -177 -86 -170 -79 14 36 166 -31 49 225 118 -294 -355 78 221 -111 191 20 -177 148 -38 40 28 43
5750 43 139 -9 64 65 62 -10 -38 167 55 -261 -120 -169 211 -28 -77 -152 -51 249 -103 63 93 150 56 -66 75
5775 75 -39 -144 -52 158 -96 56 -15 -43 109 72 -90 -11 118 51 44 109 148 144 320 8 30 -334 -142 26 -144
5800 -144 -22 73 256 91 191 -104 -39 21 -138 -5 207 306 -33 100 -92 205 -19 -16 -104 81 -255 45
5822 45 -227 108 0 -274 -55 -212 6 89 103 -126 38 154 -81 -70 134 82 274 53 -48 -18 88 77
5844 77 -128 -110 208 232 150 -88 -139 -177 24 226 -70 248 -72 -349 70 23 -121 142 113 223 340 121 184
5867 184 -4 39 -51 -92 105 -54 66 -178 69 -116 -185 24 -49 -173 93 -121 -140 -120 -326 -80 46 173
5889 173 -233 -52 58 9 163 125 -27 63 -67 153 -107 -69 -121 -105 89 63 -42 2 348 -82 -13 128 23
5912 23 -77 -154 117 59 69 1 -29 205 19 137 -90 -8 -9 -27 -170 80 60 -101 209 -99 121 113 235 225 205
5937 205 -114 -37 -179 -69 -96 43 -138 34 23 -77 263 -310 -193 69 -52 54 36 -7 -119 114 9 -100
5959 -100 39 77 102 -121 -75 -96 128 -98 -28 -274 -51 210 116 148 180 187 30 81 -30 94 -33 -107 63 -84
5983 -84 -57 100 -7 44 185 53 48 190 103 -187 5 -80 -13 184 96 289 6 -219 120 -92 178 -4 120
6006 120 119 -20 -86 21 -130 36 -122 -167 173 127 -178 20 -130 -75 -53 -165 -41 20 46 -87 82 17 -22 24
6030 24 -317 191 86 270 -185 33 -85 -122 0 -66 51 -96 -174 -113 -190 -177 -65 -89 -238 -261 14 157 109
6053 109 204 352 -44 -206 -108 -49 -189 -89 -170 -239 -16 -65 -280 43 -57 188 6 -106 237 -132 -64 141
6075 141 83 68 -177 98 55 54 -61 -87 35 -1 78 53 -27 -58 -60 73 32 83 88 60 -147 5 76 109 103 -44 -145
6102 -145 192 -133 -296 -277 -62 15 -46 -96 -213 3 -166 -50 41 -63 145 67 -248 14 -35 -53 -118 176 161
6125 161 173 -138 80 87 258 -95 121 419 23 -194 -11 157 6 -195 -15 63 165 -28 -117 258 -94 136
6147 136 -67 -307 331 198 -81 -111 176 165 -59 95 -133 -136 129 -166 -150 151 -46 -224 -209 173 16 112
6169 112 -209 -47 -62 -57 64 133 157 -331 11 -21 19 71 61 -98 401 50 -17 -224 -146 228 181 90 -30 -79 135
6194 135 21 -76 -154 60 -60 -114 47 -338 -200 163 116 -87 -97 -50 -22 26 84 66 -130 84 71 149 -97 -257
6218 -257 -82 18 -276 243 110 109 85 37 -14 -37 -16 0 31 66 21 128 95 -24 -4 114 -24 -4 331 -16 -33
6243 -33 219 -167 119 86 55 38 56 -116 91 -20 -160 122 54 175 -286 88 -23 -90 -65 -165 -235 60 -14
6266 -14 -18 -169 -124 83 -257 160 -30 82 144 -156 30 -193 -80 120 -47 83 226 -47 159 -24 63 -125
6288 -125 15 7 168 170 29 -93 45 -90 245 51 -220 9 53 254 -81 -43 -19 -150 -10 151 -151 -62 -43
6311 -43 -227 -16 328 116 213 -55 -257 86 -161 -208 -5 -128 54 136 114 106 -346 -110 -52 -120 -127 -112 -1 -3 150
6336 150 -58 -206 -58 186 -112 45 52 -158 -141 -7 -31 -32 -189 -30 82 -114 88 -124 97 -91 -193 25
6358 25 209 136 -185 202 213 -168 216 34 -42 86 -85 125 310 149 95 64 -118 178 145 -40 -7 -205 118
6381 118 49 -108 -21 134 87 49 42 -71 -135 60 131 -53 -89 -141 67 -224 84 -17 -75 168 -108 239 99 -21
6405 -21 62 206 15 -7 -159 19 -80 23 122 -40 -33 216 354 25 -93 8 -178 20 4 -115 101 20 209
6428 209 31 -65 -14 -126 73 115 41 108 154 -225 -121 -95 107 -13 34 41 -140 84 -53 46 226 160 80 36 31
6453 31 -240 29 -113 20 64 -141 123 33 284 208 -2 -277 -85 -124 -135 53 57 -4 32 19 -168 17 111 11
6477 11 70 147 -104 -177 15 47 -6 -288 73 13 -63 107 -44 -26 -117 -12 132 -120 142 236 -270 33 40 1 -99
6502 -99 -4 -54 -21 164 218 -18 -131 9 195 89 -176 141 -51 -135 -123 -25 -177 135 120 76 8 107 -88 170
6526 170 -167 -210 74 133 68 -35 -131 -182 116 -54 -107 171 148 -68 31 -70 79 -34 -31 -52 210 -8 276 177
6550 177 -246 104 -54 46 123 -105 77 -204 -23 -220 -381 -209 98 -139 123 -13 7 -60 -10 241 -314
6571 -314 111 -1 126 -82 -81 -76 -290 20 128 -31 -265 -67 106 -74 -152 125 -140 -87 223 -239 -12 -121
6593 -121 -52 355 286 83 171 -26 20 8 -148 96 146 95 129 -282 -87 358 -63 41 133 -21 -105 66 256
6616 256 -3 28 346 -34 56 -137 -178 320 18 -303 -251 -60 5 176 -343 -138 12 109 32 20 153 -61 -14
6639 -14 -88 98 81 -172 302 50 -48 -85 -50 -156 -42 -54 91 -114 -55 -80 107 -303 -1 -47 66 257 162 46
6663 46 -98 10 63 79 -183 -67 125 -21 187 -203 104 -79 10 188 -102 -43 196 -95 -188 -229 133 100 -15
6686 -15 -99 117 34 -10 153 43 40 -17 413 135 36 116 -18 2 -29 84 78 -8 20 -41 -2 -136 94 -158 17 -99
6712 -99 -35 -111 155 -86 58 1 17 -329 256 32 -69 -54 -5 -90 -344 -160 -85 -71 -33 -167 57 124 -90 7
6736 7 -63 123 116 180 65 -179 64 2 -97 -105 -85 123 160 98 285 97 8 -80 90 290 -59 -87 89 88 194 -39
6762 -39 126 48 -60 -56 -132 -56 11 34 -196 -19 -160 -70 120 13 88 -69 -143 42 -101 -53 32 14 129 -195 104
6787 104 -2 -18 -268 45 80 -173 102 112 253 -73 -192 21 -119 -50 -2 -131 89 -125 59 96 -340 143
6809 143 13 108 -264 -41 -40 -6 87 115 19 -154 -92 79 164 -60 171 -216 -249 105 105 -47 -66 137 212 -101 217
6834 217 -12 -231 54 23 -188 -121 45 -83 -196 35 -28 149 213 -133 -49 29 152 269 -32 2 -235 -44
6856 -44 -383 46 113 154 151 -229 26 20 33 -97 34 233 143 9 -43 -102 -72 254 6 -276 -250 -142 114 19 292
6881 292 66 -200 60 -135 53 141 -128 192 152 96 -18 -69 100 96 -68 -193 -60 55 -25 -18 -13 17 -131 -295
6905 -295 210 164 -176 39 -208 74 -95 -78 88 163 40 -196 94 -324 -36 -5 66 -254 159 61 -204 -71
6927 -71 81 -64 91 173 -46 85 194 -118 -117 -34 -83 -31 -15 -44 225 278 -73 -112 -380 -46 -1 -179 -229 -109
6951 -109 169 69 61 93 -61 246 89 111 -55 -112 74 -17 -289 -263 158 -155 149 62 116 -40 64 5 69 81
6975 81 -313 91 46 -4 143 -107 -65 -145 322 -102 169 110 14 156 172 149 60 58 -30 260 54 -4 -233 -26 -82
7000 -82 153 -5 18 24 45 84 86 30 42 24 -474 207 -138 222 123 -98 -117 -31 107 49 94 -119 21 -107 -50 25
7026 25 -127 10 -174 57 156 -4 182 -37 4 171 48 -297 13 -49 -16 48 -24 45 118 37 73 103 -143 -268
7050 -268 -122 -56 26 -178 112 229 300 77 -33 -96 20 -55 3 -182 38 383 140 -92 219 115 -78 306
7072 306 -207 -8 -168 9 107 87 92 -59 176 247 -125 60 117 45 166 -89 -66 183 39 -157 101 159 -160
7095 -160 -208 -108 214 -126 -116 -195 103 19 -47 -20 -20 -16 348 -123 -122 139 -79 -169 41 -10 4 174 -229 -58 -97
7120 -97 -168 181 18 224 211 -258 -138 105 -119 244 0 50 62 26 -251 -137 177 -163 -10 -24 -29 -13 -155
7143 -155 -59 -9 162 -177 9 -99 -52 -120 40 -82 -78 -33 -27 86 -35 28 -159 -46 1 229 60 262 -96 -10
7167 -10 127 144 -64 96 51 -78 -70 -166 18 71 -384 -201 84 -200 59 -28 19 122 185 -38 70 -34 9 -122
7191 -122 139 -14 62 -170 -76 182 -137 -48 -135 46 -17 14 -242 115 -130 14 142 53 160 235 -74 136 29
7214 29 79 135 -212 -17 158 2 49 64 58 -84 5 -199 -48 -111 -256 156 -304 -13 -69 59 -48 -47 23 12 140
7239 140 71 -408 -88 38 -19 -31 -11 -148 -43 50 42 125 -109 163 8 153 -62 81 -58 25 -275 -43 123
7262 123 -68 130 -94 -25 -6 -58 372 140 56 243 -190 22 113 9 88 220 10 -38 -14 350 -59 -110 2
7285 2 42 95 -105 175 95 -225 -99 282 -102 -20 -90 -85 -168 76 93 78 -170 -10 -306 9 -139 120 254 248 69
7310 69 -135 90 83 -130 -115 -13 -126 202 -55 51 -51 -44 -23 133 -101 -158 310 -109 144 -134 13 -45 21
7333 21 103 -58 -132 -4 -41 149 -55 -58 172 74 4 47 55 115 -20 -51 143 -14 -2 -26 134 147 92 -82 -52 160
7359 160 126 -92 75 89 -219 235 124 178 -81 -32 93 -135 172 -89 -53 0 52 -54 159 2 -127 -139 111
7382 111 -349 -191 -229 -5 152 -274 -181 302 -23 -52 110 -130 -65 -134 -8 -182 -57 -112 -372 -2 -94 102
7404 102 321 70 64 97 25 -301 -50 -38 208 -265 -56 103 -53 46 -39 -93 83 -145 -113 -147 55 -3 46 -118
7428 -118 79 -2 -199 181 -85 189 -359 -78 -383 -27 -122 -10 -41 -110 -80 13 154 -18 -305 117 -95 77
7450 77 154 131 66 -197 133 -129 -61 -108 69 -129 135 32 218 -23 -115 194 157 81 135 5 -78 -248 -306 174
7474 174 214 -27 -259 184 66 23 28 -100 -254 125 -81 -179 86 83 -100 51 -122 -238 -121 -201 -257 89 -135
7497 -135 262 -122 62 -149 -4 -39 -69 -30 245 -1 4 -147 -128 -147 124 -322 -83 -53 -163 -410 73 171 -62
7520 -62 136 -77 -117 -55 -66 -259 -58 -177 9 166 189 107 76 57 -266 65 -140 27 -100 35 93 156 -60
7543 -60 -53 -106 -105 -56 -61 76 -153 24 -116 -266 -16 -134 -40 -40 17 -154 -178 -181 -89 -45 -319 127 15 -146 39 -65
7569 -65 15 6 130 -76 -62 43 -12 -247 31 0 87 -32 22 160 -25 -126 85 -53 -108 238 140 229 88 114
7593 114 40 63 47 -45 -153 153 -77 72 7 -104 8 -80 -204 -187 -33 -13 -49 208 -213 69 -133 -463 -57
7616 -57 23 83 -76 -199 -20 220 -136 38 160 102 5 18 46 13 -128 -109 298 -88 14 -30 -224 -84 -70 -356
7640 -356 103 -153 137 -162 -87 89 -125 57 6 152 90 -74 -126 -95 19 136 -136 -105 66 44 76 101 160
7663 160 55 -168 67 56 168 -95 -61 -59 -31 239 -195 -87 -53 -12 -41 37 -7 3 164 3 76 10 80 -234 -10
7688 -10 213 -177 238 -23 -42 -260 -195 -14 217 -39 -215 -126 -169 -190 102 -35 -97 99 139 -156 -63 -167 -118
7711 -118 49 116 -160 185 -54 -74 81 151 37 -4 44 -77 115 -141 72 -142 37 65 182 42 -119 115
7733 115 111 142 223 47 1 19 -57 -63 -100 -48 79 -49 68 8 106 145 99 337 -203 -225 62 113 266 123 -184 -64
7759 -64 -184 182 39 -37 78 72 -100 -78 -85 0 159 186 7 29 -315 145 104 -93 -126 239 131 -29 334 78
7783 78 -17 128 232 31 103 -123 95 -184 218 200 -12 41 -6 198 -21 -192 -54 48 96 14 -42 33 36 0
7807 0 15 268 9 -120 25 -261 119 82 -227 137 -174 51 107 -95 90 -200 77 14 -132 -33 -103 21 269
7830 269 59 41 131 300 148 -51 -77 91 -47 45 143 129 159 -89 -9 -70 167 -107 -66 -300 39 64 -86 -69
7854 -69 299 141 -176 26 38 72 -68 -39 84 17 48 -201 -64 -236 -27 -117 -56 110 21 132 -36 -29 -133 116
7878 116 -7 104 61 73 -196 -130 46 -169 -107 47 -88 116 -39 -143 -142 136 35 -134 -37 114 -168 117
7900 117 199 -102 55 -196 -113 168 -268 218 131 177 148 -112 -270 130 45 18 87 112 82 -166 175 -176 -101 -167
7924 -167 -14 6 -146 -98 -134 79 -50 -17 -70 119 58 -19 291 124 -197 17 -21 -166 -193 87 92 59 83 56 292
7949 292 232 215 124 -253 -26 53 142 40 -244 103 -149 -73 16 -1 -46 114 -29 -53 99 139 -199 -179 241 6
7973 6 -32 -121 156 237 -53 -20 -102 34 -80 -99 4 129 -30 -154 106 -137 -85 -68 8 -224 123 -217 -104 -28
7997 -28 -87 -164 97 112 -23 -105 -30 33 27 386 127 -362 2 349 10 -136 -194 -54 -164 -148 -43 8 -12 102
8021 102 2 -17 132 47 117 -241 -167 -199 29 -213 15 189 -48 -13 47 103 -148 -38 23 11 81 175 75 247
8045 247 274 -20 -301 136 -130 216 -225 -23 108 -133 -27 33 110 -395 -223 -116 -51 -87 -66 164 19 -24
8067 -24 21 -96 -103 -20 -205 -130 -120 48 -256 -68 -122 181 39 96 -110 195 -288 -131 106 42 104 90 158 -4
8091 -4 182 121 -104 69 -64 -35 99 -199 89 -130 36 57 -213 -1 32 -230 -97 -53 -12 -9 45 143 -33 24
8115 24 -176 111 7 52 -191 -59 47 261 -43 -62 93 83 149 -212 102 39 114 49 -52 149 -169 218 195
8138 195 -59 29 -155 -320 54 100 -152 128 42 14 -8 -139 195 47 228 15 -65 -80 -49 -82 -40 -132 -258 64
8162 64 -95 67 -112 130 -74 67 6 -313 -25 -252 147 35 23 12 52 -72 316 10 -86 125 83 101 5
8185 5 -40 -131 -3 115 32 44
8191D4
##END NTUPLES=NMR FID
##END=
