##TITLE=1H_Pr 4687-3d
 CDCl3, 8 sc, 
 27.2.2020
##JCAMPDX= 6.0         $$ Bruker NMR JCAMP-DX V2.0
##DATA TYPE= NMR FID
##DATA CLASS= NTUPLES
##ORIGIN= UXNMR, Bruker Analytische Messtechnik GmbH
##OWNER= root
$$ XWIN-NMR		Version 3.5
$$ Thu Feb 27 15:38:28 2020 Russian Standard Time (UT+4h)  she@DPX200
##.OBSERVE FREQUENCY= 200.1315
##.OBSERVE NUCLEUS= ^1H
##.DELAY= (6, 6)
##.ACQUISITION MODE= SIMULTANEOUS
##.ACQUISITION SCHEME= undefined
##.AVERAGES= 8
##.DIGITISER RES= 18
##SPECTROMETER/DATA SYSTEM= spect
##.PULSE SEQUENCE= zg30
##.SOLVENT NAME= D2O
##.SHIFT REFERENCE= (INTERNAL, D2O, 0, 15.7039)
##AUDIT TRAIL= $$ (NUMBER, WHEN, WHO, WHERE, WHAT)
$$ ##TITLE= Audit trail, XWIN-NMR		Version 3.5
$$ ##JCAMPDX= 5.01
$$ ##ORIGIN= Bruker BioSpin GmbH
$$ ##OWNER= she
$$ F:/spectra/data/she/nmr/H-F/1/audita.txt
$$ ##AUDIT TRAIL=  $$ (NUMBER, WHEN, WHO, WHERE, WHAT)
(   1,<2020-02-27 15:37:12.65 +0400>,<she>,<DPX200>,
      <created by zg, POWCHK disabled, PULCHK disabled
       configuration hash MD5:
       00 E9 B6 7A A2 85 ED C7 34 08 36 98 17 FE 4E 26
       data hash MD5: 16K
       59 B5 F0 14 5C FE C9 40 B7 28 C3 92 87 A9 E4 87>)
$$ ##END=
$$ 
$$ hash MD5
$$ 25 4B 5F ED 56 18 A8 10 26 A9 A5 F7 E0 FE D3 02
##$RELAX= 
##$RELAX= 
##$RELAX= 
##$RELAX= 
##$RELAX= 
##$RELAX= 
$$ Bruker specific parameters
$$ --------------------------
##$DU= <F:/spectra>
##$EXPNO= 1
##$NAME= <H-F>
##$PROCNO= 1
##$TYPE= <nmr>
##$USER= <she>
##$AMP= (0..31)
100 100 100 100 100 100 100 100 100 100 100 100 100 100 100 100 100 100 
100 100 100 100 100 100 100 100 100 100 100 100 100 100 
##$AQSEQ= 0
##$AQ_mod= 1
##$AUNM= <au_zg>
##$AUTOPOS= <>
##$BF1= 200.13
##$BF2= 200.13
##$BF3= 200.13
##$BF4= 200.13
##$BF5= 200.13
##$BF6= 200.13
##$BF7= 200.13
##$BF8= 200.13
##$BYTORDA= 1
##$CFDGTYP= 0
##$CFRGTYP= 5
##$CHEMSTR= <none>
##$CNST= (0..31)
1 1 145 1 1 1 1 1 1 1 1 1 1 1 1 1 1 1 1 1 1 1 1 1 1 1 1 1 1 1 1 1 
##$CPDPRG= <>
##$CPDPRG1= <>
##$CPDPRG2= <>
##$CPDPRG3= <>
##$CPDPRG4= <mlev>
##$CPDPRG5= <mlev>
##$CPDPRG6= <mlev>
##$CPDPRG7= <mlev>
##$CPDPRG8= <mlev>
##$CPDPRGB= <>
##$CPDPRGT= <>
##$D= (0..31)
0 1.2 0 0 0 0 0 0 0 0.06 0 0.03 0 0 0 0 0.0002 0 0 0 0 0 0 0 0 0 0 0 0 
0 0 0 
##$DATE= 1582803431
##$DBL= (0..7)
120 120 120 120 120 120 120 120 
##$DBP= (0..7)
150 150 150 150 150 150 150 150 
##$DBP07= 0
##$DBPNAM0= <>
##$DBPNAM1= <>
##$DBPNAM2= <>
##$DBPNAM3= <>
##$DBPNAM4= <>
##$DBPNAM5= <>
##$DBPNAM6= <>
##$DBPNAM7= <>
##$DBPOAL= (0..7)
0.5 0.5 0.5 0.5 0.5 0.5 0.5 0.5 
##$DBPOFFS= (0..7)
0 0 0 0 0 0 0 0 
##$DE= 6
##$DECBNUC= <off>
##$DECIM= 24
##$DECNUC= <off>
##$DECSTAT= 4
##$DIGMOD= 1
##$DIGTYP= 9
##$DL= (0..7)
0 120 120 120 120 120 120 120 
##$DP= (0..7)
150 150 150 150 150 150 150 150 
##$DP07= 0
##$DPNAME0= <>
##$DPNAME1= <>
##$DPNAME2= <>
##$DPNAME3= <>
##$DPNAME4= <>
##$DPNAME5= <>
##$DPNAME6= <>
##$DPNAME7= <>
##$DPOAL= (0..7)
0.5 0.5 0.5 0.5 0.5 0.5 0.5 0.5 
##$DPOFFS= (0..7)
0 0 0 0 0 0 0 0 
##$DQDMODE= 0
##$DR= 18
##$DS= 0
##$DSLIST= <SSSSSSSSSSSSSSS>
$$ [...]
##$SUBNAM2= <"">
##$SUBNAM3= <"">
##$SUBNAM4= <"">
##$SUBNAM5= <"">
##$SUBNAM6= <"">
##$SUBNAM7= <"">
##$SUBNAM8= <"">
##$SUBNAM9= <"">
##$SW= 24.9337058887773
##$SWIBOX= (0..15)
0 0 2 0 0 0 0 0 0 0 0 0 0 0 0 0 
##$SW_h= 4990.01996007984
##$TD= 16384
##$TD0= 1
##$TE= 0
##$TE2= 300
##$TE3= 300
##$TEG= 300
##$TL= (0..7)
0 120 120 120 120 120 120 120 
##$TP= (0..7)
150 150 150 150 150 150 150 150 
##$TP07= 0
##$TPNAME0= <>
##$TPNAME1= <>
##$TPNAME2= <>
##$TPNAME3= <>
##$TPNAME4= <>
##$TPNAME5= <>
##$TPNAME6= <>
##$TPNAME7= <>
##$TPOAL= (0..7)
0.5 0.5 0.5 0.5 0.5 0.5 0.5 0.5 
##$TPOFFS= (0..7)
0 0 0 0 0 0 0 0 
##$TUNHIN= 0
##$TUNHOUT= 0
##$TUNXOUT= 0
##$USERA1= <user>
##$USERA2= <user>
##$USERA3= <user>
##$USERA4= <user>
##$USERA5= <user>
##$V9= 5
##$VALIST= <valist>
##$VCLIST= <CCCCCCCCCCCCCCC>
##$VD= 0
##$VDLIST= <DDDDDDDDDDDDDDD>
##$VPLIST= <PPPPPPPPPPPPPPP>
##$VTLIST= <TTTTTTTTTTTTTTT>
##$WBST= 1024
##$WBSW= 4
##$XGAIN= (0..3)
0 0 0 0 
##$XL= 0
##$YL= 0
##$YMAX_a= 117127
##$YMIN_a= -82823
##$ZGOPTNS= <>
##$ZL1= 120
##$ZL2= 120
##$ZL3= 120
##$ZL4= 120
##$ABSF1= 10
##$ABSF2= 0
##$ABSG= 5
##$ABSL= 3
##$ALPHA= 0
##$AQORDER= 0
##$ASSFAC= 0
##$ASSFACI= 0
##$ASSFACX= 0
##$ASSWID= 0
##$AUNMP= <proc_1d>
##$AZFE= 0.1
##$AZFW= 0.1
##$BCFW= 1
##$BC_mod= 2
##$BYTORDP= 1
##$COROFFS= 0
##$CY= 11.3945322036743
##$DATMOD= 1
##$DC= 2
##$DFILT= <>
##$DTYPP= 0
##$F1P= 16.9975609425685
##$F2P= -3.02152046262296
##$FCOR= 0.5
##$FTSIZE= 0
##$FT_mod= 4
##$GAMMA= 1
##$GB= 0.15
##$INTBC= 1
##$INTSCL= 1
##$ISEN= 128
##$LB= 0.24
##$LEV0= 0
##$LPBIN= 0
##$MAXI= 10000
##$MC2= 0
##$MEAN= 0
##$ME_mod= 0
##$MI= 1.114404
##$NCOEF= 0
##$NC_proc= 0
##$NLEV= 6
##$NOISF1= 3.799351
##$NOISF2= 2.8
##$NSP= 1
##$NTH_PI= 0
##$NZP= 0
##$OFFSET= 15.70392
##$PC= 1
##$PHC0= -9794.585
##$PHC1= 25.20082
##$PH_mod= 1
##$PKNL= yes
##$PPARMOD= 0
##$PSCAL= 0
##$PSIGN= 0
##$REVERSE= no
##$SF= 200.130013532006
##$SI= 16384
##$SIGF1= 3
##$SIGF2= 2
##$SINO= 400
##$SIOLD= 16384
##$SREGLST= <1H.CDCl3>
##$SSB= 0
##$STSI= 0
##$STSR= 0
##$SW_p= 3612.71676300578
##$SYMM= 0
##$S_DEV= 0
##$TDeff= 0
##$TDoff= 0
##$TI= <>
##$TILT= no
##$TM1= 0
##$TM2= 0
##$TOPLEV= 0
##$USERP1= <user>
##$USERP2= <user>
##$USERP3= <user>
##$USERP4= <user>
##$USERP5= <user>
##$WDW= 1
##$XDIM= 8192
##$YMAX_p= 0
##$YMIN_p= 0
$$ End of Bruker specific parameters
$$ ---------------------------------
##NTUPLES= NMR FID
##VAR_NAME=  TIME,          FID/REAL,        FID/IMAG
##SYMBOL=    X,             R,               I
##VAR_TYPE=  INDEPENDENT,   DEPENDENT,       DEPENDENT
##VAR_FORM=  AFFN,          ASDF,            ASDF
##VAR_DIM=   8192,          8192,            8192
##UNITS=     SECONDS,       ARBITRARY UNITS, ARBITRARY UNITS
##FACTOR=    0.0002004,     1,               1
##FIRST=     0,             0,               0
##LAST=      1.6414764,     0,               0
##MIN=       0,             -82823,          0
##MAX=       1.6414764,     117127,          0
$$ Real data points
##PAGE= N=1
##DATA TABLE= (X++(R..R)), XYDATA
0@%%%%%%%%%%jRj6J6j6J7k5L2l3M1m9N7o5P4q9J02j16J32j49J68j90K13k39K69
34A42l01L36l73M15m62N10n65O29o95P69q53R45j050J166j297J451j630J841k097
53a119K413k814L344m080N182p036J0948l6735P3651N8961j03063p8364K5327
66e3385Q0118P673m7158k9598K8038L1011J896j9388j0593j0157l133J8284L7460
79C1068J1900l5142m8332K301N2091L5782k8677m3555P132M2854P596l7224k4960
92b7166K0953L2981M941j9046j2305r72o401m863J7061K7019m854l4032j7157
105b3841J9419J9726q355j6824N527J8281R6j7427r342N250K106R22J5445J5038
119B6021j4729l3223q724K9298K9068o901k8315p953K2806J5272j9524k4985R737
$$ y = [0, 0, 0, 0, 0, 0, 0, 0, 0, 0, 0, -1, 8, -8, 8, -8, 9, -16, 16, -17, 24, -25, 32, -33, 41, -48, 54, -62, 70, -79, 89, -101, 112, -127, 142, -159, 177, -196, 219, -243, 267, -298, 331, -364, 405, -448, 497, -553, 613, -684, 767, -863, 978, -1119, 1294, -1520, 1824, -2256, 2926, -4110, 6838, -29897, 43754, 102715, -348, -78712, -53385, 26733, 34406, -12752, -42350, -14312, 16699, 18595, -793, -11386, -21543, -24676, -6392, 31068, 42968, 7826, -40506, -38205, 13886, 49668, 20991, -22564, -15432, 27422, 35018, -2206, -27166, -6213, 26768, 31709, 12663, 358, -614, -7015, -11878, 5183, 32202, 27348, -6684, -23841, -4422, 15304, 6949, -9875, -4348, 13933, 14029, -3398, -12740, -7490, -5384, -4462, 10983, 26021, 11292, -21931, -30655, -1357, 27711, 20810, -7505, -15458, 7348, 22620, 3096, -21889, -12152]
132a2152L3485R861k4076k0704O944J3273n006o809J4186J5742j5010k8983J257
145a7992K7017P542k1551j0411K0258J7023j9495l1815L689L4348J3423k3756
157a720j9104J3650J6940j2159k2320N507K9081J1819k1513k4189M829K1100N347
170G268j1587m280J0031O572p427j1413O79R031M509l43M027K281j1907j5924
184a8483N895K4161Q747j8027j6668Q707J6224l854j8935k769J9244J3792j0081
197G953j7199m309O766P050L755P73l004m675l249J991M007m53l035L305Q742
212H418P90j2618j0985O401J6908O401j0782j0101L960R593l404j0969K103J5834
226A1549O250j1390j2810J573R490K183l957J457N942k064j1366l469Q218N764
$$ y = [-12152, 21333, 31194, 7118, -13586, -6642, 6631, 1625, -5184, 9002, 24744, 9734, -19249, -17992, 9025, 16567, -4984, -15395, 4863, 21886, 2391, -29424, -25735, 8613, 22036, -1720, -20824, -7174, 9766, -2393, -24713, -19206, 9875, 21694, 181, -24008, -19179, 1921, 7268, -4319, -8599, 1432, 8004, 577, -10836, -10157, -1126, 3383, 3040, 7067, 9348, -2559, -18483, -12588, 11573, 20320, 2293, -14375, -5668, 10556, 6702, -12233, -15002, 4242, 18034, 7953, -9246, -13555, -6789, 261, 4016, 4789, 1785, -2890, -6139, -4148, -141, -594, -3629, -324, 8418, 9208, -3410, -14395, -7994, 8914, 15315, 4533, -5568, -1608, 7985, 4581, -6388, -4285, 11549, 17799, 6409, -6401, -4828, 4662, 6845, 2888, 4345, 10287, 8223, -3143, -6612, 1606, 7370]
240G370l444k849M224J993q091q744K746J1942N721o524q144N67L113j735l479
255e334K971Q406K832p954r540Q99Q710K401m773L78O617J205r464q351M240J1204
271D447M208m589m881q33j698k270K535O421J291m962j909K125j19o381l506P061
287c060J1205J422j2394j1031K392R774M164k774l373L75J960j530m713k197M847
302d933O262J949j706m581o139k291N532R834L204o043p342N74N339m77n054J295
318d577J0001M058o999r429j013M983M771K025J88N7l521m971k006M406M767R87
334C727L7q87k404l991k089J909N274N045l39n289l440j007O36M03M177N353Q91
351H006n848o641o74N114L685q50M79L495m14p484m685K870P111L724m00k783
$$ y = [7370, 3926, 1077, 5301, 7294, -797, -9541, -6795, 5147, 10868, 4344, -3800, -3233, -120, -1855, -5334, -2363, 6043, 8875, 921, -8619, -7720, 990, 3391, -1382, -1004, 5613, 6818, -2646, -10997, -6757, 4447, 8655, 4066, -815, -1648, -3346, -5616, -3081, 3340, 4631, -331, -2240, -115, -234, -6615, -10121, -3060, 8145, 9567, -2827, -13858, -11466, -1692, 2472, -302, -3675, -3300, -1340, -2870, -7583, -9780, -4933, 1329, 3278, 1572, -3009, -9148, -11439, -5907, 3927, 7131, 1088, -6254, -5680, -341, -818, -5872, -4577, 5424, 9482, 2483, -6946, -7959, -2976, 1795, 3820, 4008, 4065, 544, -4427, -6433, -2027, 2740, 3727, 3764, 2877, 473, -3518, -5607, -3698, 1576, 6621, 6282, 993, -2447, -3454, -2818, -2415, 1762, 7115, 8006, 2158, -4483, -5157, -43, 3642, 2792, 3271, 6766, 6352, -1132, -5817, -2947, 4164, 7888, 7488, 4705]
367D705l331k701j773K384N302L109j916k900j276k156k599Q65M586N014P76n173
383B916o677k426M010M033J100K86P04j680m309l759O18N341M562l44k919j396
399F0k593l396P31N670M698n65l466l134j856J6O01K814M635Q76m480m355q54
416d598N52K025K797K520J59k560m040l319P47N073L354R8k140k279k338j571
432e520R14K589L869K012k615m135j734l82P79L045M078J317l559m435j575J467
448c885K531K168J376J112j519m285k156J176L597K116J194k71j812l378j364
463c400P38K921L317J271j983l140j968m78K031K317J782J64o34k794k573j52
479b581J964J809J898J733j766m255k263J236L673K321j17j569j193o72j251n65
$$ y = [4705, 1374, -1327, -3100, -716, 4586, 7695, 5779, 2879, 1603, -553, -3152, -2287, 2299, 7313, 8089, 2916, -3761, -6187, -2177, 1856, 2956, 3242, 3946, 2266, -2043, -5802, -5184, 157, 4719, 4375, 1456, 60, -2533, -5929, -5198, 472, 5170, 4605, 1139, -1995, -3851, -3835, -3234, -420, 4215, 5091, 611, -3744, -4598, -4046, -2021, 776, 3296, 3455, 895, -3145, -6464, -5717, -644, 2710, 2808, 668, -1611, -3949, -5520, -4606, -2017, 1852, 3864, 1249, -2886, -4620, -5002, -4223, -1178, 2900, 4217, 658, -3777, -5352, -3885, -1354, 814, 2190, 3302, 1783, -2502, -4658, -3482, 115, 2231, 3425, 3154, 1342, -2036, -3400, -2662, 259, 3576, 4847, 2864, -276, -2244, -2722, -691, 1626, 3408, 3572, 2938, 144, -2429, -2581, -617, 1192, 3090, 4823, 3057, -1198, -3461, -2225, 1448, 3769, 3652, 2083, 890, 218, -1033, -1598]
495a598K018K984N27q77j198l010j879K097K990K333k52k261k395q50J64J074
511a33J318J712nj283j867k179q6J746K883M31j267j094j638j467j05K244K649
528A859L36j412k223j200n5P76J514J476N18k175j664l64K75O48R49J303Q05q75
546D91k065k225j05K576K711P19k030k505n98O44J296N9P61Q64q3j386j338n18
564b732K12J167K078J378j144l195k390J099L489K205j172k133q89N42Q67j73
580g91r01M61K261J605j474l432j863K031L564J989j003k706j521p3J188K000
596A335M72p35j211J017R17j155k022k38K289L009J032l579m150k42L816L471
612D026k25l305j141J226J243j560j155Q61K192J195j124j746j722n80J596K360
$$ y = [-1598, 420, 3404, 3931, 3054, 1856, -1154, -3033, -936, 2054, 4387, 4135, 1874, -521, -1371, -1207, -133, 1185, 2897, 2892, 1609, -258, -2437, -2523, -777, 2106, 2537, 1270, 176, -1462, -2929, -3034, -790, 1859, 2195, 783, -1440, -2640, -2695, -1919, -405, 1071, 1589, -586, -2250, -2614, -2339, -1691, -742, 561, 1366, 491, -1574, -3799, -3904, -1328, 1383, 2102, 72, -2433, -3031, -2387, -1091, -1032, -271, 593, 510, -876, -2214, -2732, -2520, -1353, 725, 2103, 959, -2236, -4626, -3527, -38, 2167, 995, -1138, -2027, -1485, -618, -791, -1692, -1231, 1030, 2635, 1161, -2271, -4134, -2103, 1461, 3450, 2447, -259, -1780, -1853, -665, 1335, 1807, 1072, -139, 878, 1795, 640, -1382, -1620, 669, 3678, 4710, 1131, -3019, -3261, 555, 4026, 3801, 496, -645, 581, 1824, 264, -891, -30, 2162, 3357, 2233, 487, -1235, -1815, -219, 2141]
628B141K011r79l117k338J058K665O56j009n87P23Q87j051k742p01K376L615j31
645C477k859k326L03J008M81J64J181Q72q63k514j473J167J986N96k69l26n75
662C0n49j248m42Q72K765N46j083j824j259j22J036Q93J280Q88j004l006q16J297
680a746J813K69q09J83J261k43k618k289J615M089J924k097l085j241R76J742
696b56L58k61L83M99n40j112j172R96N90Q78J148K15j136k864j525K178L733J269
714C381k767k836N04J842O08j228n14J397J764M49k711k601K42K771K285M21j458
731A549j898r79L64J347J187O04j472m83K46P76j181j816N09L210K051j250l952
748a188j973J911L084R56j570j354J11Q13m58j700J9J916K131n29j696j203q38
$$ y = [2141, 4152, 3173, 56, -2282, -1224, 1441, 2097, 1088, 501, 1224, 2111, 1060, -1682, -2383, -7, 3608, 3477, 618, -1708, -1405, -397, 84, 248, 1429, 2301, 1438, -1076, -2549, -1382, 604, 1200, 931, 605, 30, -519, -1767, -2209, -1337, 1428, 1974, 891, -933, -2192, -2314, -1278, -385, 895, 1783, 779, -2227, -3043, -1746, 67, 336, -473, -290, 971, 728, -1890, -4179, -2564, 1525, 3449, 1352, -1733, -2974, -1998, -256, 102, -159, 224, 723, 183, -929, -2101, -1105, -515, 363, 1511, 1726, 590, -2274, -3799, -1621, 2112, 3381, 614, -2222, -1718, 124, 732, -496, -1010, 387, 2151, 2600, -111, -2712, -2470, 301, 2586, 3007, 1549, -349, -1328, -964, 383, 1570, 2174, 702, 219, 465, 1241, 60, -1756, -1247, 1963, 4014, 2764, -1188, -3161, -1250, 1834, 2790, 1220, -134, -23, 790, 332, -1368, -1349, 567, 2698, 2169, 473, -730, -1568]
765a568P97J006J325N40p96k127r91J296P73j61%M51P92q69j899q75J161K377
783A232Q67j301j675l42L66J94m85P17J137Q61j269k402l37J578J479n00l17J06
801i1jp31p11l17J791O36J12l49j156l64l82K43J232J100p2q67j549l27P75J282
821B54l25l3K25M3m29q15m63O33J477P90m62j718l76K09L70P90P26l13l19l87
841a23n54J95L36L96J90L23J22n30j427p12J118J943J070j513j716L36J017J28
859E99o73L31L61M59k42p24p80K51Q79O31O09p45r91n49K00R39Q60j96o24o44
879d9rM95l17q10J167P23L98j055j517K1J320L35L83l90l08l00n11K24L17K39
899C56K71J40o22l78l41j10M25P07K57o5p31j57m21L1P23N38k64j75m66n64M40
$$ y = [-1568, -771, 235, 1560, 2100, 1304, -823, -1814, -518, 255, 94, 94, 545, 1337, 468, -1431, -2306, -1145, 1232, 2099, 798, -877, -1219, -853, -659, -1144, -427, 710, 1571, 302, -2100, -2437, -859, 620, 120, -197, -91, -92, -823, -1534, -1851, -60, 576, 688, 339, -817, -1181, -1563, -1320, -88, 1012, 940, 73, -1476, -1803, -1028, 254, -71, -104, 121, 164, -265, -1080, -1543, -910, 567, 1357, 895, -823, -1199, -990, -620, 170, 896, 583, 264, -123, -677, -482, -146, 250, 440, 763, 885, 355, -1072, -1784, -666, 1277, 2347, 834, -882, -546, 471, 599, -74, 257, 618, 1077, 835, 111, -669, -418, 461, 1092, 1701, 956, -35, -584, -384, 555, 1415, 1219, 595, -49, -58, 437, 120, -690, 477, 1200, 1598, 543, -974, -953, 367, 702, 1085, 695, 387, 87, -424, -200, 117, 356, 627, 767, 145, -233, -574, -684, -259, 448, 705, 640, -91, -248, -669, -638, 85, 623, 359, 184, -282, -846, -406]
920d06L59l5M26p0k27Lr78O2O09n8Q75m60m57j64n81N57N81O68m63n68L9k35K39
943b84m68N22L60N13k70r73m17K83N11K86L21M4q00l9l27K47L11M63M59k41l63
964A38m94r3J43K76O25J17k80o63j32j88N14K16N99K45o94l25p07M57N32L23J06
985G15mj32o76m62R9P15L99K89k63o34m84Q9L60J43P10l9m40n11k06M0J4M54L42
1008E18L62l45o24m32K36M53L61J50p3l11l40o56L85L05N95O5r8r77k53k54M65
1029d68O72R1M63p28j85l93o7K23N46K96L14m88p01m68j92Q52K63L07J8l07n82
1050e34l40K04J64L18N34m64J04o32k68L13M50L95J88p3p45l71rL3L44O11Q5l26
1072a9o09m2k11O68O4N59j81lo94l54j1P65M96L90l01o98l55k48K30O00L09M17
$$ y = [-406, -47, -82, 344, 274, 47, 50, -928, -866, -257, -315, 560, 100, -357, -521, -1102, -545, 36, 704, 241, -327, -288, -523, -284, -752, -230, 130, 643, 373, -600, -1017, -734, -223, 63, 384, 428, -372, -411, -738, -491, -180, 283, 742, 501, 138, -356, -449, -306, -30, 595, 712, 432, -231, -363, -551, -37, 179, 778, 1023, 329, 4, -703, -246, 286, 609, 715, 711, 579, -97, -559, -460, 255, 654, 943, 680, 46, -438, -349, 11, 154, 864, 825, 385, -126, -332, -292, -278, 176, 518, 880, 535, -89, -521, -285, 168, 529, 679, 606, 295, -45, -701, -316, -11, 584, 649, 551, -426, -679, -933, -468, 204, 295, 758, 30, -155, -548, -615, -392, 154, 450, 764, 276, -425, -893, -1085, -233, 30, 337, 355, 48, -534, -874, -670, -506, -188, 346, -118, -14, -646, -914, -601, -151, 244, 432, 359, -386, -757, -766, -733, -389, 222, 307, -19, -628, -670, -881, -213, -149, 410, 229, 226, -468, -822, -833, -68, 428, 818, 517, -181, -536, -784, -554, 46, 355, 772]
1094G72k64n92l99m43O75M55N16j24k75n53j55J20J10L85J63J52L3o31l87m8M97
1115GM39L59j2n08o25J67j86N13L11J47p2k92n01m26N60N19K03L99j42o60n15
1136c15J40J85K04L13K50l87n30l40J78L93N12J65k6o03j29m87K25J98M00K61
1156F07K4n86k07l73K20N63K6J32j47k40k07n18M34J29N64J14k14o85k90j1J06
1177e59O32M26m15l84j92l4N8K13L54P5%k67l29l59K27N36mJP9j14K1n13L04K55
1201A1M73k84m35l31p7K27lO05n5K41J06j076K24k35P24J83n7lj94k78q8J16J81
1224b5N31k71l68K55k79j45M25N9k7L90l81k40m18L24K83K77J90m39R6p9m8k14
1246a04K2N37o8M9k35l96N8K71M67J30k54k73l26k84K58M16L15l71k40K87Q4j46
$$ y = [772, 508, -84, -483, -926, -251, 204, 720, 596, 321, -232, -387, -267, -157, 228, 391, 543, 576, -55, -442, -490, 7, 446, 805, 793, 285, -340, -173, -359, 154, 465, 612, 540, 248, -253, -679, -119, 400, 603, 1002, 860, 200, -315, -175, 10, 214, 527, 777, 390, -140, -480, -302, 91, 603, 768, 742, 139, 10, -477, -252, -54, 346, 607, 631, 45, -162, -535, -315, 248, 274, 406, 259, 19, -188, -706, -272, -143, 421, 535, 321, -364, -654, -665, -559, 73, 499, 84, -300, -492, -526, -468, -255, 99, 174, 174, -93, -422, -781, -554, -18, -22, -21, 58, -56, -35, -548, -244, 11, 484, 200, -235, -566, -643, -416, -419, 186, 131, 372, 478, -598, -374, -609, 115, 298, 241, 238, 44, -234, -322, -206, -25, 506, 235, -133, 122, -157, -302, 123, 182, 155, 545, 164, -76, -494, -170, 113, 390, 580, 141, 237, 158, 110, -104, -82, 455, 387, 436, 201, -195, -137, 134, 601, 731, 477, 204, -122, -406, -148, 268, 583, 212, -28, 259, 343, 197]
1268A97o01M57L16J44L57r68m18K73j35O38K95j13k07k68k65j24L06M00l21L7
1288@k74L27j59l71j37R14L46k7p69l83j52O46M7j55p4M75k40m57j25Q9M86Nl3
1311b1J8j76n37K48j97L90P34k39j68n31m2r8J56Q2J33P15k21q97l12N60J01L20
1333A8J97l04j63k95k78M24L29K83K03L30j063l77K56L40J14R3n1L07n19n64K69
1354d51K2P64K17J17p90l00K72k22p2P12O99n49m31o99N64J83l1L55l1K66Oo56
1376e5o23L94J077K78m80l81k48J00J45l74N24M40K64q17n72N4L35pJ02N69Q5
1397H10k7r10m16M56N21M63n76j44J23k71j96j41m3P73N28n17q24j14K84K8L17
1418A24N53N4m66n77k25L1M12K55Q8nr2r3n77k62M01O71K91k18o15k13K46k24
$$ y = [197, -404, 53, 369, 513, 870, -98, -516, -243, -378, 260, 555, 442, 235, -33, -298, -422, -116, 284, -37, 0, -274, 53, -106, -477, -614, 300, 646, 619, -150, -533, -685, -39, 8, -147, -221, 254, 14, -443, -568, -479, 7, 12, -21, -3, -179, -716, -468, -665, -275, 459, 220, 52, -479, -521, -619, -463, -381, -248, 467, 246, -651, -963, -403, -302, 18, 215, -89, -252, -547, -825, -401, -72, 211, 414, 744, -319, -696, -440, -100, 14, 107, 56, 363, -156, -720, -451, -429, 335, 552, 669, -121, -421, -149, -371, -443, 269, 968, 419, -12, -711, -147, 36, 5, 360, 329, 595, 601, -55, -678, -284, 793, 1071, 591, 210, -38, 62, 207, -167, 357, 797, 1061, 244, -328, -274, 61, 54, 156, 725, 810, 783, -127, -543, -87, 434, 897, 321, 177, 300, 29, -167, -308, -351, 422, 950, 433, -391, -505, -221, -193, 124, 677, 731, 265, -312, -537, -506, -94, 161, 249, 244, 152, 59, -518, -780, -379, 292, 583, 365, -250, -463, -217, -441]
1440d41L37K46J35ml38J0p86O29L53o6J35j10l34l36J31pL38M34j06m4q39J18
1462e45m7o9Q22l39N64j99m05p62M66N22K74r3P6k40l74l13J94L13M22N30r08
1483a11Qn79M67o2K07N21pj19k52p46M5P50K54jJ1J3j97n21j4K62L82N18l75o83
1507b29M24l23J19j01L37N31k42l59m31Q5J52J57J90L27j8o58j81r0L31M10q1
1528C50J71J60p11j45l17L08M62K01J22m85M7l26p9J80L92J14j07m11K0j69J61
1549f2k92O26L16m18n02k09L22N5J59J29qj69j4l24q6M94K39k39O5m76J81j65
1571c78m2K98K29K8j52l46j89K45j99K4L38L34n5l57m43J47L5N72j08j31j40K22
1593f8k58m58N81K90K8L3o32L2J41k30L99J61Q8P5l87j73M42l39L58K84j60L7
$$ y = [-441, -104, 142, 277, 273, -65, -55, -841, -212, 141, 75, 210, 100, -234, -570, -439, -446, -108, 326, 220, 176, -663, -545, -592, -661, 161, -178, 386, 187, -218, -980, -514, 8, 282, 189, 265, 25, -349, -662, -468, -155, 267, 797, -111, -103, -682, -215, -277, -70, 451, 444, 325, 73, -673, -628, 122, 376, 375, 386, 399, 202, -319, -333, -71, 311, 829, 454, -229, 195, -128, -9, -110, 227, 758, 516, 157, -274, -189, -37, 120, 310, 637, 619, -39, -220, -310, 21, 431, 350, 521, 681, -30, -175, -492, -184, 278, 479, 601, 116, 163, -163, -242, -62, 330, 444, 337, -74, -54, -223, -62, -354, 272, 588, 170, -332, -541, -219, -164, -5, 124, 116, -53, -67, -391, -477, 17, 256, 17, 82, -394, -213, -378, -420, -122, 107, 135, -17, -363, -552, -307, -506, -482, -144, 190, 135, -222, -665, -518, -483, 89, -19, -150, -290, -68, -326, -784, -203, 87, 115, 148, -484, -452, -311, -541, -142, 19, 107, 182, -205, -378, 64, -275, 83, 367, 207, 244]
1615B44l63l6k45M42L53O0k18j20k72p9j90K96M10K09o4p83P0K64j08L63J85L87
1637H05m64r3o39J69J21N43K38k7k00m32k42J46J64K37K64K17o60l0m40J79K46
1658A02J57K21P3l70J87o22J44L38L64P5m18N2o35K63J31J28N26j22n9p80j09
1679c54J65K26J02K38O7o72J04l84J85J03N94K82k72m68l96J03k64L68N75K17
1699E19l02l91m27J37M24q0K96J28k33k29j71k01K47M55K37m19L2j97n38n5M14
1720c54N77M24m71l33r0k21j77M83N78k2k73k77l99l26O02J08N63J64j77o72j68
1741d61j99K97P30k76K38K4m86j21l65L66K34N07M4m30m15j97L35J27N91m5j82
1762C16k45n04joO82J76O7L28n51o44J13nN05L60k1n5m03l96l0L55p3O78O5k57
$$ y = [244, -119, -155, -400, 42, 395, 455, 237, 117, -155, -234, -424, -128, 282, 491, 427, -356, -286, -22, -130, 233, 418, 805, 341, 248, -391, -222, -101, 442, 680, 653, 453, 21, -221, -75, 89, 326, 590, 807, 147, 117, -323, -144, 102, 259, 480, 553, 183, 370, -252, -108, 230, 594, 669, 251, 303, -332, -69, 62, 190, 716, 594, 535, -245, -354, -189, 37, 139, 377, 444, -228, -124, -508, -323, -220, 374, 656, 384, -84, -480, -377, -641, -273, 302, 519, 217, -174, -601, -464, -40, -120, 176, 304, 71, -158, -329, -530, -283, 172, 409, -10, 22, -175, -713, -768, -354, 223, 647, 176, -157, -247, -468, -645, -162, 416, 394, 121, -156, -555, -881, -279, -171, 392, 556, 379, -293, -461, -660, -363, 367, 91, 329, 353, -133, -254, -619, -253, -19, 488, 532, 102, -313, -510, -175, -48, 543, 498, 316, 71, -433, -434, -440, 242, 418, 485, 813, 262, -382, -269, -274, 231, 591, 570, 515, 112, -284, -314, 41, -32, 646, 711, 454]
1786D54l85m98O7M97J91K99Q3n92k70q1P8J23M05L0J17l61l39k74L21M02J32j97
1808B02N50n88m22l56K63N74j2L57l84m75P5M8j03L06J47K23l19m57k19N7K72
1829b61L88P9j37Qm57l02k7P42J8J36O0l71o0m26Q8L47J36J67k27l34J08k47k25
1852g97O98%K09l56k60j22K77K32p3K97k1l34j30l10K69J50L03M66k75m52k51
1873d80N9Q1K35K66k5J27o37L5oj08M31L02l5j23l54k37M42J88J16j87K74k82
1895H2m64J37L30p0M46K7kk55k08j45J20K18J13J07J00m35n23K05M20K80n7O1
1917D87j5m21k4M0K01J02L03l67J63o38l3R7N64l13J01J24j1n00J89K11n8K40
1939D42j27j09k49j94j34L94J39L25k62k72j18j09L24J6J30j7J6O4l00n93N11
$$ y = [454, 69, -429, -362, 135, 326, 625, 708, 116, -154, -235, -157, -34, 371, 401, 518, 157, -182, -456, -135, 267, 399, 202, 752, 164, -258, -614, -351, 223, 211, 568, 184, -291, -216, -168, -271, 35, 182, 405, 86, -371, -590, -533, -261, 127, 206, 69, 77, -380, -682, -709, 33, 51, 187, 247, -124, -184, -610, -522, -175, -39, 128, -99, -433, -325, -572, -797, -99, -99, 110, -246, -506, -628, -351, -119, -192, 105, 84, -250, -380, -690, -421, -271, 32, 498, 223, -229, -480, -421, -340, -105, 161, 136, 263, -374, -339, -345, -453, -22, 280, 245, 122, -232, -469, -27, 161, 277, 90, 364, 82, -382, -245, 85, 15, 461, 488, 486, 231, 23, -122, -2, 216, 329, 436, 536, 101, -422, -217, 203, 483, 426, 487, 472, 51, 27, 67, 268, 370, 673, 306, 469, -169, -202, -105, 459, 146, 247, 371, 360, -140, 49, 260, 202, 442, 315, 206, -43, -237, -371, 23, 162, 487, 225, -47, -165, -274, 50, 66, 196, 179, 195, 259, -41, -634, -123]
1960a23J7L16J22k58l21n9N1p9L71M6%j3n33J12K88k52K24K49k05J47m71k21J30
1983d62M74r0K01k93o4p1k43R6K02L21J04o1n01j69M03J46LO7O6j40l54k62R5
2006e32N77N0K66k97m0l92O5l1J68N27J40l57j78M3k41L53N2L34J05%l99n91J56
2029b22L33N84k27l27J60J73p57P4J83N79J8Ql11k36k93K08K99K66k1j19j49k40
2051a7k38K44J74L09J28l31j7m02J03J11j69P05K5k74n66N8K54k08K65K05K70
2072F29k73m30o84M00L59O15k50k62q8J03n98j36K03R17K16m71n09j87R8K51K9
2093f8r5K98qr6o04j33M08K55K37Jl59l62j95J83j01N57N67k99n66k57J00j49
2115f86O40P0J94L4m99n49q4N55K28J18K03n62L67k94p55N31M93k0j52J29m22
$$ y = [-123, -106, 210, 332, 74, -247, -306, -255, -334, 37, 83, 83, 70, -463, -351, -63, -315, -91, 158, -47, 100, -371, -592, -462, 12, -78, 123, -170, -234, -305, -548, -452, -250, 71, 175, 114, -387, -556, -153, -7, -4, 63, 129, -11, -365, -627, -532, 45, 95, 361, 64, 24, -368, -303, -334, -166, 361, 501, 144, -34, 9, -232, 121, 173, 507, 612, 612, 213, -378, -222, 111, 695, 468, 141, 301, 474, -283, -209, -26, 553, 571, 579, 268, 32, -261, -53, 246, 512, 491, 372, 223, -17, -255, -11, 163, 472, 600, 269, 252, -150, -47, 64, -105, 600, 625, 351, -215, -157, 97, -111, 154, 359, 629, 356, -74, -758, -358, 1, 616, 366, 104, 16, 119, -479, -615, -412, 505, 721, 250, -259, -446, -348, -97, -68, -163, 135, 127, 31, -573, -706, -298, -43, 194, 195, -164, -526, -721, -538, -639, -82, 485, 186, -380, -637, -537, -686, -46, 24, 218, 252, -247, -796, -880, -325, -97, 21, 224, -338, 29, -265, -1020, -489, 4, -16, -168, -39, -461]
2136d61J64K26o0J85L53J27n37j98l1n9J16N38K2Q1k40l19k93M3K47K70N62l57
2158C79p06J59J27k0K94J69K59l16n20J89q9K02J44K06j61k6j35l66K77n1K63
2179B78M33r9m22k97q3K52P9M8L94J00k80n31P8L91M5J18k5l28J32o04K90l6L38
2202B71N06k83l14l91Q4j01J44J09O48l99l23l34R6J73j4L71q4j39J61o83J4j
2224d89O19n2O9j73j0k09n4L27k39M13m5k04k91m36L76K26j56K73L50l99l41j
2246d46M96l16K07J82l35L6l27l27J70P17R7J88l02qk33p7K11K35M3K7m72l24
2268e58M49k50L56qo1L09l44k25J52q6M41j85R1K98k30K43n79L8P54j78l57J9
2290H9j70r7K10J91L51P7k90k36p6j14K23J01J60k10K59l69j50j74J28N27l24
$$ y = [-461, -297, -71, -131, 54, 407, 534, -3, -201, -232, -291, -175, 363, 385, 466, 226, -93, -386, -343, -96, 174, 736, 379, -327, -168, -41, -61, 233, 402, 661, 345, -175, 14, -75, 127, 271, 477, 316, 290, 155, -211, 66, 15, 278, 711, 612, 190, -107, -190, 62, 141, 189, 583, 683, 403, -128, -50, 341, 386, 504, 479, 151, 283, -321, -31, -67, 271, 777, 494, 180, -211, -127, -228, -84, 25, 673, 274, -49, -383, -287, -114, -128, 243, 159, 20, 181, -502, -488, -489, 130, 78, 147, -26, -36, -245, -299, 28, -211, 202, 157, -47, -338, -774, -398, -172, -328, -55, 295, -104, -445, -446, 50, -266, -59, 123, -212, -176, -503, -830, -660, 57, 154, 342, 40, 32, -201, -278, -67, 168, 211, 238, -234, -558, -109, -359, -3, -11, -72, 237, -107, -332, -180, -266, 175, -10, 81, 379, 149, 392, -187, -149, 605, 427, 70, 89, -81, -178, 32, 223, 574, 651, 361, 125, 49, -65, 158, 259, 419, 209, 468, 99, -51, -225, -97, 430, 106]
2311A06K40Mk09n34K07M4N53k2m39N06l32j92j4J06J34M37m46Jl08k13K28M01
2333B58j0p2J63j55m10l50P51k32K91p6l4l04J50l73J08N56q8r8k09n2r4L7J65
2356g8J54P4k32j98j56j79J42K08O38l11O0l34m13P4J08K26K95K06o15J69k81
2377d43j62J62L94K98M9n87J04j77LK63J26M09k35k09k03j14j38p9Q66P5l73p0
2399d1l45J66r4J86L88k5p4j06l23k52L26J17L59Q3k92k4k80j51J90M35k8K01
2421D16k5p77PL91J96O7K97qm41j28k58J69L09K62J01l77k32j74k1L47J26R3J09
2444D49l98q8j97M21l40K99M85m37O7j44k96J56o2O66o1j63l65L7m68L88K90M53
2466F92j35n09J04k68j07k88N02J69L05l08k61j74j05j12L40K58L29k41j67m17
$$ y = [106, 346, 350, 141, -393, -186, -142, 411, 389, -50, 456, 124, -68, -82, 24, 158, 595, 149, 150, -158, -371, -143, 258, 248, 176, 339, 184, -226, -576, 175, -57, 234, 158, 124, -180, -30, -403, -295, 261, 173, 75, -134, -186, -280, -243, -78, 76, 150, -82, -280, -436, -615, -473, -265, 373, 62, 122, -212, -625, -551, -443, -217, 78, 284, -331, -162, -443, -605, -443, -49, 249, 298, -289, -185, -362, -359, -96, 30, 439, 204, -5, -208, -322, -460, -539, 327, 402, 29, -41, -386, -220, -314, -128, 260, 235, 161, 55, -268, -520, -194, -77, 282, 365, 73, 49, -231, -382, -192, 243, 215, 416, 391, -386, -379, 12, 208, 275, 572, 564, 123, -5, -263, -94, 215, 477, 578, 201, -31, -205, -226, 121, 247, 340, 449, 51, -37, -234, 187, -153, 146, 631, 194, 261, 117, -179, -23, -85, 581, 520, 357, -8, 29, -439, -51, 239, 692, 557, 48, 152, -116, -223, -511, -9, 160, 465, 157, -104, -278, -383, -495, -155, 103, 432, 191, 24, -393]
2486c93m6L17N1K87m43M04n14J4l2K76K66K48k96m23k78K42o6J51P12j85l77k36
2508c21n8J45O3K69R2k68M21m37k6l67M41Q5K45R0l88k40l5O1J56pK29K5k99n3
2532a77l30J58M03M79m80J66J6o12J76p0K42K58j45M8r7m26K17L42l0L12k22Q7
2554C15l34Or1M0P02j69l8L3p11J75j81L92j61L22K1L4m03r0J69J20K14l52M38
2577D51n82j38L03L21j55K38k84J69p0n76K7N01K15R1k35k73r9l19L66J76J11
2598B38J29n84L36m80K27J3J34j79M70k08r0k38q9L45k5p4K26j80j51O0k33M28
2620G5m8j69K08j3l22J41k86j08L95J19j27j14j38J7m1L20R6n6j28k31m4R7J9
2643c38N04q7j90k0o0l31J43K30n6J78J16j36k31Q2L3O5P3j19O0k78K68K24j29
$$ y = [-393, -439, -122, -71, 216, -227, 177, -337, -323, -355, -79, 187, 435, 139, -284, -562, -320, -386, -235, 477, 292, -85, -321, -379, -234, -171, 98, 190, -78, 343, -94, -120, -487, -46, 39, 284, 374, -14, -254, -289, -228, -72, -79, 150, 175, -124, -177, -507, -349, 54, 533, 53, 219, 235, -377, -201, -271, -29, 229, 84, 132, 35, -391, -174, 168, 138, 450, 228, 315, -19, -13, -104, -64, 638, 469, 431, 464, -247, -72, -253, 139, -22, 300, 321, 355, -48, -138, 31, 151, 365, 13, 451, -131, -269, 34, 355, 200, 438, 154, 323, 253, -323, -296, 205, 420, 511, 276, 3, -96, -415, -49, 127, 238, 367, -217, 119, -361, -134, -121, 13, -166, 304, 96, 6, -232, -321, 24, -1, -75, 151, -29, -180, -120, -353, 75, 27, -142, 66, 53, -269, -128, -414, -522, -127, -8, -135, -249, -387, -370, -411, -91, 5, -51, -179, -410, -454, -357, -338, 166, 79, -111, -131, -191, -522, -379, -149, -205, -27, 89, -47, -278, -196, -163, -98, -25, -144, -84, -362, -94, 130, 1]
2666Aq4M9J38j96L8l5k1M2J88K87m2n97o3R5K26N5K37j1k61J98j26m16K23J51
2690G6M39j18l5k84m9R2J98k21K06q7L3j39l29J50M65N8m49J69J21k32j05q2K98
2713A75R2J57j73o6n41K98J74J3J14K19k73l92K56L19l26L0K11l01K69l66q3j68
2735c62N75J45P5l47J1l40m7M6k7L07M58m82N6o08o7N13K36k5o4p3J84k80k51
2758c67L43O4l2K65j10n04L8k25K59p3L70k7k43n6O6k61J85N64k06o4J98m54M8
2781b22l14L35M36l2k52l04M6L9N6K37L55j45k34j72Q9l85K16L00L96k14n0l29
2803a48J14j11M13j51L41m45P5k68p6N45j79J19j63K10k62P1n66K02L71K61j72
2824A81j87M01m65N6k3K05k07L30k49l4j94Q7M07j60J91R3l36M3k59K8j08N30
$$ y = [1, -83, -34, 104, -92, -54, -89, -110, -68, 120, 407, 365, -232, -295, -200, 26, 81, 318, 307, 46, 244, 118, -298, -75, 76, 515, 397, 362, 78, 29, 121, 319, 98, 304, 217, 250, 111, -218, -68, 397, 455, 6, 175, 296, 64, -41, -123, 175, 267, 424, 251, 185, -356, -58, 116, 129, 243, 462, 189, -203, 53, 372, 46, 76, 287, -14, 255, -111, -194, -362, 213, 358, 433, 86, 97, -243, -290, -244, -271, 36, 494, 12, 68, -540, -607, -94, 142, 117, 53, -20, 164, -116, -367, -24, 40, 8, 273, 163, -341, -303, -528, -269, -342, 28, 1, -242, -298, -232, -493, -308, 256, 50, -14, 184, -270, -222, -536, -201, 235, 203, -49, -353, -307, -268, -212, 25, 380, 235, 1, -171, -82, -467, -251, 49, 445, 231, 181, -148, -34, -145, 268, 117, 458, 13, 88, -180, -256, 289, 110, 229, 66, 276, 14, 85, -481, -279, 92, 353, 181, -6, 395, -70, -14, -37, 168, -39, 291, 42, 8, -186, -99, 308, 148, 339, 432, 96, 139, -120, -92, -200, 330]
2846C30k2l11J3o7qj11P0J01K14J33l13ml31K43K72r9K4m4k15R6j63J55M6K32
2870B41k25j73L62l49k02K00J33j93L64O9m61j51M7J67R9K0k53r6m3L19j50J69
2892a06Q0J8l8J93l09j86K36N8K53k99l98L14k73J92j3L59j81M1p1j72k61K09
2914c54L03j88nJ15q7K84m04N0N55j70K26j79p3o9J13n64O36P2k13Kk79j24L39
2937a4J08j17N02l1m66j19k2J58L12j94K01M4j34n41L12k69M55N9j37J30k81j5
2959e9K04N5J5m4m3j04L0L1K09q1k43J56l1q4r1K02l89L55O2P3k17j4Q6n0j50
2984a22M3K07j30J17j65k32J28R6K9N0K17l78K21k25k8P1K20k5k0p5n80N51J3
3007a7K98j09K84o52J17k97q0N16l16O7L34k86P6j16j69J86LL12r8Pk16J11K4
$$ y = [330, 308, -3, 10, -57, -65, -176, -106, -5, 209, 342, 29, 25, -306, -63, 209, 110, 134, 90, -125, -29, -192, -37, 9, 241, 16, -157, 205, -144, -346, -146, -13, -206, 158, 227, -234, -385, -338, -171, -72, -52, -305, -401, -444, -125, -275, -106, -26, -8, -46, 147, -162, -348, -112, -54, 199, -100, -498, -184, -457, -265, -278, 81, -100, -59, -130, -302, -563, -354, -51, -239, -244, -129, -216, 68, -336, -286, 269, 99, 325, 146, 73, 4, 117, -447, 189, 261, 48, 50, -229, -353, -14, 94, -23, 479, 448, -18, -137, -159, -1, 311, 117, 318, 362, 228, -313, -1, -270, 185, 244, 107, 237, -44, -59, 145, 200, 215, 171, 128, 24, 54, 85, 294, 213, -30, 126, 95, 11, -80, 122, -267, 88, 150, 223, 6, -8, 78, 28, -122, -79, 128, -2, 115, -50, -282, -154, -58, -29, 21, 238, -140, 81, -144, -172, -101, 119, 94, 74, -1, -581, -30, -17, 281, 172, 456, -196, -79, -376, -456, 60, -256, -189, 145, -141, -65, -181, -350, -164, -161, 151, 53, 60, -156, -45, -21]
3030b1R4j66J36J52o9k20k4J9j27L69M9P6l34r4j70K59L56m03K35j93j55j20K98
3053e3M9J88j05p8K83l09m37J82K67R4K33K0k73m02L09R7O6j27M10n03L67k98
3075b0M1J98q0M9J29L2k40K6k37K68J6P7r8P8j21l01K33K69l69M42l35R1Rn77
3099d20K42J21M57L5m47p7J8j6j82P6M80J21k85l97j76J19L56Q3J3m4k56k02L70
3122a1K03j55P7J27j74l9j34k10Q5L52J14p5l91J66r1q4r3K53M2J44j69J34m6
3145B5j54J46l28K99j90L45n11J73K74j78K14J15k18J39n38K67J3J61k04P3J93
3166A16k19j18L5K10k69M02j3k0k03j30N5J48J47k50J18k4m41L47l06N14J25j59
3188F5J23l3m98O2L10k4j7K91j35k52K7l01N37j11L30J6j25j26p0jj90K30K45
$$ y = [-21, 73, -93, 43, 195, 126, -94, -118, -99, -226, 143, 192, 268, -66, -160, -330, -71, 285, -118, 117, -76, -231, -351, -53, -4, 184, 79, 1, 284, -25, -462, -280, -13, 81, 314, 334, 61, -341, -32, 65, 131, 4, 414, -89, 278, -20, 21, 219, 139, 188, 317, 349, 109, 135, -102, 166, 182, 259, 161, 239, 118, -183, 50, 319, -50, 392, 57, 148, 157, -420, -178, -57, 400, 435, -12, -89, -71, -87, -269, -193, 287, 408, 123, -274, -450, -331, 25, 108, 121, 77, -179, -381, -11, 192, 37, 114, 241, 67, 28, -106, -316, -231, 121, 235, 160, -231, -65, -156, -240, -333, -80, -38, 106, -63, 71, 25, -129, 17, -311, -12, -202, 143, -368, -195, 79, -99, 115, 230, 12, 151, -387, -120, -107, 54, -150, -77, 116, -103, -221, -186, 24, -245, 157, 144, 124, -79, -209, -154, -6, 141, -109, 9, -15, -456, -109, -415, 99, 224, 65, 188, 155, -343, -281, 29, 5, -12, 279, 144, -108, -81, -382, 155, 44, 374, 390, 265, 139, 69, 68, -122, 108, 353]
3211C53j15k3k13l5j39M40m13K62J94k31pj24J03K26n0j06O5k79K92m35J00O3
3233g2M0l0K93J52n68J08K01M08m52j74J76q2l3OM2J88n1k3l2J6l32L16k9q5N03
3258D86n45j83K35k13L74k5J38l21j08J37k80J30K51No9J54l20J49k78Q5K35j19
3280h2P1J70l85J35k48L2M19n8nM7j10N1k1k05N0J30K71l04J31j02r9m64P43N1
3304B18k16K40k12Nm50N87k18J29k26J08j15l04M93K06j47j99J0K34j44qk1K67
3326B37j89rK44n78K64J76l67J60K10l4m9j8l0r4o2N39n19K73j58pl9M07j13p8
3350A66R5m94M17m95P2j8L50n2K63j89j51o8L7P1J66j21J06j42j62k8J18o4L40
3373B17n5k1j01r6J8K38k9R1M1j29j36k59J91J5p2K32j17jl35kK95J65m90L29
$$ y = [353, 238, 215, 2, -33, -172, 268, -145, 117, 311, 80, 73, -51, 52, 278, 228, 122, 187, -92, 200, -235, -135, -72, -32, -62, 231, 383, -185, -77, 124, 532, 80, -94, 82, 0, -33, -27, 15, 203, 152, 129, 97, 113, -219, 97, 68, -17, 486, -59, -242, -7, -220, 154, 129, 267, -54, -162, -25, -305, -175, 76, 81, 12, 166, -154, -5, -283, -198, 37, -82, -11, 159, -226, -91, -339, -307, 112, 54, 49, 96, -14, 37, 16, -189, -139, -9, 262, -42, 89, -13, -112, -576, 167, 218, 2, 242, 30, 35, -415, 172, -46, 83, -143, -35, -150, -454, 39, 245, 98, -101, -91, 143, -1, -9, -30, 237, 48, 39, 283, -295, -31, 145, -222, -62, 148, 114, 65, 47, 17, -77, -139, 400, -119, 154, -4, -11, -50, 357, 244, 166, 261, -233, 184, -311, -239, -257, 93, 41, 304, 115, -36, -104, -67, 4, 170, 49, 155, 13, -149, -177, -59, -123, 217, 162, 141, 40, -56, -38, 200, 171, 262, 303, 174, 38, -221, -30, -15, -87, 145, 28, 27, -308, -310, -15, 150, -340, -11]
3397a1J88k13L6j93O6J95P9j89l1j16J44j49J71k38M6L04N5j74K0k9p2R4J40l1
3421I2k10l14J13K52J60r9K11r4k58j09j20K34J80J22k51N3K10m08N8J10M00k22
3443A10R6k15r2J16K99n01K78k12J11k3K02O6l0k43K45k21j03M69l19l6j23J52
3465B6l4l8J20J30j48oj6K9K07n5j8J93j58k96J92p6J76N2j99q6l48M77M9j78
3489ek5K8l9j62K99l08L45Qk13N99l91j72J2m7l6jL59Q0l65k2r1J9J89j59J80
3514H2j40r5M9L9N8r2RN3p5J56j80Q0J52k52K68K91l32m40J76Q9J49k13J13K43
3538A88k66l81L47L31J34l31k12rN5J72J26k58j16K41M57m11n83N36P8j74L16
3559B40l45L5k76N16l61o2K15rJ2J60J36l93m6K04R9j93kl10M26P9l50o0M03J31
$$ y = [-11, 177, -36, 0, -193, -127, 68, 147, -42, -73, -189, -45, -194, -23, -261, -215, 89, 144, -30, -10, -39, -111, -17, 123, 92, -118, -432, -319, -67, 93, -6, 205, 111, -147, -256, -376, -142, 38, 160, -91, -38, 172, -236, -178, -68, 332, 110, 206, -9, -101, 15, 314, -187, 91, -121, -10, -33, 169, 235, 205, -38, 207, -14, -117, 352, 33, -3, -126, 26, -8, -46, 74, 204, 56, 50, 34, 63, 270, 215, 197, 390, 232, -64, 128, 52, 228, 280, 81, -5, -353, 124, 173, -5, -30, -2, -41, -203, 96, -212, 133, 141, -72, 527, 136, -36, -24, -71, -107, -108, 251, 331, -34, -56, -147, -128, 61, -98, 82, -58, -153, -104, -65, -7, -99, -90, -37, -112, 44, -136, -56, 96, -156, 112, 403, 71, -369, -193, -104, 45, -168, -55, 188, -78, -459, -112, 219, 353, 22, -190, -199, -144, 28, 154, -104, -220, 21, 478, 67, -516, 20, 98, -76, 240, -105, -70, -346, 170, -191, -253, -38, -47, -35, 125, 261, -132, -178, 26, 125, -68, -70, -380, 46, 125, -225, -285, 118, 249]
3583B49m9j09P9k18k19J87M4J00j7j40K40k19J09K81j81o7k01O0N4j07JM89l46
3606B0k41J94J61j23K71j59r4j6j38p0K52k8l88L03J45P1j93kl0K33j93L01n0
3629B26l57L42k73j16j08M88p2k20L66m32Pj30L05p3j9l7J95m52M08l65M77q3
3651G7j82L0l50M14n1l89M15N3l96M46n8l48J03O2J13K62m37K74k60J00j49j05
3673c76K17L0M31k45k48j12K27J15K07j57j46J38l15J03L0J91r6J80j82k8Q1j58
3695a13nK0R3L6jp5O9j95R6J03J83M6j49l29r0M88l32O1j8K01J75r0k56M8MM09
3721C79q1l24J32l30N73j47k24R0j18M02l23L3M0j38J48J30j31N7k74L39j86q1
3743c4N8q7M84l12r4k9Q6k8K37j55j67J03j37K41k76k66O27P3m90R0nj50K7K30
$$ y = [249, 200, 91, 170, -48, -267, -80, -36, 64, 47, -93, 147, -72, 37, 318, 137, 70, -131, -71, -17, -124, -123, 366, 20, -221, -27, 134, 11, 282, 123, 29, 13, -125, -195, 57, 29, -359, -56, 89, 160, -33, -35, -65, 168, -25, 276, 226, -131, 211, -62, -178, -286, 202, 130, -90, 276, -156, -149, -279, 26, -47, -66, -103, 92, -360, 48, -317, 160, 77, -105, -75, -425, -11, -62, -451, -36, 17, -379, 67, 9, -339, -236, -174, -61, 201, -236, 38, -222, -122, -271, -376, -159, -129, 302, 57, -191, -303, -76, 39, 246, 89, -57, 81, -234, -131, -101, 90, -6, 174, -8, -36, 45, -113, -118, -98, -5, 31, 30, -45, 24, -171, -75, 28, 211, 257, 108, -221, -311, 177, -155, -94, -112, 89, 264, 174, -82, -34, -30, 379, 298, -26, 106, -224, 349, 202, -22, 68, -50, 352, 29, 62, 102, -36, 112, 242, 111, 168, -106, 233, 47, -34, 24, -63, 421, 109, 15, -14, 72, 44, 281, 126, -41, 62, -75, 166, -110, -376, 251, 324, -166, -76, -81, -231, -204, 26]
3767B6R8o1m2l0m5P8R9nj04K28k32j34M4o1P6J69k96N04n21L05j92k22L47N2N8
3792A39k5q9k38L01l80L45K65j06j67j57O2P9k66R7K98j03J74j66P0l08K50o3
3814A2Q0J33m0j57j97p5K57K47j80mj64p7N47m79q8K72k0j97R1J3j44J39j02P3
3838f0J65K1k20M73m11K99j34k22J87J60j41j19o5J84J04Q9j67K6o9J7j62j32
3860a77n9K74K56l22jl52M36o5J25k6K0l47M6J8K01j73j11J21K66k83J65j11K55
3883A56k52J65l0P2k26o0O8J34Q9l62N00m01J88j27J30l68K34j57K63j70J76k50
3905b28K70P4J52m29K90j81n1j67J89K74m1l82R3J1j73K03r0N5J30J76l45j76
3927c46K54Q7L7n74M83J25l47L80j84L6j63L29Nj48l30M77o18L60K43k34M47k65
$$ y = [26, 124, 63, 21, -9, -54, 24, 123, 118, 14, 242, 10, -124, -80, -141, -65, 104, -192, 312, -209, 96, -96, -318, 29, 81, 139, 114, 25, -213, 88, -292, 53, 318, 212, 45, -112, -50, 29, -237, -140, 158, 55, 229, 63, 133, -175, 75, 12, 92, 225, 185, 28, -169, -244, 13, 260, 80, 76, -88, -165, 382, -97, -185, 87, 67, -130, -39, -26, -170, -31, -133, -60, 105, 126, -94, 379, -32, 267, 133, -89, 98, 258, 117, -2, -67, 117, 221, 310, 143, 169, 100, 117, -45, -177, -236, 38, 294, -28, -29, -381, 55, -10, 115, 89, 109, -238, -192, -174, 27, -146, -257, -136, 130, -153, 12, -99, 156, -96, 69, 39, 111, -115, -175, -107, 27, 116, -246, 254, -147, 41, -86, 44, -324, -90, -247, 16, -154, 22, -228, 42, 116, 268, -161, 129, -52, -103, -270, -81, 193, 152, -230, -137, -126, -299, -96, -186, -131, -1, 175, -170, -346, -92, -5, 32, -542, -59, 66, -281, 99, -85, -49, -212, 117, 122, -26, -356, 121, -497, -137, 106, -128, 319, 54]
3949E4J53n50J75K46j7L2K5j31j24r9L22l3j7m3K75m86J23j3J21p9K65k37J61
3972A23J54k11QN5p9j72L43Rk17O2K4n7M5K73q3l70j61N81n24K95J20j66K28k97
3996a7r6M5J64N0J25l40J38J2k21L9K65m29K73J04j88k8m2k07L06R6k23J41N1
4019A8l69M25J97l22n8M8r7Q9K26l25K13Q3j20o6q4o4j35J57R5k01K14M89n58
4042a45K74l7m23P15o42L56r7J79m14j19O07l57jK61k28m7k35O4L67k11J36q4
4064h1om46N20q8PJ07J61m8j47j14J87j42r4J87K44K6j81j45N8o7J05p9K99l24
4088f1p7J9q3L15q0K16j03l7j27R8k61m0K31j08L30j77Oj61k2K27j39L52k54J15
4112A79n6j47o8R8J27o4K69j00m69K54J66L0J32l33p5k20K71Q2j80M00k77J44
$$ y = [54, 207, -343, -168, 78, 61, 93, 118, -13, -137, -236, 86, 53, 36, -7, 268, -218, -95, -108, 13, -66, 199, -38, 123, 277, 66, 74, 129, 50, -122, 221, 230, 13, 75, 99, 42, 87, 360, 277, -93, -254, 327, -197, 98, 218, 52, 280, -17, -113, -68, 96, 146, 271, -69, 69, 81, -140, -101, 164, -265, 8, 112, -76, -104, -146, -353, -47, 49, -174, -33, 18, -351, 74, 271, -51, -109, -61, -158, -69, 157, -168, 45, 128, 8, -58, -142, -206, -341, -184, -89, -290, -76, 413, -145, 129, 92, -331, 384, -258, 98, 1, 180, -234, -353, 254, -103, -104, 157, -71, -118, -353, -289, 78, -133, 3, -81, -87, -533, -13, -101, -94, 13, 174, 126, -21, -135, 52, -90, -184, 3, 247, 273, 92, -53, 5, -62, 43, -36, 263, -61, -138, -119, -202, 113, 33, 249, 146, 109, -18, 80, -181, -221, 10, -98, 232, 55, 61, -100, -122, 105, -34, 318, 64, 179, 123, -24, -92, 6, 133, 69, 338, 238, -231, 23, 189, 219, 351, 18, -57, -277, -6, 76, -104, 296, 19, 163]
4134A63r6j34K11J08l25L97k05M6Lm1k75J32q5J92j14m9J77j96M67o04L06j98
4156a20M21m07q7L4j19K04p0L91j77L0n1k02J13n4l1K20P1l28k84K85j12J36J79
4179D2j20K5n7j11K29L2K45n00J80j81K29m19J64j24K18J88m53M85l7q5o34J024
4201C40k19j50J2p2j32K60n06N94r1N4q4J22m76M27j71N11k42l70L56j62J00j51
4223e0j2J73K18l61K53l35j5k9J50L1J4j11n7K77p1L1q0kN1R4k36k20K50K29N6
4248B48r9J22q4k57K01k67K27L41q4j73o3j76J09j80O9M62m78J44q9lK0J32l94
4271b72O08j23k00K21k42K26o9L9j71Q2m7l78L5J59l4J60l47L23j10n7j80K67
4293a10M6J34J94j24l9p5l30J05R9J32j92KJ67k05L06j84N3l22N34j28j93j17
$$ y = [163, 67, -67, 144, 252, -73, 324, 119, 165, 168, 127, -148, -16, -101, 91, -23, -72, 105, -91, 376, -228, 78, -120, 301, -106, -193, -159, -278, -74, -144, 247, 70, 100, 49, -153, -40, -94, -125, 95, 166, -162, -446, -161, -273, -137, 42, -78, -53, -110, -221, 8, 40, 285, -215, -35, -216, 13, -406, -242, -366, -148, 40, -413, 72, 35, -50, -684, 340, 121, -29, -17, -89, -221, 39, -467, 127, 36, 90, 6, 128, -348, 79, -92, 419, 177, -193, 163, 1, 101, -50, -62, 111, 329, -32, 221, -114, -129, -158, -8, 23, 37, -74, -131, 146, 75, 106, 26, 24, 75, 169, -67, -287, -37, 192, 248, 149, 271, 187, -70, 131, -136, 91, 432, 348, 175, 112, -64, 45, -135, -66, 396, -82, 62, -27, -30, -10, 122, -272, 336, 213, 13, 234, -8, 218, 149, 188, 17, 99, 52, -326, -291, -132, -166, -6, -353, -30, -140, -197, -377, -110, -64, 70, 264, 140, 101, 26, -304, -199, -100, 32, -160, -158, 9, -196, 110, -74, -21, -343, 191, 63, -130, -247]
4315b47K13K04k3k53K17k00K12k22K32ol05K18L8k68J44j10K66j79P8j41j32K62
4337bJ57k70l9j59J31J72J84m39J37J62J84l55JJ66J5q9J93j99J62Mj71q4K50
4360A11m3p2J4M40k65K9n5j36o0N7J9o5L35L3j50k82J73n02O92K60n06j11M6j6
4384e4Kk09P4K23qK9j0J19j72k25N57m66K65l9qj13Q7O3pJ7qK75o44J11j80L62
4410D1l40O99k24k45J4J5r1RJ92j73K27Q1l97q8N5L01j40J94j39l37K36j00J67
4433d3Q4p4J24k59J01k6k32k2M64K1p2J79k72q8l4K01j15PK32l65Q7l8J66mOj80
4459a52L14K9n01K77J46k07J13L6j14j52L8n8K95m45P00l02J02k48M8j78M43N1
4481B35m2k25n4O7n8J48j02L74J2j60k83J34j64L24l71K93k19kP8o0K4K75m12
$$ y = [-247, -34, 170, 147, -106, 111, -89, 123, -99, 133, 127, -178, 40, 78, -190, -46, -156, 110, -69, 9, -132, -264, -2, 155, -115, -154, -313, -182, -10, 174, -265, -128, 34, 218, -137, -136, 30, 45, -44, 149, -50, 112, 116, -55, -139, 111, 68, -4, 10, 450, 185, 214, 159, 23, -37, 20, 39, -26, 309, 342, 192, -90, 83, -419, 273, 533, 27, -84, -38, -54, -52, -261, -187, 36, 28, 57, 47, 166, -6, -231, 326, -140, 125, 86, 78, -35, 52, 115, 108, 125, 117, 392, -252, -141, -321, 41, -299, 400, 176, -69, -55, -40, -131, -122, 70, -103, 124, 205, -192, -280, -225, 76, -64, 130, -9, -346, -110, -210, -43, 41, -33, 91, -168, -67, -93, -325, -347, 117, 138, 66, 245, -27, -115, -149, 52, -63, -56, 176, -189, -102, -140, 26, 22, 28, -152, 162, 191, -310, -33, 113, -94, 19, 55, -59, -211, -173, -231, 64, -381, 319, 17, 119, -129, -81, -259, 184, 235, 193, -32, -86, -19, -77, 71, -31, 343, 355, 195, -88, 46, -118, 206, -165, 128, -91, -93, -15, -75, -51, 224, -188]
4504a88J48J63O5k69j82J74M29m0j44j91j27L19k49J18m9l55M79J75j35l31J56
4525c4Mk06J26L10k78k37P1K30J49j79K79j42J84m14J38qj14K26m9K49k27L3R8
4548B09j05J4r0O6k7k5m29J97N8J81j67l0j98L27j74K37m3j45K73l39O4J43k19
4571b22n9m8O62m94L48k73j56L23n83L14K04j54Q1m8n0j8L3J12q0K66k65J05o5
4594f7o6o2N72m02j40k7q9K40j32L11J20r5p8R2l6j71r6J21J96J68l75j40J94
4617C8m0j9M2J8K42J09m49J35k7j43J59l1K37l59N3j41K51N7lP5N7k42O2k5%k77
4643b21L64j48q7RK11j82J05pJ31k05L43k25k90K38j97M26n22K95J29j65P6l99
4665c21K70q4K86l02K15J34n44K87L02m69J32J13l05L1J82j0k09J37N5J00k43
$$ y = [-188, -40, 123, 188, -81, -263, -89, 340, 300, 156, -35, -162, 157, -92, 26, -23, -378, 101, 276, 141, -190, -34, -30, -236, -110, 200, -78, -315, -244, -14, 135, -44, 235, 93, 277, -137, 1, -7, -121, 105, 56, 305, 78, 111, 209, 104, 118, 28, 94, 67, 42, -387, -190, -132, 49, -118, -148, -346, -19, -193, 44, 1, -144, 129, -210, -146, -3, -222, -281, -329, 333, -161, 187, -86, -242, 81, -502, -188, 16, -138, -57, -105, -155, -173, -140, -28, -108, 158, -107, -2, -67, -133, -195, 377, -25, -165, -192, -281, -41, -173, 138, 258, 163, 85, 177, 141, -30, -126, -5, 191, 359, -16, -156, 38, -2, -21, 21, 39, 281, 390, -59, 76, 49, -94, 65, 34, 271, -88, -35, -176, 75, 132, 129, 204, 261, 19, 81, 56, 56, -221, 143, -5, -92, -83, 128, -54, 51, 44, 175, -30, 313, 88, -202, 36, -161, 265, -257, 38, 167, 2, 78, -321, -51, -135, 151, -151, 64, 198, -346, -59, 243, -226, -94, 19, -286, -255, -73, -83, -292, -155, -100, 0, -243]
4686b43M00Mn25L26k21N14n96L14k15K9O5qJ35K06j84J07k81J21M4j64J76k00
4708a96Q2l7K20l10L33K6q5K19m02l5J25L45k8m19J96K62l79j10K48R7j22J82
4730B12j93l41L18l8J16J98k49j74KK1K64k89l5M02j69K30o8l87J04k65L89m4
4752DJ90l18L06l04J67J58q4J36k6k12J71k85K40J50J01m89J16R7L2j63k81J29
4774a65J66j0J53K26m10Q9j5Q6r6k1J9K83l82J52J44j57p0K40l10M29m40k83P02
4797C30k78m0J51j06j62N1k8K26j92q7o0M50k71J5J10j43L95m07p1J20j80l8J69
4820d6M9N4Q2p7Nk30J58K55l14J06k68L13n4j30L43k60J72j9k22q4%p5J16M1J63
4845G8q3KN9j62kL99l96Q8O6K5lk34M06m97L83k81J06K18j52j66K18K72j92j69
$$ y = [-243, 157, 161, -364, -38, -259, 255, -341, -27, -242, -213, -148, -156, -21, 185, 1, 108, -173, -52, -8, -172, 4, -196, -114, -151, 69, -241, 92, 118, 33, 252, -150, -185, -60, 285, 257, -162, 34, 296, -83, -193, 55, 152, 30, 212, 19, -322, -4, -42, 74, 272, 23, -151, -149, -128, 136, -153, -188, 214, 45, 275, 207, -180, -76, -341, 48, 4, 194, -124, 182, -122, 45, 203, 119, 255, 229, 17, 188, -97, 143, 293, 394, -95, 21, 118, 150, -13, -294, -165, 1, -9, 144, 370, -40, 49, 34, 120, 24, 3, 22, 305, -77, 75, 219, 62, -8, 232, -78, 351, -89, -372, 330, 52, 12, 163, 57, -105, -54, -82, 144, -48, -135, -195, 255, -16, -1, 109, -34, 361, -46, -117, 3, -177, -215, -46, 3, 57, 139, 62, 67, -163, -5, 250, -64, 42, -226, 87, 33, -97, 246, -14, 158, 139, -83, -167, -167, -242, -126, -85, 78, -5, -3, 56, -106, -108, 291, -105, -17, 49, 74, 71, -163, 243, -254, 129, -152, -46, 172, 20, -146, 72, 344, 152, -17]
4869a7j91L28l13R7R1P9k06J87l52K76J57m3k47J40J12M7J26j57j97K01l09J91
4891@J2l6Pk3K21l34L39k95L94j58j26J64l2j02j24K75k80M42l41k77K15o1P2
4914d8J82O2M0k09l71K19K59k40J99l94K25o2M62n50kL71l00Q5J40J2q6J0p3J26
4938E7o5p3k84J53O7K63l91l8M50j79k72M89k29o3J7k30L85n5o3n0J88mP7j06
4962D4Jj2J55j79n9mJ98k88O3K66j70K29k81K4J25q2j65J87q0k0j49J79J01L2
4986A15k02J77k41N5O8J62q4r9OM8K3N5k54q2M12l26J51J39p4q7J7J49l41J10
5010a03J78l44J45lL90j18O7k12J00K1k5L9k31N7m5L9K04k5j71K90l36m5K7K15
5034A14q3R1n5K0P9J2m5l60M25l80K69K1j72P9k89L63j53J02o3j8K02o8r1j85
$$ y = [-17, -208, 120, -193, -96, -5, 74, -132, 55, -297, -21, 136, 93, -154, -14, 98, 145, 271, 114, -83, 118, -191, 0, 12, -24, -17, -40, 181, -153, 186, -109, 285, 127, 1, 165, 133, 31, -93, 182, -98, 344, 3, -274, -59, -120, -48, 134, 196, 236, 27, -344, -125, 134, -106, 93, -301, -76, -138, 324, -226, -228, 143, -157, -72, 68, 80, -6, 4, -69, 57, -8, -81, -365, -212, -145, 118, -273, -311, 139, -40, -312, 177, -52, -115, -98, -328, 57, 2, -61, -111, 77, 73, 150, 44, 45, 33, 188, 9, -50, -54, 144, -144, -81, 185, 15, 244, -37, -13, 112, 30, -135, 52, -28, -48, -197, -18, 83, 115, -87, 90, -151, -96, -28, 134, 50, -49, -43, 5, 28, 83, -171, -253, 159, -167, -16, 123, 49, -38, -21, 128, -213, -103, 75, -269, -124, -127, 263, 145, 212, 0, 100, 121, 96, 135, -96, -39, -84, -45, 159, 134, -37, 253, -83, -128, -101, 114, 31, 122, 67, 87, 166, 178, 133, -227, 198, -182, 87, 108, -64, 15, -274, 89, -64, 38, -25, -43, 159, 91, 0, -185]
5058a85K12k65L05n9J31K03j94L5k57J37l89M87o65J84R2k72M87l0K51m8j10k09
5080a59j23L08Jj19J83L01l07j24J8k55K08p2r1K57m5J25L7j01J92l76J31j30
5102a41J92Q0k13k7J51J19m94N85o6l75J70j4k27M16q4L31n67K89k22n3J92k69
5124b27M37k00l1M3J23o8M2j35m3L10j09r3j44J9N58o89K48J91j16j84J69k86
5146a85K75K66j90k78P0J62j28J48n7j79oJ47k73J18j02J96R9j80K95J2n81O14
5168B43k72j06J80k4J97l32j1L6J54m19K87J8k24L59j73M9QN5j18K17j25ok0K00
5192A73j24l6M2k07M1K67j66J22j05l4J21n3k16OK90j86L31j85j55Q5%j35O4L1
5216b9k74N1K89J32l72J99j55j3K65r0o5r4K3M02l41P8Q1k35L58R1m02j36J69
$$ y = [-185, 27, -238, 67, 8, 139, 342, 148, 183, -74, 63, -326, 161, -504, -320, -228, -500, -13, -43, 208, 160, 50, -159, -282, 26, 27, -92, 91, 392, 85, -39, -21, -276, -68, -140, -231, 26, -19, 106, 143, 42, 234, -142, -11, -141, 51, 131, -82, -109, 42, 161, -333, 252, 186, -189, -19, -33, -260, 156, 72, 403, -164, 125, -97, -150, 42, -227, 210, 10, -21, 22, 145, 77, 119, -16, -59, 251, 142, 49, -95, -76, 482, -207, 41, 232, 116, -68, 101, -185, 90, 356, 166, -112, -42, 120, -8, 140, 83, -96, -102, 45, -228, -110, -212, -16, 83, -97, 198, 210, -371, 243, -29, -135, 45, 21, 218, -114, -125, -89, 65, -354, -67, -49, -273, 86, -87, -38, -30, 25, -93, 124, -1, -7, -27, 173, 49, 13, 55, -152, -111, 156, -10, 112, 7, -27, 94, 41, -175, -169, 121, -65, 266, 81, -74, 11, 11, -124, -60, -29, -303, -252, 37, 169, -203, -4, -159, -172, 93, 3, -62, -156, -133, 269, -72, 6, 87, -148, 210, 301, -101, -237, -68]
5239f8M2L63m36o4Q3K20m88M74j01m3K98m76J74R9j24n0M05l92J88k15J03J85
5261A77l30j98L47Q5k33M9kJ89j51k54L11L76m29L7N1k0J0j06O2j20L48L1l59
5284a29J00J89k39j77M14k06l97N40J4q2O4k13N9K63k46o2K95j80J06j17J49l04
5306a59J87k66L18J28ko34M09j25JK86o5J64k53P4j18K48k52O2R2l33M40k54J38
5329H6j58K04k5j42n2L09k28m37M62K70l96k0K87n19J88J9K44j54Q8p1L6k7jj9
5353e6K71n7o7k17R0Q1m49M60j15K72J00n6j96j86K64j28J1PJ61l88L5Q3J15j07
5377g2K89j48q9M2q3J44J53j82j6j26L66l40J61l7j63J58m1j14K93k92J84j99
5399a12l3K18J22m01K25J08J4mj28j36q0l4L0J65q0J32L43m47K58j52j40M87k25
$$ y = [-68, -26, 337, -99, -163, -80, 140, -348, 126, 25, -18, 280, -196, -22, 77, -47, -97, 308, -84, 104, -111, -8, 177, -153, -351, -4, 81, -152, -103, -105, 84, -67, -321, -10, 366, -63, -26, 25, 5, 15, -91, -29, -149, 199, 230, -129, -29, 160, -79, -256, 158, -48, -445, 95, 109, 27, 91, -122, -63, 200, -46, -108, 187, 7, 113, -4, 145, -159, 28, -238, 80, 208, 206, -428, -19, -144, -143, 143, 78, 242, -11, 63, -55, 193, -59, 3, 95, -238, 202, -52, 86, -72, 132, 107, -35, -87, 222, -6, -443, 19, 289, -107, -127, 160, -359, -171, -152, 92, -62, 26, -45, -9, -36, -37, -56, 215, 158, 91, -126, -36, 45, -404, 56, -59, 213, 313, 257, 61, -125, 139, 11, 22, 29, 190, -198, -163, -80, 35, -72, 217, 69, -20, 22, -61, 83, 236, 54, 38, -88, 278, -62, 99, 62, -101, 57, 16, -98, 195, -97, 87, -112, -145, 73, 195, -206, 19, 127, 141, 137, 9, -127, -207, -241, -211, -46, -126, 6, 349, -98, 160, 8, -132, 355, 130]
5422A30m06L36m3m7K81l77K78j49m1M2L53m20M6M7K60o28L36r4j13O07m30p9J64
5445E3p5j11M98l27L95l97j31O7n6Q1J62j06J23k20Q3J10j50J51k09j29K29k40
5467a99jL8Q5Q9L9K76k02r1j51Q4J50L7k44l2M1K03R3n29K62J16j62l7q7J90l
5492c5J20o7j7J55O8o0o5K04j44j51j21J8L21k21j08L02r3j72J37Qk6j74K19l00
5516b02J24q2M74l08M8j80J02j15J58J01j98J19n8k32J54J3M1R2j25J12j60J15
5538gk2O1J71k02l5j57J38O0q4N3l4J57K8j46J84j77K00l7j33L9j08J80k11R6
5562A4M4k7p2J06n4j2L38m06K09k01q1R3L2j44J17rN9l6O7K46n24J90M6mQ7Q1
5588A59l35N6J83K66j66Nj76J54j06J95k05j29K31m30K65J18r4J18k90L20l6m88
$$ y = [130, -276, 60, 17, -30, 251, -126, 152, 3, -38, 4, 357, -63, -17, 30, 290, -338, -2, -96, -209, 398, -32, -111, 53, -22, -133, 365, 38, 433, 36, -95, -28, -84, -3, 159, 53, 176, -44, 39, 149, -1, 150, -59, -188, 41, -199, -200, -162, -77, 12, 51, 327, 125, 34, -117, -33, 117, 154, -90, -122, -81, 122, 215, -314, -52, 64, -98, -135, -222, -32, -35, 85, 18, 1, 156, 224, 164, 99, 303, 159, 8, -113, -95, 226, 5, -103, 199, 106, -66, 71, 79, 53, -121, 98, -202, -78, -160, 314, 6, 54, -126, -24, -139, 19, 120, -78, 41, -17, -249, -95, -82, -41, 51, -74, 38, -122, -7, -29, 32, 203, 1, -34, -191, -53, 7, -77, -24, -58, 99, 127, -19, 165, -12, 188, 151, 18, 57, -51, 129, -82, 14, 58, 31, -41, 65, 11, -1, 337, -69, 140, -61, -142, -49, -17, -161, -44, -53, 6, -30, 37, 283, -241, -51, -5, -9, 78, 159, -176, -120, 63, 329, 163, 168, -8, 146, 40, 235, 30, -99, 132, -298, -33, 85, -9, 109, -181, 139, 103, -385]
5610c85K94j6L32l61N4J7j64k7K39l2J00j35K13k81L1J77l0k8%Rj27J55p0q2q2
5635a99p7J14L58k59K51l51J44j87J57J25L3m8j27O4O6P5L2k80K38l17p6o4K12
5658a16L03n78N57k42J60j36Q4l28J82J97Jq6k15L36P9m03j22N31J1j84P4j00
5680El0J86j39J12ol05K91k20l8N30m21j08K71k67K50l33L07k11j97K68J21l04
5702b38K14j63K49o0k95L40j46J78k04J61j02PJ41j3k74K89j91K86k92L5P1j18
5724a25M78m10K48j51j60L02j84j6L6O3j06J10Q4k62R0j39L25j9Q6k82J11J34
5746B13l5j87j15K88p4k47K22j2j82j39N75j20l05J04r0nm3K45K14k02p0p2rL00
5770B54j62J08l33n7N1J1J72j43Q6K80l99J12j00J72k23J85O3l05L08l11M92K4
$$ y = [-385, -91, -107, 225, -136, -82, -65, -229, -256, -17, -49, 51, -84, 129, -152, -121, 56, 26, -2, -2, 7, -120, 35, -35, -117, -199, -276, -162, 196, -63, 188, -163, -19, -206, -49, 76, 109, 61, -66, -2, 64, 139, 171, -109, 129, -188, -264, -328, -116, 187, -391, 166, -76, 84, -52, 32, -296, -114, 83, 84, -2, -217, 119, 198, -205, -327, 204, 215, 31, 105, 5, -25, 161, 22, 134, 128, -177, 114, -106, -144, 386, -35, -143, 128, -139, 111, -222, 85, -126, -323, -55, 66, -238, -24, -187, 62, 2, -293, 47, -99, 79, -125, 36, -66, -59, 82, 69, -205, 84, -107, 179, -113, -78, -7, -125, 353, -57, 191, 40, -120, 182, -2, -18, 18, 81, -25, 85, 169, -93, -3, -142, 183, 164, 250, -32, 79, 213, 178, -9, -124, 164, 90, -157, 65, 53, -129, -268, 307, 187, -118, -14, -104, -109, -152, 93, 307, 105, 35, -37, -46, 254, 92, 200, -133, -190, -139, -128, 44, -99, -13, 267, -132, -20, -120, 52, -171, 14, 77, -228, 80, -231, 261, 285]
5792B85k49J69l90J75j06j07M7K58j23r3K41n4k40O0Q6j38L17J24m91L80l85L03
5814F9o2j08j11N4K85l13Q6J11j07J30j94J82J9j93J12k89K65k06J23K20l05q
5836b40J9L31Nr8J4N6J60n95K65o7K56k34R3k19K86k04m8K71O4k87K16j91K61
5859A14P6l23K85O6q3k6k04J81k10m8J15J94k22q3K37rJ69N4l35k1j39J23J97
5882A08j04J2k26K28Oo1O9p5l3J40j71q0K66PM6k16p4Q2K20j4r7P6J41k42o0K95
5908B43p8j19j39O2J59l0k08j60J36K8J64K19l00J12j31O8Q8j96J66o1L2K3k22
5931a44J42K31l88J97J5j97J04J86J11k58o1L60k16j8J81Q1n23K94J52l09J58
5952I8k22L24p8l11J1K60L3q1J46j84j08q3J33J48J5Mm43N04l45K94K2k29P4r3
$$ y = [285, 36, 205, -185, -10, -116, -223, -176, 82, -41, -134, 107, 53, -187, -127, -41, -179, 138, 262, -229, 151, -234, 69, 7, -101, -212, -158, 127, -186, -100, 11, -96, 34, -160, 22, 41, -152, -40, -329, -64, -270, -147, 73, -232, -240, -221, 110, 115, 17, 31, 87, 247, -348, -83, -150, 106, -128, -35, -254, 32, -172, -220, 51, 115, -172, 44, -147, 114, 190, -133, 152, 218, 135, 109, -95, 86, -124, -172, -57, 137, -85, -168, 69, 60, 229, 283, -52, -73, -212, -89, 108, 4, 16, -210, 18, 24, -37, 32, -43, -76, 64, -107, -187, 79, 86, 132, -84, -158, -76, 144, 130, 33, 109, 250, 8, -52, 243, 165, 46, -93, -31, 128, 98, -110, -270, -134, -106, 58, 277, -23, 89, -42, 26, 114, -82, 84, 23, 55, 78, -144, -2, 229, -159, 38, 53, -144, -40, 146, 257, -1, -62, 298, 82, 64, 245, 326, -197, 97, 249, -60, 98, -124, 200, 122, -189, -178, 82, 115, 34, 180, -4, -112, -195, -62, 86, 101, 105, -338, 166, -179, 115, 137, -92, -18, -111]
5976a11OK00k20K58j49J20p4j45N8j2O4J81j57l06J95NQ3N6K34m12J31j63J46
5999a2r8J47Ok37J50J37q0n7MK32k85j13P5j22K46k84K82M0J87l20k6j51m9M28
6023A00l50n6L30k12K08L8q1l00N63k88O7l2l4J54j91K13j79k9p4Q6J52p2l6P4
6047E1K38k14j51l5J15l33L35j03M3j10j0j54L41O9k5k70rK41p8JK87k38j02n4
6071a65J04J89K20n17L40J10k96K13P4k11Pl54J64J49J4L3n2j6J02m53L52J34
6093A41j5r0k0N4J89n93L49j09M9M03m36M3M5p5LL9qJ52J72m78Q2M37n10L50M4
6118B18p8k31K10l52L49j00lj93R6J59q7J30J07k09M1J58M9j93M8J53l97L25m61
6141b61L01Q6j51j0J44r7p2o0j86M36k03R0L15n22J07J08O4j07N2n7j08L03n7
$$ y = [-111, -105, 95, -125, 133, -16, 104, 30, -115, -57, -69, -5, 176, 19, -287, -92, -87, -4, 52, 286, -126, 5, -158, -12, -110, 37, 43, -194, -44, 93, 13, -44, -40, 192, -93, -206, -131, -253, -7, -291, -9, 31, 218, -102, -128, -279, -328, 100, -250, -306, 24, -188, 20, 58, -23, -323, 240, -48, 19, -13, -47, 107, -84, 129, -50, -79, -153, -67, 85, 13, -23, 51, 289, 75, -76, -111, 4, -329, 6, -97, -54, -164, -174, -328, 13, 82, 57, -213, -222, 19, -59, -58, 229, -9, -111, -165, -61, 128, 348, -169, 171, 281, -15, 198, 272, 61, 68, -286, -122, 27, 41, 74, 22, 6, 108, -345, 7, 141, 126, 36, 16, 70, 259, -334, 15, -94, -45, 358, -78, -35, 10, -65, -62, -23, -31, 121, 293, -185, -103, 334, -176, 174, 218, 140, -91, 119, -233, 116, 16, 13, -180, -84, 75, -12, 118, 225, 16, 57, 215, 264, 71, 119, 272, -125, 200, -261, 40, 126, -25, -35, 109, 12, -60, -120, -306, 130, -73, 17, 332, -190, -83, 25, 89, -18, 34, -23, -131, 172, 115]
6164A15k12J27K8q7K7j93K14l02L80O0k88L4K85k1j86J56k69O1j33O4O0N5J81
6187A56K0k34R5r0j51P9K88l33K77j25K20k75J03k24K53J75j20M4l34J51J39O7
6209A81n1j44J18P3j23k04j4K72Pk86M6Q3J23k69K12p7J5l3L4L62m86J69j53k22
6233c67P07m80q6J92j88L08k85M02k08j42P4P8k0N2N3k60L69j19j54j66L38k48
6255a50O3j3J87k54J87l9L9l1l9M5L37j82j55K4j70J33M8L3j81K21j15j50J56
6278fo3N8L6J87l85q6J90K36j77rj4J56L6o4q6K8l68J62o7J06Q7K02k42k48L71
6303D0j22Q4P1j95J01j49L20k74K60j01q5K75l13K24k3q8q5P3k2k9j5K73Lk36
6327a3J53m2k77k6K59J03m3r8M40o30j14L77j19o6L58m00N4K43m04J19J09k00
$$ y = [115, -97, 30, 58, -29, -2, -195, 19, -283, 97, 157, -131, -97, 188, 167, -19, 137, -132, -71, -204, -140, -80, -25, 156, 176, -58, 37, -53, -204, -125, 163, -170, 107, -18, 202, -73, 30, -194, 59, 234, 114, 158, -176, -25, 114, 181, 130, -14, 104, 177, 54, -150, -164, 108, 115, -171, -125, -42, 81, -188, 24, -53, -38, -71, -37, 325, -161, 8, -145, -367, 340, -140, -226, -34, -222, 86, -199, 203, -5, -147, -73, 5, -15, 37, 90, -170, 199, 80, -74, -240, 98, -150, -87, -100, 87, -167, 20, -19, 20, -11, -50, -5, 332, 150, -5, 19, -151, -18, 30, 63, -118, 103, -12, -162, -6, -69, -11, 25, 212, -173, -259, -69, 167, -10, -19, -33, 123, 159, 95, 9, 37, -331, -169, -236, -130, -43, 159, -83, -331, 40, -82, 2, 73, -122, -21, -170, 150, -124, 136, 35, -50, 225, -88, 136, 113, 25, -60, 13, -9, -38, -53, 220, 223, -13, 140, 98, -179, -205, 54, 157, 114, 16, 456, -174, -288, 89, -30, -96, 262, -138, -84, 159, -245, -126, -17, -217]
6349b17L70j67j93L61k41J5j37P01j67n37J55n0O3k97M71k39J48ol38L27O7l67
6371b78p6L51P5k41M54k51O1j96l59P70o5j43k3m07K08J67j13P4J18j78L69m24
6393a07j5N14l78J8N1mP5k54J26l00L23k21J47q4J55l53K10J16J06l02p9K17n0
6416h9J39j19m6J50O4Q2m3q9r4Q9j71N37m61J18q0l39L74j62M06p1k91P3J20j06
6440ij15J81j73J71J02q1k12j08Q8M17l81OJ51j29J65r1k11J50M62n22L59j23
6462I7Q3k52K68k45k54K61j70J90J40l88K98R4l95M17l87L26J20k82M0J6%m6L71
6485C02l53Q8j3k62J61q0N5J42k20K93P4k16j5k27K83j27nk30Q1r7K18K95l70
6508b23M92m47j35L28J9K8n1L37m13K55j37k4j79k6M5J13j5L7p0j5j4K89rk43
$$ y = [-217, 153, -14, -207, 154, -87, -72, -209, 492, 325, -212, -57, -107, -44, -341, 130, -109, 39, 33, -305, 22, 89, -278, -354, -3, 72, -169, 285, 34, 95, -101, -460, 310, 245, 102, 79, -328, -120, 47, -66, 8, 126, -52, 317, -107, -122, 392, 14, 32, 83, 79, 154, -100, 26, -274, 49, -172, -25, -109, 46, -307, -97, 19, 125, -177, -256, -39, -89, 50, -69, -115, 35, 99, 181, 138, 49, -45, 44, -127, 410, -51, 67, -13, -352, 22, -140, 266, 195, -96, -23, 97, -9, -124, 57, -116, 55, 157, 76, -136, -244, -156, 261, -120, -114, 37, -92, 73, -18, -229, -79, 383, -139, 220, 97, 180, -72, 196, -49, -303, -42, -212, -22, 118, -270, 28, 122, -273, 144, -243, 83, 203, -79, -39, -23, -23, -69, 302, -51, 37, 24, -238, -77, -157, -102, 40, -180, 113, 187, -29, -44, -271, 12, -115, -120, -350, -269, -366, -148, 147, -223, 269, -178, -313, 15, 34, 62, 11, 348, -65, 190, 53, 29, -150, -176, -131, -18, -33, 4, -66, -81, -95, 194, 185, -58]
6532e8k38J5K17M6j68Q5K61j40k1J63k07k07J35M11k71J75m69J03J02K27K4P4
6554B59n86O49m17r9m8N1J68J22k84J94L2k76J76P3jJ04k05NJ56j81L86j55k06
6577h3jJ86M7M5j43J32l08NJ4j02K99j55J27K81l71R2m2j1j66J79L15j83j51m2
6601c6k32L75l0j91k0J12Q8q4j64k3N01l94L22p4l07L04j27N6j63J69J8m4k34
6624a78J9N3J78j45L68j20j86J79P3m3m9j02j56L58l62q7J56M7%n8j06J27L3j51
6648a52jK44J30k62K18l4k2J19k28J31l19L50o5l5j34j17K63k98J39J00n6J28
6670I9p9ml9k06L81J76m15l0K47o7k16K15O3k02J22M5j74J21O6j72K79m07N9o
6694a44J70j86L38l97K46j68J01j52J7m9L39k9J8j26K02p3m2Q3K8j99k9J78j43
$$ y = [-58, -296, -281, -64, -18, -186, -101, 160, 20, -1, 162, -45, -252, -117, 294, 23, 198, -271, -168, -66, 161, 185, 259, -327, 322, -95, -194, -242, -191, -23, 99, -185, 9, 41, -235, -59, 14, 13, 117, -88, -83, 73, -108, 278, 123, -83, -84, 102, 149, 194, 51, 183, -125, -120, -106, -208, 91, -64, 63, 344, -27, 65, 23, 12, -154, 25, 340, 157, 6, -36, -268, 107, 77, -114, -134, -22, 66, -18, -182, -205, 296, -98, 224, 150, -157, 147, 20, 76, -87, 82, 100, 56, -178, -159, -106, 72, -73, 295, 175, -11, 168, 241, 198, 149, 47, -109, 249, -113, -200, -44, 3, 3, -55, -161, -34, -1, -152, -153, 91, 221, -41, 177, 143, 121, 240, 12, 143, -176, 174, 109, 74, -60, -177, 86, -212, -73, 27, -29, 99, 20, 16, -23, -229, 152, 328, -87, -117, 130, 63, -153, 62, 125, -77, 45, 90, -84, 37, 103, -69, 210, -197, -138, -144, 26, -160, 178, -219, 27, -141, -40, -192, -175, -224, 115, 86, 104, -22, 180, 107, 65, 148, 176, -23, -52, 126, -17]
6717a7j7q9K51o6N9k80M15o1j24R3k23oR9J74k30k8K59%J4j93j05L6K33l05j3
6742a24K8J83Rj22J91j01j43M07n51M03j2k20L19l08L5k85L46L9L18m51l6j20
6764a95ko1oL60l37K98k48K13l30L81k24J82n7j5O2K7j62K61p8j18K25j40k0o3
6788d7J6j27k20O8R5J07j26K15J26j91M0J20J94n68J45K12m4J60n8j38J98k12
6810c5K21k80J26k02O5J41j09J74j59K94k26j66K49p2j4j10J48m2o3r8J27k4J18
6833F3O5p7M7k19j35K87r1M7J69Kk28n4K6J54M2N8k11k20K89L8K97n17p0M01m5
6858A18j51j83L10L18l63P8j07N6J5j68J23O3k77L89j03m7K2m11L97N0j21o5N1
6881fJ88k09Q7o8k30J80j57M29k29J8K70l84M25k93n9j57L15K6m6k21m0L75p4
$$ y = [-17, -34, -123, 128, 62, 121, -159, 256, 195, 71, 164, -59, -65, 34, 208, -22, -50, 209, 209, 223, 30, -75, -39, 194, -111, -124, -96, 87, 96, -26, 165, 64, -79, 328, -223, 180, 168, -52, 267, -41, -6, -291, 55, 94, 412, -39, -75, -195, -197, -258, -264, 96, -241, 57, -191, 22, -308, 73, -151, 31, -26, -41, 21, 48, -114, 147, 69, -49, 176, 36, 16, -47, -31, -158, -378, -310, -215, -108, -234, -19, 107, -84, -44, 76, 270, -298, -153, 59, 15, 175, 117, -21, 177, -35, 186, -94, 32, -170, -105, 36, -73, 101, -58, 236, 10, -156, 93, 21, 7, -103, 45, 3, -60, -158, -31, -55, 63, 128, 51, 98, -121, -256, 31, -60, -13, 156, 158, -70, -124, -98, 56, 98, 156, -55, -275, 14, 52, 349, -168, -238, 163, 118, -33, -216, 94, 412, 49, 127, 20, 76, 91, -77, 46, 109, -168, 221, 118, 71, 93, -318, 79, 129, 8, -57, -6, 182, -27, 60, -8, -238, -58, -215, 214, -15, 3, 273, -111, 314, 21, -38, -195, 120, 146, 100, -121, -161, 214, 140]
6904A40j93p0o2K50k07M46j35k57K13j36q0J16j98k5P7JN7M4J61m1j88K44Kk92
6928a33K51j77j17J70j17Q2L7j33j48J04J04Oo6P5J18j38M49l37j9K3j97J58M7
6951D2J29k37L30k72J86j62j18K03l81L48J51p2m07L02J20n4p8p6K51j85j29k3
6973a32O0K97l7j40O8j14J36l97L20J09r8J19j05j54Q7K06k44K6o2K55M4p7j57
6996A0j79P7K4K22M0J5j67k14kN8L68p5j33KJ52j68k15K8J80J70j66Qj56K12P
7021I8j98J77r3J73mq6j83J5K19j19k63M4K1R7L76l10m5j00J89j68K62j12m2j23
7045a75K20j3k18K46k38P0l76O15p7k3l28N32k52q5J16k62J0P1l05M29J2j71J30
7068g2j1R2l1k7n0M6J09j43J78J63l98Q6o6P0L25l05J1M4K67k67P0j61J03ok38
$$ y = [140, -53, -123, -185, 65, -142, 304, 169, -88, 125, -11, -91, 25, -173, -198, -121, -120, -63, -19, 142, 101, -87, 157, 159, -133, 118, -59, -176, -6, -123, -41, -4, -137, -285, -181, -77, -71, -137, -62, 56, -82, 367, 30, 11, 34, -163, -5, 42, 171, -66, 264, -8, 178, 16, -102, 101, -280, 68, 219, 147, -260, 42, 162, 108, 30, -46, 205, 20, -109, -132, -72, 225, 188, 48, 116, 2, 138, -259, 61, 170, 72, 191, 86, -68, 19, 225, -19, 7, -55, 200, 244, 167, 10, -169, -92, -68, 154, 194, 209, 42, -172, -174, -116, 252, 177, 44, 46, 198, 30, -185, -157, 23, 193, 27, 35, -121, 91, 98, -100, 77, -16, 157, 153, 67, -116, -101, 118, -1, -264, -220, -199, -102, 274, -36, -81, -181, 8, -160, 102, -10, -52, -175, 45, 32, -186, 60, -178, -108, -484, 131, 54, 31, -297, 235, -17, -102, 14, -248, -238, -167, -472, -43, -31, -202, -72, -83, 9, -22, -49, -99, -53, 56, -87, 91, 254, -144, -58, -124, -54, 271, -34, -23, 21, 288, 21, 91, -70, 33, 27, -211]
7093b11L71j1k28l5J3J69r5M7qo7Q3lL9j22R2l29L16p9J06j75L86R0k63j8k15
7118a47J52p5L6q4J05n8J51k27JN6L98J11p51L54j47J47J32j72N2j82K10L0r0
7141BK4m51N37l27Q9Mq1K58j18M1l2j88J84r9K59j42k04K14j61J18J4N8k29K55
7165B5J37k10J58j43J30j09L1K07k54l9j98L79O0l01K46r4Q6k7j41q1R9n3R2M8
7189D8j46K4j59L09o5l3j31O6K79l52J20o6m7K27n7p1j2q2m2K08m1o1L60p5j92
7214IR2j68N1k36L84m87P49l82J62L1k64j84J94j39j27K14K29l1j61J64j39K70
7236B31j02n1k76K8K70Q2k66k69J32M44j40J92J69k26j11j40Q0m9K22m51J89M47
7258D05l33R8k06O1l2J44j39o4L48j93l15J63J03K17m15L68k74k24M89k44j46
$$ y = [-211, 160, 149, -79, -114, -101, 68, -27, 20, 12, -55, 28, 25, 64, -58, 34, -295, 21, -58, 48, -127, 259, 349, 86, 68, -147, 5, -70, -34, -118, -13, -71, 80, -147, -146, -90, 308, 419, -332, 22, -125, 22, 154, -18, 34, -148, 62, 92, 2, 26, -425, 112, -215, -126, -122, -203, 55, -63, -22, -54, -242, -58, -157, 102, -40, -244, -30, -191, -73, -59, -1, -230, 25, 162, -48, 110, -33, 97, -12, 19, 226, -28, -67, -265, 114, 174, -127, 119, 25, 111, 84, -57, -138, -39, -92, 0, 48, -98, -74, -233, 76, 11, -22, -153, -87, 192, -160, -40, -106, -153, 74, 17, -54, -66, -148, -190, 18, -23, -84, 276, 201, 9, 101, -67, -16, -252, 132, -355, 394, 12, 174, 205, -59, -243, -49, -188, -315, -101, 128, 97, -64, 100, -39, 231, 129, 78, -198, -170, 100, 182, -84, -353, -221, 223, 83, 275, 444, 218, 107, -33, 47, -2, 220, -231, -42, 405, 72, 170, -36, 25, -7, 137, -2, -66, 282, 89, -226, -63, 40, 257, -158, 210, -64, -288, 201, -43, -189]
7279a89K30j21n6J28J10O4O2l63K66l69NL42j13J7j1Mj5k6j6j36q6K30J1J10p1
7304Gl15N86l6l7p5j69J67j57L07j83k7n4K08l05Q4j38n3M60l64O6k6Q7J91l08
7328h4K03l13J49K57n04R9L60j79ON8k22r4K12j2r6p7J18j5j32K42k74J07K38
7351D7n2J2j09L13l34j45JL69r7k52M16q5j0l2J08j22J21J4j09J1p6L1M65k97
7375A88k35K01j85k04l5K54L53m15l9k0J85l4p3J33K9k69m8M43k15j27o9J91k05
7398a96J29m8R3Mj01J20r5J20P7m7J20l40J41J75j81J33j81J79N2Lj3l11K38J1
7422H2l3J7m00M78l5l85N67l87K11J60l55J5J96j17J06j19Q9l25J08Q1J30k21
7444a37J16O2k18R8k49K02o5k0J42L14n49K09K38k25R4J40j30M6q5j16K97j79
$$ y = [-189, 41, -80, -136, -8, 102, 166, 228, -135, 131, -238, -233, 109, -4, 13, 2, 6, -9, -35, -51, -187, -273, -43, -32, 78, 7, -308, 278, 242, 205, 130, -39, 128, -29, 278, 95, 68, 14, 222, -83, 1, -137, -190, 270, -94, -28, -54, 33, 224, -84, 119, -194, -45, 212, -292, -193, 167, -12, -6, 52, -170, -264, -52, -64, -160, -237, -119, -134, -266, -24, -298, -191, 47, -5, 7, -102, 211, -123, -268, -267, 102, 5, -247, 169, 84, 74, 42, 150, 28, 149, 163, 54, 65, -11, 20, 485, 188, -47, 154, -31, -235, -270, -16, 337, -78, -117, -137, 48, 14, -59, 74, 103, -166, -214, 229, 14, -113, -182, 9, -196, -67, -115, -22, -18, -119, 1, -94, 26, 103, 56, 176, -164, -23, 152, -29, 104, -77, 102, 154, 157, 144, -167, 71, 82, 49, 66, -334, 144, 109, -276, 291, -96, 115, 275, -80, -65, 131, 14, 120, 1, 90, -235, -127, -46, 84, -137, -21, 41, -177, -79, -328, -126, -191, -211, -69, 245, -304, -95, 143, -82, 12, 152, 22, 68, -17, -133, 164, -15]
7466a5R9k16K92l71J80m0R7J14j86j78J53l3J38n7j34J35N8j79L47l4M2k64K12
7489A60k90K07Q0j52J15P2K3m18K56k7o7M7k3O7q6R8j94K30m7l9K84l63j0Q4J7
7514B4m24O90j51n4J01k46J05P2kn8M6r5j89J30J0O8mK36j11Kj88%J24p3J56j05
7540F4k71Q3K9J44K73k49k28k44K36K46j6M2J06k06K02l54P8J8M11m43J94k69
7562a54N76l37M2k79m8L78k80o2J06k58J14R1L00K96o17J35k38KmK11J28l05K22
7585A9k81J59l6K08j8j07J97l25K85K00J26o36M34k77J45L3Q5p3j10j20K63k41
7607g0k65L76q4MK34R6j97J55l56J35j74K48r5j87J99j30K20J38o46N10j50J66
7629A27j01j14J87k62O8jL62m72P4K24l32Q9P7K25J8J9k39k18L39J13R8j96q2
$$ y = [-15, 84, -132, 160, -211, -31, -71, 26, 140, -46, -224, -71, -104, 34, -23, -157, -22, 36, -143, 204, 170, 212, -52, 160, -130, 77, 157, 5, 120, 192, 215, -203, 53, 26, -41, 6, -17, 50, -36, 62, -132, 98, 51, 12, 296, -67, -77, 7, 24, -400, 290, 139, 85, 186, -60, 45, 117, 115, 57, 103, 8, -181, -51, -41, 27, 23, 259, 148, 150, -38, -38, 86, 13, 169, 64, -207, -124, -95, 49, 322, 73, -155, -399, -163, 83, 67, 109, 215, 9, 211, -143, -65, -47, 364, -79, 115, -154, 422, 85, 127, -152, -200, 178, -102, -164, -58, -316, -202, -111, 189, 485, -132, 3, -235, -233, -237, -26, 102, -203, 19, -262, -103, -139, 69, 51, -56, 141, -184, 101, 301, 427, -209, 225, -52, 93, 126, 211, 138, 28, -92, 171, -70, -335, 41, -43, -39, 195, 291, 94, 249, -107, 28, -146, 102, 7, -180, 19, -111, 109, 247, -399, 111, -39, 127, 26, -88, 99, -163, -95, -96, 266, -206, -132, 92, -240, -151, -74, 151, 169, 188, -51, -269, 70, 183, 281, 85, 3]
7652Cm2N1m5k3j51J94j28P8J14J90k44j42J21j14L05l15J45k59L00n8q7J13J73
7675A79k79k0K16k46R5q1K75j50J35n04L23O2j44K19k17J27m7Q2j33K4K7j35k4
7698b16o7P6K50J93m95K39m3R5P9k28j03K80Lk82P7j8L31j10L5m1j6j22j92K77
7722BO3j40L68l29p2J26K01k3k25J59j55j22K34k70J35Q1l11K80j37J03j52K54
7744G0j6J02J25l52j26j5K97l41J04J05K07k63k3K43n6J46j95j48N30l62K3l7
7766A8j9J68jj44j1l2n75L90L47j55K6N2n4J71jJ24j21n14L67j04K3o7j37M57
7790B08j2k16qk77K7L06M2j22j19L1J27p2j32N6K54L7j05k47K76P2l46J65j0J60
7814I5j9j87l7j5n8J30J49R6l03J67j04J81k1m9J39j30M4N02n81K91m89K11q4
$$ y = [3, -39, 12, -33, -56, -207, -13, -141, -63, 51, 241, -3, -145, -24, -138, 167, -148, -3, -262, 38, -20, -107, 6, 179, -100, -120, 96, -150, -55, -136, 139, -11, 124, -380, -57, 5, -139, 80, -137, -10, -57, 25, -108, -84, -57, -192, -216, -283, -207, 43, 236, -259, -20, -63, 32, 111, -117, -220, 60, 63, -219, -142, -160, 171, 61, 96, 55, 39, -83, -275, 2, 65, -75, 293, -36, -108, 18, 219, 196, -29, 130, -25, -147, 87, -183, -48, 33, -278, 2, -135, -32, -184, 70, 54, 156, 281, -71, -197, -212, 85, -256, -152, -47, 160, -103, -126, 117, 61, 207, 12, -136, 394, 32, 55, 18, -1, 167, 166, 22, 11, -21, -596, -206, 141, -14, 12, 64, 10, 181, 180, 304, 183, -331, 36, -68, -45, -112, -249, 208, 196, -20, -28, -305, -278, 28, 70, -52, -171, -140, -13, -85, -217, -161, 93, 130, 25, -222, 54, 126, -220, -55, -65, 95, 76, -111, -148, -163, -221, -91, 58, 154, -149, 18, -86, 95, 74, 25, 164, 34, 78, 580, -1, 290, -199, 12, -72]
7837g2k49K13n2K43L4o7r1J85kj40J65j09k03P3N8j00J56j07J96j18j75M77k73
7860D2k48L06OKl81L65J6j41l13L73M8k31L77k60k6j33M29K5j98J74m14L03m8
7883G3r3Rk06J91k3m9L74l37L98k78R9L5m04L84j56n1r3J05O0j17j92J85j36Q2
7907a40L50j56J17l21L28q6k71K59k95K98K42j29r7k03m5n5L88l14j69K68j14
7928a45j16R6K38k11L46k95J29o8k06K94o1K30j85q1K6n3K54m80K65J29k32M5
7950h1K19J7m21L13Q5J41m18K35k49J21K25j01qp7p5M2J48j9J29j69K05k74k15
7973b27J7K24j60Q7K33l53K61J73k07j52L5Q5K55k8n11M34k62p5j47L25jr6L3
7996e7M4j66J04K33P5j85m5J43m20L34J64j73n0j35J70j54K68J31j85j17r8j2
$$ y = [-72, -321, -108, -160, 83, 117, 50, -41, 144, 142, 2, 167, 58, -145, -72, -14, -114, 42, -65, 131, 13, -162, 315, 42, -206, 100, 106, 108, -273, 92, 108, -33, -346, 27, 75, -156, 221, -39, -65, -198, 231, 256, 58, 232, -182, 121, 73, -20, -11, -217, -26, -49, -98, 276, -61, 337, 59, 158, 193, -211, 173, 17, -34, -127, -22, 38, -79, -271, -86, -222, -140, 210, 54, 171, -150, 178, 92, -179, 80, -215, 83, 325, 196, 99, -104, -149, -204, 184, -130, -299, -31, -145, -261, -165, 73, -138, 208, -87, 42, -26, -232, 62, 1, 231, 46, -35, -9, -62, 192, -288, -23, 106, -126, -81, 138, 155, -266, 47, 132, 273, -145, 90, -159, -38, 187, 86, 78, 1, -74, -32, 116, 97, 226, 57, 262, -12, -227, -210, 14, -146, -59, 174, -179, 82, 255, 48, -104, -69, 16, 271, 243, -268, 166, -96, -171, -318, 7, 6, -90, -57, -13, -179, -75, 158, 233, 48, 3, 146, -274, 60, 224, 51, 1, -134, 36, -118, 150, 281, 96, -21, -119, -131]
8018a31M09n71J90pk9J29l3J93L2j42L33j46l74j36L38L13q02M35L38k70j01J1
8040b1J10M0j15j98M9m6J30k82M14j11J25Kj83K37j28Q7j56J31m7j80J50K9R4
8063A31no5J07l76L97j22K0O0j33J05m8m9K49o84L89l8J5J19l2p3J09j6k41J70
8087a1J33j53j08M28k26j22Q2K10j57l23K66Qk9m8K05J2o0j60J09N5j80j45K6
8110a88J36j32Q6J50j29Lj30J05N19m88j1J22m5P0p4o3jo9j16K60K43j21j27J88
8134A88O9m21K06k32K56l09K88L4n5L8j03J75j44M4j37J26J09j61K41m2m17L12
8156F5ol75J08K37rl21L47j61J36j41j75J13J57J19j41J11j18l19L05J68j67L3
8178c4R8j74R2J90n6j15J0J93k71K76r0k64K22
$$ y = [-131, 278, -293, -103, -110, -139, -10, -43, 150, 182, 40, 373, 227, -147, -283, 55, 368, -434, 1, 339, 69, -32, -21, 89, 129, 14, -184, -135, -181, -51, -333, 81, -30, 95, 97, -86, 151, 23, 110, -46, 85, 38, -142, 8, 37, 131, 126, 61, 168, -208, 189, 67, 87, 147, 14, 119, 71, 22, 271, -413, -24, -62, -47, 72, 40, -33, 76, 60, -181, -11, 122, -31, -139, 289, 63, -59, 23, 233, 76, -247, 19, 27, -2, -50, 155, 167, 107, -53, 56, 111, -69, -214, -188, -52, -184, -98, 52, -77, -74, -204, -99, 420, -68, -79, 43, -2, 68, -6, -69, -70, -139, -255, 5, 248, 127, 0, 188, 257, -164, 42, -190, 66, -243, 45, 79, 24, 62, -41, 134, -10, 34, -103, 23, 132, -29, 212, 170, -247, 65, 59, -316, -208, 29, 20, -301, 46, -115, 21, -120, -295, -182, -25, 94, -47, 64, -54, -373, -68, 100, -67, -34, 64, -110, -18, 172, 116, 1, 11, 204, -67, 209, 119, -145, 77]
8191G7
$$ Imaginary data points
##PAGE= N=2
##DATA TABLE= (X++(I..I)), XYDATA
0@%%%%%%%%%qJ6j6J6j6K4l2L2m0M8n6O9p7Q8j04J20j39J60j81K05k33K63k96L30
33A73l70M15m61N15n74O37p03P77q62R54j057J172j300J443j606J794k010K264
51A201k568K938l402M002m811N974p796J1079j8855P0375N8990j38677o1273N3170
65b9653R0097j1371o0165k4969L9874K8647j1690l0453q266K282R266J6738K2493
78C2830q061m0942l3152K2211N4494K0183m1625m1529J6346M4553L28l9893j5608
91b9865L1749L2038o798k8841j1846P562N525J241J5129J6017j3920l4264p276
104b3549K7558K0437j3364j8484O270J5942m337j9967o364J1378P501p5O060M048
118A3054j8752k6665L960L4516K0511j8646l1018k494K5300J2018k0760j9708
$$ y = [0, 0, 0, 0, 0, 0, 0, 0, 0, 0, -8, 8, -8, 8, -8, 16, -16, 16, -24, 24, -32, 37, -40, 48, -56, 64, -75, 85, -96, 109, -124, 139, -157, 173, -197, 218, -243, 272, -302, 335, -368, 409, -453, 501, -556, 616, -684, 759, -847, 947, -1063, 1201, -1367, 1571, -1831, 2171, -2640, 3334, -4462, 6617, -12238, 58137, 117127, -21550, -82823, -29653, 60444, 49073, -11092, -36061, 3813, 32460, 20770, -9683, -17949, -15667, -6401, 10337, 32830, 24769, -16173, -49325, -27114, 27380, 47563, 5938, -35591, -19245, 25308, 25636, -14257, -29865, 1884, 33922, 27124, -1717, -13563, -6001, -476, 765, 15894, 31911, 17991, -16273, -23549, 4009, 24446, 11082, -7402, -1132, 14810, 10473, -9494, -15858, -4480, 3021, 2946, 9006, 13054, -5698, -32363, -28403, 6113, 26624, 7978, -23040, -25534, -234, 11784, -8976, -28684]
130b8684J7183L0697K50l0940j7571J5323J9330k912q196R773J0332j6533k3610
143b5558R615L0206M752k4031q968K0356J2332k1340k4513J3046L5097N366k9823
156c463j8615J7323J7535j2794j8665R798K6308K616k7813k0077J3119K4509J847
169A1628j5829n454J0006N141r447q989M599J1943M120m126j271m30q335q578
183a5022J1125K2449K036k2113j3768J3267J6891n701j6959J662K0109Q202j5703
196F475j7564K384J2705P734l89m493m740m478k19L758L549p05l008J159N159
211G327k748j1886n727J0685J4964j90j4546r510O518J0049l376r035L244J4059
225I828J573j4765j0460O617J2502J433n575j395M767k781q804o24J0843N489
$$ y = [-28684, -11501, 19196, 19446, -11494, -29065, -13742, 5588, 2676, -5520, 4253, 14585, -1948, -25558, -15943, 14263, 19015, -5016, -13984, 6372, 18704, -2636, -27149, -14103, 20994, 26360, -3463, -22078, -4755, 12780, -14, -18679, -8881, 17427, 20043, -7770, -27847, -14728, 9781, 11628, -4201, -9655, 351, 5492, -3955, -12944, -8345, 3598, 7718, 3592, 2321, 1891, -6444, -15022, -3897, 18552, 20588, -1525, -15293, -2026, 14865, 9164, -7795, -6133, 13976, 22178, 6475, -11089, -8705, 4000, 11734, 11345, 6852, 2112, -2366, -2585, 1173, 4722, 4017, 1009, 2168, 7327, 4579, -7307, -13034, -2349, 12615, 12425, -2121, -11631, -5113, 4936, 1560, -7475, -4231, 9828, 11401, -3364, -13824, -7207, 5295, 6728, 1153, -242, 4525, 1744, -7060, -7684, 3159, 8648]
239H648n844m140K462J375o884m787O310J1162J407j0128q724K252N637k83k647
254d184L119N499j376r379o838M594J0015J414o291j618N197n62q835m315Q170
269e390J0873R75q436o202J253K309l6L414N329n08n972k620L491J027l892l26
285d711P450P846l539j3659o729Q339J1731J980o287m520P32K086j157l010L0
300c418N919M160j527m952m402k961J856Q162O990j625r010o259K933O656O31
315C153m223J284P633J066r462p342L210Q318M344o72k381k427k604k675J423
330a355N598M379j129l131k147k043j922P00L912M588J709l654o705k512K401
345a311K571J287K556J943k452p307m276K746P038L097k973j958J102j447n913
$$ y = [8648, 2804, -1336, 1126, 2501, -4383, -9170, -2860, 8302, 9709, -419, -9143, -6891, -1254, -1537, -4184, -1065, 4434, 3058, -6321, -13159, -8565, 1450, 2864, -3427, -5045, 152, -410, -9245, -13560, -5390, 5483, 6458, -1978, -8180, -6927, -4618, -4654, -1240, 4089, 3581, -2391, -5011, -1520, -493, -4385, -4711, 2739, 10585, 7046, -6613, -13342, -5003, 6728, 8708, 2421, -2099, -1367, 719, -438, -3448, -3418, 2501, 6661, 5134, 182, -4220, -7181, -5325, 2837, 9827, 8202, -808, -7067, -4134, 2522, 3153, -1070, 214, 7847, 8913, -549, -7891, -4681, 3637, 7981, 7309, 4928, 2501, -103, -2778, -1355, 4243, 8622, 7493, 4362, 2215, 172, -1750, -1050, 2862, 7450, 9159, 5505, -1200, -3712, -1311, 1260, 2547, 5103, 7046, 4594, -2713, -6989, -4243, 2795, 5892, 2919, 961, 2063, 616, -5297]
360e297k046O304P064P20m220m490k582j93J630L614M246P56m588l756k51j47
376c236J04K705M437J692k672o041m907J282O353M054m69k317j476k022l203o65
392f381L111N470K744l393m801j908l52j30K694N381K222l779n000k132Q25K035
408c394K612K391K048k001n025l599J897L728K388J721N26j968l650k693J20L709
424a190N032J690k225m112j913m92Q21K576K984J613p72l761l801J06J966K467
440I89K229K250j736m722l402J129L248L064P67l59j082k613l061m76M148L853
456D226O14j615j288k743k035Q68K533K851K062j176l329l380m6J740K852J759
472C893R9j293j751k589r95J611K922J549l58o46k381l359p66L356L644J020j999
$$ y = [-5297, -7343, -1039, 6025, 6745, 2525, -1965, -4547, -4740, -3110, 504, 4750, 5506, 918, -2838, -3089, -3236, -3132, -427, 4010, 5702, 3030, -3011, -7918, -6636, -283, 3771, 3302, 985, -491, -2513, -5716, -6381, -3270, 2200, 4944, 1551, -3250, -5158, -5510, -5640, -2946, 2435, 4657, 878, -4122, -6254, -5429, -3394, -782, 1609, 3657, 1656, -3369, -6968, -5071, -1343, 1045, 2766, 3292, 1324, -2326, -5019, -4899, -1190, 3842, 5532, 3307, -805, -2718, -3210, -2389, 187, 3171, 4784, 4012, 251, -3550, -3444, -1478, 989, 3218, 5468, 3732, -990, -4392, -3263, -15, 3049, 3816, 3457, 2375, -238, -3299, -3775, 373, 4226, 4840, 3225, 1937, -806, -2841, -1973, 560, 3411, 5473, 4297, 968, -2412, -2458, -718, 2134, 3893, 3992, 2699, 948, -1641, -2636, -1025, 1897, 3446, 3088, 2442, 61, -3298, -4064, -708, 2936, 3956, 1957]
489A957l137j246J55m8R49K282J506o14k084j913j544JL082K876K37k518k187
506b246j731O64J652J720O66N12j088j954j577J21R59K662J544n20k717j032n16
523b881QQ17K509J638j118k683j796J58J308J325J122O61n00k502j914J210J640
540i98O57Q35M74j03j845j831p82J569L305J819j607k486j589N61J900J693l53
557A219l35N82n65j512n75L90R29J626R20J71k122k510r45K746L828L53k709j729
575b38l68Q98J203p9q36M52J467N91k310l117J26L164L255K58k779k819r61J348
593g45K037J666l14j745p84M73Q30j311j080M67K935K225j996l911k655J774M876
610B742K159k100l857j016K255J451j431j151J220J740p0j626k136q00J308K002
$$ y = [1957, -1180, -2426, -2271, -2319, -1370, 912, 2418, 1804, -280, -2193, -3737, -3736, -654, 2222, 2459, -59, -2246, -3977, -3313, -1661, 59, 725, 1237, 149, -1805, -3382, -3261, -2302, 360, 1904, 1384, -1333, -2365, -2881, -2873, -2056, 453, 2091, 973, -1710, -3506, -3348, -2040, -715, 407, 1068, 568, -1934, -3848, -2638, -998, -341, 494, 968, 865, -980, -2811, -3593, -2024, 1281, 3100, 1493, -993, -2582, -2021, -121, 1572, 1219, 884, 1466, 901, -611, -1186, -796, 133, 1759, 2679, 2850, 728, -1782, -2727, 19, 3847, 4200, 1491, -238, -606, 292, 1495, 1416, 580, 1032, 2499, 3090, 780, -2337, -2211, 953, 4208, 4466, 1687, -1132, -2093, -745, 1292, 2958, 2644, 899, 115, 588, 1418, 107, -973, -506, 2429, 4654, 2658, -1253, -3908, -2134, 2742, 4901, 2801, -1056, -2072, 183, 1634, 203, -948, 272, 2012, 1942, 316, -1820, -2620, -1312, 690]
626F90J883L9k479k832r24K447K485k5j452q45J39Q05p85j939K58L265K603k072
644A261l387j649J465J996R25o53K28P08j872k075J26K225K092l72j254m31o68
661a335n4o23N84J892J736n06k223j702m61J392J614Q33O7n28j154k293J18K565
679g8J343j71j259N6Q99p37j857r05K261L917P7l167l114p6K520K024K71j075
697I29r81P70r41p70J61J146J158J50K92o20j720k121P35K793L389j042l439k328
715b439J021K514N06j233l44Q20J444r82k680j438K081K861R09q84k772j201K20
732a597J273J249J012n84j531p66Q10L34p60q73J216K405R92k913l674q8L229
749b66K959m74k621j054O54P56m56p53J38K249O75j228k258r90J063J125J420
$$ y = [690, 2573, 2612, 133, -2699, -3623, -1176, 1309, 1284, -168, -1013, -874, -69, -854, -2793, -2535, 730, 3333, 1261, -2126, -3775, -2310, -314, 611, -42, 186, 894, -978, -3053, -2927, -702, 1390, 1018, -236, -667, -1335, -1389, -2012, -1428, 464, 2200, 1694, -529, -2231, -2692, -1300, 314, 1147, 1214, 686, -468, -2761, -2643, -78, 1265, 1094, -165, -109, 790, 53, -1804, -2709, -448, 3469, 3546, 379, -2735, -2811, -291, 1733, 2004, 929, -52, 718, -223, -993, -832, 314, 1472, 1622, 1914, 1294, -426, -2547, -1812, 981, 4370, 3328, -111, -2439, -1418, 1096, 1602, 369, 25, 845, 2289, 1307, -1373, -2811, -730, 2131, 3040, 2156, -616, -1817, -1597, -324, 925, 1937, 1353, -178, -944, -134, 200, -560, -1433, -217, 2188, 3180, 267, -3407, -3495, -266, 2693, 2219, -402, -1456, -802, -46, -502, -1255, -1117, 1132, 1807, 579, -1679, -2669, -1606, -481, 939]
766I39K31m94j534j617O5K041J147k14j065L19J80p76j534K81J469K459l11k154
784e68j765O30J219M02l90M88P58N9j695j683P13K104J275q55j082l5n6n86K20
803h47L57J354N08p93q73n63k77O96P00J074j27p97n39q77Q9J368P37j33o10j14
823C33L12r20m46K47J597P34k50j552r51J8R51O47O61k77L8j176m2J58N1Q94K36
844A263l06m9k95n80o14k7J308J265l36j633r95J95J401O82n91m83K76N8k94q37
864e92k4O38P60K42n22p99l96j98Q59R80L01o34j082l16N32L21n94k5P59O15l48
885D77j280o72L15J199Q02l23n90m89M0k72L35M59J37P6m26r6l46m8j6O59P22
906F63l13l65q52K4j64O28R76k99k54m78k73j98M35P14n5M8k72l53k52J69j80
$$ y = [939, 1170, 676, -858, -2475, -2410, -369, 778, 564, -501, -182, -2, -778, -2312, -2031, -562, 1897, 1586, -568, -2333, -1703, -484, -82, -472, 16, 774, 833, -862, -2545, -1832, 272, 1547, 692, -390, -425, -481, -1067, -847, -490, 864, 1372, 579, -294, -857, -1134, -438, 262, 1336, 1209, 412, -127, -1004, -915, 453, 1190, 1057, 447, 333, 645, -275, -721, -474, 1123, 1857, 1607, 55, -896, -878, 73, 720, 1381, 1104, 1142, -34, -76, 82, 133, 1027, 1263, 957, 908, 613, 33, -581, -608, 700, 1965, 1629, -4, -999, -804, 597, 1279, 688, 205, 481, 539, 245, -592, -616, 22, 782, 1024, 502, -297, -693, -891, -32, 948, 1249, 615, -467, -783, -251, 70, -524, -549, 210, 825, 477, -803, -1475, -1160, 39, 841, 518, -72, -561, -521, -793, -458, 1, 138, 214, -212, -308, -654, -702, -718, -59, 663, 350, -15, -867, -843, -1007, -379, 597, 298, 44, -434, -707, -905, -470, 244, 189, 237, -35, -388, -640, -471, -651]
927f51N14P95j76o12l24l08K28N52N26J43k83q69o8O42k89k4O98q7L61m99j049
948g80J02O59N86L82m89n90j2L2j24j29Q63M98k55m72k69m33N43L0N44J89j32
969G43p24k96l72Q55N5N41k8j9r26o65K23R80K38p9K47m85l29n61r8K08R27K20
991F55j46n70m54l59N24N19L76P0j92n16o18j37O96J05J82M04m20k61l94r2L66
1012b62N00K61n36j44j22n76J20J68P04M89m42j81q01k68N37K86N87j36l25l72
1032e13J6k70J5N28L51M77n93n7r30J02M48O88K18j9l61o41j22K46Q9N71L10J7
1054E70q49l67J41M5J77L70P45k73p35n67J27L92L57N54M0l60l10o61K21M8P20
1075C85J2L52n21j87k17k36L24O50L29j44n86m20j39M67M33J57o7K94n47m12k24
$$ y = [-651, -137, 658, 482, -130, -454, -762, -534, 18, 544, 687, 404, -465, -533, 109, -180, -204, 494, 407, 768, 269, -780, -678, -19, 567, 949, 460, -130, -142, -110, -234, -363, 500, 998, 743, 271, 2, -431, 112, 142, 686, 875, 743, 19, -277, -649, 206, 261, 802, 774, 755, -171, -836, -613, 367, 605, 526, 773, 288, -41, -602, -700, -492, 435, 655, 509, -61, -515, -874, -350, 169, 545, 615, 423, -93, -711, -848, -152, -47, 135, 539, 119, -142, -536, -628, -262, 238, 499, -37, -181, -303, -879, -759, -591, 113, 602, 160, -21, -822, -1090, -553, -267, 320, 184, -141, -513, -497, -767, -752, -224, 127, 604, 11, -46, -976, -874, -426, 262, 480, 461, 100, -541, -663, -417, -328, 243, 553, 570, -279, -646, -505, -460, -283, 87, 832, 559, -176, -743, -616, -224, 133, 687, 727, 367, 57, -604, -383, -335, 385, 397, 749, 228, 41, -176, -412, -88, 562, 891, 747, 161, -259, -398, 69, 502, 659, 592, 886, 339, -73, -297]
1096b97J07N36M48K06j62q00k61k98O19J51N01l13k9m63l79m37Q95M25L33M7n74
1117B55o29m07M69N26N17j69j84m61j70l86L61K97N22O2l48k31p61K60J26N47
1137A96L05j88j47l07l44l72O23N1O62Ll22p33p3j49M22L78Q4J71k83l95k03r9
1159g20O13m6K05m5l46k58k59L18K48L44J24k29m64k23J49J94M03Q4M31p70l87
1180f34L61k1J78N5K39P6r0m13k56L27L95P3J0R9m49n16R0L39N28k77N75l09p92
1203d12J85j2L09L04R9kr4n19j51j37M86M43Q1j39k92n94R6K99K37K65M08l29
1225E31l89k44p6n9M85J60R6J17p51k64J85J52M22J81j16k69l69K40j34L55K82
1246E35R2n13pK6l70l52O33L61L9q8p03K31m67N28N34k70m1l68j14j48M90q1m13
$$ y = [-297, -190, 346, 794, 1000, 838, 38, -223, -521, 98, 249, 750, 437, 408, -55, -434, -871, 24, 449, 782, 829, 255, -374, -781, -312, 214, 731, 562, 378, -83, -253, -639, -278, 19, 541, 603, 255, 24, -737, -477, -351, 196, 501, 313, 166, -141, -485, -857, -234, -183, 479, 482, 160, -573, -646, -795, -373, 5, 89, 260, -23, -418, -621, -720, -107, -153, 52, 7, -339, -597, -856, -538, -290, 54, 178, -51, -515, -738, -589, -395, 8, 92, 523, -247, -634, -273, -294, -116, -61, 178, 254, 164, -249, -505, -178, 217, 290, 300, 399, -50, -566, -476, -137, 391, 114, 689, 380, -412, -227, -239, 70, 374, 473, 471, 377, -142, -293, -430, 56, 499, 580, 441, 149, -445, -349, -50, 187, 452, 860, 531, 142, -102, -178, -237, 248, 408, 504, 621, -130, -394, -209, -57, 365, 546, 430, 161, -208, 32, -102, 253, 535, 627, 114, 107, 133, -237, -589, 44, 405, 444, 356, -347, -116, -583, -55, 479, 209, 168, -200, -314, -462, 28, -53, -466]
1269d66N76O2Ko39q1j4P25L69l16l78k52N7l26L06M20J31k45j69J05l24J22j37
1291d72J24M52N58m53j083j72J027L28n5k63q3K6k7n75K61J88N24K47n11l78O5
1312b72j53L08P2L41K5P1q18l30O10L38J46j56J00n0k12k03l07N10N89j18K7n10
1334HL2j81j15K78M79K76j36m01o26L1N06L51L07l85k20P1j13o00K79P18L25k74
1356F10j65m85r7L42k6J44M57j89l62m62o8M09K70J71O4p7j10m59m50m4M75Q60
1378H08jo73m56N1K83j93K48K43L04l12n08o7P5J24K60Q0k0q4n75m97k38J178
1400C0P54j54n36n85L71k18j27J45L32M86j80p37m04j57M80K78K68M00k59q17
1420f30k6p0PP80K73j71n66M32l56l78K01L8R48J8m76q98k7M09L86M43o6N8l22
$$ y = [-466, 110, 172, 174, -465, -546, -560, 165, 534, 218, -160, -412, -355, -681, -375, 45, 176, -69, -238, -133, -457, -335, -472, -348, 104, 662, 209, -874, -1046, -19, 309, 254, -9, -92, -66, -93, -668, -407, -219, 305, 552, 41, -337, -272, -425, -117, -45, 296, 321, 392, -426, -756, -146, 192, 338, 182, 282, 232, 20, -183, -490, 20, 609, 491, 518, 8, 40, -141, -256, 22, 501, 777, 641, 240, -386, -355, 151, 502, 809, 424, 204, 275, 162, -438, -159, 559, 884, 610, 445, -40, -137, 205, 179, 323, 780, 591, 229, -233, -301, 108, 378, 549, 613, 536, 426, -33, -483, -527, -52, 808, 807, 134, -322, -271, 12, -181, 67, 310, 614, 302, -206, -273, -198, -74, 186, 266, 246, 162, -413, -910, -1148, 30, 784, 630, 94, -491, -120, -338, -465, -320, 12, 498, 318, -419, -823, -980, -500, -222, 46, 446, 187, -630, -656, -726, -719, 61, 334, 163, -403, 29, -327, -705, -504, -466, 482, 500, 24, -874, -901, -492, -106, 337, 271, 329, 7]
1443Gl88o57O44L85M43J11m98j13n62L25K28J53K58L92k72m43o16k5M01L76J84
1464C33j2l4m4m18l42J19Q35J62k07n24j06J50l7R5L81M76k21m08q13J33Q22j46
1486A94M2K09K27k90n49k97L22O39M75o70m06L84l91j36n3Q93L47m14m70l66M0
1507b70K48mJ49N19j83o98O3n36P60J38K45j11k4l42k55k8R1L36K98k26j56j26
1529a12l64l1N93k49M38Q2l92o64J81r5M34L03R6o6m18j80j85K47M7J97K55l18
1551b01O1p55J01J57O13j45L79l23k51l0k59K21M12J37K28m75m6j82m07N52L99
1572A86K18k9n62Ll36J73J04L60O4m3k31l47R3J98J52O19n55M1j87p7j28N3M56
1595B25L71l82k58J18k12J62J51J94K45N5k18n74l14L21L78M96k60J75o64k31
$$ y = [7, -381, -1038, -394, -9, 434, 545, 47, -66, -628, -303, -75, 78, 336, 728, 456, 13, -603, -628, -227, 149, 333, 321, 287, 243, -175, -517, -398, 437, 599, 392, -132, -238, -88, -125, -30, 351, 827, 606, 198, -615, -482, 340, 194, 236, 445, 672, 382, -167, -464, -142, 497, 972, 302, -104, 280, -111, -247, -300, 593, 940, 526, 56, -310, -270, -22, -26, 123, 642, 459, -239, -176, -712, 48, 186, 431, 320, 296, -46, -301, -329, -238, 98, 396, 170, 14, -112, -476, -507, 86, -163, 275, 357, -35, -699, -518, -613, -179, 124, 220, 154, -264, -444, -629, -382, -335, -138, 117, -201, -140, -895, -794, -637, -24, -169, 210, -113, -364, -394, -653, -432, -20, 117, 345, -130, -176, -358, -765, -213, 186, 404, 375, -187, -184, -520, -347, -243, 117, 181, 138, -93, -440, -347, -149, 3, 622, 67, 108, -79, -156, -284, -231, 225, 596, 214, -44, 74, -138, 24, 175, 369, 614, 669, 451, -123, -437, -116, 262, 758, 498, 673, 9, -222]
1615b22L15k63M66P4Q9k76k14L71q4k50L66J13K27q32k50L24J96R4K73r7R3k91
1637B22m83M49l2K23pK80o91k42J73k61J75M87L4J28k76l70l45N99J7K64j57J02
1659B89j59r51N47l9J2K84L37j94l54j34j72n1P61K00l56J01n31k80K63J05J39
1680a83M75L2l34m48k05L11J30N25p3P5o09o0k20J94R1N06R9m05J93o96k44N31
1702c15L68K10M4l89K0p55M80J4K97M61l15o4m32J18r3J60K77K92O2l71o24K7
1724e28L03J35K65M96k53m99n45J10J63M49K77p9j89p0l08o1K40K23N29k32j51
1745B75n3n17q0K88L30L81K46o64n75L06j63K31L37N06j76q21q3J49k66L45N88
1766E84j08j66p9m23k76L45M66J22r4J42n14j68k94J86L72M70P1q20Kj61O0j6
$$ y = [-222, 93, -170, 296, 370, 459, 183, -31, 340, 256, 6, 372, 485, 712, -120, -370, -46, 150, 244, 517, 420, 513, 222, -261, 188, 156, 379, 372, 652, -39, -281, -108, -369, -194, 293, 327, 455, 179, -191, -536, 63, 80, 344, 187, 289, 130, -821, -274, -313, -301, -17, 320, 126, -228, -362, -534, -585, 176, 376, 20, 121, -410, -690, -427, -322, -183, 292, 324, -10, -458, -663, -352, -222, 303, 230, 305, -304, -364, -584, -390, -299, 207, 306, -99, 94, -602, -846, -315, 53, 263, 307, -82, -62, -817, -337, -323, -26, 435, 120, 56, -376, -258, -351, -191, 86, 378, 440, 69, -555, -528, -225, -90, 175, 671, 418, -81, -626, -516, -353, 96, 373, 294, 105, 35, -273, -334, -94, 129, 658, 426, 275, 222, -295, -375, -87, 243, 624, 870, 206, -369, -63, -226, 5, 342, 848, 672, -149, -232, -83, -349, -4, 584, 476, 310, 231, -192, -468, -123, 343, 465, 371, 513, -1, -169, -463, -277, 95, 565, 636, -184, -182, -343, -283, -299]
1788b99M96J73j84j18k82k99P4J68L84L45n47J32l66j74qK62O21j64j46m06l39
1809f77J91J1L08J57J19k32n13K49k80N15k59N28K07k31n85k04K91PN07K58k09
1830A58j73j57l90K02J06J45K22Ql06p8m81M32R8N55n9k44l34l15L55K16J10J58
1852B28K35k99j26m79K11K49N50k83L39m37l93k7jN18J60l6K5o1n65J99K40j71
1874G6K90J84o3m77n3m7K00K24K16L45l83l18m46J56K63K28K33j59j58q0j56j20
1896d5K66R1J50l13o3k62J62KL28K91R2m04l45r6k28M10P4K25O8j47n62J16j98
1919c88R8K93L06P6m74r1j75J77K30N4k6O5n64K10o1l53L77K62M4n2l08J40k20
1942c80m7L63J97J22o79J5l04K50L02Q4R5j34k20K17m39J14K39K02J57j92k50
$$ y = [-299, 197, 370, 186, 68, -214, -513, -439, -271, 113, 458, -89, 43, -323, -497, -505, -243, 378, 214, 68, -338, -677, -486, -475, -167, -10, 109, -123, -636, -387, -667, -152, -411, 117, 324, 93, -492, -696, -405, -398, 109, 367, 158, -15, -172, -562, -360, -254, -109, 113, 121, -185, -263, -744, -312, -214, 341, 282, 38, -296, -611, -256, -40, 70, 228, 463, 164, 38, -441, -230, 19, 569, 286, 625, 188, -205, -232, -233, 285, 445, 409, 434, 373, -192, 7, 247, 76, 366, 550, 487, 10, -43, -90, 110, 334, 550, 895, 512, 194, -252, -96, 167, 395, 628, 469, 311, 231, 75, -45, 221, 312, 462, 149, 86, -176, -14, -12, 316, 607, 699, 295, -50, -146, -374, 36, 110, 335, 403, 256, -306, -190, -388, -290, 3, 309, 385, -89, -180, -355, -178, 52, 106, 80, 145, -419, -209, -270, -623, -246, 16, 60, 8, -300, -160, -380, -427, -64, 133, 255, -424, -409, -713, -463, -161, -77, 18, -116, -336, -119, -558, -444, -205, -3, 154, -38, -288]
1963b88k89K54K08O8J69J62p02L56l50K32j77L27J67J02k40k88k56n8N15M84%
1984C96n39J26m95K85L23j92J89K60P9m38j35J02K20K67q3Q3n2l16l67j25N52
2005A40K92P4j99kk20j5k71M00R4L50ll54o35o4N71r9K92J45k49j88j21j79J67
2028g4N29L48n41l73J47j60l54L11J89J68K95k98o10j56L54J43O0K60K18l16m84
2049c44k28O9N68L44l69J81m37k53l66L87M74L50Mk57m70l00M4L70K44K11K0m56
2071b14J23m29O3M9M36J14L5k78m15k9j4M28K97j27K96o51n65J08K48M37M14n18
2093a92K70J45o38k27J65O34K57l49l31K08j63k18J63J34N04j5l62m94J03K21
2113a85L58L17k41M0j84j49l91L34L00K43l2L7m25k18k3pK32M72Rk24j53l12k2
$$ y = [-288, -577, -323, -115, -47, 122, 284, -418, -62, -412, -180, -357, -30, 137, 239, -1, -289, -545, -603, -88, 396, 396, -143, -17, -512, -227, 96, -96, 93, 353, 432, -6, -141, -39, 181, 448, 365, 448, 396, 80, -287, -412, 140, 432, 506, 307, 305, 85, 70, -201, 199, 293, 643, 640, 286, -349, -413, 158, 59, 351, 496, 247, 59, -62, -241, -74, 455, 803, 262, -111, 36, -124, -478, -167, 22, 190, 485, 187, -423, -579, -225, -82, -22, 238, 456, 140, -344, -572, -503, 65, 409, 40, 221, -216, -469, -835, -448, 26, 376, 380, 123, -347, -647, -603, -233, 11, 222, 242, -214, -91, -520, -457, -408, 28, 142, 177, -101, -516, -545, -559, -131, 166, 39, 335, -316, -881, -773, -525, -88, 326, -192, 78, 223, -415, -642, -477, 157, 414, 65, -266, -58, -221, -439, -276, -142, 362, 347, -15, -509, -406, -185, 173, 490, 249, 289, 105, -44, -435, -101, 199, 442, 410, 447, 22, -196, -219, -226, 6, 478, 487, 263, 110, -202, -224]
2136b24M71K00Rj62K67n37m47R6M06K68m4L5m5k39l97K41M42J08j6K0l09j82m1
2159h0PM48n2J78k1j70l65l6k12M96M48k88j04k95k99K8J48J21K21K03k07k49
2181h0j19j15N90k83L81m24j52k87J56L33l1K70N7k74k41Nr1OJ81K31k24M15o93
2204c89J12j41L98l43M21L58m54k15j71j36P38m6M8k87j97J78m43K65R1O98m92
2225gk60l0j04K63k55M36K5K14o8o64j54N00k34N58j10p5J56m39o1j94M10O05
2247E12l20j64P6p4l60L47J85L6K86n15P3k48L53l49L60J89j19q9j84k89K22O8
2269dK73K80m07K24k78o4j9P9L88j43j09J35l82k79J74M02J83J53j81o01K6K74
2291A24l69N36J98j95k15k57j63R2L22K8K9K04n6o24p1K29L86r6Nj78n5j20J71
$$ y = [-224, 247, 447, 456, 294, 561, 24, -423, -327, 79, 347, 303, 338, 293, 54, -343, -102, 340, 448, 432, 452, 143, -39, -80, -73, 375, 323, 501, 480, 310, -55, -91, -303, 193, 641, 353, 249, -46, -345, -317, -169, -48, 173, 376, 169, -80, -199, -314, 276, -7, 374, -50, -202, -489, -333, 0, -31, 239, 296, 22, -219, -214, -305, -299, -118, 113, -111, 304, -389, -277, -418, -20, -363, 58, 416, -38, -253, -424, -560, 178, 132, 180, -107, -304, -126, -569, -304, -213, 485, -7, -267, -297, -401, -138, -393, 43, 68, 282, 214, -450, -604, -104, -338, 220, 110, 35, 191, -248, -309, -503, -93, 512, 192, 28, 104, 30, -330, 17, 202, 238, 524, 9, 82, -166, 187, -162, 198, 387, 268, 179, -5, -294, -72, -4, 269, 549, 142, 366, 88, 24, 5, 84, 472, 329, 220, 355, -27, -306, -132, 270, 453, 606, 425, -176, -150, 124, -245, 291, 489, 294, 79, -178, -341, -249, 73, 101, 130, 334, 278, -346, -417, -188, 198, 102, 107, -71, -126, -246, -75]
2314g5l90M18J17Q1k18j89j71J62J96r0Q3JK4j98l43M41J09O8J06l9rm55n2j2
2338d35J89K99J34j99j69j91o8k6M79J36j8r8k21k86J95nJ75L06L3l77n3m34J
2361f33M56K68P6j34j09k16r6J76J49N86J5n11Q2m23KK79o8L19m4K61o45N4K53
2384I7r7N76m83M31j96m13o6O9M46K16j10n6o1m06l09M7Q35J11k50P7m60Rj25
2407a18J40J87K29N84q05l31M2Q1L12J04L56k30k67o38j77N51K89J20l00K99l69
2428E9j40l95M46K11K82K2k23Kl19k62K76K00R4m3p0m43j7J83k63K04J48L38l46
2451e6k78l54N17p6K89M58k0n61l74J75k81L88M34o4k50l02L86m88K41lK80j84
2473a23O2P0m29j65L15J38L01j0r3m27L66j05j88K41K13J02k41k70j2j18K01M40
$$ y = [-75, -465, -47, 70, 151, -67, -256, -427, -265, -69, -159, -76, -75, -51, -249, -592, -151, -42, 26, 132, 93, 84, -371, -423, -435, -246, 53, 187, -12, -181, -372, -440, -466, 13, 149, 131, 33, -188, -474, -279, -284, -109, 197, 230, -147, -200, -634, -633, -177, 91, 167, 33, -76, -292, -388, -212, -63, 523, 538, 27, 109, -314, -312, -33, -101, 218, 174, 435, -210, -156, 97, 0, 576, 93, 524, 328, -85, -151, -82, 364, 580, 470, 414, 353, -53, -362, -315, 520, 631, 381, 458, -2, 7, -118, 22, 209, 438, 1022, 217, -114, -72, 9, 321, 425, 781, 551, 284, -354, -531, 20, 309, 429, 129, 428, 59, -81, -476, -30, 181, 463, 485, 262, 264, -55, -317, -41, 159, 253, 210, 140, -303, -320, -137, -400, -196, -48, 290, -56, -334, -688, -171, -247, 42, 500, 480, -81, -455, -280, -561, -173, 261, 197, -53, -355, 31, -457, -216, -219, 61, -123, -61, 9, -420, -585, -270, -132, 169, 159, 66, -361, 5, -100, -288, -47, 166, 268, 27, -243, -255, -373, -172, 268]
2495B68j29M2o27N1J62j33K05N44j56j03j53l45J26J90P5K74k07N7j05j84N5k2
2517a15K35K39q1j62k44J69J8R9J16L0J22k26q6l34m07P25K64K67k10j53k61l57
2539c52L55OL56N4J42m78m13K87r4K81R2L69p04K4j21k3L21J0L6J32l01j00k10
2562c31p5L23K70J71l85K42k48k62l8J99L2L75k89q6l15j08N09nJ52l08J20j8
2584g5l21O3n7K46K75l44N3j31J43k78L45PPo0O4k21j3j8J12Q9L00k41k36K32
2608e9l39J11K49P4j53j82J48m1j10L80j19J65q0p6l53K96M2k39K04J18j28j34
2630b26J21j82J65M16j40j20j84R0j59j78J1N59l6j0J87k21j96L01N3K23l13K53
2652D14l36j97q8L11k52M99m4j6j09J2r7N6m2L48p3Jk94l95L18J80K58l81K17
$$ y = [268, 139, 181, -446, -395, -233, -366, -161, 383, 227, 124, -29, -374, -248, -58, 17, 291, 84, 141, 36, -148, -93, -115, 120, 359, 278, 116, -128, 41, 59, 158, 274, 304, 426, 200, 114, -220, -627, 98, 362, 629, 419, 266, 5, -352, 3, 9, 365, 419, 561, 83, -330, -43, -137, 144, 236, 605, -99, -75, -196, -219, 102, 112, 148, 280, -21, -121, -331, -406, -83, 187, 358, -27, 215, -33, -295, -333, -134, -102, 273, -16, -102, -417, -525, -16, -21, 131, -177, -57, -75, -396, -333, -390, -144, 131, -213, -160, -291, -148, -426, -81, -74, -67, -127, -63, -284, -297, -315, -203, -114, 186, -55, -291, -59, -398, -287, -38, 36, -117, -299, -151, -192, -302, 78, -41, 124, 44, -32, -385, -89, -47, -286, -82, 36, -92, -226, -105, -287, -122, 294, 154, 34, -150, -60, -219, -397, -386, 173, 137, 127, 314, 93, -103, 198, 251, 474, 161, 414, 78, -119, -207, 104, -148, 351, 307, 291, 182, 194, 97, 153, 111, 459, 386, 387, 93, -302, 16, 196, 454, 73, 290]
2675B90J34m42j77L04J5L19j32j6l72k5j72L38j37j8N94n5j76n44o9K34K12M1
2697A46J84r6m37%R1J6L87J85j28j86l51n0l29M85L45r9j18r0m60J52J59L18l9
2720H5l44L12k26j60j24P4O33j62kk33M5m9k68J60J57M00j47j95m93L34K82Jj74
2743i4J17J21k54j88N5j8j2L86K21k38k25l2J34k23K38R6J03o9j73k31J34L56
2765B04k08LN77n91J38l64N3j4J54L71r0l1j02j67o1K41M35j69k39j53k05L34
2787A16q5P0K9l6P3l5k03l5L86k74M13j8q0m66M9K59l6j74J83R8j53j58k26L12
2811IN2K42l75J97K69n19j69K81Q6K5L70n08J5j78n5J31K10R7J17r2l43l18N1
2834d05L56N7K08j60j7m36K8p2P71k39j8j43m08K19L02l74M5K11J8n8k26j35J08
$$ y = [290, 424, -18, -195, 109, 124, 443, 311, 295, -77, -102, -274, 64, -73, -91, 503, 448, 272, -272, -341, -107, 105, 146, 330, 234, -203, -203, -112, -96, 291, 476, 348, 162, -189, -239, -568, -83, 262, 163, 45, -45, -505, -353, -194, 124, 85, -259, 53, -173, -333, -457, -383, 250, 88, 86, -147, -102, -151, -419, -259, -102, 298, 151, -44, -537, -203, 79, 80, -94, 23, 144, -110, -298, -243, -261, -273, 113, 334, 96, -129, -161, -27, -250, -12, 84, 187, 118, -55, -286, -152, 204, -4, -1, 576, -15, 123, -241, -188, -202, -48, 323, 233, 202, 100, -67, -128, 113, 548, 379, 140, -13, -218, 116, 31, 101, 130, 94, 167, 132, -71, -106, 280, 6, 419, 401, 321, -145, -96, 163, 127, -47, 136, 234, 81, -77, -303, 9, 61, 303, -72, 125, 394, -125, -294, -13, 73, 98, 468, -40, -25, -203, -258, -127, 83, 180, 297, 205, -138, -456, -405, -49, 8, 216, 56, 39, -397, -369, -441, 330, 91, 73, -70, -478, -259, 43, -331, -286, -75, -57, -115, -341, -476, -368]
2857c68J97P6L4L5rr6j31J08K78q7m7L60q40K92p4k15K85J24J87k59m9N1k76J12
2881c12J45K36l5j51j2j54K90k32J47J74K01l10j78J13k65L79P4L9n3Q5j57j81
2903a57l8J80J61M5pl9j21j59J32J24J62k9L9j10j93j30J57K21o1N30o73o1J62
2926A35j70k0L62q3j56P7j51j78M61J78l37L5J18j23j44L31k78l6K27j50%k64
2948a66Q7r6Q0L43m2o4L06n57J24o2J8J99KP6k62k60K55K8k33K86J0P3m58L09
2972dk50j01J62L10q5m5Q1o52L15l3M29j64n2J54j46m19M35j4L35l14O6j96J89
2995Ak11j7L06k43J99j17n2r6O9j32K96N9l0k13o7J82j94M2K88P1j51j67J61j27
3019a43P4j06M76l9l56K26j17q2p7M16o2l67J17K83n44K35k94M42l6K90m14K01
$$ y = [-368, -171, -95, -61, -26, -35, -131, -262, -154, 124, 37, -10, 350, -490, -198, -272, -487, -202, -78, 109, -150, -199, -148, -424, -312, -167, 69, 34, -117, -129, -283, 7, -225, -78, 96, 297, -13, -191, -78, -343, 36, 110, 149, 96, 181, 24, -157, -195, -15, 146, 191, 184, 145, 24, -135, -3, 121, 283, 254, 293, 183, -10, -140, 17, 238, 177, 707, 34, -27, 135, -35, -55, 307, 224, 68, 145, -6, -184, 277, 455, 118, 153, 271, 148, 4, 335, 57, 21, 248, 98, 98, -166, -79, -175, -95, 248, 206, 142, 448, -109, 15, -47, -29, 170, 172, 248, -14, -274, -19, 9, -224, 62, 72, 145, -313, -4, -254, -355, -193, 117, 32, -13, 68, -584, -269, -302, 127, -37, -89, 65, -81, -500, -65, -79, 256, -58, 8, -188, 1, -210, -227, 79, -164, 35, -82, -134, -230, -161, -293, 3, 62, 32, -181, -248, -66, -260, -218, 70, 141, -10, -177, -16, -143, -69, -175, 301, 262, -94, 132, 15, -67, -144, 272, 210, -157, -40, 243, -301, -66, -360, 82, 46, 336, -78, 123]
3041A23j40j64N8K14J30Q2k55j68k18J76M07J28j50m5K48k89q2j07M07k25m3J07
3063A94J0j59j92J53j82P18l44J12j42k49m1N74k78M1j32J85k25R2m52M67k7k01
3085g8K16j22N2l53L05mJ50No6n9l23K1K33K67n0j22q6j80J15J74j33p8K50j95
3109f1n4rj26K01k21K42J60N2l01o7j11N1J93R3j39Q4j54k74M2O4N62o0j43J77
3133B01j34m33M19k29K53K33j74j2k48j27R3J08Q0M4Rl11o3R1Jk3M27j24k10J70
3157D1j51J90nq8K70q5j89K4K86n61L45j32K50j01Nkk08k35K44L94r0k55J40m
3181H3j24qK38j18K41l1j22o4J79j76J01k20l2J20Q8k00j49J98j53L70m8P7j96
3204E4J1j61K16R2k48K84k34k67K32q5J89N7K16k38j88qj52J86l3K3L09k19jj42
$$ y = [123, -17, -181, -123, 91, 221, 303, 48, -120, -338, -162, 245, 373, 223, 178, 426, 137, 55, -52, 355, 130, 87, 194, 204, 45, -147, 6, -176, 542, 198, 310, 168, -81, -122, 452, 174, 215, 83, 268, 43, 135, -317, 150, 123, -78, 138, 16, 68, -285, 20, 16, 166, 171, 105, 46, -277, -256, -23, 244, 194, 72, -14, -194, -79, 95, -38, -116, 134, -61, -115, -124, -250, -49, -270, -28, 132, 184, -117, -184, -295, -244, -51, 42, -97, -13, -167, -441, -399, -335, 227, 167, 24, 201, 67, -366, 53, -176, 77, 310, 136, 124, -124, -251, -158, -50, 30, 74, 83, -228, -291, -200, -199, -222, 205, 81, -129, 41, -110, 80, 75, -13, 257, 172, -17, 7, 293, -268, 77, -55, 195, 94, 99, 97, -111, -346, -102, 292, 202, -53, 87, 83, -41, -49, 189, 71, 312, 281, 159, 95, 274, 98, 199, -21, -53, 67, 155, -45, -194, 4, -149, 221, 173, 250, 54, 65, -96, 120, 212, -36, 248, 14, -253, -21, -106, 83, 140, 356, 118, -70, -78, -230, -44, -77, -54, 255, 36, 35, -107]
3228a07l69M74m2j64N80k41j73j4k09j17N45m1l08N1l5J20o6J9K95r4l67K15j02
3251a50j20K4K4j2L2M9l17L88R1l09J40K45L11m56J0l46J81n3L42j53J31m3p0
3274f1J6j00K26J00o1j12M6k72J17q0K45k69J71P7K9mkk31K75k8j21r2n3K8J14
3299d2K38n0jn0r0J46k95J70K44k00pJ23k05J97j74j43J06K63J3k61J6O7n8j08
3323a01J34p2N9L6j6J35l6J42j82J05n7l33L25m33P9N26l20J93k19J41m18K10
3345a02J72m0J54j57K9m9l5q4M08l18J07j02J08p5p9O6o2Q0k10L25j67j9l53K50
3369a53L30J8k85QJ52j33j03J96j33J07j50J67k40Jj7K00L3Q5L23l77k77J25J14
3392iJ05l5l6k69J9n1j35M75m5K10J4j60j29N6j55j80K9K93k9p5j54J70R2M0J78
$$ y = [-107, -476, -2, -44, -208, 372, 131, -42, -56, -265, -382, 163, 122, -186, -135, -170, -50, -116, -97, 198, 104, -263, -48, -150, -270, -246, -222, -234, -202, -153, -470, -82, 9, -300, -160, 85, 396, -60, -50, -396, -215, -268, 74, -79, 52, 9, -61, -45, -145, 81, 181, 120, 8, 54, -218, -101, -181, 64, -205, -34, 43, 72, 68, 66, -165, 110, 82, -39, -131, -184, -156, -42, 196, 146, 145, 95, 5, 151, -144, 26, 270, 70, 63, 186, -19, 178, 4, -139, -33, 230, 243, -18, -2, 65, 7, -101, 33, -39, 20, 56, 40, 175, 139, 281, 99, 204, 147, -186, 139, -294, -215, 311, -9, 184, -35, 106, -312, -102, 70, 30, 184, 27, 56, 7, -28, -112, 296, -22, 85, -17, 91, 16, -63, 3, -59, 21, -189, 136, -31, -50, -403, -153, 177, 195, -90, -82, 70, -63, -166, 30, -103, 4, -146, 21, -219, -218, -235, -35, -2, 83, 406, 29, -248, -123, -9, 96, 61, 25, -244, -225, -276, -411, 64, 19, 229, 243, 83, -46, 10, -145, -325, -296, -3, -32, -107, -261, -91, 1, 41, 219]
3417B19p5k3p6K49m02J7L96o24M34j89K13l25J15K3j19L60J37j52k61K73m72K87
3439EO3R5j25l2oj34r4K44K81j76P6p7k06O3J77j03L92q4j27j20q0k60K88K27
3463B87K1j69K8k73K04m4k72K54o1J14k14L3mL06n05M57P1k33n4k57J85J4j36
3486b48L15M2j24K62l56k07j28O95k20K2j39J93l17p8j41J45L25M0K30l70K10
3507A51m00o7L99k40K4j78pJ51N7Mm4K20P7J05k44m02N92k02M8k1n3K10j16j67
3531a03j37K11J01j30K07l6j94j8P3L35j95j40J88m06o1L25r5J85j95k2K26k98
3553a79J04L11j74R6Q4k26pj1j18O4P2J3j8Q7p5l6K6J90L1m4k0P9k4o44N05N5
3579A41k12J45j27P2K90n91P8K90J58o0j35n0O3k8k54K54k4Q6q0k59K47J24K5
$$ y = [219, 144, 121, 45, 294, -108, -91, 305, -319, 115, -74, 139, -186, -71, -48, -167, 193, 330, 178, -83, 190, -282, 5, 68, 163, 38, 6, 0, -134, -228, 16, 297, 121, 197, 120, -86, -23, 154, 51, 443, 359, 232, 112, 32, -228, 60, 287, 308, 139, 167, -106, 98, 54, -218, 36, -25, 89, -125, -92, -96, 210, -295, 162, 233, 0, -54, -311, -126, -112, -248, 67, 109, -15, 247, -109, -316, -444, 251, 31, 53, -86, 107, -210, -288, -429, -284, 41, 81, 311, -59, 151, -249, -316, 83, -157, -133, -311, -318, -167, -110, -106, -150, 70, 147, 252, 8, -394, 198, -4, 44, 23, -30, 180, 64, -103, -240, -29, 72, -58, 149, 113, -81, -99, -26, 309, 114, -26, 162, -244, -305, 20, -75, 110, -85, -107, 119, -179, -75, 236, 62, 158, 242, 16, 9, -2, -120, -56, 16, 29, 11, 98, 23, -13, 13, 203, 234, 190, 170, 249, 225, -419, 86, 141, -71, 74, -53, 19, 309, -282, -204, 86, 244, 184, 49, -1, 62, 34, -220, 34, 10, 96, 16, -243, 4, 128, 153]
3602A53k80K30k8r0j41O8J07m49L65R7K8k5j93j3n6L87l49j8J44q2O1o5j95L41
3626cJ83k20J13k71J88J74n26O6K45j67L70l22j70L40l2o6k9J82m08K96l55L47
3648f5J43l30N3J2K88k97J8J93k8l3J18n8J67l66M0J77O0k56K48j95o2n9L23l17
3672b26K60J84j09k17K3L16q0K2Q1k68J02k29k05K17L08j39R5J6p6K19m29Q4J74
3695A23j10P6k10K15q2n0L02J1j85K97k84q2K33k13Q7O5j60p7K23j10k37M96l86
3718e8p8K76k04K58k08J0K1J05k37L23q6j19j73K9J12n6L4K45p2j55K52k08J31
$$ y = [153, -127, 103, 75, -15, -156, -88, 19, -430, -65, 32, 60, 35, -158, -171, -227, 160, -189, -207, -63, -145, -84, -149, -344, -3, 180, -40, 73, -198, -10, 164, -362, -296, -51, -218, 152, -170, -340, 0, -32, -98, -127, 55, -353, -57, -412, -65, 78, -252, -199, -187, 101, -196, -178, 15, -13, -46, 72, 14, 181, -185, -145, 32, 92, -164, 84, -111, -173, -232, 91, -226, 34, 218, 109, -108, -85, 231, 151, 173, 254, -14, 88, -141, -346, -129, 179, 40, 135, 151, 75, 294, -135, -51, 123, 13, 89, -121, 94, 12, -38, 264, 275, 90, 387, 103, 21, 254, 41, 128, 193, 33, -44, 179, 69, -168, 328, -58, -136, 140, -64, 194, -14, -4, 17, 122, -115, 208, 122, 3, -170, -141, -29, -85, -51, 194, 122, -33, 219, 11, 142]
$$ [...]
8191a25
##END NTUPLES=NMR FID
##END=
