##TITLE=1H_Pr 4687-265
 CDCl3, 8 sc, 
 26.10.2020
##JCAMPDX= 6.0         $$ Bruker NMR JCAMP-DX V2.0
##DATA TYPE= NMR FID
##DATA CLASS= NTUPLES
##ORIGIN= UXNMR, Bruker Analytische Messtechnik GmbH
##OWNER= root
$$ XWIN-NMR		Version 3.5
$$ Mon Oct 26 13:17:41 2020 Russian Standard Time (UT+4h)  she@DPX200
##.OBSERVE FREQUENCY= 200.1315066352
##.OBSERVE NUCLEUS= ^1H
##.DELAY= (6, 6)
##.ACQUISITION MODE= SIMULTANEOUS
##.ACQUISITION SCHEME= undefined
##.AVERAGES= 8
##.DIGITISER RES= 18
##SPECTROMETER/DATA SYSTEM= spect
##.PULSE SEQUENCE= zg30
##.SOLVENT NAME= CDCl3
##.SHIFT REFERENCE= (INTERNAL, CDCl3, 0, 15.7039)
##AUDIT TRAIL= $$ (NUMBER, WHEN, WHO, WHERE, WHAT)
$$ ##TITLE= Audit trail, XWIN-NMR		Version 3.5
$$ ##JCAMPDX= 5.01
$$ ##ORIGIN= Bruker BioSpin GmbH
$$ ##OWNER= she
$$ F:/spectra/data/she/nmr/H-F/1/audita.txt
$$ ##AUDIT TRAIL=  $$ (NUMBER, WHEN, WHO, WHERE, WHAT)
(   1,<2020-10-26 13:16:33.29 +0400>,<she>,<DPX200>,
      <created by zg, POWCHK disabled, PULCHK disabled
       configuration hash MD5:
       00 E9 B6 7A A2 85 ED C7 34 08 36 98 17 FE 4E 26
       data hash MD5: 16K
       B0 49 BC F2 7F 12 9E 60 05 47 3A 36 06 95 86 5F>)
$$ ##END=
$$ 
$$ hash MD5
$$ 27 30 F8 22 47 3C 2C 61 55 4C E6 F9 F7 E5 FB F7
##$RELAX= 
##$RELAX= 
##$RELAX= 
##$RELAX= 
##$RELAX= 
##$RELAX= 
$$ Bruker specific parameters
$$ --------------------------
##$DU= <F:/spectra>
##$EXPNO= 1
##$NAME= <H-F>
##$PROCNO= 1
##$TYPE= <nmr>
##$USER= <she>
##$AMP= (0..31)
100 100 100 100 100 100 100 100 100 100 100 100 100 100 100 100 100 100 
100 100 100 100 100 100 100 100 100 100 100 100 100 100 
##$AQSEQ= 0
##$AQ_mod= 1
##$AUNM= <au_zg>
##$AUTOPOS= <>
##$BF1= 200.13
##$BF2= 200.13
##$BF3= 200.13
##$BF4= 200.13
##$BF5= 200.13
##$BF6= 200.13
##$BF7= 200.13
##$BF8= 200.13
##$BYTORDA= 1
##$CFDGTYP= 0
##$CFRGTYP= 5
##$CHEMSTR= <none>
##$CNST= (0..31)
1 1 145 1 1 1 1 1 1 1 1 1 1 1 1 1 1 1 1 1 1 1 1 1 1 1 1 1 1 1 1 1 
##$CPDPRG= <>
##$CPDPRG1= <>
##$CPDPRG2= <>
##$CPDPRG3= <>
##$CPDPRG4= <mlev>
##$CPDPRG5= <mlev>
##$CPDPRG6= <mlev>
##$CPDPRG7= <mlev>
##$CPDPRG8= <mlev>
##$CPDPRGB= <>
##$CPDPRGT= <>
##$D= (0..31)
0 1.2 0 0 0 0 0 0 0 0.06 0 0.03 0 0 0 0 0.0002 0 0 0 0 0 0 0 0 0 0 0 0 
0 0 0 
##$DATE= 1603703792
##$DBL= (0..7)
120 120 120 120 120 120 120 120 
##$DBP= (0..7)
150 150 150 150 150 150 150 150 
##$DBP07= 0
##$DBPNAM0= <>
##$DBPNAM1= <>
##$DBPNAM2= <>
##$DBPNAM3= <>
##$DBPNAM4= <>
##$DBPNAM5= <>
##$DBPNAM6= <>
##$DBPNAM7= <>
##$DBPOAL= (0..7)
0.5 0.5 0.5 0.5 0.5 0.5 0.5 0.5 
##$DBPOFFS= (0..7)
0 0 0 0 0 0 0 0 
##$DE= 6
##$DECBNUC= <off>
##$DECIM= 32
##$DECNUC= <off>
##$DECSTAT= 4
##$DIGMOD= 1
##$DIGTYP= 9
##$DL= (0..7)
0 120 120 120 120 120 120 120 
##$DP= (0..7)
150 150 150 150 150 150 150 150 
##$DP07= 0
##$DPNAME0= <>
##$DPNAME1= <>
##$DPNAME2= <>
##$DPNAME3= <>
##$DPNAME4= <>
##$DPNAME5= <>
##$DPNAME6= <>
##$DPNAME7= <>
##$DPOAL= (0..7)
0.5 0.5 0.5 0.5 0.5 0.5 0.5 0.5 
##$DPOFFS= (0..7)
0 0 0 0 0 0 0 0 
##$DQDMODE= 0
##$DR= 18
##$DS= 0
##$DSLIST= <SSSSSSSSSSSSSSS>
$$ [...]
##$SUBNAM2= <"">
##$SUBNAM3= <"">
##$SUBNAM4= <"">
##$SUBNAM5= <"">
##$SUBNAM6= <"">
##$SUBNAM7= <"">
##$SUBNAM8= <"">
##$SUBNAM9= <"">
##$SW= 16.880792210976
##$SWIBOX= (0..15)
0 0 2 0 0 0 0 0 0 0 0 0 0 0 0 0 
##$SW_h= 3378.37837837838
##$TD= 16384
##$TD0= 1
##$TE= 0
##$TE2= 300
##$TE3= 300
##$TEG= 300
##$TL= (0..7)
0 120 120 120 120 120 120 120 
##$TP= (0..7)
150 150 150 150 150 150 150 150 
##$TP07= 0
##$TPNAME0= <>
##$TPNAME1= <>
##$TPNAME2= <>
##$TPNAME3= <>
##$TPNAME4= <>
##$TPNAME5= <>
##$TPNAME6= <>
##$TPNAME7= <>
##$TPOAL= (0..7)
0.5 0.5 0.5 0.5 0.5 0.5 0.5 0.5 
##$TPOFFS= (0..7)
0 0 0 0 0 0 0 0 
##$TUNHIN= 0
##$TUNHOUT= 0
##$TUNXOUT= 0
##$USERA1= <user>
##$USERA2= <user>
##$USERA3= <user>
##$USERA4= <user>
##$USERA5= <user>
##$V9= 5
##$VALIST= <valist>
##$VCLIST= <CCCCCCCCCCCCCCC>
##$VD= 0
##$VDLIST= <DDDDDDDDDDDDDDD>
##$VPLIST= <PPPPPPPPPPPPPPP>
##$VTLIST= <TTTTTTTTTTTTTTT>
##$WBST= 1024
##$WBSW= 4
##$XGAIN= (0..3)
0 0 0 0 
##$XL= 0
##$YL= 0
##$YMAX_a= 179734
##$YMIN_a= -199574
##$ZGOPTNS= <>
##$ZL1= 120
##$ZL2= 120
##$ZL3= 120
##$ZL4= 120
##$ABSF1= 10
##$ABSF2= 0
##$ABSG= 5
##$ABSL= 3
##$ALPHA= 0
##$AQORDER= 0
##$ASSFAC= 0
##$ASSFACI= 0
##$ASSFACX= 0
##$ASSWID= 0
##$AUNMP= <proc_1d>
##$AZFE= 0.1
##$AZFW= 0.1
##$BCFW= 1
##$BC_mod= 2
##$BYTORDP= 1
##$COROFFS= 0
##$CY= 11.3945322036743
##$DATMOD= 1
##$DC= 2
##$DFILT= <>
##$DTYPP= 0
##$F1P= 16.9975609425685
##$F2P= -3.02152046262296
##$FCOR= 0.5
##$FTSIZE= 0
##$FT_mod= 4
##$GAMMA= 1
##$GB= 0.15
##$INTBC= 1
##$INTSCL= 1
##$ISEN= 128
##$LB= 0.24
##$LEV0= 0
##$LPBIN= 0
##$MAXI= 10000
##$MC2= 0
##$MEAN= 0
##$ME_mod= 0
##$MI= 1.114404
##$NCOEF= 0
##$NC_proc= 0
##$NLEV= 6
##$NOISF1= 3.799351
##$NOISF2= 2.8
##$NSP= 1
##$NTH_PI= 0
##$NZP= 0
##$OFFSET= 15.70392
##$PC= 1
##$PHC0= -10690.03
##$PHC1= 10.80088
##$PH_mod= 1
##$PKNL= yes
##$PPARMOD= 0
##$PSCAL= 0
##$PSIGN= 0
##$REVERSE= no
##$SF= 200.130013532006
##$SI= 16384
##$SIGF1= 3
##$SIGF2= 2
##$SINO= 400
##$SIOLD= 16384
##$SREGLST= <1H.CDCl3>
##$SSB= 0
##$STSI= 0
##$STSR= 0
##$SW_p= 3612.71676300578
##$SYMM= 0
##$S_DEV= 0
##$TDeff= 0
##$TDoff= 0
##$TI= <>
##$TILT= no
##$TM1= 0
##$TM2= 0
##$TOPLEV= 0
##$USERP1= <user>
##$USERP2= <user>
##$USERP3= <user>
##$USERP4= <user>
##$USERP5= <user>
##$WDW= 1
##$XDIM= 8192
##$YMAX_p= 0
##$YMIN_p= 0
$$ End of Bruker specific parameters
$$ ---------------------------------
##NTUPLES= NMR FID
##VAR_NAME=  TIME,          FID/REAL,        FID/IMAG
##SYMBOL=    X,             R,               I
##VAR_TYPE=  INDEPENDENT,   DEPENDENT,       DEPENDENT
##VAR_FORM=  AFFN,          ASDF,            ASDF
##VAR_DIM=   8192,          8192,            8192
##UNITS=     SECONDS,       ARBITRARY UNITS, ARBITRARY UNITS
##FACTOR=    0.000296,      1,               1
##FIRST=     0,             0,               0
##LAST=      2.424536,      0,               0
##MIN=       0,             -199574,         0
##MAX=       2.424536,      179734,          0
$$ Real data points
##PAGE= N=1
##DATA TABLE= (X++(R..R)), XYDATA
$$ [...]
1769E83l99o65P1L38K86K86q14QK43M74j78n82k98K73P43j29l68n11K75N79j2
1790B03k28m16L55R6N20n90n05L95K82L12n40j33j10M71N04j26p83J53K85R1K5
1811B61n57J76J71M53m3k44l20j1O42J20n44m31K74J73J27j7n92O1N74K21k69
1832B25m45p0J61P82l47m92j28K21L01L0k33n34M66K36J27l84k36k94Q15L77q72
1853b94m48N79M12J8j43n59p4Q29N4l06K2m88L52K86l6o26J06L71L69k48k30m60
1875e14M90M66j21k42n29l6Q30l0k73k05j9L10L89j01p24N7P08j12j44l33j56
1896b89M3Q28n37k97Q5J27L68j3j82n16K63L57o5k29l89J81P43K8l17n35J50L89
1918A93J33J9m51l88M78K39n1m60n7K57J80J62l69n7J26L2P1m2m52r6Q45j35p9
$$ y = [583, 184, -481, -410, -72, 214, 500, -314, -306, -63, 411, 233, -349, -647, -374, 369, 240, -128, -639, -364, 215, 203, -25, -441, -86, 10, 530, -60, -565, -170, 112, 424, -116, -249, -359, 112, 616, 490, -293, -140, 145, 236, 261, -296, -120, 51, 504, 461, 217, -103, -114, 528, 648, 104, -327, -53, 120, 247, 230, -362, -301, 273, 494, 225, -220, -290, -129, 653, 306, -186, -314, -93, 208, 238, 5, -529, -63, 173, 300, -84, -320, -614, 201, 578, -294, -742, -163, 249, 267, 124, -435, -509, 320, 374, 68, 90, -398, -46, 240, 204, -422, -316, 55, 424, 176, -54, -514, -24, 442, 321, 79, -450, -486, 344, 314, 41, -164, -183, 127, 516, 415, -309, -252, 456, 344, 200, -133, -289, -246, 582, 45, -252, -167, -40, 328, 315, 133, -383, -120, 237, 172, -57, -446, -265, 478, 506, 189, -346, -196, 193, 326, 345, -106, -494, -16, 223, 172, -288, -345, -88, 92, 254, -115, -172, -46, -14, 57, 15, -437, -533, 312, 177, 98]
1941I8m88J14N28J6l02k68K14M31O2k20l18l00O54J57m14J00k78J78M73k28j82
1962B7j91J93O9K40l08j80J7M07K44p60j2j95N61L04l62l85J37J00M00j46j78
1983a8r2j9L72o3n61K62O5J50N2j98l98K97K22J56l91M5j11P9N53m06n70M11L74
2006B11O6k81o1k44O43l22P6l39O4K49R9l1l53j8l4M67j31k06qk5M89k76q5j68
2030b18Q6L08R5K2o14J31J97N08k84l10j22K73R6j25K56o92M97J63Ql24j18M1
2052a26M20J3l72o1Q9J79K54m78k18J72L42j92k53m5j01K52K90m5l81J48J21L13
2074C21j02m64J16j1M55k03j36j01J40J34k79K4l34K51N00j30n78r1K95PN41l48
2096Gl89K58L28L3k21k18l59Q40o2j04k87j1J11K46N1m19J32k45N46Nm21K00j90
$$ y = [98, -390, -276, 252, 268, -34, -302, -88, 343, 405, 185, -133, -433, 221, 378, -36, 64, -214, -36, 437, 209, 27, -164, 29, 98, 338, 30, -150, -133, 274, 518, -242, -254, -449, 112, 416, 54, -331, -194, -94, 306, 160, -18, -110, -129, 243, 180, -381, -119, -54, 96, 148, -50, -448, -151, 71, 227, -164, -119, -230, -151, 402, -4, -574, -163, 211, 277, -4, -65, -309, 334, 12, 88, -251, -187, 62, 161, 130, -223, -241, -275, 192, 61, -145, -153, -178, 311, 35, -50, -218, -132, 176, 271, 293, -321, -190, 7, 515, 231, -79, -201, 72, 168, 43, 299, -393, 104, 267, 275, -49, -167, -126, 294, 307, -65, -126, -37, 142, 396, -82, -300, -128, 214, 22, -231, -276, -377, -125, 165, 120, -261, -113, 8, 321, 219, -245, -129, -140, 315, 112, -24, -125, 15, 149, -130, -106, -440, -189, 311, 181, -397, -488, -193, -186, 355, 7, -382, -124, 204, 237, 16, -202, -561, 279, 217, 113, -174, -185, -74, 172, 223, -196, -64, -309, 237, 242, -179, 21, -169]
2119a69L55O3j61j34q5K89L4Jl13j45N62r6k31j69k33L53L92k8n28m0L26K62j13
2142A92r1k64r7L63K68m55n2L9K95l71lk7p3L89%j25l06N5L13J1lr6pM7K76j54
2168A24l39j97M01K28k28j85q6Q4L50K2k26N8K7L40K3k17l13j4K77K49k17k58
2190i7J9M9M22k33l14K15J07N2n6l17j11M79k90o5L12j89K5K32qk39j51j97K45
2213a10J81j97Q0n0J79j64M18p15K32K25J10r3k56N5j82J45K37k85j57K97K53
2234B03j68Q5n03M41k04L47o8l38L31o4j0oj60M1J08K89n04J37p4Q3L72l00j19
2257h1M9K1lL82l66k98K83J35r6L5j76M3K95k84j30k7Q8J25J75J22l48K2K8K59
2281B53j17j2j87j60L21l19p9J46L8J42R4l26p0J56K26r1N8k82L4K86mk26n7K36
$$ y = [-169, 186, 249, 88, -46, -131, 158, 192, 193, -120, -265, 297, 201, -30, -199, -432, -79, 313, 285, -243, -283, 43, 305, 192, 101, -163, -260, 103, 371, -84, -136, -97, 198, -173, -176, -203, -276, 113, 113, -12, -318, -263, 50, 61, 58, -38, -45, 2, 278, 124, -215, -412, -11, 217, -11, -196, -282, -198, 152, 174, -52, 6, 33, 373, 396, 179, -134, -148, 129, 378, 161, -97, -78, -29, 393, 160, -154, 61, 168, 220, 164, -153, -264, 215, -75, -140, 172, -17, 8, 240, 232, -7, -158, -355, -110, 71, -126, -46, -96, 83, -81, 337, -378, -146, 79, 189, 96, -160, -105, -287, -142, 95, -190, -347, -50, 203, 35, 120, -383, 58, -146, 201, 133, -205, 126, 62, 52, 46, -114, -73, 35, 324, -180, -43, -117, -34, 338, 38, -81, -32, -11, -14, 368, 2, -296, -13, 122, 26, 61, -115, -72, 223, -61, -191, -218, -130, -5, 170, 292, -56, -34, -6, 253, 136, 124, -63, -223, 98, -221, -300, -154, -116, 26, 120, -206, -276, -120, 106, 15, 73, -209, -175, 111, 107, -119, -176, 60]
2305F0J53Pk61j23j5K38K57p3n44K36M9J56J08l64L1o1K98n3r7oK03r0O0k6k46
2330a03P9R7J10k71J58ml43M93l51p5J19O8J48Q7j50m15P48p5m26P4j5p5J13K36
2354B27l74M4N7J14J07J2k99m6J91n4R8l12L96j94O2J23k73m5M42J0l32m2J9l3
2378a02K95l9k37j28K24J41J53o62K28K53q1m3l73K04J3L09J03l74l05L64k37
2399b94L26K39l67K49j01J98m73K49o9K93j70j29K1k18L88L9K01l65j24N3K4M39
2421D09l13l42J20K32L2j67J28L2j24J35l06k9K4MJ14L26k90j48R0j53M16k30
2443d0r9O6n8J13j71J2L8J07J16k12K29j35k9K88k17k33K2L75j97J65q2l80M00
2466G8j7m3K25n14M61j64pR5r7k93K43J17k5l26J15M17j80Q9k03j59J26L98k54
$$ y = [60, 213, 220, -41, -164, -179, 59, 316, 243, -301, -65, -16, 140, 248, -116, -85, -146, 152, 99, 2, -4, 199, 109, 169, 143, -103, -24, 73, 183, -88, 70, 66, -277, 216, -135, -210, -91, -23, 125, 212, 62, -353, 395, 320, -106, -32, -47, -122, -9, 227, -147, -103, -46, 68, 175, 187, -112, -158, 33, -21, 77, -235, 161, -33, 29, 152, -121, -166, 276, 286, -46, -88, -69, -102, 193, 154, -83, -211, 13, 154, 307, -355, -127, 126, 45, 2, -371, -167, -154, 155, 258, -116, -421, -57, -294, 32, 271, -96, 153, 52, 250, -223, 26, -43, 250, 80, -49, -28, -246, 142, 181, 382, 17, -107, -54, -30, 409, 96, -246, -126, 106, 138, -29, 99, 131, 7, 142, -164, -193, -169, -165, -51, 275, -15, -163, -73, -226, 190, -40, -139, -73, -131, -18, -189, -177, -139, -32, 84, -128, 101, -34, -63, 225, 8, -225, -203, 172, -25, 140, 58, -322, 78, 61, 18, 243, -271, 190, 26, 19, 114, 17, -276, -33, 84, 59, -267, -152, 265, 85, 174, -29, -188, -62, 336, 82]
2489H2j32j58K37K77j85j40q3R7R0j62J29r6j0j18M37m82J20j34N27k35k52L55
2511A64l31L83R1m66P6p5L99k08l8n1P5L3o4J13k62J97l5p1l5q9K28J31p1Nk52
2536a53J00k62K99j7J94k60KJ72N4r1Rk31J53K08m49L83l03K11N1KK75m65O0K64
2560B06Pl64P8P1J20j50p0j1rL29k29m9J07k24J0K01O9j53l9J49J33l46L04k24
2584h4J01j08K16l24J01K80o6k51R4l21J81K90O0j31l32N96l46P3k0j3j47Q7K40
2607A76j20p6j80J9K38k44k56L27jK47q1l30K24n7K79k94N9R9j62K11j03O1k56
2630b20J84j1K11l11J05J61l65N29k01l8O7R5l59J67k93J20K23j34K07j73J61
2651A25j16oO9J27k60N8J01J65J25m56J52m5l6J78j88l1N9j4J7qj96K70J07N7
$$ y = [82, -50, -208, 29, 306, 121, -19, -102, -5, 85, -77, 52, -44, -54, -172, 265, -217, -97, -231, 296, 61, -191, 164, -167, 216, 307, -159, -83, -158, 241, 33, -5, -56, 19, 52, -12, 101, -161, 36, 1, -70, -105, -194, 34, 165, 94, 99, -153, -53, -315, -16, -33, 161, -99, -97, 75, 129, 38, 47, -184, -31, 177, -272, 111, -192, 19, 70, 72, 347, -118, -58, 206, 213, -151, -73, -2, 118, -32, -102, -113, -122, 207, -22, -71, 36, -188, -178, 23, 92, -61, -100, 49, 182, -164, 140, -84, 17, -91, 125, -199, -98, 182, 116, -135, -41, -362, -181, 109, 169, 38, -294, 302, -44, 29, 9, -4, -151, -64, 176, 56, -20, -200, -181, 57, -187, -443, -116, -117, 130, 49, -281, -57, -114, 165, -129, -70, 29, -133, 78, -25, 36, -220, -36, -47, 164, -147, -42, 119, -246, 283, 82, 44, 111, 206, -153, 14, -279, -159, 64, -70, 137, -36, 125, 9, 3, 72, 199, -61, -3, 98, 263, 388, -68, 84, 39, 3, 181, -7, -38, 21, 7, 24, 16, -180, 90, 197, 254]
2675B54l74N8k4O5M5o4oJ02o8m7j9o5L8J68J03l05K28l30L64k17R4J32j16n3l0
2700f7J09m6qL13l61P8m7j24J37m9j30M2J52j36L6J81J0l32J10O2J19O9l12O7
2724a27K31J3k46P2L9j4m0J00j08qmK49J8j65N1K2j19P4K26j90kj69k7j65K62
2749b7l01K76K64q0M4r7m7P2j79r9J09P0N0J05r7J21k26jQ2Q2j25k02Q9N5j37
2774a99M3L26k31r6J77O3j89p8K3M99m02P6K26n16K16R4J06j53Q9o6O4k9k10J37
2798c0R3Q0j86m3pJ12J03l32K38k26M33j59m5KJ31J39l43j73J47J4N2m0J44o3
2822D1l32J99K5J60l7J26j90j92L26k42J03L7P9J75j54m08N9l9J95L93l89J87
2844A22j03o2j02K45n4J54l0k55O8oJ40l7l00J29J82O0j18j26J55p8k5l0L05k80
$$ y = [254, -120, -62, -86, -21, 24, -40, -46, 56, -12, -59, -78, -143, -105, 63, 166, -139, 89, -241, 123, -94, 0, 132, 16, -37, -67, 42, -4, -12, 301, -60, 18, -29, -153, -16, -65, -195, -153, -1, -137, -101, 80, 90, -242, -132, -70, 49, 118, -194, -127, 104, 117, -129, -57, -18, -32, -72, 28, -80, -88, -92, 157, 175, 10, 61, 83, -36, 38, 264, 74, 72, -97, -124, -289, -27, -328, -52, 212, 132, 176, 79, 32, 104, -75, -174, -65, 5, 55, 160, 63, 184, -42, -43, 39, 121, -4, -206, -117, -62, -199, -156, 170, -61, -157, 20, 83, -106, -184, -161, 338, -64, 12, 238, -278, -62, 32, 138, -15, 74, 8, 72, 43, -167, -30, 63, 143, -43, -86, -93, 19, 122, -210, 28, -198, 235, 76, 31, 33, 164, 303, -40, -213, -66, -52, 0, -40, 104, 41, -291, -92, -67, 93, 56, 182, -8, -200, 126, -116, -13, 24, 103, 278, 124, -284, -225, -264, -69, 324, -65, 122, 19, -43, -145, 100, 46, 200, 170, -85, -17, -23, 117, 80, -220, -91, 91, 151, 33, -93, 62, -16, -41, -71, 234, -46]
2868d6j16K01J1K78l91L39l26m39L49L0K8jj68P5L38k27J52j53p2J94l80K57j57
2891b24K39J40k1j18J83k83J09J79L5k41K4O4j41M7R8j44R6j05J65j47K17l8k56
2914a22K56l52L22J51j71j1j46J7lJ5N7K82l40L08l15k3o7J98n2J42n7l41K27
2937b5jJ20Pj05o0k68M69q1P2J67j97J8l29K16L1j6j70Q4m5J40l6j45K99l0J64
2962B79k95J79k18N3R7k69K46r3j51M85k43k04K72J12j51j70M9Q7j55Q4j3o1j38
2985b18K62o3R9J23k85m0K62j3o1j75J31J34j27J46j65M6n6J33l1k00p8N34l22
3008C6P6k16Q5k62L31K15l66L6j41K41K20j20k22J65j55K37j54JQ8k58J63J42
3030A42nj56j11l3J44j4O7q9O9n0M1j48J60M3k05K34l18J04P8k1P8j41L63L6j50
$$ y = [-46, -162, 39, 50, 328, -63, 276, -50, -489, -140, -110, -82, -83, -251, -176, 162, -65, 87, -66, -138, 56, -324, -67, -224, 15, 155, 134, 16, 199, -84, 25, 204, 239, -2, 22, 86, -55, -8, 90, -54, 42, -63, 102, -45, 172, 134, -122, 134, -218, 104, 255, 84, 73, -73, -56, -59, -44, 13, 295, -45, 263, -52, -75, -142, 56, 4, 146, 89, -252, -25, -26, 94, 101, -4, -64, -332, 137, 56, 128, 295, 98, 116, -213, 3, 34, 18, -152, -68, -113, 27, -9, -154, 145, 115, 279, -16, 163, -55, -2, 95, -174, 72, -21, -172, 313, 70, -134, 138, 250, 99, -71, -22, 65, -90, -6, -19, -80, -218, 44, -19, 80, 203, -82, -122, 140, 127, 66, -109, 22, 156, 29, 175, 10, 56, 0, 133, 102, -98, -176, 358, 36, 112, -104, -19, -281, 50, 265, -101, -65, -206, 35, 255, 135, -87, 78, -77, 160, 6, 7, 95, -163, 0, 142, 137, -19, -130, -163, -19, -33, 34, -55, 14, -36, 5, -143, 17, 60, -145, 89, -229, -125, -47, -68, 10, -131, 232, 268, 118]
3055A18n5K1k20K92j12k3k5J34p9jJ55k63k4j2J00J09l0j87J29R6K6j58k6j41
3079a76K47J06l13J05J39l50L91k26Q3n4K71o7j15j32J49m2r9m2J09m4N3J40o4
3102F9O8m39K55L12j80K33j20l88K71k08L78l79L9J54J73p4j97j60Q0K46P6k65
3124e6j12J67J22M7l09K69R5k20N2K65m73K42r8K28j08Jp2m9O%L9j01K69k30j06
3149a32K60o6o8J37j89k22L61j26J24j54j7k1J05J50j68K8j28O0J8K37j91n4n0
3172a06J05k53R3J35m17M80j26J40j38j28K21J99n05OK32O5l6L74o30L62k0J8
3194G1j69K0J25rn1L9J63l17J56j07L37j39l74K42q4L02k27J56j69l7K6J3p7J09
3218aj85J64J08o0n7k29J89j42J45M4n8K13k44Ml1J95J37k50K02k94J34J38k33
$$ y = [118, 63, 84, -136, 156, 44, 21, -4, 130, 51, 50, 205, -58, -82, -94, 6, 115, 85, -102, 27, 123, 149, -9, -35, -176, 71, 177, -136, -31, 108, -242, 149, -77, 6, -48, 223, 156, 41, -91, 58, 16, -83, -125, -16, -60, -7, 133, 69, 137, -302, -47, 265, 85, 318, 198, -190, 81, -127, 251, -128, -89, 65, 238, 164, -33, -193, -113, 133, 209, -56, -168, -1, 121, 168, -141, 128, 223, 3, 55, 320, -153, 89, -9, 219, 111, 112, 40, -9, -3, -3, 36, -65, 204, -26, -132, 128, 62, -6, 131, -58, -280, 81, -45, 79, -75, -92, -113, -8, 142, -26, 2, -126, -66, -48, 189, -2, -56, -106, -1, -254, -161, -26, -443, 37, -89, 51, -87, -215, 6, 205, -300, -294, -62, 3, -33, 341, -289, 73, 53, 71, -98, -78, 47, 38, -13, 26, 189, -128, 28, -79, 258, 119, -255, -13, -97, 205, -22, 134, -35, -72, -46, -33, -110, -1, -186, -22, 86, 26, -31, -260, -71, -213, -68, -24, -82, 131, -113, -109, -140, 55, 192, -58, 144, -150, -16, 122, -111]
3241a11R5J14j68O1K26l55K05k82K8J12QL2j29J17L15j55p0k55K28M0O9l02P5
3264a02p5J70k18R7J50j4J93j84O2j82l8K65j84K17k05N6k21L95k16n9j56J64
3286h5k9k8K47j09O8J13k31O4o8J10L60k96Jj11q4N5p5J07K3k58K83l3R3k88l5
3311b06J55L3J32l01n7L61k11l9K27k21J0K27L9j98r2K60m06K07o3N6J03k63K23
3334b4J6k52L03q7J0K20k24L0j33L42J61j25k80K03n9q6j0J41o3J0K2n5j63K6
3358g7K18j26K46k65L8j07K44j46k52J81r4K18J32Q0k56J89l17P5K40k47n7J75
3380I2N8k79J17P6j47J98j60P2J5J37j14q5k26L5J80n1K54m00J29j13L79k22j05
3403a60K56p4m9j30M4R9J15J54j7j09l72J65lM16j49j78j38j46L83j55k2n7J42
$$ y = [-111, -16, 98, -70, -9, 217, -138, 67, -215, -187, -75, -67, -35, -164, -47, 268, 113, 43, -212, 16, 56, 125, -177, -102, -177, -7, -225, -128, 22, 8, 201, 17, 79, -103, -141, 124, -60, 157, -48, 8, -213, 182, -34, -93, -249, -85, -114, -142, 105, -4, 64, 177, -54, 10, -58, 52, 412, 116, 117, 6, -78, -23, -98, 9, 32, -226, 57, 24, 117, -171, -206, -51, -18, 114, -187, -244, 117, -94, -133, 94, -127, -117, 110, 149, -49, -141, 119, -287, -80, -143, -87, 16, -247, -24, -8, -260, 43, -44, -34, 186, -38, -8, -141, 201, 362, 237, -43, 160, 101, 15, 5, 146, 83, 93, 115, 60, -103, -77, 141, 15, 261, -4, 34, -73, 171, 25, -227, -46, -140, 78, 210, 290, 34, 223, -94, -19, 221, -26, -83, 92, 150, -129, -12, 64, -83, 115, -45, 27, 42, 179, 65, -20, -246, -211, -31, -82, 172, -228, -99, -212, 167, -55, -160, 96, 22, -27, -157, -113, -14, 101, 255, 238, 129, -243, -78, -81, 335, 186, 8, -130, -276, 107, -48, -70, -127, 15]
3426A5M6r3j81J78O6J20L6j59j35K76m5k17K23Q0m25L53k57K3L02k70j0Q5K1P
3450C9j21J31O7k52k9J21J3k5K20m3P2o8m1j48n4m0L39l0l61J48O8m3r2L10j44
3475C7k59k2K01P7j03J70k64P0J58O5q7j67R5K30j7k54l5J22K65p8j80j20J77
3498H1Q2k96K91k2l41L05J23l4l27J30K30J87k10p4j90R9l12J30J94Qr3K28l3
3521A56j28L1O6j12Kj2j92J10O0kR1q1J39M1m00K37J9j46J15J90j32j23R7l07
3545b81M41j29J6r3o7J88m7K9l08J51m5L43j56k00L13j41l4K45l17J89j60J1Q7
3568C5j35j23L55j97J60k22m5M6K80j20J98k53n4P0N4R3k05O9J47n7k4r8J36o0
3592E0J40j57o0Qj5K98k43j12K06M2j41Mp9p8K5L1J88j71m3m5J36nn1o8N9L4j75
$$ y = [15, 61, -32, -213, -35, 31, 151, 187, 28, -107, 169, 124, -93, 130, 210, -215, 138, -119, -96, 206, -64, -74, 11, 32, 39, -82, 49, 116, -136, -165, -44, -31, -56, 164, 121, 193, 125, 84, -64, -118, -158, 181, 151, -210, -62, 6, -37, -129, 181, 37, -222, -244, -43, 34, -69, 101, -163, -93, 65, 130, 43, -124, -29, 201, 184, -70, -105, 17, 282, 204, 24, -96, 81, 163, -133, 158, 136, -205, 100, 223, 189, -138, -8, 222, 409, 199, 125, -65, 34, -278, -148, 46, 54, -39, 189, 156, 28, 59, 125, 13, 15, 3, -189, -79, -19, -21, 70, -11, 128, 169, -231, 6, 25, -121, -6, 184, 52, -71, 26, -281, 160, 31, 47, -46, -113, 75, 28, 57, -251, -100, -145, 198, 42, -158, 155, 14, -20, 225, -92, 97, -63, -52, 35, -100, -223, 132, -65, 95, -127, -172, -126, 154, 34, 232, -21, -75, -5, 49, 142, -63, 6, 153, 96, 72, -26, 110, 50, 190, 33, -27, -19, -34, 264, 21, -91, 115, 157, 16, 20, -59, -137, -112, -81, 107, -64, -107, -152, -16, -21, -72, -140, -81, -47, -222]
3619b22J52J2j97J76J18Q0l45K7J61m0J41j01j79K34N8k8n0M4j05K73q8k23K5
3642g7k05L62L48l12l47J00M5%J70k0L6J34O2j48j89o5J67J23j6J92m84k6K43
3665I3J85l80R9r4K44m2j73q6J72J08J76k25k49P0j75O08n27K29l66O06j50j38
3687a5k89N1N8M7K04j22j22j29N04j65j42L3l9J71J03k25n4K81j86nJ45l0k69
3710a95L38jk78j0J94k0J38o0l58J83K72k84L03r1k77L14r4J07k16l03L58q0L74
3733C14m00M6J6j42J79J10k85K74l7N1L9k08J9N4O3Q7j79j13j98L75r9m7k3p5
3757a79J50n2M4J38j3j25n6L7j76J71j87P8K54j99l70N44j65K9o1K2L00k71L40
3780B53l41O8l7O9J08%q5j45N88o54K35j52J19j51J27j58Q5j9K13m5j44M6k0L
$$ y = [-222, -70, -58, -255, -79, 39, 119, -226, -199, -38, -78, 63, -38, -217, 17, 75, 47, -3, 41, -64, 209, 121, -102, -77, -282, 80, 428, 116, -231, -131, -86, -86, 84, 64, 100, 234, 296, 148, -41, -106, 61, 184, 168, 360, -124, -150, 93, 278, -102, -3, -97, 147, 105, -68, -154, 18, 126, 302, 77, -172, -102, -277, 331, -196, 33, -333, 273, 123, -15, -304, -253, -195, -148, 56, -66, -188, -317, 187, 22, -120, -87, -126, 45, 148, -77, -131, 150, -36, -41, 104, 74, -195, 143, 142, -136, -146, 48, 28, 166, 106, -252, -69, 203, -81, 222, 131, -146, 168, 74, 181, -35, -338, 20, -60, 314, -86, -40, -24, -166, 13, 123, -162, 112, 75, 126, 165, -43, -24, 30, 93, 180, 1, -112, -310, 65, -34, -81, -104, -179, -29, -81, -37, 101, 88, -37, -93, -56, -232, -61, -248, -170, 84, -115, -485, 59, -106, -77, -138, -116, 184, -87, 253, -88, -20, -57, 12, 120, 120, 35, -110, 478, -176, 59, -93, 26, -125, 2, -156, -71, -90, 123, 78, -66, -20, -40, -37]
3804c7L12m7j30l88J60J71Rn2j38L1K25k8k61l2K91kj42J77m75K00J37J39O1n65
3828c84K04K71MNj44J97j60J40o9J31n04M35j53K18k22j43K35n0r9j24K91qP6
3851A47k85R0j63j71K82M8K73K4k84J95n4J56l00j9Q5J5J76j85r0j21J3J64p0
3874g4n7L35n6ok02k1J98jO3k85M3L02l02K72n7k39J43k4q8K45k52J24m4K81j58
3899A40j56J3J75P4l22j55J65J68j30K13k59J46q1M9P0j41M5n0L1R2l7P3k12n6
3923a45J26R5J28k17j26l7J00o5j26J81Q6Ol33K51k8J3J82L9l14o6M03k11K74
3946B16l21K4K3p6L93kj81J6j4O4j73J21j61J50j22L42m15K61k10M23r6k78LJ50
3970A37J13m36K6J15J15r8J17k70J44r9M1K04J24k64M1P4j69j20K33j89J28n7
$$ y = [-37, 275, 228, 98, -290, -130, 41, 50, -2, -140, -109, 116, 88, -173, -205, 86, 84, -58, 119, -356, -156, -19, 120, 181, -384, -180, 91, 95, 100, -44, 153, -7, 133, 64, 195, -309, 126, -27, 191, -31, -174, 61, 11, -88, -212, 79, 71, 147, -138, -48, -211, -382, -100, -52, 221, 245, -39, 156, 102, 258, -42, -61, 24, 39, 215, 30, -60, -181, -168, -4, -74, -131, 204, 148, 142, -60, -81, 117, 116, 179, -106, -63, 239, -63, 209, 152, -87, 56, 32, -56, 189, -63, 61, 17, 298, 140, -16, -3, 172, 246, -76, -231, -66, 102, -28, 185, -74, 72, -9, 40, 110, -31, 14, -36, -5, 87, 50, 123, -89, -145, -19, 76, 204, -13, -139, -176, -76, -141, -267, -86, 0, 6, -327, -76, -104, -91, 91, 130, -184, -250, 153, -58, 216, -105, -81, -58, -134, 259, 257, 76, 92, 78, 142, -31, 90, -71, 79, -43, 299, -116, 145, -65, 358, 262, -16, -13, 137, 250, -186, -160, -45, 70, -28, 89, -181, -37, -136, -95, 109, 233, -31, 10, 84, -85, -205, 28, -161, -33, -90]
3992i0O3j8k28K24NN3j38K49J5j71L20l48K13l52L40m9j66J21j7K73p0q2l00K69
4016A16k95mJ54k27L85k1j57O3L9k05j2L01j64J96q0K23m11J02k32J16R3J0K13
4039B03k97R6l9K40n05Q7J78j0J57L6M1p1j50jJ26J7l25J68l0L8K1j54R8N2j69
4064a93J35J03l61M82j24k4Ol02L74j10J22k44K8J92K65l84l5k16J30K0M3J60
4086F7pl1q0K04l55J31P0l70M60l3J13k01J27Q2l5m9K0k41K49o2j90M16k25R6
4110A56r9k22K15p4K00j05k21K10j39L5L87n07J3J58j09J63pj45J46rK17k35j65
4133a37j19L04Q4l34KP5L9K4J22m8m1k9p4J86r7j05P0K44k27j14K16j49J21J8
4157C1p2J55j75j19K30J7r5M5q3K89k93J96r9j59N3J84l1m45M42P9J01o48M00
$$ y = [-90, -27, -45, -273, -49, -44, 9, -129, 120, 135, -36, 284, -64, 149, -203, 137, 88, -78, 43, 26, 299, 229, 147, -153, 116, -179, -183, -29, -256, 129, 108, -49, 14, 53, -152, -164, 137, -27, 169, 89, 312, -99, 3, -229, -113, -20, -10, 203, -94, 2, -37, 203, -302, -215, -37, -47, 110, 146, 187, 116, -34, -35, 91, 108, -217, -49, -79, -41, -20, -174, -76, -24, -193, -58, 45, -316, 166, 42, 18, 24, -278, 96, -14, 108, -136, -108, 84, 349, -35, -70, -286, -156, -136, -93, 67, 60, 29, -51, 153, -202, -71, -1, -371, 89, 56, 169, -32, 95, 177, 142, 93, 113, -128, 121, 59, -131, 285, 60, 156, 57, -165, 50, -24, 176, 71, -150, 60, -79, -44, 343, -164, -151, 7, -102, 61, 54, -91, 55, 46, 263, 28, -137, -256, 48, 132, -202, -200, -125, -86, -62, 60, 12, -29, -58, -132, 54, -43, -148, -78, 166, -61, -175, 41, -108, 13, 31, -41, 114, -61, -180, 50, 67, -28, 17, -66, 223, -70, 126, 27, -132, -79, 105, 74, -371, 71, 150, 251, -397, 3]
4180CO7J56j70mk76K8K72o3L0n0J06L1k04K64k89l4J73J23j06p7j96J67p1L04
4204A84l2m38M84l44J18j44L2K01J52j07K1j26j44J68k3KQ1l13J19J95o7r6j75
4227b52M7K77o9j95K12j31M83j98l70J98q9K18p6O5j41R9r0J28j49J74k82R8L21
4250B78k87r0K7J42O5J28j30r7p3M6j35k0L04k90J90km8r6M6J08n4J08j01o6K58
4275B11j99r8jL0Q0N1O7l23J61k27K59j22N8KP1J34j49q1k23K23p6J95l49K22
4299h4k64J57L07l77J62Q1R0K0k12OJ59m7O0O5j66J00k93K10j65L43j08k17J40
4322c3J85j56n1J18J43N5k46M2j89J20J53j39K5k25K14J12j09N3m4R0o6m3q9J94
4346A14kL5P6k99l5L75l04M6j46K16J6J64j84o8j58k8K25r0j93J62m7o0L47%o3
$$ y = [3, 70, 226, 56, 52, -224, -196, 76, 13, 43, -7, 99, 130, -74, 190, -99, -133, 40, 163, 57, -20, -216, -49, -120, 184, 152, -286, 198, -146, -28, -172, -140, 61, 213, 106, 127, 1, -143, 25, 2, 4, 85, -228, -109, 86, 19, -77, -252, -205, 72, 3, -192, 20, -111, 372, 174, -196, 2, -87, 131, 55, 120, -21, 78, -12, 116, -33, 141, -141, -43, 278, -9, -99, -72, 70, 135, 263, 133, 36, -37, 9, -126, -146, 158, -132, 58, 56, 8, -88, -42, 66, 12, 120, 19, -47, 211, 12, -86, -87, -57, 23, 74, 141, -182, -21, -248, 11, -111, -53, -51, 20, 154, 5, -76, -299, -76, -152, 43, -306, -84, -348, -191, 116, -261, -99, -18, 72, 92, -120, -114, 45, -2, 58, 123, -43, 57, -236, -26, -191, 152, 44, -173, -33, 152, -4, -55, 63, 206, 261, 15, 57, -132, -12, 141, 2, 27, -198, 16, 128, 19, 72, 28, 118, 52, 9, -80, 114, 112, 147, 223, -76, -111, 264, -40, 6, -140, 76, 92, 256, 72, 4, -154, -182, 43, -47, -240, -78, -125, -185, 162, 162, 99]
4371I9k33k6L22j53j68K22K3l79K37N4o2J17j56J5k21M72l23K94K49l40k28K94
4393A09O2k14k29L08k67N10L5j53j3m45M66j87J82j20J11j6o1o9ok3K25o3j06
4416C6J7o4J18N8j61O6k27J09J78k07K31k17l4j41M17k13N4j23N0J39m4p7k32
4439b67K68j72J70j06J29j73J54L4k24K1r0J76M5m9J6j52P8L38k27j44O6J97J57
4462B45j26j82J9P2j01J06N1l21K06pJ58R5n16N68j37N5k26J63r6n5J89J53m79
4485a66K9K91n9j51j30J39J51Q0K13n17J75r0J13l8j79kL84j69O3k40M2j06O7
4508a00J85j56J14n9n0j08K16k77O7K74O3m13J20l6M4J16J22j27K94m60J63L5
4530B7j2j70l0M02m38OK82j06J30K6j74J0j89K44N8L9o2j26JK39q7J14k20M7L0
$$ y = [99, -134, -160, 162, 9, -159, 63, 86, -293, -56, -2, -64, 53, -103, -88, -309, 163, -160, 134, 383, 43, -185, 109, 171, -43, -272, 36, -231, 279, 314, 161, 148, -297, 169, -18, 164, 44, 155, 139, 78, 9, 3, -20, 205, 142, 36, 53, -11, 107, 165, 4, 70, -157, -48, 130, -77, 154, -63, -97, -238, 179, -34, 20, -103, -53, 86, 42, -35, -267, 1, -171, -1, -107, 22, -151, 3, 37, -187, -166, -256, -80, -35, -84, -68, -220, -142, 196, -31, -175, -109, 88, 245, 119, -63, -44, 28, -73, 33, 84, -237, -31, -38, 120, 215, -301, 267, 130, 185, -41, 122, 26, -29, 160, 313, -166, -137, 154, 95, -56, -186, -47, 104, 184, 397, -120, 55, -35, 78, 40, -139, -141, 243, 74, 137, -103, -61, -167, -100, 85, -71, 43, -16, -66, -174, 42, -235, -168, 106, 169, -244, -124, -160, -116, 0, 122, -5, 289, -171, -8, 27, 15, -155, -185, 217, -221, -215, 67, -39, 91, 117, -57, -47, -236, 8, 66, 105, 43, -83, -82, 157, 70, 184, -36, 11, 41]
4555D1j59J44p9L3K05M4o8m7m7k34K43m6J61j22j1q7j14K96q6P2l21K32o2n1m4
4580a07kP0J08k40KJ15L0k67K86j02L5J30Q9l00J06J52K58l46j7o0j2J80j39J03
4604G2j30J35j95K56l42J09k4L01q3l07O9J81n2j8O2j00J02k18K15k9o6oJ05J50
4628A87r2J30k24K12M8k05Q0k8k2J25j79l7j09K30p9J64j70r3O0N3j42j52M38
4651A95j23k03J30j11L97k56M8k00q9R6k2K26PJ83n18L52j79J83j0l85K42Q9j53
4674a01L01K6j29k18L82k09O6q8m23M12K1j39o7J23K02l8M5j73k83L80j24K32
4696A98j63k59L91k52K88l08j35K50N0J41r2L4l04R7K08j07j15j8J19j54J27K29
4718B25q8k50J84L1j97j01K55n9m9L4j1k7M5K19k29k01J85q0J99k26%L4q3n0Q1
$$ y = [41, -118, 26, -53, -20, 185, 229, 161, 114, 67, -167, 76, 30, 191, 69, 58, -29, -143, 153, 67, 139, -182, 50, -12, -63, -107, -109, -39, 69, -171, -169, -54, -24, -291, -5, -107, -72, 58, 147, -153, -47, 105, 363, 17, 0, -60, -72, 108, -31, 72, -58, 77, -118, 138, -204, -95, -119, 182, 99, -208, -139, 42, -10, -28, 34, -66, 36, -182, 33, 4, -62, -68, 37, 187, 95, 225, 1, 213, 261, 56, 136, 108, 86, 211, 32, -5, -114, 116, 37, 201, 31, -62, -2, 51, -91, -243, 195, 72, -131, -1, -112, 285, 29, 77, -123, -212, -116, -138, 88, 95, 278, -240, 112, -67, 116, 106, -279, -37, 52, -101, 200, 226, 97, -121, 261, 52, 118, 30, -393, 19, 40, -99, -166, -43, 159, 121, 166, -7, -290, 90, -34, 198, 35, -224, 167, -85, 203, -105, -240, 10, 60, 201, 109, 143, -161, -64, 144, 37, -78, -96, 23, -131, -4, 225, 137, -113, 71, 102, -95, -196, 59, 0, -49, -15, -26, -53, -8, 211, -18, -219, -34, -114, 85, -141, -141, -107, -190, -240, -159]
4743a59J44or5J59qj16j72J59Q6lJ7j83J74K88k87J70m02J76K92m6p4o5Kj99K12
4768F4J9l7m12K85M4L84k16k72K57r3Q4j11R8k44J31J64j33j02j05N55l68K6o0
4791d2J09N3L8k36J1mK48k85J72j73pK12o4Mn8L8P5J21j62l5o2O8m3M9N2k44J63
4818bp5k87L57k04K12j16RN6j35L0J28J64j41k71L91j66P7R5m64M91j55J63k43
4841h6m2M1p6K68j1j19P0M0J74l35K46K2R2j23l4M1j89K71k65K55j88j67J56p6
4865c5K60j65k39J03J90n2m36M28O6k06m8R0J72r5k16K00M3l8K5k92M45k06L3
4888B7l3P9J96l43J30m7j18K9M7K54m99R7L9J79k80J39j52K34K7Ml52K09J49j56
4912a41J80J07j38k3L2n0Q6M9N7O8L6j97J29l42R5kj33K31l52M49k92J35K33k40
$$ y = [-159, -15, -21, -116, 43, 35, -81, -253, -94, -8, -11, 6, -177, -3, 285, -2, 168, -234, -58, 234, 188, 114, 49, 51, -148, 64, 83, 46, -366, -81, -37, 347, 131, -141, 116, 23, 107, -4, 94, -150, -19, 145, 12, -90, -195, 360, -8, 18, -42, 67, 120, 158, -78, -67, -71, 177, -108, 64, -109, -116, 96, 32, 36, -22, 16, 91, 212, 50, 15, -47, 21, -22, 27, 79, -165, -2, -77, -364, -7, -211, 1, -115, -106, -50, -185, -155, -27, 137, -4, -275, 116, -50, 27, 122, -342, 149, -6, 157, -86, -128, -87, -163, 105, 94, -25, 45, 85, 259, -76, 170, 192, 284, 161, 127, 168, -21, 250, -15, 240, 52, -115, 41, -35, 225, 60, -179, -76, 114, 62, -374, 54, 120, -86, -134, -44, 128, 33, -183, 17, 60, 22, 47, -245, 200, -6, 27, -6, 73, 269, -74, 56, 9, -109, -80, -33, 221, -278, -181, -142, 37, -243, -104, -256, -22, 5, 9, -343, -134, 15, -141, 39, 146, 8, -15, 17, -33, 53, 102, 159, 227, 263, 66, 195, -147, -52, -54, -187, 44, -308, 141, -151, -16, 217, -23]
4936b3K94n85J94l4L46l48R7K47k30p2J15j29K67j07j8j61L33j37J69l93P8r7
4958a94K14J71l89L13l88M78l32P0K5K71k51J25k79K08k1j2J6k2k57p9L86k16
4980a63J02O4L6p7m0K55l40k9L10K6J2j77J56j58J40n9p9j65L80k3j11o2m8M0
5004a0J78k05J73k15K11P0p2k31K9k16J57K39j48K24j68n6j04L25m29K14K24j87
5026CL67l51P9q5J68P6k10R1L3k52K22K39m80K04j59Q2L5lk78K41J28J2k22K90
5050B30l33J42l1M4j45K00nj23j3m2j08J32Q6M5r0k26L45J1J21k55k5j01J34R1
5074H4j08L8j15K8j14r4K94p1K21o9R0k35J88m5j85K06j81P2O0J07j28O1n7J12
5098A59j74j18j6K14j0K65j82n6j32j65J43l4m8m8K62k46K66p9J31qJ1L3j60n0
$$ y = [-23, 271, -314, -120, -154, 192, -156, -59, 188, -42, -114, 1, -128, 139, 32, 14, -147, 186, 49, 218, -175, -97, -194, 20, 191, -198, 115, -273, 205, -127, -57, -32, 239, -12, 113, -166, 42, 21, 9, 25, 3, -254, -333, 53, -163, -61, 3, 39, -38, -78, 177, -163, -192, 118, 144, 156, -21, 135, -23, 117, 58, -21, -186, 194, 171, 60, -2, -50, -10, 168, -37, 136, -79, 132, 202, 130, -101, -72, -288, -131, 108, -40, 184, 16, -40, -144, 181, -248, -34, 190, 3, 370, 19, 98, 13, 181, 257, 47, 138, 171, -81, 141, 380, -100, 104, -55, 27, 62, 59, -219, 22, 150, 162, -60, 230, -103, 39, 8, 52, -93, 107, 102, -21, -34, -76, -184, -52, 34, 79, -11, -237, 108, 119, 240, -15, -40, -141, -7, 84, -24, 14, -101, -73, -187, -281, 13, -58, 163, 94, 184, -51, 137, 92, -93, 113, -68, 4, 64, 171, 43, 104, 47, 159, -15, -133, -149, 65, 55, 320, 138, 82, -50, -215, -72, -106, -154, -202, 60, -186, 80, 1, 132, 124, 135, 168, 8, -42]
5122d2o9L18k16L7j80J2K54j03O9k22R4JK94k44j24J93k73L56j52K44j82Rq0J88
5146A82N2j46j45J00p6J10J43k79J93j44K04k42J39M7k67R8J41r4j89J86k45L35
5168A03j73O8l3j8J0n2jJ38j71K47j45qP4J05j55L9K16j28m4k02L48l46l3l8M54
5193B55l18J67k82J40Q2l95K62K07j63L6kj79J45J91k31N1k0J51r8j68Lj0L28
5216A52j35J89k57O6M4L4j36N5p9K83j14j39K58j53O8r8j92j92K48K45k29J40
5238E8j25O1j65J85J24L9j22q7r8J99k38J02j9J35nk1n0k92N13k19J75k2j49L7
5262A6j45L1K5j95K17k58K64m5K37j66J96j51Nj36L8J0K02J25l22j29K63j11L8
5285IN2J4j03O4j56J22J77j84J39k29J45j00J41j45J14j6J63j98J68k11j90L07
$$ y = [-42, -111, 207, -9, 28, -152, -140, 114, 11, 80, -142, -48, -47, 247, 3, -121, 72, -201, 155, 3, 247, 65, 74, -6, 182, 234, 88, -57, 43, -33, 77, 220, -59, 134, -10, 194, -48, 91, 138, -129, -31, 110, 16, -173, 13, -232, 103, -70, -2, -35, -53, -43, -95, -96, 42, -129, 118, -27, -35, 39, 144, -11, 28, 244, 116, 72, -130, 218, -128, -161, -199, 255, -63, 104, -178, -38, 44, -351, -89, 118, -45, -9, -11, -190, -45, 146, -85, -34, -54, 97, -1, -169, -166, -176, 152, 17, 206, -51, 15, 59, 93, -43, 12, -67, 216, 102, -37, 221, 68, 136, 38, -154, -346, -98, 147, -82, 58, -67, -6, -171, 14, 138, 177, 55, -32, -130, 69, -169, -67, -86, 49, 44, 23, -27, -319, 194, -25, 150, 128, -21, 16, -129, -98, -73, -268, -51, -309, -45, -90, 147, -19, 177, 26, 31, -105, -67, -57, 145, 270, -52, -181, 82, -29, 9, 61, 75, -28, 36, -120, 2, 179, -5, 134, -95, 50, -50, 91, -54, 60, 44, 207, 9, 177, -34, -224, 83]
5307H3k36K44J2j89L2j07k3J65N7J15k19L0N4J12j81K48j49j01R7M0J39n23J80
5330a20J51o8K67k19J26l3j18m6N6j9O9j8j19j6J13L13l06Lr3P7nj74J87j3m6
5355e1j8n9J53p3q1P4K6q5p1N1j52K67J9J17j60j05o9J77L6j73J77j24L57l84
5379a51J35q1k4J92j46J75j40pK64J4l71L5J96l10L70l47J04j4J63j2k10L78l85
5402a72L92k39j79O6M7J77l5j85J07q7K42j62L1j3L3k0M2K1j70J94J1k13L15N1
5426B54n1l93K99j45r4J97j86J63j04q8K65j16Q5J83j15q6j4J50k53M3J5o6k6
5449h3qN1m2j24J90J1lm5J4M4j14M16l13l3M0K7K2p8l06K91J28l59J72M07m35
5474a30O8p5J70Q6j13N2j48p3K53r5J09%oK1j10J89j36n3J7j98K52J9m9p7J84
$$ y = [83, -153, 91, 103, -86, -54, -161, -184, -19, 38, 153, -66, -36, 18, 130, -51, 197, 48, -53, 44, 84, 223, -300, -120, 31, -37, 230, 11, 137, 104, -14, -60, -4, -23, 46, 28, -91, -107, 6, 319, 13, 16, -77, 0, -5, -179, 8, -5, -51, -69, -128, 25, -48, -129, -55, -29, -114, -185, -134, -286, -19, 0, 117, -43, -148, -217, -40, -4, -177, 0, -124, 233, -151, -16, -97, -121, 71, -75, 100, -40, -47, 217, 231, -140, -105, 91, -219, 151, -196, -92, -106, 57, 45, -165, 213, -172, 220, -19, -198, -132, -85, 92, 57, -128, -21, -108, 134, -28, 3, -10, 23, 3, 45, 66, -104, 90, 101, -112, 203, 254, 203, -190, 109, -36, -130, 67, -119, 44, -60, -148, 117, 1, 86, 269, 154, 68, 54, 204, -49, -6, 9, -57, -83, -91, -40, -82, -206, -16, -5, -8, -53, -39, 5, -109, 307, -6, -39, 1, 28, 50, -28, -334, -43, 85, -274, -102, 305, -130, -62, -137, 33, 119, 6, 58, -90, -163, 90, -5, 104, 104, 98, 119, 9, 198, 62, 9, 26, -172, 80, 99, 50, -27, 157]
5499A57l36J22K8J92k39j70Q1K67j3j08k16N4Q4p3%lJ28L5j60J55r6J87j04J71
5523A43j8P2k49J7LO6q5p2K44J92k99j53J37n9K87Ok91j00M62j84j05j67J77j16
5547i2L1K3j31O3J66k34J43j89K76j98K7J48R2N1j89r8J2P4j21K1m9L13j49K26
5571B16l95K16M8k54O6J00j44K4L28Ok69M23k61N8j05j72J80J01j80K9OJ34j65
5594a0j20L49j05k21K28K69l44r4q2K25K09l93J0K30k40J9K72j01Ql9o9J49L2
5617A82l55O3K1J8j9rJ15P2l91K24O2J88q6J15Nk28m4J03j25J25K7p4j24K04q8
5642a9j09K58j80J2MJ42J1qj20M6j91J56J91k05J92j39J48k35J00l5J43j46j56
5665a40k7K20p4Q3m48L03J17k01K16%r6J40j76O0J01j94J78J00OL8k28m1J63q4
$$ y = [157, -179, -57, -29, 163, -76, -246, -165, 102, 89, -19, -235, -181, -97, -170, -170, -173, -45, -10, -170, -15, -111, 76, -28, 143, 125, 197, -52, -35, -32, 34, -51, -123, 121, 313, 14, -139, -2, -61, 226, 232, -59, -159, 303, 119, 14, -153, 24, -92, -61, -38, -169, -106, 60, -174, -31, -220, 56, -142, -115, 33, 125, 176, -13, -111, -99, -25, -146, -125, -174, 139, -10, 216, -179, 37, 85, -169, -103, -3, -147, -123, 205, 211, -58, 365, 104, 162, 57, -115, 65, 166, -14, 15, 21, 155, -10, -130, 219, 114, -107, 121, 390, 46, -48, -130, 95, 304, -89, -79, 151, -89, -70, 202, 101, 109, 70, 1, 150, 182, -173, -110, -89, -71, -90, -99, 16, 88, -303, -79, -17, 171, 85, 200, 205, -23, -67, 36, -89, 36, 63, -11, -135, 69, -19, -128, 130, -50, -38, -34, 108, 119, 111, -9, 37, -154, 2, 193, -12, 180, 41, 189, -46, 54, 19, 162, 16, -140, -167, 53, -21, 62, -386, -83, 34, -167, 49, 49, -47, 93, -83, -23, 78, -116, 62, 162, 168, 206, -22, -63, 100, 16]
5689A6l6J90L4j29j27J42p6r6K58K7j76k5j77J94m5o3j54K50q8q8K8K05l9R0j84
5714f9J8R9j63P4l7K48k52K37r8j77J56o6J23L3r1J79m02K99q0O7Rl21K14o0k88
5739c48M40k83J97Oj83K29K5J37m78M43j06K1R6j27j81J89k46J82j53J89J03L2
5761A84o0p6j98J56J21j68k72J66N4P2K5K1k64J83J92m55J44J81J1j00J86K6j62
5784c3O8P3L8m43L10j00Q0p8J67m18L55K11j88J06j65K11l49k3P9J05KJ65j44
5807B9J69o08M26QM9j46j1n0K48j09J38j50M4J0k40L10p2j84P1q6K53p7k0J10
5831A12L3k69K19l21K2K70J65l27OQ9k4N9Q6j36n5%L57k4k50j92N7R6P1j4k61
5856b31R5L59l99K77l29K46J3j80L44j95l63M32j05q7NJ06rl01M37j93J74Lm4
$$ y = [16, -20, 170, 204, 75, -52, 90, 14, -82, 176, 203, 27, 2, -175, 19, -26, -89, -243, 7, -81, -169, -141, 64, 25, 115, -69, -51, 48, -115, -41, -78, 170, -82, 155, 57, -120, 36, -30, 93, 126, 35, 214, -188, 111, 31, 98, 107, -214, 0, -60, -348, 92, -191, 6, 12, -171, 58, 83, 220, -258, 185, 79, 100, 196, 69, -112, 77, -169, 13, -140, 49, 152, 184, 124, 48, -150, 6, 127, -41, -313, -147, -93, -21, 4, 25, -239, -56, 136, -319, -175, 6, 17, -83, 103, 129, -33, 35, 108, 146, -297, 13, -87, -7, -85, 82, -336, 19, 230, 42, 148, -17, 194, -155, -178, -99, 6, 8, 173, 29, 198, -410, 16, 24, 73, -73, -84, -134, 114, 5, 143, -7, 37, 47, -193, 117, 45, -139, -68, -154, 99, 22, 2, 112, 145, -124, 95, -226, -204, 66, 231, -96, -90, -1, -25, 34, 120, -16, -71, -71, 286, 262, 12, -180, -123, -27, 44, 30, -231, -136, 223, -176, 101, -228, 18, 31, -149, 195, 0, -363, 69, -36, -123, -118, -12, -21, -322, 115, -78, 96, 99, 55]
5879E5J10j04l9K14k40j04K88k27J58J2l63L57j45k89L17J62j31K8P6K5j33j83
5901a56p9N4J64k05M38l80P7N7J17j65J08j80K30J93l49K1O9J6j49N7L17j45R7
5924B07l08p0O7n0J8k5L96j25j95J14p4J12L2k33J45r2k5K77l6j51N4o3O2j62
5948a25m0M37k31m8j5J77J31m64J40P0Lk67J04J36j22J29j62J19O9J10r0n6M4
5971D9Q0j05j73K12k6K4j39j93K67NK58l30J40n0j91K32j77L10o2R9k16N6Pj54
5995g7J22R1l32K0j4o4K64r0J08L05k76J11J17k72L4Op1L22k55m8j06J32j76N5
6019i4K13l28K83j57QpJ87j81R8O0j2P3k82K14J5j01nj11P6O9r4K06p8k04Q4J11
6045D3l4M7j59J44j88P3K10j73j19n9K05Q4r6Q8k23L32M0j20j04J74j08k68J15
$$ y = [55, 165, 61, 22, 236, -4, -108, 180, -47, 111, 123, -240, 117, -28, -317, 0, 162, 31, 59, 135, 160, 27, -156, -235, -181, -17, -222, 216, -164, -87, -30, 87, -78, 30, -150, 80, 273, -76, -55, 14, 30, -119, -62, 255, 110, 207, -101, -171, -104, -154, -136, -161, 235, 110, -85, 29, -45, 67, 99, -134, 11, -81, -106, 171, 135, -16, 38, -25, 37, -125, -165, 272, 41, -7, -22, 155, 286, -178, -38, 32, 35, -232, -128, 8, -114, 15, -147, -28, 41, 151, 61, 5, 49, 129, 24, -149, 63, 37, 61, -78, -271, -4, 1, 259, -71, 69, 19, -172, 60, -117, 193, 131, 230, 14, 70, 77, -77, 45, 136, -196, -176, -190, -254, 10, -80, 28, 333, 57, 168, 285, 13, 47, 53, -18, 304, 49, 1, -105, 27, -149, -94, 119, -209, 74, -83, -75, -82, 105, -76, 22, 82, 70, 143, -139, 75, 90, -11, -16, -127, -51, 18, -76, 130, 52, -152, -68, 43, 9, 56, -103, 41, -147, -74, 136, -37, -156, -215, -10, 74, -22, 66, -157, 175, 215, 95, -9, 165, 57, -211, -96]
6068i6k8j22J09J94k0o9q8L05k39J56l72M50j28k39J77r4J08J34l66j3K50k3R7
6091H3k00q6K50k2o1K92o7L3k49J9O3j01j9N5p3J92J54l14K35n2j11J79l77J04
6115g3P6p1nR2J10j24j42l5Q0L26m90K26J8K38k49N1M11n32K23L9j78j2J16l77
6139b82K98J28j22P7P5n0r0r5m4L21j69o7j00J30j77P9o1K76l7j79%M3j5K7M1
6164Gk6m5%O9j54K23j12j25j0K88l46J44N4Pl7L00k33J11k15J01J30j74J49k48
6188a42L74j43M4j38Q9J69j76J49l46K5J86j29L3J35k39q6K89NJ01j21r6Q7j55
6211h5J43k0J5j45l5j11K61L69l86r1O7l0J23K5m5K87k38j04J16j93J81k43J45
6234FK7J19j67j78N1L16m81L71K0J63k09j82J64M5L0K6j20P3k00J10O7k36L70
$$ y = [-96, -124, -246, -137, 57, 37, -32, -120, 185, -54, 102, -270, 180, 52, -187, -10, -104, 4, 138, -228, -241, 9, -14, 83, -117, -203, 47, 25, -36, 256, 189, 222, -27, -8, 55, -46, -65, -10, -83, 109, 263, -51, 184, 132, 21, 200, -177, -73, 3, -68, -73, 19, 129, 5, -137, -172, -92, 234, -256, -30, -12, 226, -23, 28, 439, -93, 130, 169, -9, -21, 95, -282, 16, 144, 22, 99, 174, 124, 34, -61, -105, 216, 47, -20, -120, 10, -167, -88, -149, 127, 90, -89, -89, -46, -61, -34, 7, -19, -64, -64, 5, -149, 74, -38, -163, -173, 115, -231, -87, -33, -26, -63, 237, 4, 115, -100, 1, 131, -43, 106, -142, 232, 89, 133, -5, 84, 253, 77, 226, -120, -95, 91, -38, -5, 130, -109, -195, 94, 99, 200, 79, -17, 70, -85, 58, 38, 53, -92, -127, -238, 23, 392, 6, -85, -18, -48, 75, 100, 55, 342, 104, 0, 116, -77, 104, -139, 6, 33, 152, -15, -193, -142, 174, -307, 64, 84, 247, 38, -144, 20, 65, 95, 121, 1, 74, -126, -16, 51, -185, 185]
6257A85j45P1j27N6mo8j22J70K6M8j26K6m6J02j6k8J75j72l45L86J64j31n7l08
6281b86J17K99l23J17l2J04J56k10Q1p6n4J83K81l27K4n8j28J79Qj39j33L77j70
6304a0K6J0J15k41j05J54k33L33j67%OO3j38J89j78K29L2p9o4k4K2K1j0L7J54
6329A42j12n3K02m12N46l79J9M5o0K24j02k22j65L61q6M8N2j37qM0Q7J24J6j14
6353E6l00L63Rr2JJ76l7j67j27J69J52k48k41L39o6m0J87p6l19K18j52M19k66
6376d2K03N2k87K46R8l68L00r0k49O4j87L06q0l64N65n1j38j75o1L28l4K47q1
6399B02j62j38j09J28K10j69j65K45j66J49n5P6n1q9J76J74m34J27R6o9J65j31
6421A0J16j35q3L6P7J51k13J12j05j61N2L46Q4j87j2l1m2k35J69O4l5J83j57J3
$$ y = [185, 40, 111, -16, 40, 36, -32, -154, 16, 42, 90, -36, -10, -56, 46, 30, 2, 177, 5, -340, 46, 210, 79, 22, -286, -169, 130, -193, -76, -108, -4, 152, -58, 23, -53, -107, 76, 357, 30, 54, -4, -132, 47, 55, -84, -217, 160, -10, 16, 26, 141, -100, -205, -51, -284, 49, -118, -118, -112, -49, -187, 2, -176, 53, 85, 6, -58, -82, -60, -39, -49, -12, 142, 30, -23, 179, -233, 313, -66, -47, -2, -62, 162, 60, -162, -327, 34, -52, -4, 48, -89, -97, -57, 30, 154, 170, 56, -244, 119, 128, 36, 37, 213, 176, 9, -118, 51, 203, -45, -286, 53, -13, -53, 134, 58, -261, -43, -195, 224, -42, 161, 213, -74, 172, 270, -98, 202, 112, -137, -73, -260, 46, -34, -398, 167, 116, -22, -197, -258, 70, 36, 283, 202, 40, -98, -207, -79, 131, -38, -203, 42, -124, 25, -30, 46, -5, -94, 82, 256, -178, -51, 45, -24, 141, 10, 126, -9, -92, -56, 21, 172, -41, 71, -34, -195, -143, 203, 287, 100, 88, 57, 15, -220, -51, 13, -22, 161, 4, 17]
6445A7q1p6O1J31l72L03Q3M1O4n7k44L5J26l8J05j19Oj44K46n6p9K7r6K13k41
6470a45Kk7R4O8Q0J34l32K83J01l84K07k71M05l60Q3Rm3N0r6J25l35J12N26n74
6494b88J44L31k55L84j72L6l0k86J53J4K09n4j83M9O2k14j19LJ14L3O2J80n0J2
6518A35K9k29K25l21K99q2k57K02j02J01j41j9K28j7j1j22j50K37K05l51P7J09
6540D5j15K4J88k50J8K80J1j21j64J67k52k0J47n3L37m09M48m04J64M2n5K83j57
6563A54m5j89j32L70k28M4J56k74r6J67Nj4J33m1M3o1O3R5l15K00Q4Pl27L3qJ69
6589gM3M5j01j53L16m75M10j70J01k33J94j25J56P6j04ol2j50K44NN5j63j18K15
6613B3j7K06m4o0o2r6r2R9Ql9K55J50k78P8k97J43R5L3Mk04K65j83J92k0k24L45
$$ y = [17, -64, -140, -79, 52, -320, -17, 66, 107, 171, 114, -130, -95, 31, -7, 98, -21, -15, -159, 87, 31, -48, -21, -117, 96, -145, -143, -170, -76, -8, 72, 206, -126, 157, 258, -126, 81, -190, 215, -145, -62, -53, -96, -46, -142, -17, -352, -240, 286, -288, -144, 187, -68, 316, 144, 180, 150, -136, 17, 31, 240, 186, 3, 52, 114, -100, -219, -216, -102, -69, -7, 173, 123, 135, 164, -65, 160, -161, 138, 56, -201, 1, -101, 0, -141, -160, 68, 51, 40, -82, -232, 5, 210, -141, -64, 45, -70, -46, 142, -108, -90, 190, 201, 80, -84, 83, -169, -189, -42, -95, 242, -167, 281, -123, 41, 83, 28, 311, 154, 109, -80, -212, 158, -70, -26, 130, -144, -240, -73, -68, -82, 51, 10, 53, -8, 55, 150, -165, 35, 119, 126, -201, -168, -176, -7, 36, 81, -20, -173, 143, -332, 78, -92, 9, -224, -30, -155, 1, 77, -27, -33, -65, -215, 29, 34, 89, -74, -192, 23, 6, 212, 168, 108, 46, -50, -142, -43, -35, -74, 181, 331, 53, 131, -166, -23, 72, 105, 109, -95, 170, -13, 179, 159, -65, 280]
6639B80k82j24J29R1j77J83L11m09j78K78l9k3r3j04J72J07N6k24j9q9J90L5Q5
6662A56p9N1p6K22m3l84r5J51J43K00j37j37k4m1oJ6J20m24L83J90K3q7o3m7L7
6687D9M6j17kMJ12J3k67J29j0M5P4l52M47l20Q1K19j97lM4n6nj07P4K47j50q9
6713i1J24j70L81l01J4J19j27Q1r5j04M79k99r5J97J19j09K01l24R0q9L2J5k2
6736B6K5o6P3j27M0O7L7k92L01k80M8J08K8rM4L9j6J19K9k39p5K10j35K08m0n4
6762F9j14k9K34j13o4N7j02J91l56J96k85K65n0M9Q5j88J92M8o4%P3J25j44k1
6786E4m9p5n6kR6J32r2r7J81l4j31L0j0L2K2L3n7j28L91q5j71R7j62j61K70j7
6812A1N4KJ4J47l57l7J54l1J02j50J22j82l5p4K12K16k30J09k37QJ77q9J86K3
$$ y = [280, -2, -126, 3, 94, -83, 100, 411, 2, -176, 102, 63, 40, -53, -157, 15, 122, 178, -46, -65, -154, 36, 71, 156, 77, 128, 52, 274, 231, -153, -248, -97, 46, 246, 109, -28, -52, -93, -99, -83, 37, -387, -4, 186, 209, 122, 59, 12, 49, 95, -22, -24, -20, 92, 105, -162, -33, -43, 2, 76, -276, 171, -149, -68, 151, -46, -49, -5, -61, -66, -173, -99, 148, -2, -91, 33, -137, 244, -57, -43, 76, -51, 30, -65, -169, 310, 11, -84, 113, 232, 123, 324, 0, 90, 1, 33, 48, 26, 51, -15, 58, -69, -29, 38, 75, -217, 84, -196, -148, -40, -12, -21, 23, 62, 46, 165, 194, -45, -120, 90, -45, 163, 123, 69, -45, -74, 160, 47, -17, 40, -62, 129, -227, -31, -316, -51, -101, -52, 33, -155, 37, 85, 21, 21, 94, 219, 75, 54, 5, -70, -126, -128, -32, 100, 8, -89, 92, 58, -73, -43, -53, -21, 1, 34, -23, -151, 240, 155, -16, 81, -81, -242, 28, 11, 65, 67, 81, 228, -129, -166, -12, -43, 59, -91, 31, -151, -186, -260, -48, 168, -62, 47, -190, -182, -5, -94, 92, 115]
6836A15j07j27J58Rp9k69L30J4j36o8o2O8J93k5K45k93N7K4k30P5J96l10j5J13
6860a24J26j34L37n4j32pk57K07Q2j18L44k16j30K26J98k17k42K6J43o7N6j10
6882f3qj06M07j52j91M1R0J34k78J12O5o2K5j56K39L6j51N1J13k41r5K02l0j08
6906a26j37K4P5J21K5p4Q4J22l79J34L38k83L74k00k10j87K49k3j62L73j00J13
6928A51k26J31m5j91J11J50j28J38j47J43j37k09L54k45l9J77r0K03k97J68R0
6949F2n3K03q3o7J8k36J56Km8R3R1j42p9j26O4M54l37J2j29P8N6R6P0L5r9n9p6
6976d4j70M19l02K46J60k27J22k16q3K15m9j45O6j75Q0Q6L4NK8q9N5k47K12P3
7000E4P8Q6L2m26M89m87J98o0k3J01J06j57L6J49l05K74mk01j38L09l4PL51n38
$$ y = [115, 8, -119, 39, 48, -31, -300, 30, 44, -92, -160, -222, -154, 39, 14, 259, -34, 23, 47, -183, -108, 88, -222, -237, -124, 2, -132, 205, 151, 19, 12, -245, -38, 44, -74, 270, 54, -76, 150, 348, 131, -111, -85, 58, -9, 47, -63, -71, -177, 230, 78, -113, -72, 18, 152, -126, -14, 51, -11, 14, -142, 97, 133, -18, 33, 146, -95, -190, 12, -18, -126, -263, -239, -164, -43, -18, -92, -8, 114, -265, -131, 207, -76, 298, 98, -112, -299, -50, -73, -235, 138, 38, 151, -75, 56, 11, -180, -69, 81, -47, 91, -56, 87, -50, -259, 95, -150, -189, -12, -102, 101, -196, -28, 62, 9, 212, 129, 62, 80, -156, 0, 2, -46, 47, 138, -4, -83, -209, -145, 309, -28, -16, -145, -67, -11, 85, 155, 190, 91, 32, -44, -214, 205, -97, 149, 309, 82, 204, -12, -95, 120, 71, -74, -8, -183, -103, -17, 17, 22, 50, -39, 16, -231, -19, 54, 132, 218, 250, -176, 313, -174, 24, -36, -59, 42, 148, -9, 27, 176, -129, 145, 141, -60, -198, 111, 77, 84, 435, -103]
7024a03r6L57k39L16j37k21J43k2J99m1l35J37K21j66k30L46k46J46p5J8J8J26
7046A16j21j19K71j41p9R9N5k33o6L41rj12j35R6J76j34J95l07L88k62O1j20J25
7069H5k74K8J40J63j37O1K34l62k3K52o8o6J68j30P0k69nm8K41j78L08m17J42
7092h5J54k90K91J36j24k49K07l0j00k03K60R7n1m7K3O5q4RK21m36L08j14P6O7
7116A01q2K4m7R4k35R7r3J32j30Q6l8J64Pj02L13l32k58O0pM67m27J36n3J13L5
7141B5j01L15j98l94M17rJ52q3M6o2l17L38j92R3lK0K6j66K02l1j79Q2k38L16
7165E9j73M5J58J18k63R4l7J24j41m1K05j97K35k21j02J29R9j84J5O3j26j0K07
7188E6r5k20L14j05K72k00j2J21j98o1k5QMK02j27J25n1K04j75n0q6L17k44P1
$$ y = [-103, -199, 158, -81, 235, 98, -123, 20, -2, 197, 156, -179, -42, 179, 13, -217, 129, -117, 29, -46, -28, -10, 116, -5, -124, 147, 6, -73, 26, 81, -152, -218, 123, 114, 2, -133, -37, 139, 5, 200, -107, 281, 19, 80, -40, 85, -189, -161, -21, 142, 5, 66, 300, -62, -85, 167, 99, 33, 201, 71, 141, -128, -133, -181, 60, -118, 190, -227, -85, 69, -221, 70, 206, 82, -167, 40, 10, -90, -293, -33, 64, 13, -34, -11, 54, -30, -21, 200, -236, 72, -42, 34, 101, 19, 43, -4, 90, -145, -48, -141, -9, -139, -53, -91, 73, 80, -22, 291, -41, -299, -239, -246, 221, -206, -70, -123, -10, 25, -76, 239, 41, -353, 64, 55, 207, 124, 170, 108, -209, 129, -63, 30, 27, 47, 73, -93, 109, 78, -101, -19, -257, 59, -114, -69, 89, 207, -56, 38, 1, 125, -16, -57, 148, -49, 186, -35, -137, -8, 91, -93, -78, -15, -141, -151, 56, -39, -259, 55, -50, 222, 22, 10, 131, -67, -128, -153, -145, -141, 61, -66, 59, 8, 212, 37, -13, -99, 218, -26, 45]
7212D5k60K61l56M41q7N9J14l61L16j24o6J39k31jL99n8r7j63m6Q8N0k47J03J12
7236C0J34m9o7K5O9j20J34j06R4k99K70k7%k6l94L52J11j68L14l67L8N5j68K27
7260F2q0K0J05m9p3L0J10q9J83l27J1K49j9j95R1R2j38o9K26m51J99J4J95K21
7284C18k22j61L31k31o5L7P4j10N9J34j08J85m21K73r6k1p0O5J26J6j86J97j55
7307c1j6J60oJ3l0k55O4J80k4l6m5J17L9j02K9K35n83M42j31J86rl70J06MNQ2
7333B4j06Q4K4j47J19p2l2J10RL0r1j48J04R9QJ4J31k34pL5l88K70j1J60M5J65
7359A95k54J23j05l5j16P0K11k6rm6q0N9LJ95K0j93p8p7K78m0M1r6j01K03k99
7384a57N7J66j5J13k73J62m9j79K10J82Q3l84m9K9l0K60k32J89j09K49k72K2q8
$$ y = [45, -215, 46, -310, 131, 44, 103, 217, -144, 172, 48, -18, 121, -110, -111, 288, 230, 133, -30, -76, 12, 62, -185, -82, 30, 164, 115, 48, 73, 142, 22, 156, 50, 144, -155, 115, 88, 88, 62, -332, 20, 131, -37, 277, -90, -52, 3, -165, 62, -18, 2, 107, 58, -15, 15, 125, 36, 219, -108, -97, 152, 133, -62, 29, 121, -17, -86, 140, -311, -112, -98, 97, 318, 96, -65, 266, 35, -30, 7, 81, -29, 30, 164, 56, 241, -180, 93, -3, -24, -94, -29, 97, 113, -73, 124, -31, -47, 113, 107, 120, 90, -165, -101, 79, 55, 19, -26, 91, 130, 28, 57, 292, -291, 151, 20, 206, 197, -173, -67, -63, -58, 24, -82, 2, 26, -121, -2, -74, -106, 4, 13, 43, -48, -196, -92, 7, 15, 29, 160, -74, -81, -46, -434, -164, -175, -15, 30, 195, -59, 64, -41, -76, -192, -122, 89, 63, 54, 8, -72, -13, -10, 185, 205, 12, -66, -143, 135, 95, 136, 40, -61, 142, -157, -100, 66, 51, 164, -109, 53, 4, -175, 35, 217, 300, -84, -133, -104, -134, 126, -106, 83, -26, 223, -49, -27, -115]
7407a15J7k08J73K71l14K97l54L8J08J78j01J20j08M7j14K10k09K49j64r6q5J65
7429Ek45J97P5k92J27K65n4k2k69M56k56p7j58K06O0M4K2J16j08j34k04K77j51
7452a20L07k49Q2j19K1J38l41L00j3J78k90J25P6j5r0J23k30l7J10K5j20K35j80
7475h4J93j55J11J01k42p6J81k19L90m60J83L9P6j41n7l0R1L2N1o8K43j75J67
7498A51j44Qj08J16n4K32k66J4O6J33p2k45J82O8n9j27J90r7N1k87M75q4l12P4
7522i5J25l4l5J3k3k4R0J98k70j09P6l0O3J72j40p8j23J50rMj9Q8K3Qn3j7q8J33
7550dJ23RJ3r7l5J41p3j73n7K12j80Q6km1j28L23p5K2j16P3r7n0L54j27l20L73
7576A54j9j89RJ81j15m6l9j6J01N2J09N4k03O5n4O1k25P6O2J30k00L05l71j1N6
$$ y = [-115, -98, -306, -133, 138, -176, 121, -233, -195, -87, 91, -10, 110, 2, 49, -65, 145, -64, 185, 21, -75, -160, 5, -240, -43, 32, -260, -133, 132, 78, 56, -213, 243, -13, -90, -248, -42, 18, 62, 84, 200, 92, -42, -246, 31, -120, 187, -62, 20, -99, -78, 60, -281, 19, 6, 184, -106, 19, 95, 80, -10, 113, -117, -154, -44, -19, -139, 96, -84, 109, -46, 65, 166, -76, -152, 29, -190, 200, -260, -77, -38, 38, -103, -160, -190, -99, -67, -16, -84, 159, -16, 151, 7, 15, -93, 23, -31, 201, -65, -51, 15, 148, 76, -169, 13, 81, 22, -105, 85, -12, 39, -248, 227, 143, -169, -95, 30, -4, -39, -26, -49, -73, 17, 215, -55, -164, -88, -118, -55, 117, -23, -101, -224, -74, -83, -79, -98, -10, 13, 21, -32, -49, -137, -4, 119, 128, 141, 44, 9, 150, 77, -96, -153, 59, -121, -35, -37, -78, -206, 117, 42, 64, -52, 21, -76, -126, 228, 101, -219, 154, 135, -54, -45, 136, 21, -25, -64, -80, 21, 73, 182, 236, 33, 98, 44, 105, -120, -44, 18, 148, -52, 253, -118, -129, -73]
7601g3J93L9k34NJ83j00K06m17L25l8j5l7k61L65J34k44p6j91R0K40l26K32J45
7624A45j43j99J36Q0j37J3L53j75n3J12k87J36J94j04j41m0J52J15n9l3K0Q9o9
7647A05k68K60k21J74j06J05J90k43K6J63jN1k47j48K87Q5k94R7j12M6Q7k6%k9
7671a9nJ71N7n9j42J02Q0L6l23j02K45k26K91j84J18k5J92j93j04J21k3j16K14
7694A06j3J11m05L26r0J43j33l2J08j89M9j12J05qL33k92pp5K30l9p4j00J04Q2
7718A28j92Q1NM1J14k34K11j55J66j03r8l0M3N1p9p9M1J00K1o9l2K24j55j73J42
7743c1K27j85R7K4l35R7K60J12l08P5j4Q5j57J51j57R8Q1m3j29j13o1O9P4o2J64
7768A9j6M1J52q3j3m5r7K82N5l24m7L6P1j73K61k43j3R6j17LK60Q5k91L27l60
$$ y = [-73, 120, 159, -75, -70, 113, 13, 219, -198, 127, 89, 74, 37, -224, 141, 275, 31, -45, -236, -146, 94, -232, 0, 145, 2, -197, -61, 19, -118, -105, 248, 73, 20, 132, -155, -19, 175, 71, -70, -110, 42, 157, 98, 65, 85, 174, 105, -163, 97, -124, 50, -56, 49, 239, -4, 22, 185, 184, 235, -12, -160, 127, 212, -82, 15, -97, -51, 36, 10, 10, -19, -24, 147, 204, 145, 3, 105, 185, 221, -102, -204, 41, -185, 106, -78, 40, 15, 207, 14, -90, 31, 8, -108, 106, 93, 204, -201, 125, 35, 178, 45, 13, 121, -68, -19, -131, -26, -34, 299, 7, 0, -75, 155, 116, 42, -58, 46, 128, -64, 17, 22, 63, 177, -57, 154, -1, 165, 62, -36, -66, -23, 28, -51, -130, -89, 11, 32, -37, -69, 155, 0, -173, -31, 196, 11, 108, 132, -203, -106, 154, 266, -42, 33, 19, 104, -53, 98, -59, 39, 120, 77, -52, -165, -226, -157, -83, -145, 19, 3, 44, 196, 113, 100, 55, -42, 240, 295, -29, -76, -40, 31, -142, 119, -124, -137, -41, -158, -155, 105, 190, -101, 226, -134]
7793a34J65k9K9l37J52L27j47J59l43K69k94L50k66j01M22k66k5J71q7j6k7r6
7815a24J42j7m2j49J58K05k28K9nJ61j0j61K96k11q2K65J04m32J34n3J67Q3k5
7838B05k15p1J08k4ol2N4k26L28J3k19K18m5k51N1J91j73L48l81OK26m8q5j78
7862b06J94NO7Q1j81j52M0J20j12p8K19R2j38J94j9r3L3j66K04j6J9J3Kl88l7
7887c03K02L27j80k0n1j6j69O0K64n2N7k9r1k47L28q7N8m0R4l22N20q7m34J10
7911a08Kn8K29j1k27L85n88J84L67j4k01n1J1n0J09n3M4j01O5q9J77q9J9L51k94
7936IL1k62J1P3kJ46oj58J68j57J60J6mk12K21o2J30j02J10M7j38p3Q5M5j59K06
7962A23K69k75k09N2Rr0J52j04J45j12Q7J80j32J04k55r9J32J5P6L2m3J41l07
$$ y = [-134, 31, 2, 31, -306, -154, 173, 26, 185, -158, 111, -183, 167, -99, -200, 222, -44, -69, 102, 15, -1, -28, -124, 18, 1, -41, -190, -32, 173, -55, -26, -31, 130, 120, -41, 255, 44, -38, 227, 331, -101, 33, -20, 147, 230, 205, -10, -81, 27, 3, -3, -35, 19, -207, 121, 134, -85, 133, 88, -163, -112, 79, -94, 254, -127, -121, 105, 57, -28, -206, -12, -7, 60, 141, -40, -192, -152, -32, -144, -222, -3, 89, -49, 145, 126, 33, 66, -100, 104, 88, 107, 120, 122, -266, -303, -101, 226, 46, 26, -25, -41, -210, -150, 114, 62, 119, 90, -1, -248, 80, -7, 51, 11, 105, -217, 303, 216, -218, -108, -106, -164, 65, 54, -173, 212, -376, -192, 175, 161, -40, -91, -80, -130, -21, -74, -30, -131, -66, -155, 22, -67, -48, 303, 9, 40, -222, -211, -138, -140, 6, 0, -158, 10, -147, 13, 29, 25, -187, 34, -28, 102, 0, 110, 157, 19, -54, 31, 76, -83, 123, 392, 117, -92, -40, -31, -121, 31, -73, 72, -40, 47, 227, 95, 199, -56, -155, -23, -8, 68, 100, 57, 198, -109]
7985a09P0oJ42rk4M1k19k2J63m3J83k64K09k00K19l23K90j62j33M06k90J49R7
8008A65j65j09J61j50Q5K7r1M9l3R1J52k75L4M34m97K30j00j0j93K55j0J20L0
8031B00l52K17J55k43J33L6J21j55J09J0k65K48k0J65l76l01J92j5J74L75k59
8052A49k79lJ50j56K53l31K17m36M75j2k8K18k29m1J6Jr2N0J52j50J1K61j16o1
8076A9m1J64k49K32m63N76l31R8j4l9J27k26P6m1K33j34j66r7K09r4K50o3k8k8
8100c0o6K7L5O8j31J60o3m3j2J14p3o1Q4j21L01j13j88l1j9J17J61Q2j18P9j06
8125E3m8M3j23l0m7L09j60p8J28r4n2K6J31q9j11P9j28K95q8l5N9lj03R4Q7j88
8151g3P4k16L58n0R5k9o8j15J19n1j4q7P1Q3J42j87n6J60k8P6l78K48j56j25K79
$$ y = [-109, -39, -45, 97, 88, 64, 105, -114, -136, 27, -16, 167, -97, 112, -88, 131, -192, 98, -64, -197, 209, -81, 68, 165, 0, -109, 52, -98, -13, 14, -77, -28, -61, 30, 182, -93, -59, 375, -122, 108, 8, -2, -195, 60, 50, 170, 200, -152, 65, 220, -23, 110, 146, 267, 112, 221, 231, -34, 214, 194, 359, -17, -318, -126, -141, 33, 408, 149, -130, -133, 17, -139, 114, -217, 0, -436, 39, 27, -1, 217, -12, -53, -37, -36, -128, -78, 74, -76, -65, 196, 80, 19, -22, 142, -107, 125, -338, 238, -93, 5, -9, -48, 79, -147, -71, -112, 121, -13, -179, -276, -67, -161, 89, 26, -2, -30, -96, -69, -34, 34, -97, 63, 0, -43, -55, 59, -14, -75, 9, -112, 189, 76, -112, -143, -162, -45, 116, 198, 80, 159, 53, 5, 48, -75, -105, -152, 157, -3, -81, 47, -47, -99, -73, 58, -31, -142, -63, -191, 104, 16, -19, 40, 37, -66, 28, 115, -73, 1, -215, 143, 93, 188, 159, 91, -24, 95, 44, 30, -57, 14, 97, 239, 52, -4, 156, 128, 204, -174, 74, -82, -207, 72]
8176G2k96K50J32j30j87P3J50K3n6l74L44k9J80j78k55
$$ y = [72, -224, 26, 158, 28, -159, -86, 64, 87, 31, -343, 1, -28, 152, -26, -281]
8191b81
$$ Imaginary data points
##PAGE= N=2
##DATA TABLE= (X++(I..I)), XYDATA
0@%%%%%%%%%%%Qj6J6j6J6k4L2m0M8n6P2q0Q8j07J31j52J76k01K26k62L01l43L90
34B07m39M93n54O21o94P73q60R56j061J176j302J438j587J751j929K125k342K580
52A352k843L135l461L831m251M730n286N939o720P673q865J0406j2483J5447k0038
67a1434K8133m6428J58204j6030l12019K54004N2256j80780O4946Q3003j10310
78c6455M789J1455N2369K3751j39834j16J88928q6158j27519J51423n331j27703
90i0401J17283M7957j14627M236N4250N223K2538o8431j4555Q3038k6737l3407
102a3633M0763k7813l1332M3321J0949m245m8087l1312R8230N260j05583L6139
114b7343O1685q3303K7722P7973r1621k7771Q3500m613j9810N307m4227N1100
$$ y = [0, 0, 0, 0, 0, 0, 0, 0, 0, 0, 0, 0, 8, -8, 8, -8, 8, -16, 16, -24, 24, -32, 40, -40, 48, -59, 72, -80, 96, -105, 121, -141, 160, -183, 207, -232, 261, -293, 328, -366, 407, -453, 503, -558, 618, -684, 754, -833, 918, -1011, 1114, -1228, 1352, -1491, 1644, -1817, 2014, -2237, 2493, -2793, 3146, -3574, 4099, -4766, 5640, -6843, 8604, -11434, 16699, -29729, 128475, 112445, -199574, 54430, 106686, -74094, -9148, 73855, -36455, -31666, -20211, 32158, 55909, -83925, -84041, 104887, 18729, -108790, 42633, 37302, -90401, 26882, 74839, -39788, -35552, 18698, 23921, 46459, -21972, -36527, 46511, 19774, -13633, 27130, -683, -32015, 11306, 22255, 18010, -30077, -61389, 36841, 42101, -63482, -27343, 34342, -48961, -21239, 56734, -34887, -62658, 20842, 16229, -3581, 1726, -42501, 8599]
126H599L4926p0138L8926J4364p9380P1605O0505j21405J7205P3799o8731K3148
138C423N0501r0055n917R2286m0335l4566L4710k6407m99M0572j6371k2522L812
151a1368j2098N0432R188q0440L1323M9367m9143J5282L9497o6491j301O5397
163C9645j2578l2853o893J3282J6486l409j5232M928j6460k457M6834j8235n0295
176c7237K4745K7004k6150J7246j708m4329L2916L0436k7784p050L025j0180L1968
189A2902K767l0116R209m288Q426K8818k2909l3934L0872J3697j5090J1802j6029
202c873j9504K8831J8758k9666k989K349q319L0561n45l5272L121K0293Q94O036
216A0675j5645j1997J9654j107R927L796l3200p9M6857q538l3419J4182M371o535
$$ y = [8599, 43525, -26613, 12313, 26677, -52703, 18902, 79407, -41998, -24793, 49006, -19725, 3423, 53924, -36131, -42048, 50238, 9903, -24663, 10047, -16360, -16859, 23713, 7342, -15180, -11368, -23466, 26966, 36154, -44286, -12963, 36404, -12739, 2543, 42040, -24451, -25752, 39645, 27067, -5786, -12679, 603, 17089, 13680, -1552, 3376, -13084, -15541, 31293, 13058, -37237, -12492, 14512, -11638, 5608, 3900, -40429, -7513, 22923, -4861, -11911, -8886, -19066, 12902, 15669, -14447, -5238, -9526, -1100, 27718, 4809, -29125, 1747, 15444, 354, 12156, -3873, -23377, 5454, 24212, -5454, -8443, -6094, -14413, 16148, 15603, -19669, -16548, 3745, 4639, 10675, -4970, -16967, 2687, 1580, 11507, 15303, -17897, -17976, 28881, 20343, -13076, 1106, 5477, -1058]
230a058J4191P361k7586q568K2222J4740q868l0172O608K4158q626p448J2973
243I927k4860p149M2930p930k7936J625R418P606P326j4305j0840R277N355J1514
257A1958n497j9485j057K2373M855j3203m668q342J1464J7520j1823j7115P255
270e765M86O977J4486k4902j1343J7740J0319l293q471j0851P034J4826k175j694
284C374j3185l241J9187J1608j6590j3383J1218M763O634J015j4775q360J7477
297E742Q738o487p642j2993J3769J3468p262q938n501M68J5386N179j8491l708
311h272K727R528P654q799j4084K036J6836J478o119r081k453Q503J2726n457
325G223j5132K10M539J5170l520j6787j223Q249N686L220q516j4723J0119J0380
$$ y = [-1058, 13133, 20494, -7092, -15660, 6562, 21302, 12434, -17738, -11130, 13028, 4402, -3046, 9927, -14933, -22082, 20848, 12918, -15018, -13393, -3975, 3631, 10957, -3348, -14188, -4911, 444, 11958, 6461, -13024, -14081, 8292, 13147, -56, -4724, -13066, -1602, 15918, 4095, -13020, -5765, -5279, 1698, 16184, -8718, -20061, -2321, 7998, 4705, -3766, -14617, -7583, 7243, 5068, 3374, -9811, -13052, 6135, 17743, 1153, -12230, -1012, 3751, 10385, 11400, -3375, -11735, 5742, 14480, 7993, 351, -12642, 1127, 14595, 7333, -1605, -7106, -6638, 8748, 13927, -4564, -8272, -5545, 3983, 11637, 2838, -11246, -9210, 7626, 9104, 2985, -6096, -8549, -46, 12680, 7223, -7909, -7699, -3160, 12010, 8490, -8297, -9520, -1271, 4415, 7635, -881, -15604, -5485, 4895]
339D895J748q097j1726L478J2576O245j1409q733K018J0234N126k933j0054n186
353a1818J2700P641r0j4361o397J4868Q768p494n674j867k016J3299L856r942
367A473j1776L771J7711p17j2668n274N701M316N943k791j0927m080J0563J3252
381A4497j0149j0850n03R724P779m878q707k402M389O981O849j5134p909R854
395d59P254J163q010q282J320J3572J373r253o889K329O403M751l04j4464r70
410a0466J0772O424l091j1069m900J2429R077j0116k976j365j13P265P981q067
424A785j7229R706J7190m646j3277J080L460L430M039l509l414q722O703J7590
438A4186n541k3192M650K2090o174j1337P146O43j3426J5460J3412k0819j0676
$$ y = [4895, 6643, -1454, -13180, -9702, 2874, 9119, -2290, -11023, -9005, 1229, 6355, 3422, -6632, -11818, 882, 8523, 8433, -5928, -12325, 2543, 11311, 3817, -1857, -3724, -5740, 7559, 11415, 1473, -10303, -6532, 11179, 10462, -2206, -7480, -1779, 2537, 8480, 5689, -5238, -9318, 1245, 14497, 4348, -6502, -7005, 2719, 10498, 5620, -3087, -5489, -1100, 5881, 12730, -2404, -10313, -459, 6795, 7958, -52, -8334, -7014, 6558, 7931, -1322, -8211, -5882, 521, 5272, 4968, -9496, -10466, 306, 6730, 3639, -7430, -12330, 99, 9176, -940, -3916, -5281, -5394, 1871, 9852, 1785, -15444, -5738, 11452, 6806, -6471, -5391, -1931, 1499, 5538, 2029, -1385, -10107, -3404, 14186, 8645, -14547, -9897, 12193, 6019, -5318, 1828, 2471, -10955, 4505, 17917, -2902, -13578]
451a3578J3729J3199n994j2917o06J2507k926m006J0739r231j5662J5932K1738
464B2924k2974j7451K0377N570j0620M684N35j3444P632R903j275p949j0126P961
478d253J5543n870j6658O806O749m661N446K820j5090k243K0221l012r297o64
492d163l380O956J1569j1310j1803J1480J713j593N456m951j2745R125J5371r842
506A883p985Q55K201Q365L354j4984l46J0744n469N197M538j5098m730K0571L979
521A3075j7189j781O635K723R11Q81p992J90K828K186R176j1678j5206J7343J5654
536A7756k0339o040J4446o086m897J4340p52k1759O073J7893l538j0509l843N258
550a997P145k210o236N844p660l317J9168j528k2335L312J8502o310n680M001
$$ y = [-13578, 151, 13350, 7356, -5561, -6167, 6340, 3414, -592, 10147, 916, -14746, 1186, 22924, -50, -17501, 2876, 8446, -2174, 2510, 3045, -10399, -2767, 7136, 5861, -2088, -12214, -4253, 11290, 5420, -11238, -4432, 2317, -2344, 3102, 5922, -9168, -11411, 8810, 5798, -3499, -4163, -7543, -587, 10982, -328, -12131, -651, 1062, -531, 4925, -26, -12771, -3646, 11725, 1883, -6102, -5247, -3046, 5319, 8673, -6311, -6657, 4087, -1382, 3815, 8353, -6745, -11475, 9096, 13075, -4114, -5895, 740, 3463, 4374, 5255, -2737, -2547, 281, 2467, 11643, -35, -15241, 2102, 17756, -2583, -8623, 5823, -263, -5160, 9180, 8428, -13331, -7258, 10635, 7097, -3412, -7255, -1997, 5148, 2938, -3298, 2546, -5114, -8431, 10737, 9209, -13126, -9814, 8688, 2378, -3302, 699]
564F99n065k813J2036K088j2849J69J779O494M161r479o069P072M960j425N25
579B283p204j759Q752N016o075o686L102K731M933J71r058l802J0141M505n068
594A982k512m004L361O266J596p732l896M195M042L927n058q826K572J3177m658
609D432o817L552m452J267R567j249j2547L41Q716M547n296p482K817L766R96
624B158l55J100q813j744J5018L74j4803m53J0046j981N06K67n324j763N067P203
640F503m888r349J424R910M1m912j934j119K992M243J485p540k974M573N997j42
656D310p204k658M538M988j498j988m947J321O846O31k401n658q19P555M659q023
672c48l484L191J230L986p06n192l824N940N545k436n685k738N357L805r15m564
$$ y = [699, -4366, -7179, 4857, 6945, -5904, -5735, -3956, 2538, 6699, -2780, -8849, -1777, 3183, 1758, 2283, -4921, -6680, 2072, 7088, 1013, -5673, -2571, 160, 5093, 5264, -3794, -7596, 2545, 7050, 1982, -530, -4534, -1173, 5093, 6689, -1043, -4939, -744, 3298, 7225, 2167, -6659, -4087, 9090, 4432, -2385, 1167, -3285, -2018, 7549, 6300, -6247, -5906, 2810, 7357, 2061, -5421, -2604, 1162, 2158, 1803, 2903, -5910, -7654, 7364, 7738, -7065, -7518, 2528, 547, 1053, 1320, -4004, -5767, -700, 6503, 1615, -7734, -6310, 3600, 3641, -1271, -3205, -4324, -1332, 2911, 4396, -3144, -6118, -1545, 4452, 4310, -2894, -5552, -1014, 3974, 2476, 488, -4459, -3138, 3708, 4339, 1938, -3720, -4539, 3016, 7675, -348, -3832, -641, 589, 4575, 3869, -1323, -5147, 793, 6338, 3902, -1783, -4521, 836, 4641, 3726, -838]
688h38j231j047N833M365q526l332L324M243R43k051o282P08O232J133j722n600
704c848o86M462M301k647n286p64L139M933j369n393k195M359K711Q67k626o589
720f631L659O293j03n142k053M84M672K545l770l139j843O011L902l512n500P78
736c349M708J470k16m100k139J854O929j183o164q95K155N126l46l891l007J837
752a211L789K749m093n292K987L435K311l060m179m18M512L370l078l922j315
767c415M373K714o55m811k709M476K994K34m664k624K490M325m24k741l402M71
783c368N954K02l175l599Q19M058J988k284m285l12L768M060l285l579o94K762
799i70M274k152k763k359K251M597N01n284k256L140L047J494m529j891J308L197
$$ y = [-838, -2069, -3116, 2717, 7082, -1444, -4776, -1452, 2791, 3734, 1683, -4599, -3891, 2341, 3474, 1752, -3848, -4534, -72, 4229, 1582, -3704, -4468, -1329, 3604, 2235, -3158, -5353, -994, 1717, 2584, -42, -6631, -2972, 3321, 3218, -1924, -3977, -3493, 1179, 3724, -46, -3185, -5028, 983, 4885, 1373, -4127, -3349, 1359, 2829, 2613, -1487, -3626, -1772, 5157, 3974, -2190, -3085, -930, 4196, 3850, -41, -3048, -1211, 2578, 5327, 1234, -4058, -1071, 2364, 4675, 1615, -2564, -2982, 1530, 4900, 1822, -2100, -3415, 958, 3672, 3017, -1794, -4503, -27, 2967, 3201, -1463, -4087, -1597, 2728, 2304, -437, -3839, -3368, 2586, 2788, -387, -3986, -3167, 891, 2879, 595, -3690, -4002, -234, 3826, 541, -3038, -3732, -970, 3304, 1152, -1611, -3970, -1719, 2878, 3379, -1905, -4161, -1021, 2026, 3520, -1009, -2900, -1592, 1605]
815A605K483k624m372n2N297J732k218m804J053L302J680j89l986j483K179M293
831C896l74l885l410L758M491k548k192j938J184K391K442k551m982J457M510
846B249J471l791k599j68M580J349l037j284k154K230M502r82n893j55L519K195
862B032l26l561j503J285M447m34l205j676J68L772K089l083m440K684K952J024
878B225j559l254K07K396L252k076k805j049K344L129R1m694k089N411J037j634
894I32n53k174l18M585J759m731j751J185K867K108l046m156K578M188k623J222
910B072j193m802L152P076m851n179L009J085J744K48l248k032K863J420P75n58
926A581n593Q91O564m9o822J445K114j164L026m77m630n04M653J156j954k788
$$ y = [1605, 4088, 1464, -2908, -2960, 2337, 4069, 1851, -2953, -1900, 1402, 3082, 2893, -1093, -2576, -397, 3896, 3522, -363, -3773, -15, 4476, 1928, -264, -2202, -1018, 1373, 3815, 1264, -3718, -2261, 2249, 3720, -71, -2670, -2838, 1742, 3091, 54, -1230, -3384, -1154, 3348, 2366, -3527, -3682, -163, 2032, 1706, -1855, -3358, -2073, 2374, 1940, -1265, -2941, -2773, 999, 3088, 5, -4435, -1751, 1201, 2225, 666, -2588, -2381, 15, 3267, 1191, -1614, -2663, -319, 2810, 2901, -1793, -3882, 1529, 2566, 932, 379, -1795, -2113, 2472, 4231, -500, -2251, -1066, 1801, 3909, 863, -3293, -715, 3473, 850, 2072, 879, -3923, -771, 6305, 1454, -3725, -716, 369, 2113, 2361, -887, -2919, -56, 1364, 2139, 1581, -4012, -3121, 3443, 3394, -3428, -1983, 131, -1033, 1993, 1516, -3114, -3618, 1035, 2191, 237, -2551]
942b551o43L566J774j243l605R52R66J193K411l370m237L312N579l209k292k77
958a674j6K562K569l247m040L745J026O70O82l859k033O108J109m524J120j394
974a196j77N041q06n403J353K350n67K756k527m526L353M491k859k348Q15j685
990a935L237K342l488k763J773J179J894l02n276J125L567N54k327p78o96N93
1006a301L150L52l724k525M082K006j474j216k161J639J773J278k669j198P0K169
1022B51K470k359l820J235M496j785k50n15k763K498L876k611l007J458mK773
1038A943M23l906o07K928J033p78K51l388M60M296p5l225m23N65P49L268k982
1055E32k623J784J411R54n06k596j286L703P52j016j734j601K246J665M1k910
$$ y = [-2551, -3194, 372, 2146, 903, -2702, -1750, -784, 409, 2820, -550, -4787, -1475, 4104, 895, -1397, -1674, -1690, 872, 3441, 194, -3846, -101, 925, 1595, 2277, -1582, -3615, 2493, 3602, -922, 198, -1196, -1373, 3668, 2862, -2541, -1188, 1162, 595, 3351, 824, -3702, -349, 4142, 1283, -1065, -250, -1935, 1302, 3644, 156, -2607, -834, 345, 2239, 1937, -3339, -2214, 1353, 1907, -420, -1198, -1894, -1301, 1849, 2201, -1523, -4048, 34, 2040, 566, -650, -2811, -1172, 601, 1879, -790, -1988, -1918, 251, 2721, 362, -3458, -2223, 2273, 488, 238, -277, -3040, -542, 3334, 723, -2284, -826, -830, 1943, 2366, -1540, -2147, 781, 1814, 1036, 1287, -2101, -1641, 2655, 2580, -645, -1068, -503, 246, 3514, 532, -2091, -307, 1104, 2058, 1552, -1044, -2330, 1373, 2125, 1109, -625, -2226, 20, 1685, 1726, -1184]
1071a184n25Q88K419K31k286j583J043K170K27j104k811J172K210M08j236j761
1087a722m79K101K329k286j174j053J573K625j154k427n49J921J077P68k104j817
1103b371J764K162j17k123p89q8K692Q46k273j091L94J458J800j118l213J098
1119i69K039O99k87k605p14K064K118j184j516q51Q32K428j71k186j408J729P80
1136G98J389j861k276J437J946P2j248j375o45K791Q80j763j043p34J783J684
1152A835r65k374j16J393J587m00k308n62J122K221m90j432j755R31K460rj384
1169b46j831P95J581J499j774k053P14J173J863j199k013n64K526R66m81j898
1185i42q07J693J713l23k323q3N71J845N60k243j294J346J553p2m34k105J10K678
$$ y = [-1184, -1709, -821, 1598, 1829, -457, -2040, -997, 1173, 1400, 296, -2515, -1343, 867, 1275, 39, -1722, -2201, -100, 2229, -57, -1231, -2284, -711, 1914, 760, -1667, -2216, -295, 782, 1550, -554, -2371, -607, 1555, 1438, -685, -1474, -1562, 1130, 1976, -297, -1388, -994, 464, 2264, 1146, -2067, -969, 1070, 1769, 1482, -1123, -1837, 227, 2345, 1161, -355, -1206, -374, 2054, 1883, -303, -1711, 18, 798, 2187, 326, -1950, -513, 1433, 1505, 257, -1118, -1763, 1028, 1908, 145, -898, -1632, 151, 1835, 870, -1504, -1620, -227, 1360, 960, -1348, -1910, -788, 1433, 943, -489, -2244, -1313, 1147, 1138, -246, -2077, -1282, 299, 1798, 24, -2029, -1315, -142, 1721, 522, -1491, -2055, 471, 1437, 956, -942, -1749, -56, 1657, 1334, -989, -1072, -501, 1344, 1904, -339, -1633, -287, 1266, 1194, 760, -1345, -1235, 1443]
1203A443Q9q47j498k84J651J472j559j529K73P05J853q55j427r58J582J487o04
1220I94j174j306J032J667J62j899p49L4J878J099k253r03M35J475N90o51k171
1237a740K68J768P27r7k165m82J388J575o68j601m87N91K040j42j548j208J148
1254f33J505Q6r67k011J403J500K71q63j195m70K155J079j615r44l07J591R22
1271A507k46j844m68J499R57n7j761p22R79J484q9j317q95J14K420j17j373j012
1289i41K46J202J207j145j907L82J250J032o76j917k29J319J404r12q18j031J029
1306e05J277l0j541o19J018P89O66j410j093O11J588q5n94j263k40K025K28j037
1324b15j160K37J329O79l71j630Q5J027J372o85j239n81Q59K115q53j609m49J344
$$ y = [1443, 1532, 685, -813, -1097, 554, 2026, 467, -1062, -789, -84, 1769, 914, -513, -1471, 111, 1598, 994, -180, -1486, -454, 1213, 1375, -524, -1273, -1239, 639, 1738, -515, -1418, -983, 492, 1082, 431, -1740, -1472, 296, 1023, 926, -1239, -1721, -333, 1242, 574, -1027, -1514, -923, 1117, 975, -573, -1781, -633, 872, 958, -9, -2020, -617, 883, 1154, 291, -904, -1374, 781, 1860, 245, -699, -1006, 585, 1507, 1261, -583, -1051, 448, 1405, 1348, -413, -1135, -156, 1328, 1239, -78, -973, -859, 1561, 1444, 71, -941, -695, 507, 1714, 569, -1338, -956, 294, 1326, 650, -1267, -1496, -177, 1227, 315, -503, -1534, -505, 772, 742, -799, -1418, -400, 389, 1055, -355, -1448, -837, 751, 666, 72, -1191, -1431, 594, 822, -215, -1375, -1138, 191, 870, 499, -1131, -1046, -19, 1353, 668, -571, -1152, -293, 1822, 969, -640, -1089, 255]
1342B55N80M68j117j284M68J611P04j738m30J24R38J417j445j426K46J083O23
1359A077q2j587l60J286Q49l27j634K07M79J075j45j070r16P68J176j09m58j591
1377a362L85J722K23j153p98L83O51R48o76j558o8J616L44n19k54j566J408J575
1395A301q14j618L45J35J021R48j666j145J261J065m39l03p68l70J822M32j311
1412a04p45P03M5J239n13j795L09J332M02k31p14p83Q68J118m38r03l90P99L52
1431E51N98j221j092J018J185k25o76p09j9J472J10q19j432Q40R39j44M34j354
1449e44q68J488Q41p69o00j7m12J682n6j665k60J167P0O51n86j763Q42J126J27
1468D54p70j56j82P56J117j374r21Q11L67L48L08j691j00J333L39O7j058p29Q48
$$ y = [255, 835, 1303, 186, -1098, -630, 981, 1685, -53, -483, -359, 579, 1996, 551, -875, -629, 454, 1077, 995, -592, -952, 334, 1183, 856, -778, -571, -92, 983, 838, -232, -1148, -380, 796, 687, 229, -1362, -977, 745, 968, -185, -983, -600, 51, 999, 323, -1235, -1303, 313, 657, 138, -116, -1682, -274, 1301, 487, -1131, -786, -651, 370, 1318, -348, -1493, -232, 833, 394, 91, -677, -1047, 775, 1207, -104, -849, -146, -101, 1138, 625, -1170, -861, 471, 873, 642, -72, -855, 13, 1131, 693, -210, -600, 199, 551, 1149, -72, -1164, -146, 1039, 814, 138, -571, -590, 882, 992, 173, -1259, -419, 520, 376, 810, -544, -1412, 76, 917, 148, -452, -469, -881, 801, 745, -920, -1180, -13, 57, 708, 122, -1641, -799, 327, 454, -316, -472, -654, 102, 1219, -155, -1076, -265, 102, 450, 758, -933, -1033, 300, 639, 706, -352, -1081, -233]
1487b33J036j01j191k52N09J102l6o52j056P10Q31L38o00j443O76J036L02n85
1505C91q09N4P78N88n58n59n70P41J008l64j110k31N86P32K31j203o94P52Q48
1524F11j76n67m24l32J324J85p91k57l70R38M91n13j464P56M04M66K84j040o86
1543a161J163O60n16n35n21N84Q19k7q46n92N79P39Q41j349q86Q09N60K55m57
1562A19l94o69J576p7k25p74l37R55O79k92q61oK76R07l8r95m85P67N62k3k48
1583D17j241M20J084K10q63o36L37O23P95j068p68J46N13M88kq71o10J508k7m7
1603D08n75p09P67O88J2j101J5R5P41o2q66k26M53O71L58n44j073K87Q78j1j82
1624B4n11j56O88P31n40o89j05K65Q32m2q92j41N36M25R3n90l25K29P70J93q11
$$ y = [-233, 803, 702, -489, -741, -232, 870, 834, 182, -874, -164, 667, 1005, 405, -1038, -362, 674, 976, 391, -418, -364, 414, 1002, 444, -115, -685, 56, 1064, 700, -410, -641, -55, 677, 908, -295, -989, -237, 611, 435, -132, -556, -888, 436, 621, -170, -427, -797, 141, 632, 119, -1345, -589, -185, 281, 565, -475, -1161, 2, 662, 146, -389, -910, -326, 493, 466, -380, -972, -393, 346, 1187, -162, -1048, -239, 321, 576, 119, -275, -944, 632, 555, 330, -444, -781, 174, 853, 561, -300, -306, -30, 877, 839, -156, -641, 126, 688, 665, 417, -824, -404, 680, 890, 27, -609, -272, 351, 1146, 78, -690, -544, -31, 457, 455, -416, -1026, 482, 455, 408, -167, -876, -109, 579, 591, -510, -495, -400, 341, 279, -587, -813, -360, 311, 669, 125, -948, -661, 217, 206, 24, -487, -643, 45, 776, 236, -453, -558, -293, 539, 497, -395, -536, 0, 425, 518, -72, -397, -168, 602, 795, -16]
1645a6n83J31P50M24o95m94L1P54N50p53o09K64L53N47k70p47n07J064M40j41
1665D93o33l80M74J035n71n88q8l2O07J66o28n89N08J96M15j90o86l27J008Q1
1685B71k63n43k83P35L25J02r85Q5L6R74j18o96l47L16Q33Op89k34L24P40J38
1706F27m75o82K95N56K27k84q84K35P26K84l93n72r3N57N78q4p27l76O26L89K8
1727E58o89r2M96L36O2p88j86J94L13L09p27k13K22P67j28k14p67K87M78%m7n74
1749d03m7O85L90m97m87j11N01L52r6k22q26N42M42J88p55M6K12N41j02m97m24
1770e68J80Q10j69j08n98P5L84M61J5q44Q5M02M75j30n55k17K85M09J5m93l76
1791d62L93N12j6n66l78L98M82Qm89k85K12J05O68j87o37P0M21J84j71l43k93
$$ y = [-16, -599, -468, 282, 706, 11, -483, -452, 302, 852, 99, -510, -246, 107, 654, 384, -363, -870, 194, 634, 493, -140, -520, -46, 989, 418, -170, -258, -290, 317, 483, -145, -734, -226, -30, 385, 195, -491, -818, 190, 271, 8, -535, -818, -83, 242, 344, -641, -556, -520, 454, 336, -360, -707, -391, 442, 448, -341, -575, -251, 489, 627, 152, -530, -235, 321, 548, 264, -620, -385, 341, 625, 232, -340, -433, 124, 702, 618, -109, -485, 141, 530, 558, -131, -223, 273, 609, 671, -117, -303, -109, 204, 513, -214, -427, -205, 562, 434, 220, -547, -260, 218, 218, 171, -403, -450, 235, 625, 128, -359, -470, 31, 383, 287, 65, -761, -219, 223, 411, -344, -298, -86, 455, 353, -144, -568, -388, 422, 253, 145, -453, -378, 6, 467, 482, -362, -277, 125, 600, 470, -85, -302, -17, 392, 407, -86, -462, -69, 443, 427, -139, -517, -119, 363, 371, -118, -403, -191, -86, 582, 395, -242, -172, 249, 433, 262, -81, -374]
1812c74P55O8k17k79m55M47K10L71o09j81O9O80k49j95m83k1P76Pl31m35L91n4
1834a09P88o45n85L18M96kk56j75o77Q33M14j58n16m7O9L71M21q99mK68L01J44
1856C50l49k89L7N63K09l04m49j88K78M09J00n39m8M97j16p3k14k98M34O17m91
1877A36m13P9K37P2L58l31l48N12k11J35k10j28k84O28K74m52k76J00J33O31m69
1898A73m44j65L77L25m4l97l51N52K33j07l73q4P9N44J15p30k74K64N15J14m61
1919a39l63N08L30j21k06j43P0J06L03j78k65k13M65J84j49k29k16K39M06%n53
1940a64q3M01M2K03n06l14K45L80K10m24l62L80J72M29n97k06K0R1O14j96m11
1961g6j16L87m2Q1l68l4Q9J49K16l92j48j35N31J16m56j67P2L39M44l86l43j49
$$ y = [-374, 381, 449, 232, -47, -502, -55, 155, 526, -83, -264, -195, 485, 236, 41, -442, -463, 313, 320, -11, -446, -55, -109, 679, 34, -551, -233, 263, 261, 5, -170, -847, -14, 400, 242, -274, -321, -252, 119, 540, -359, -363, -95, 206, 350, 1, -288, -251, 312, 521, 217, -232, -420, -142, 267, 367, -172, -220, 277, 161, 88, -126, -424, 10, 627, 136, -277, -198, 39, 111, 469, 138, -210, 302, 91, 226, 16, -112, -396, 232, 506, 54, -222, -122, 11, 642, 173, -271, -436, -59, 266, 222, -175, -526, 26, 259, 152, -221, -305, -226, 318, 433, -297, -571, -307, 208, 322, -139, -502, 6, 336, 215, 9, -134, -64, 42, 345, 167, -98, -311, 154, 338, 189, -40, -256, -17, 389, 389, -164, -247, 154, 196, 399, -107, -421, -176, 204, 414, -10, -372, 8, 180, 609, 12, -194, -174, -83, 531, 335, -76, -192, 195, 153, 234, -134, -168, -79, 70, 286, -106, -254, -389, 142, 258, -198, -365, -293, 46, 490, 104, -239, -388]
1983c88L72J25Q2l09k54K96L73p2m56r0L99K54k97j83j39L02J99K12l64m03M33
2004I2L49j34k41m05J64M41J98o38R4r5N62K7j19o69K5L90J55J6n22k37N10K00
2026A63m7O5m42K81J95K42k51m15K37J67J28m94n7O6L51j64n0j56q9K41O51m06
2048B16l47j25M32J63j26k54l09L42L78m66J62m90K56M56j42k95q5n5N31J37j00
2069B79m85J47J69P2j50l2P9n8m7L13n99J75L31P2k78O4j78K11J36k07m20M06
2091@Q7K21J69n38K4j1K84j6k33r2j77M07Q2l24J47k07J18P4J29j26k81K58J41
2114A36K61n50k57K63M60lm55P3J93P6j8k30k92J22M12k5m31K9N8L21J06k07j55
2137a13j50M01N3j74l27L41j53M10j08l61L0K20j35m1kMj28K09j0p9j25K51Q9
$$ y = [-388, -16, 109, 191, -118, -372, -76, 297, 225, -231, -321, 78, 332, 35, -148, -287, 15, 214, 426, 62, -341, 92, 441, 307, 66, -339, -175, 266, 464, -174, -80, -175, 387, 414, 295, -374, -349, 41, 196, 212, -310, -547, -37, 163, 116, 181, -261, 20, 215, 457, 206, -209, 28, 195, 323, -171, -228, -162, 189, 25, -25, -181, -270, -29, 622, 216, -131, -256, 176, 339, 213, -41, -350, -8, 370, -96, 66, -424, -168, 288, 146, -149, -234, -289, 242, 379, 279, -206, -59, 110, 182, 32, 0, 79, 21, -26, 287, -312, -137, 194, 266, -12, 52, -126, 85, 221, 14, -406, 0, 87, 308, 477, -61, -37, -48, 236, 220, -13, -105, -282, 125, 207, -117, 30, -177, -59, 15, 144, 18, -263, -5, 136, 397, -153, -410, -147, 313, 310, -145, -72, 121, 197, 179, -51, -343, -221, 191, 166, -265, -236, -178, 143, 249, 42, -113, -263, 138, 191, 17, -310, 31, -122, 288, 180, -181, -151, 69, -66, -107, -109, -105, -233, -24, -34, -113, -238, 13, 102]
2160A02J84j41k81j42K96L76k63k12r5L02J1Q8%m71M80R2l42p4J13k05K35Lj44
2183h8r1l0M71J7j23l10M0P9J4J24k71m2J19J02l6om44K82N02l34j45l0J24L67
2207B91j63k7k94o3R0K85J71o43J50K53L75k91l24N3K21j01O5r6p9R4M49m10j82
2230a76J22L16j37M3r7n9l6M92l48p6j57J08M07j91m6l36L51o5K68l39M7m56M50
2253H5Q9p3m87L32q8K91q6j86J54LK02k68k08J32J12J36K52n99K38P3p9j31J13
2276GN5k79L45l19K85o4M7K76m53K02j78QN1L45k29J19k92K24N9j16k70K35J11
2299A69J57j2m70J38k67M29J68l53j59J67J56K7j33J9j61L11K1k04r3m8J5J12
2321a1K88m61n0J98j08pO4K37j14M7L5k87nK07k91L00j67j73L19n9K41l73j4m3
$$ y = [102, 286, 145, -136, -278, 18, 394, 131, -81, -176, 126, 137, 225, 225, -246, 234, 326, -16, -90, 23, -182, 53, 56, -88, -179, -209, 262, 279, 156, -154, -114, -35, -21, 103, -168, -210, -91, 11, -25, -31, -475, -193, 309, -25, -170, -200, -76, 291, 128, 101, -193, -256, -166, 119, 290, -353, -203, 50, 425, 134, -190, -137, 84, -17, 48, -48, -127, -33, 416, 6, -176, -54, 262, 125, 168, 71, 12, -24, 468, 120, 44, -113, -5, 402, 211, 165, -171, 180, 115, 383, 44, 91, -365, 85, 174, 101, -386, -54, -142, 149, 63, -123, 31, 34, 236, -32, -240, -108, 4, 140, 392, -207, 31, 104, 25, -106, 7, 62, -217, 128, -191, 94, 30, 77, 353, -100, 102, -76, -68, -17, 328, 99, 218, -74, 150, 209, 93, -177, 58, 169, 326, 314, -156, -18, -285, 144, 312, -41, -200, -33, 123, 150, 17, 36, -125, 186, 207, 3, -90, -138, -123, -11, 277, -184, -234, -36, -144, -151, -87, 150, 36, 83, 118, -169, -174, 33, -258, 42, -125, -298, 21, -38, 203, -170, -184, -227]
2345b27J68K0P6j98J27J25k18L17j04j86J96J73j05k52J92k4j9j23J42m20K53
2366h7oK62j55m0O3q8L79l83j5j33K65M05m01k21J85J4J11r6l96L31K09Mj32j78
2390a03j22Q6J68K09j02k47J2L57k50k7p6j67L55P6Pk35m7K09l51L22j46m6o3
2413a81J90j50LP8J02O7o0n9l66N39j77Q2M1r3J90j10j73K3ln1N4L7Q1m32K20
2438a48J01J18o7l95J08l9M82k54rJ08j33M09n0k50j39M8J00J54j84%M7k38M04
2461A73m38K26K0N8J4k05Q9J50N4rk5l71J48K80K1j48j08o7j22K33K92l23o7O
2485a19K74l92J94p0J92M0Q6j50k18J86Q6K0o6l25K11k1J65N7r8k59L16K9L9k54
2509g7L0j21M16j1l21p8L92R9m89K88m25K08J98Q0q9j72M7P8m1P6o0k88J35J83
$$ y = [-227, -59, -39, 37, -161, -34, 91, -127, 190, 86, -100, 96, 269, 164, -88, 104, 80, 61, -62, 80, -340, -87, -93, 169, 14, -26, 37, -51, 328, -55, -70, -203, 62, 467, 66, -155, 30, 44, 155, 59, -337, -6, 203, 207, 75, -103, -225, -139, 29, 238, 136, -111, -99, 258, 8, -19, -95, -262, 93, 169, 176, -59, -106, 103, -248, 74, -72, -118, -181, 9, -141, -138, -60, 42, 109, 49, -10, -376, 163, -14, 68, 109, 16, 206, 96, -77, -54, -57, -108, -54, -17, 64, -368, -148, -47, 71, 4, -391, -283, -322, 160, -94, -103, 5, -128, 281, 231, -19, -158, -110, -10, 144, -40, -40, 7, -231, 173, -265, -39, -19, 39, 53, -152, -63, 87, 141, 132, 107, -264, -116, 164, 185, 37, -71, -138, -260, -27, 265, -58, -125, -119, 155, -237, -43, -113, 79, 119, 205, 55, -163, 23, 109, 129, 63, -262, -51, -72, 93, 150, 52, -207, 109, 138, 177, -77, -47, -168, 248, 237, -84, -162, 230, 329, -160, 128, -297, -89, 109, 189, 100, -72, -25, 53, 12, 88, 28, -260, -125, 58]
2533E8P3r9j01R2j5J49j33j26p4NL50m1m57K29J59J00k89LK2l6J46j38J99k44
2557a68J07K93l83K01r1p7l3L56l61L4k8L8L00l95K44k39L84o4j97j66J96J07
2579E8J60j47L4j00PJ28j20r9P1j10K80k78J71k72M08K24m41K2q4O6p0J25P4m42
2603c35J69K99m8K71k84j98K22r3P5j71J39r4J77k97NJ01K99n18J11K16j71j29
2625b54N7K54q8J7N5l9j71J61PO7J8j85P5j67K80q1q0J26j29j51M46k35N5R8l8
2650I8n7O6K1r7j03nJ7K87l33m9J53L8M3mMj82J80N2m1j84n1J28K4P5K8k46N6
2677h2K51j45q7J3L06l51oP1J12j48K17j10J32j40k09L04o7j0Pk72L25j59K60
2700B12j45o5O0j40J83k41P0K11M2k34r2j09L05r8N4j0K33j72j66RK04j95J39
$$ y = [58, 131, 32, -69, 23, 8, 157, 24, -102, -176, -171, 179, 138, -319, -90, 69, 169, -120, -117, -95, -131, 15, -123, 76, -168, -61, 232, -151, 50, -41, -118, -151, 205, -156, -122, -150, -112, 188, -207, 37, -202, 182, 118, -79, -245, -49, 58, 218, 71, 105, 5, 12, 140, 20, -79, -8, -118, 162, -116, 55, -217, 191, 415, -26, -4, -88, -22, -92, 33, 107, -335, -166, 133, 85, 356, 72, -126, 96, 3, 78, -93, 46, -48, 129, -168, -163, -62, 237, -281, -170, 46, -125, -254, -197, 57, -31, -14, 41, 2, -169, -8, -1, 66, 84, -101, -26, -193, 87, 6, -74, 52, -77, -228, 218, -17, 38, 136, 98, 41, 107, 128, 31, -72, -77, -60, 227, -106, -155, -2, 36, 79, 75, 79, -103, 77, 129, 88, -96, -147, -19, 5, 80, 108, -138, -82, 169, 24, -63, -50, 256, -95, -101, -30, 82, -66, 151, 41, 173, 33, -176, 128, 61, 51, 58, -214, 111, -48, 212, 67, 2, 62, -78, 105, -136, -66, 145, 187, -47, -139, -248, 57, -41, 13, 3, 236, 64, -102, -93, 111, -84, 55]
2723E5M6k79J82j30J42k22K80Rl85K38J50L7j12k8L0j73M09l69K2j6m5J17K37
2746A95j53o1n4K31r7n1q1J21j52kn6J92K5l2J29l0k58J73L5L59m21p2L5K2K23
2771B20l98J91O4j42K02m7P7r3j91J25J49k22K1R1n3j51J06K55j00k09K48j26
2793A7j07r2J15KN8L9J10j17k8K47j38n8NM5j49j27L4P6J7o4J51n5K15j78J63
2818A81k77R5l3k9j09L98l3k63M3J84l06lK58k15J84L9m4j20J19l12N9J83R6q
2842H7k54J1K59p1o4M3n1k3R7l8j60L36k32J64l77K82o3J3j01J09n9j39K75k06
2866a62J61o0J20P0k90J9P2j14K88j5l99M51j54O1l5n1K12k26q4lK76k63K39k18
2890a05K34j49k6j53J46J15J96k26Q3n2o2P5k78N12k87J49j98J16r5Q3l9j00o0
$$ y = [55, 101, -178, 4, -126, 16, -206, 74, 83, -302, -64, 86, 123, 11, -17, 13, -160, 249, -120, -98, -114, -159, -42, 195, 42, -19, -73, 158, 61, 10, -71, 50, -102, -104, -160, 32, 57, 25, 154, 124, -134, 39, 74, 433, 12, -60, -25, -3, 220, -178, 13, 77, -65, 137, 90, 167, 74, -117, 8, 157, -65, -44, 47, -6, -157, -51, 204, 104, -105, 143, 17, -90, -182, -67, -65, -7, 32, 142, 25, -3, 244, 106, 48, 53, 98, -51, -178, -144, -68, -51, -115, 36, -19, 196, 18, 181, -96, -1, -34, -63, -172, 226, 193, -70, -27, 157, -149, -152, 106, -109, 75, 114, 70, -50, 69, -243, -184, -1, 95, 87, -167, -156, 103, 32, -32, 11, -40, -63, 34, -4, -164, 172, -60, 104, -273, 9, -54, -41, -142, -33, -92, -231, 44, -162, -1, -61, 59, 129, -161, -142, -70, -184, 104, 89, -310, 141, -13, 48, 13, -38, 174, -52, -136, -139, 137, -126, 113, -105, 129, -20, -46, -199, -53, 62, 258, 32, 115, 63, 1, 76, -202, 310, 23, 172, -26, 90, -5, 78, 39, -61, -121]
2913a21J31k72J02Q2N6K4K2Lk51J17N9J23k02K41j54L2j30J18N4J75k79m7K26
2936A09j37J3o5J71l1O5j71K14k2l50L89k13l7K41k38r6J94n8J0J55R2l0k27K8
2960FJ0J74l91J95P8k38K57j45J55J79m07K83j34j34J73l2j75L01j68l6J26j5
2982F2j12j0q6K50j62K35k52lP9k5K78j87n8l1j01K01j04Ok5j5J39l13J03J24
3006go0oK42j53k0M9k64K15J60j97j03J13L66m88J86K1q0R3p5J00O1p8J17lj47
3031D2M4q9J04k22M13j82L5Q6j05q7j08K05j39L0J4k4P0j30kl0M3K78m84j03J83
3056a58K09l9K9r9j15R8R7J27j06q0k32L47j39O8j18R0R3r1K83m62P5M1%m9K5
3081a06p1K15p2l9J76j1R7M6k34lr0K13K3k27jQ5p3M7j25L18k56j03K25k6L19
$$ y = [-121, 10, -262, -160, -78, -22, 2, 24, 27, -224, -107, -48, 75, -127, 114, -40, -8, -138, -20, 34, 209, -70, -117, 109, -28, -15, -80, 91, 60, 125, -46, 168, 146, -204, 185, -28, -65, 176, -62, -158, 36, -22, -12, 143, 235, 205, -22, 6, 16, 190, -201, -6, 72, -166, 91, -54, 101, 280, -127, 156, 22, -112, 61, 29, -146, 155, -13, -49, 77, 62, -50, -60, -146, 104, -58, 177, -75, -78, 1, -24, 254, 67, 9, -22, -123, 78, -26, -20, -45, -60, 79, -234, -131, -7, -67, -73, 169, 16, -4, 45, -219, -4, 156, -41, -144, -31, 335, -153, 33, 54, -26, 67, -8, 92, 153, 75, 192, 189, 42, 86, -3, 101, -121, 292, 110, 145, 231, 126, 39, -69, 136, -3, 27, 41, 17, 87, -43, -45, -75, -32, 246, -238, -341, -158, 51, 12, 41, -58, -173, -75, 22, 149, 43, -37, -269, 78, -61, 7, -111, -21, 72, -19, 264, -198, -123, -82, -82, -131, -106, -177, 38, -34, -73, 103, 92, 189, 235, 1, -2, -92, 121, 144, -83, -84, 1, -72, -25, -150, 168, -88, -191, 34, 8, 327]
3106C27j64j22J6K77l40r6J89k7J00k72J09k73J03J77J14J27k34J88k3k40j61
3127b25N50k11j46J89j80J18j31k00O3J38N9j31J43K4K41m00k2K32k70K8R1j30
3149a70K82j71k7J8K12J6l11N0j95K75j74OL24J35j43k15R8Q3j01j44J14j34J
3172a71K66R8l04q2L55l54K89k32K41p7r0J86j93J74k7k3j21J75m4J08l96K56
3194C4j49K76r2L1P2j92q1J14K09j85j5J1r6J45N7r5j56K32J01k10j48j56L16
3217B3J45k17j75l0K65o6p3J62j88l0J01J7J75j02L5j99rJ31L81l35p2M1K44j52
3241G2P7l97L81k61L94k93k8J44J2m8j4q2q9K27j85K52l28N5J55l70K16N1N7o8
3265g0M36n98L3r6L76k81L87j28j72M81m80K67q0l26J43M64q0l66Rj59L59k51
$$ y = [327, 163, 41, 57, 334, -6, -102, 87, 60, 160, -112, -3, -276, -173, 4, 118, 245, 11, 199, 176, -64, -225, 325, 114, -32, 157, -23, 95, -36, -236, -173, -35, 24, -107, 36, 60, 301, -99, -121, 111, -159, -131, -40, -170, 112, -59, -86, -68, 144, 160, -151, -101, -296, -21, -195, -189, 135, 270, 127, -88, 10, 93, -8, -152, -38, -172, -171, 95, 193, -111, -193, 162, -192, 97, -135, 106, 29, -61, 125, -68, 106, 79, 56, -65, 110, 66, 174, -222, 34, -115, 161, 69, 100, 172, -20, -101, 13, 222, 37, 22, 33, -63, 82, 139, 44, -112, 120, 221, 11, -137, -293, 23, 168, -49, -224, -254, 11, -55, -128, 34, -154, -184, -83, -66, 109, 7, 42, -157, -166, -35, 346, 11, -61, -20, 224, 72, 149, -248, 133, -128, 266, -27, -55, 89, 101, 53, 39, -43, -132, 95, -90, 162, -166, -111, 44, -326, -110, -59, -2, -70, 366, -232, -199, -295, 81, -200, 187, 59, -113, 368, -112, 155, 75, -251, -108, 356, 276, -90, -81, -240, 119, -132]
3287a32K36P9k78J23J29m9j49k11J1J23l3J31K49j82J29l8j99r1K85p3J40k07
3309go5l1K97m8J5p9l23J47J91p6P7l2K6J6j64J71p6Q3J73l03j33j30J11M10j05
3334A45l6j63j8P5o3L6q3pK83L0k05j22J20J25j09K7l49L39j28J54L7k29J83P6
3358A18qpj30J7J81k64K55j17j15J87M2j16k89K54L8q3O2P2%j4k24L0n2J50N9
3383D6n9j43J95N2k11K67p1r9r7n6J08J54Q7k54M8P1J14j65j26%L03j27j90J43
3407a0J11j51M7m8J54j32K31K4k6j98J65k04J80j29jj28J33K16k98N0p2L3J41
3430H8J24j90j13O2Jj21J10l42J59lK28L46k84m8j73O1P3j50rJ15KRM3oo0j92
3456b70M95j7m46J63M4p4N7J34o7P8r0j41K76k81qL87k49j66L44o9k0J67k81K34
$$ y = [-132, 104, 183, -95, 28, 157, 108, -41, -252, -241, -118, -151, -20, 229, 47, 176, 138, -61, -152, 133, 60, 200, -7, -72, -103, 194, 146, 161, 82, -241, -94, 97, 21, 98, 66, 92, 108, -56, 115, 39, 122, 295, -8, -141, -271, -160, 250, 145, 109, -54, -72, 3, -60, -24, -107, -114, 169, 199, -6, -128, -8, 117, 8, 35, -314, 25, -103, 51, 88, -141, 42, 118, 110, 103, -27, -10, 171, -93, 162, 45, -70, 117, 159, 43, -246, 8, 46, -37, 25, 97, 97, 83, -141, -111, -163, -13, 46, -13, -156, 39, 91, -120, 147, 76, -23, -120, -176, -68, 86, 173, -81, -33, 38, 152, -13, -139, -139, 164, 37, -153, -10, 101, -50, -3, -51, 103, -29, 202, 226, 200, 2, 167, -37, 143, 14, 13, -115, 18, 234, -64, -14, -86, -53, 88, 212, 22, -91, -29, -28, -149, -39, -381, -222, -225, 3, 349, 65, 17, -156, -95, -22, -172, -181, -66, -64, -55, -12, -18, -78, -270, 225, 208, -238, -75, -31, -105, -48, 86, 19, 97, 7, -134, 142, -139, -147, 240, -9, -175, 169, 100, 80, 247, -34, 200]
3480B00j93k6J18M9p5o0j9J08N5k76j5j7K43o1j10o7L35j38o0L22l79n5M3L33
3504B55l29K7J41o6jj89L5K33l13K19l9M3j09J50k8J46j21k86K12K93l44J04Q8
3527A21j55J14k6K7Q0j86r7J73j87K26k09N59m92mq9J16J76k61R2M9o3k6L42o8
3551B12m26R9J41j08J47j57J45mPM30n02L8j12K08j23J51k02J74j6j22R9P1k14
3574f4N55j54m03n5Lj27N32l06k98J28J90J44k32J09j57nj20M67j33l38J85l4
3596a13J18Lk57J14K26K21l48K1M0P6Pj56k11K26J03J12k07j63J60K5Q9n1lJ43
3620A75j55q0m6J47K6k4K2q6j85J89J35j58J30k31O1j31J91L15n3l82RK94j67
3643dK97j15j91k18M32k24Q4q1k14J75p3j1J84j56J07l6o3J83m4p9R2K1k00p4
$$ y = [200, 7, -19, 99, 148, 73, 13, -6, 102, 157, -119, -134, -151, 92, 31, -79, -146, 189, 51, -9, 313, -66, -121, -78, 255, -74, -47, 94, 28, 27, -162, -127, 106, -207, 12, -27, 16, -93, 57, 29, 175, 54, -232, -20, 273, -71, 33, 121, -34, 80, 54, 81, 161, -25, -122, 51, -136, 90, -119, 440, -52, -56, -145, -29, 147, -114, -22, 27, -36, -62, 280, 212, -214, -115, 26, -82, 65, -92, 53, 49, 56, 486, -16, 22, -90, 118, -5, 146, -56, 118, 102, -20, 79, 150, -64, 491, 337, -66, -121, -118, -245, 287, -19, -317, -189, 1, 145, -87, 22, -135, -140, -260, 207, 74, -264, -79, -113, 5, 8, -249, -135, 91, 312, -36, -15, 25, 101, 108, -48, -259, -33, 70, 182, -25, -188, -28, -3, 86, 35, 32, 175, 20, -60, -106, 41, 67, 43, 65, -21, -206, -17, 118, -40, 90, -141, -80, -211, -20, 295, 242, -140, -131, 163, -4, 293, 178, -13, -231, 201, -23, 61, -20, -234, -59, -132, -143, 41, -115, -8, -44, -107, 76, 32, -47, 45, 66, -134, -208]
3667b08j13M13M3rl76M8P5K7J28K00rj37j17j1J7j00K4nJ3L8J14j30K06j58J90
3692A63l63K73k13K98r4k88L91n3Kj46j05J62o5J26Q8m94K45J53m2k5j50J55P8
3715I6j01J02j26L8K29j64j21mj13L22l6j34Q6l8m2L2J98j55j06j24L91K0m22
3738a72L27k31L72j56j18j65k08O55k70J24k47L8r1nJ44j58m4J33J20k26M3j92
3760c27K73J48p0o8K47j60m4J24P6J9l15K41k76K53l23P4K28qJ65k13J05r0J00
3783A59n9k90K53j37N07m73K38j86j23J23Q1l29L17k60K56o0MR2l28J57K66j46
3805F2k16J22j3J77r5k86J73K4K36l49K19o0K0J14o7j25r6M9K57j8l16j0K20P0
3829I2q1J86l99M04m44L73l59Q4R2Lp6J34m6N1J58j5m58J16k9K30n9J58n4r5l3
$$ y = [-208, -321, 92, 135, 126, -250, -202, -127, -100, 28, 228, 219, 82, -35, -46, -29, -129, -105, -110, -97, -59, 55, -75, 131, -27, 163, -200, 73, -140, 158, 64, -224, 167, 114, 116, -30, -135, 27, -38, 88, 176, -318, -73, 80, 38, 13, -137, 18, 96, -5, 97, -29, 9, 238, 74, -47, -51, -164, 158, 122, -12, 74, 36, -6, 26, 224, 69, -37, -161, 230, 250, -172, 155, -76, 296, 140, 22, -143, -351, 304, 34, 158, -89, -51, -142, -147, -3, -161, -205, -72, 48, -178, -135, -327, -54, 94, 24, -44, 203, 43, -1, 123, 199, 218, -97, 144, -132, 121, -202, -128, 100, 92, 257, 44, 149, 59, 159, 100, -190, 63, -74, 433, -40, 198, 12, -111, 12, 93, -236, 81, -179, 77, 17, 21, 113, -215, -58, 208, 62, -154, -32, -45, 132, 37, -249, -76, -52, 184, -165, 54, -6, 14, 128, 61, -64, -160, -111, 146, 128, -188, -198, 22, 92, 11, 197, -202, 202, -242, 131, -228, -144, -52, -49, -125, 9, -37, 14, 172, 157, -301, -185, -214, 16, -43, 115, 61, -34, -67]
3854f7J04m5J4J42k29J33j00K38j96O7Q9J28k12k24P9M7NL3j13m9J02O67n82p7
3878d6j50O8j51N61l62R4Q1k41P5o8K7o6N6J46l5KP3j32J97k28J23j14j41J82
3902d9J16l26J30N0J39p9j15N9J18J0j93J59j56P9O7J05j05j10J04k0n9J8k4Q7
3926Ej4N9N3J20m09L67r4Qk5J8l8K16k58O6k04L6J68o4J68K4m03L31k25L07l3
3951A79k70L44l9j96m3J26N9j45qj23q1R6K24j83J88k59RJ03j1Mj49K10mq1J96
3976A46k97P6L9J88q0l90J21K06J11q2k75j55M36J68l44QJ23K89k09Q7p2l15J41
3999h0J95R2J55k77L9k03L6K88m25J19J79q0k66K98j77L22j00k7q4q2K00oj21
4022eJ26j03m4O1q7J15k95J38L68l14J16p5j81k7K26j09p4M7j19J82J52o44M72
$$ y = [-67, 37, -8, 6, 148, -81, 52, -48, 190, -6, 61, 150, 278, 66, -158, -79, -32, -27, 6, -107, -156, -54, 613, 31, -46, -196, -128, -279, 282, -80, 14, 95, -146, -71, -139, -112, -178, -122, 24, -11, -9, 64, -68, 129, -99, 24, -90, -231, -49, 67, -259, -129, -79, 60, -19, -134, -75, 43, 53, -140, 19, -137, -58, 9, 114, 9, -101, 3, -17, -76, -58, -82, 5, -9, 50, 103, 223, -186, 181, 87, 95, 70, 88, 50, 266, 8, 74, -130, -94, 74, 10, 178, 202, -201, 130, -95, 212, 179, -91, 253, 214, 18, -25, 101, 160, 15, 7, -116, -197, -101, 123, -60, 128, -131, -122, -19, -30, -26, -175, 35, 31, -50, 146, -151, -75, -36, 152, 72, -318, -197, 9, 120, 38, -237, -392, 44, 212, -132, -124, -1, 288, 79, 166, 94, -221, -80, 115, 207, 362, 85, 124, -79, -43, 245, -180, -61, 118, 38, -228, 70, -107, 215, 115, 88, 4, -78, 122, 116, -5, 121, 18, -26, 35, -52, 63, -232, -94, 274, -40, 76, 1, -180, -207, 19, -90, -164, -117, -236, -54, 98, -546, -74]
4045g4J29kJ0k54L1P9K45r5L8l76K38j0K5k8j84K3K17j26L8l1L59k82P4k29J41
4070d4r3K84J56k90l2k4K15j38L07l96R7L5P6q8J85j66j08J22q5K32l13MnO3L5
4095B9j44J03K57l37Q7j29M2J15P2K6j63m5K16k30L43M6m47l8K43P7k14pPJ27
4119C6j23q4R6j48J39R3O9l60O9K24J10n6k12Q8j97M16j59j48J85l4KK42r9k14
4143f5J89j74J95o7k28R7n5P3Q1R9j60K42l35J27k5O2L86n49O9P4M0J9O7J16n9
4168B19l49L28Jl0l00r1K74j29M39m79MK2J17l6p6K14j03nJ06k88J82l09O05j91
4192A25k33N6K6r8L85k52Mk45Q6J64j24R7k81M23K36l42J55l84L12l53M20j66
4214A1J79k54mk7J31J1k37J41j32L18k71J5L39k45N7K21j06o6J40K3l04o7Q9L67
$$ y = [-74, 55, 53, 63, -191, -160, -81, 164, 69, 107, -269, -31, -41, -16, -44, -228, -205, 12, -114, -76, -107, 252, -30, 44, -185, -44, -137, 147, 303, 13, -19, -43, 172, 34, 341, -55, 42, 77, 153, 65, 250, 84, -24, 98, 13, 245, -68, -64, -69, -6, 29, -115, -12, 245, -92, -5, -134, -92, 23, 95, 121, -42, -87, 129, -101, 242, 288, -159, -197, 46, 123, -91, -98, -91, 36, -87, -171, -75, -223, -84, 9, 78, -282, -213, 11, 121, 65, -147, -59, -256, 160, 1, -147, 38, 4, 6, 248, 149, -65, 124, -50, 145, 78, -150, -53, -108, -35, 46, 145, -15, 227, -108, 19, -6, 56, 442, -107, -38, 36, 76, 95, 162, 278, 219, -130, 198, 199, 169, -131, -222, 52, -77, 362, -117, -113, -91, 26, -10, -86, 128, 25, 20, 126, -162, 20, -289, 316, 125, -108, -52, -26, -124, 261, 9, 13, -232, -146, 18, -106, -9, -290, 133, 369, 27, 182, -202, 110, -243, 177, 11, 190, -64, -68, -95, 36, 47, -190, -49, -181, 137, -134, -119, 220, -25, 32, 253, 147, 81, 221, 244, -60, -127, -38, 329]
4238C29k06L2j85j16K62P4j53J66l55J1J85m0Q2j83P6K13k1k58K45j57J62j7j96
4261e0l75L46L5J06j55k2J09l40N26k80M3j3j68K32m0l5J02Q8RJ27m77K67j21
4284h6N2L94o40J90k67M92l09j4J38mK99l05J83k94J40j31L83l26J46j98L51k39
4306d5j27K42j17P6J99J17k74k8M6l7j86j8j18J75J73j87M9j9J45J39r5k39L2
4329i7J80K5j57j73J54KJ82rq1k13L53j14n6oj01J91N2n1O6J04l91p0L05M9j92
4354d8n6J52j98J47P5l51K1Q9L08j88p1l0J01k1L35n69L91j34K75k97J43o9j34
4377a29J45J54O2r8j74L59j64k42K16j85K56k61J45p2K40l07K62j61Pq4J2J33
4399A14l86K50J2j07K45Q8j18Q9r2k8r1M3L4J43l11J46J23k10K73l38P2k1j72
$$ y = [329, 123, 155, -30, -146, 116, 190, 37, 203, -152, -141, 44, 4, 86, -97, -21, 192, 171, -87, 158, 1, 163, 146, -50, -425, -79, -44, 62, -93, -115, -6, -346, 180, -100, -57, -70, -238, -6, -46, -81, 21, 109, 118, 245, -232, 35, -86, -34, 360, -280, -90, -357, 135, -174, -188, -50, -54, 245, -60, 123, -171, -31, -162, 221, -105, 41, -157, 194, -45, -172, 70, -47, 29, 228, 345, 71, 43, 89, 52, -134, -152, -270, -95, 78, -109, -60, -79, 66, 205, 110, -129, -97, 83, 108, -49, -222, -68, -66, 116, 107, 26, -187, 166, 52, -4, -10, -111, 80, 132, 81, 147, 251, -140, -210, 95, 144, -48, -104, 48, -150, -3, 72, -279, -258, -169, 139, -49, -120, -150, -49, -70, 265, -304, 87, -47, 228, -69, 74, 5, -129, 16, 170, 232, 134, -40, 319, 155, -87, 129, -56, 200, -61, 84, 12, 252, -55, 207, 46, 53, -31, -19, 114, -272, -22, -10, -117, 128, 216, 98, 187, 95, 67, -24, 19, 53, 196, -115, 31, 154, -56, 217, -121, -49, -70, -242]
4422b42L02k50K20J01p0k22J81L2L0j51Q4M0k37K73N4j50p7L70m01m7J09k3J18
4445D4J23l76K99K8Q6j52k86m1K35j43J73J3r3j4M17l37K28j39k12J99J26j05
4467G3o9J35n6q7L23k82j51J73j98L17j50L9k39L23jj44j4K3K0N0R0k17O6J21
4491A45M5k10p9l6J53K8Qk65P7rL8m8J06j01j00L48N6j93l30j0L75N5j96M6J4
4516h3J54k04p5K82q0j13K67l9J9kk3j62k3R7k38J91J47j60j94K65j00K0j7K50
4540A79j44k4j34J34J71l26K31j78J0K19k41K76k02K6J57k97J04J07l8j51J62
4561D1N5R6k17R8k72K81k71K90j32R0k36J20J78k91R2MJ1N3k2P2J86l23K79k57
4585g5J26p6Rl3J70j4k19OOJ00P8k52L68q1p2K06l4l74J32J46k08n2j5J01RK11
$$ y = [-242, 60, -190, 30, 131, 61, -161, 20, 52, 82, -69, 15, 55, -182, 91, 145, -5, -82, 288, -113, -160, -51, -74, 44, 167, -209, 90, 118, 204, 52, -234, -275, -40, -183, -10, 3, -90, -104, 313, -24, 204, 65, -147, 52, 178, 73, 4, 139, 83, -4, 319, 37, -114, 59, -139, 178, 28, 67, -172, 151, 150, 6, -8, 15, 35, 85, 175, -42, 24, 145, 190, -20, -99, -135, 18, 46, 54, -211, -134, -143, -105, -153, -47, -148, -248, 100, 156, -37, -367, -377, -2, 53, -143, -97, -83, 71, -133, -208, 74, -6, -119, 148, 109, 128, 126, 103, -59, -82, 15, -223, -32, 115, -45, -239, 26, -74, -54, -71, 179, 35, 11, -123, 11, 182, -144, 87, -91, -81, 138, -103, 173, -29, -3, 154, -143, -39, 68, 30, -121, 41, 96, 192, -25, 73, -199, 82, -189, 101, -31, 59, -177, -57, 121, -170, -78, -74, -63, -10, -32, 40, 226, -97, 182, -75, 51, -25, -16, -49, 121, 107, -112, -106, -100, 0, 78, -174, 194, 113, 41, 247, 213, -161, -29, 117, -91, -143, -158, -57, -48, 163]
4611A63o5j47R8j33J53r4J56q3n1J90j07k15L1j5L18o2j43j1j43K16j52J1N6j60
4635a89P0J26K93j69k26J22P0j61J20j65nO4J3M3j11J44oL9J2r0l5p9j4o3Q9R7
4661a1J11j50M32k10l02K50N1k42q2L68k38J49%j70j01j19N27k61j40K00O8j59
4683b9J34k4j96J16J8p4l08L45K1J34J13l45K79j92rj26o5J94l1j23MK84j22K5
4707B3m0J04k6q2o4K1p5J78J82k28j5J6M4Q9j49m58L81J44k97K88j34J6pK6k09
4732b72J51N5J93j4q9L5o0j02M3L4j74L44j17J23j41o1J38k04j73K93j7J92k10
4755c3J38o5O3k20O8L81m58K26j7M8k08J77R2k20L8Or8kJ98k71J37J90j9j31j0
4780A0k6J26l12M08m15J37J09J67j38q2J49N8l36J6jJ65k24K61J55l39L33qk00
$$ y = [163, 98, -49, 49, -84, 69, -25, 131, 48, -3, 187, 80, -135, -104, -119, 199, 137, -6, -17, -160, 56, -96, -85, -29, -189, -119, 7, 300, 131, -95, 27, 97, -64, 56, -109, -114, -50, -37, 6, -105, 39, 33, 72, 84, -6, -41, -120, -134, -197, -108, -11, 100, -50, 382, 172, -130, 120, 171, -71, -153, 215, -23, 126, 126, -44, -145, -264, 263, 2, -138, 62, 130, -29, 105, 81, -115, 1, 19, -55, -363, -18, 3, 137, 250, -95, 184, -8, -17, -143, -208, -14, -45, -168, -164, 120, -2, 23, -17, 87, 61, -21, -85, -64, -139, 39, 221, -7, -22, -6, 38, 127, -22, -480, -99, 45, -252, 36, -98, -82, -89, -63, -272, -121, -66, 127, 113, 24, 59, -1, -103, -60, -26, -200, 144, 27, 150, 9, -52, 86, -118, -291, 2, -15, 177, -33, 105, 40, 103, -117, -49, 332, -126, 100, 83, 131, -77, 100, 192, -28, 10, 16, -82, -84, 114, -157, -20, 170, 151, 20, 10, -16, 110, -202, 206, -209, -72, 37, 204, 66, -16, 133, 191, -145, -129, -130, 35, -189, 72, 227, -112, 221, 213, 13]
4803A3k47J18J39K1j15K10l27K72j36J35j45j78J25k21P12k83j84M2J8K60k35
4824fJ29J7L6qn8k50J47N4k00K1J24n8L5Q9J6J62k77j20J89pK01l19K54J4l89
4849b04J41J82O5k65k7P7Oj15K04k24J81L25l29L3p2J50M3m1q6k33L72j64j41
4872a22K06j26K45l60J20n4M1K66k50j27nJ86M0k50J97J60l1l03L88k49m1K0k9
4895g8L10r3j45j1K18k45J38k44K62j54q8K74j4l1o5m0l1j5O1j56J77J02Lk84
4919a49q7N00l31K17j24Q2j67J47k8j99N9j05K36K6p5k39P3m7J31J13j17P5J04
4942I5k0R7P7k11o9P5k9j78N4n4L23j51J2m3Q8M3j21L8mk42L05j2o9j19R8l5J36
4969H4J6k15Q8K41l09j4J03k8P0J14q4j50J24J11r4k93K20m7J11o9k33K74k3J52
$$ y = [13, -234, -116, 23, 44, -71, 139, -188, 84, -52, 83, -62, -240, -115, -336, 376, 93, -91, -49, -31, 229, -6, 123, 140, 176, 168, 110, -140, 7, 61, -139, -118, 6, -52, -17, 72, 88, 250, -27, -147, 42, 35, 236, -83, 171, 185, -204, -63, 119, 184, -81, -108, -31, -25, -140, 64, -160, 21, 346, 17, 50, -22, 128, 171, 130, 44, -189, 183, 19, -122, 84, -42, 203, -157, -37, -91, -50, 216, -34, -161, -166, 20, 60, -190, 7, 167, 136, -167, 221, -28, -69, -49, -78, 232, 139, -6, -17, 201, -44, 94, -150, 112, -42, -130, 144, 130, 99, 34, -6, -37, -52, 9, -147, 30, 132, 135, -149, -236, 264, -67, 150, 26, 108, -59, 88, 60, -139, -80, -185, 51, 77, 2, -237, -164, -211, -80, 33, -84, -9, 95, 75, 172, 249, 38, -31, 44, 15, -163, -109, -163, 160, 9, 21, -22, 66, 109, -12, 26, 22, -220, 85, 73, 4, -115, -17, -52, 84, 100, -115, -27, 214, -95, -109, -6, -34, 36, 150, 66, -84, 40, 151, 57, -236, -16, -63, 48, -21, -254, 20, -3, 149]
4993A49k11J60j47J40r2l2J91k84J90l3J35j86K6k66R6L0J87j80O9R1R5K0m32
5016b84K01j21J43K9K5J01o2k13j8J88J40j02J7l8P1n2Q8j66J83jL0l03K79k17
5040h2M7L3j13J71l6R6j05j79K38M7j12J47k51J43M9O5l6l13K95L8q0O3k22N7
5064d0P8M0P9j59l1j26K30l9k02R0N8n2N6n5j69J8N8K38k12J33r7J01l8K7j68
5089a82R1M7O0L8k8q3j25R4N7j49K47N4k87L88k35r7K47K5%k32l0k28J41O1J03
5114b3J50j41m8K69m04N6o4J10L7M3J30j43R0j72K07k50J44p6K90j60j61KkJ92
5138G6k75L44NJ91l08m6L3l9K8J26j37J21o5j30L11l52J27J74M3l12K55j43J45
5161A72k74L2K93n58N25m49J6L36J11k65qP5K09j30m3J27l22R2k3K36k89J78l3
$$ y = [149, -62, 98, -49, 91, -1, -33, 158, -126, 64, 31, 166, -20, 6, -260, -164, -134, 53, -127, -58, 33, 128, 148, -284, -83, -204, -61, -32, -7, 94, 32, -181, -199, -11, 129, 27, 44, 6, 77, 25, 113, -53, 130, 129, 159, -144, 135, -82, -35, -2, -115, 56, 20, 116, 11, -168, 70, 117, 5, 152, -99, 44, 93, 158, 122, -191, 104, 142, 62, 125, -97, -40, 38, 78, 157, -2, -33, -159, 71, 32, -170, -80, -22, -74, -18, -73, -242, -224, -166, 72, -140, -7, -104, -3, -41, -14, -182, -91, -44, 16, 54, 26, -57, -182, -88, -31, -180, 67, 121, -166, 222, -13, -110, 137, 162, 162, -70, -100, -328, -187, -126, -23, 127, -14, -62, 207, -197, -141, -205, -95, -58, -15, 115, -28, 62, -110, 97, -153, -9, -85, 205, 45, -116, -114, -116, 76, -199, 145, 150, 341, 33, -13, 20, -19, 9, 135, -2, 119, 54, -76, 235, -117, 10, 184, 227, -85, 170, 27, 172, -102, -70, 223, -335, 190, -259, -243, 93, 204, -61, -69, 6, 215, 85, 42, 169, -153, -61, -84, 152, -137, 41, 8]
5184HM0k94M68k77jK69j79k62J74J96j2j48k09K75j81M14k54j67L8j6K05q8j24
5207a25k3K67n1J44m05L73k62oQ1K16p5k46p1Q0K05k71K10p2l8K28j30j2Q4J9
5231A20l08J45O5J06mj79K31k30J39o1J09r2K36l39J0K01l34K93m3o1l0K36j83
5254B7j36l0M63m56J24j3m0l9M6o9J70L7jk34K32R5j90L5K4M3m7l87P0L12j1J12
5280A37j70o7L06j88L7k29L02j38J78k3j2J92n05K46O5Jn6k40K36l2j56J20J62
5303A66j34o7K09j83m2j27J24N7rr1J34O4r2j86K08p5R8k27K19k76M29k43j18
5326a62K46l36J73J75j12q9J8P8M2O7j87l6%K8J89j10P0j68J41j3K03k73%J11
5350E5j51Q3kj8QK04j55k20J24J27J2J40m7j75N5M5j46J07j41J26J99j40j11O2
$$ y = [8, 48, -246, 222, -55, -56, 213, 34, -228, -54, 142, 130, -18, -227, 48, -133, 281, 27, -140, -102, -118, 87, -1, -125, -148, 119, 68, 212, -193, 180, -82, -88, -7, 209, 134, -112, -183, -103, 102, -169, 41, -31, -69, 159, 29, 17, 101, 120, -188, -43, 22, 128, 124, -55, 176, -54, 85, 24, 133, 41, 277, -62, -52, 149, -185, 108, 65, 4, -26, 210, 27, -109, -139, 324, -132, -8, -21, -61, -100, -54, -123, 47, 84, 83, -151, 81, 176, -14, 21, 45, 88, 41, -346, -276, 36, 25, 137, -33, -100, 206, 18, 55, -174, 128, -10, 168, 145, 133, 325, -180, 66, 131, 132, 76, -164, 72, 40, -116, 4, 166, 32, -35, 174, -9, -51, -178, -54, 3, -6, -97, 37, 101, 9, -177, 31, -44, 54, -173, 46, -230, 199, -44, -162, 84, -252, -79, 96, -16, -105, -87, -9, 33, 100, -87, -123, -123, -95, 94, -16, 54, -114, 27, 14, 217, -56, -56, 55, -96, -13, -15, -33, -25, 179, 24, -196, -72, 55, 67, 207, 160, -15, 40, 85, -61, 46, -95, 31, 230, 90, -21, 41]
5374D1l02L21J88m6j33pj53j35L27k84K26Lo4j55J80K4P0k0J91l65K44j4O6l79
5398a76KK40O4j28J24l7j96L31l64K62L9j93j46K42o5Q8j70K31j6k1k19J79m9
5421B2l87L36J20J0m19K38j8j20L19Mk17j33K35J23j50o6j18L32J37m40K22n0
5443b0N8r6J80k46M00n70K69j84K30j62R2N7j58K37k41M52k24Q5l99N00k47k62
5465b49L76qj68Q9r3J84o7m0k84Q0K13j75J48Q7q0j40L7j53K29L36l69J0j76j2
5489b25L21j48L34m71K25pq6n6J10J5K97k74K8Q7j19n6JJ35r6Q0j88P8j43L74
5513B16k16O0k30K67j34n7L24k11j87J27N8jL39k61J8k18K86j15o9Qj00J62j85
5536a19l7K09r6m2j2R4k00l4J82q0J90k33O6J04K44j73l3nn1j34mM08R3n72L45
$$ y = [41, -261, 60, 248, 202, 69, 62, -91, -226, 101, -183, 43, 46, -18, -173, 7, 31, 101, 81, 272, -93, 151, 137, 203, -176, -174, 66, 130, 2, 126, 89, -107, 224, -140, 122, 161, -32, -178, 64, -1, 87, -83, 148, 132, 111, -108, 71, 22, -365, -29, 91, 101, -318, -80, -98, -218, 101, 105, -112, -245, -10, 113, -37, -103, -221, 111, 248, -192, 30, -20, 38, -58, 122, -124, 276, -294, -25, -209, 21, -141, -49, 8, -150, 87, -154, 298, 74, 159, -240, 260, 13, -249, 127, 119, -49, 40, -53, 131, 64, 24, -260, -180, 33, -142, 6, 93, 13, -127, -90, -243, -14, 322, -47, -37, -213, -225, 96, -52, 282, -189, 36, 29, -57, -113, -3, 12, 309, 35, 63, 150, 31, -25, -24, 111, 15, 95, -93, -15, -158, 216, 0, 60, -170, 97, -37, -94, 230, 19, -168, -41, 17, 16, 355, 94, 112, -106, 180, 65, -4, 4, -96, 66, -119, -156, 53, -43, -85, -97, -3, -203, -237, -55, -135, 55, -178, -112, -8, 236, 63, 30, 25, -26, -160, -164, 244, 337, -235, 110]
5561A10pk85J37j15o6M52n7j82N3J46K0k48N8K56m17J50J21k50O6J48j03K12n1
5584A48m15RK75P2o4j95J49J63j1j91J28j40J07r6M4M3j93R4N0J6o2P7J8k41L18
5609A03J01Ml96P8K13j35p2k7m6J99R2l2j19r7j05L91n6k60J34k6JO5L7p3r6k4
5635a46L11k65L08n08N94k58O2k2j61P5J1J13j59K50P6Nj58j37J8P0j26J87j80
5658d0J3k4Q9N6j6k09J13J33jl24K40Q4q2l8L4r7K6J12J40q6J04l13J75k71j11
5683b93L41M1j69J20M6j42lj23J68kJ66l97L26n1p2J36j03P9j9o8p1m1R3j1J91
5708A42Jj10p5J82r4l0k21qK84R9k90MK28k25N4N1J50M2k83n3J79j76K97l0k44
5733a26J56J03l36J72q3J66j37K3J30j88K46Pq3r0J15j15J01k86l2J63K19p3j10
$$ y = [110, 103, -182, -45, -160, -226, 226, 169, -13, 40, 186, 206, -42, 16, 272, -145, 5, 126, -124, -58, 90, -13, 199, 148, -267, -258, 17, 89, 25, -170, -21, 142, 131, -60, 68, -72, 35, -61, -17, 26, -167, -73, -23, -7, -69, 8, 26, -215, 103, 204, 208, -188, -110, 103, -32, -104, -131, -177, 22, 114, 82, -37, -134, -239, 152, 96, -164, -30, -56, -55, 10, 47, -26, -122, -146, 165, -100, 208, -300, 294, 36, 98, 76, -85, -10, 1, 114, -45, 205, 281, 286, 128, -9, 9, 79, -47, 140, -40, -27, -51, 38, 94, 78, -131, -18, 115, 114, -210, 30, 114, 32, -6, 28, -69, -43, 69, 209, 123, 227, -86, 89, -182, -293, 48, 89, -80, 40, 86, -56, -59, -182, -14, -16, 150, -247, 79, 28, -44, 92, -11, 68, 49, -19, -90, -131, -38, -49, 142, 143, 33, -42, 140, 46, 16, -205, -213, 71, 170, -120, -116, 112, -113, -59, -8, 142, 184, -99, -152, 27, -149, 148, 118, -126, 30, 133, -203, -31, -114, 52, -85, -62, 68, -120, 126, 133, 50, -40, 75, -40, 61, -225, -257, -94, 125, 52, -58]
5756e8j37M76m85k6K43J63p1j74n2J42P8J05k20n1J22o7j59K19MR6k19L8NK65
5780B37j29k08K36j67m7PJ1j15K76j13Q8k88J66K68m39K76QJ67j34r1j18J98k00
5803a11K24q1j07J31J4l2r4Q7m3j80K91J28k87J10n5j4L42p2k37j70o2M47j94
5826C5l4p9p2J25J5j36J0J41j35J59l9J59j77j9Q2L3j4LQj14K09J39k93j84L12
5851A34j01r7J2p1J42k23J72l4k13K94J14j32O3J1j94J34j23K72j08j01J87m3
5873I5q5J97l39J90J54k06q9l0R4R9k7J59l28j5K3J90k27J98k01J29J66j06j62
5896a21J38j65J50q2JK04j85Q7j99J27m1k34L72j60L05k88K28j92L6K7q1K78l65
5919a60J88l0Q0J49j49j72n5J94k53J82Q8j34M2M0o3K20R3l17J0o1J26j40j2K74
$$ y = [-58, -195, 281, -204, -230, 13, 176, 105, -69, -121, 21, 99, 204, -16, -67, 55, -12, -171, 48, 52, 148, -71, -33, -28, 237, 108, -100, 136, -31, -78, -71, -60, -175, 101, -12, 76, -212, -46, 222, -217, 59, 67, 234, 100, 9, -109, 89, -111, 113, 32, -75, 56, 70, 38, -56, 31, -12, -192, 99, 227, -60, 50, -5, -19, 323, 251, 14, -156, -218, 229, 35, 1, -78, -150, -25, -10, -146, -136, 5, -130, 29, -10, 149, -28, -47, 35, 68, 54, 57, 65, -49, 160, 299, 6, -178, 134, 33, -64, -52, -123, 19, -204, -32, -66, -279, 15, 129, -3, 60, 71, -123, 11, -112, 160, 52, -49, 138, 95, 10, 207, -132, 58, 212, 6, -83, -113, -19, 80, 53, 212, -116, -131, -108, 82, -145, 53, -148, -19, 147, 41, -121, 17, -148, 2, -80, -79, 125, -60, 27, -172, -45, -86, -320, 52, -108, 197, -91, 137, -55, -19, 8, -73, 205, -160, 28, -2, 78, 227, 78, -94, -149, 45, -208, -26, 62, -72, -30, 10, -53, 167, 260, -57, -47, -108, 18, -122, -134, 140]
$$ [...]
8191A86
##END NTUPLES=NMR FID
##END=
