##TITLE=1H_Pr 4687-202
 CDCl3, 8 sc, 
 4.9.2020
##JCAMPDX= 6.0         $$ Bruker NMR JCAMP-DX V2.0
##DATA TYPE= NMR FID
##DATA CLASS= NTUPLES
##ORIGIN= UXNMR, Bruker Analytische Messtechnik GmbH
##OWNER= root
$$ XWIN-NMR		Version 3.5
$$ Fri Sep  4 12:17:03 2020 Russian Standard Time (UT+4h)  she@DPX200
##.OBSERVE FREQUENCY= 200.1315066352
##.OBSERVE NUCLEUS= ^1H
##.DELAY= (6, 6)
##.ACQUISITION MODE= SIMULTANEOUS
##.ACQUISITION SCHEME= undefined
##.AVERAGES= 8
##.DIGITISER RES= 18
##SPECTROMETER/DATA SYSTEM= spect
##.PULSE SEQUENCE= zg30
##.SOLVENT NAME= CDCl3
##.SHIFT REFERENCE= (INTERNAL, CDCl3, 0, 15.7039)
##AUDIT TRAIL= $$ (NUMBER, WHEN, WHO, WHERE, WHAT)
$$ ##TITLE= Audit trail, XWIN-NMR		Version 3.5
$$ ##JCAMPDX= 5.01
$$ ##ORIGIN= Bruker BioSpin GmbH
$$ ##OWNER= she
$$ F:/spectra/data/she/nmr/H-F/1/audita.txt
$$ ##AUDIT TRAIL=  $$ (NUMBER, WHEN, WHO, WHERE, WHAT)
(   1,<2020-09-04 12:14:59.21 +0400>,<she>,<DPX200>,
      <created by zg, POWCHK disabled, PULCHK disabled
       configuration hash MD5:
       00 E9 B6 7A A2 85 ED C7 34 08 36 98 17 FE 4E 26
       data hash MD5: 16K
       09 8C 44 5E 83 D9 7B 9D 8F 79 D8 97 C2 85 3C 6B>)
$$ ##END=
$$ 
$$ hash MD5
$$ 71 FC 75 85 CE 01 3E 98 9C 54 DF 27 DE FF D4 7E
##$RELAX= 
##$RELAX= 
##$RELAX= 
##$RELAX= 
##$RELAX= 
##$RELAX= 
$$ Bruker specific parameters
$$ --------------------------
##$DU= <F:/spectra>
##$EXPNO= 1
##$NAME= <H-F>
##$PROCNO= 1
##$TYPE= <nmr>
##$USER= <she>
##$AMP= (0..31)
100 100 100 100 100 100 100 100 100 100 100 100 100 100 100 100 100 100 
100 100 100 100 100 100 100 100 100 100 100 100 100 100 
##$AQSEQ= 0
##$AQ_mod= 1
##$AUNM= <au_zg>
##$AUTOPOS= <>
##$BF1= 200.13
##$BF2= 200.13
##$BF3= 200.13
##$BF4= 200.13
##$BF5= 200.13
##$BF6= 200.13
##$BF7= 200.13
##$BF8= 200.13
##$BYTORDA= 1
##$CFDGTYP= 0
##$CFRGTYP= 5
##$CHEMSTR= <none>
##$CNST= (0..31)
1 1 145 1 1 1 1 1 1 1 1 1 1 1 1 1 1 1 1 1 1 1 1 1 1 1 1 1 1 1 1 1 
##$CPDPRG= <>
##$CPDPRG1= <>
##$CPDPRG2= <>
##$CPDPRG3= <>
##$CPDPRG4= <mlev>
##$CPDPRG5= <mlev>
##$CPDPRG6= <mlev>
##$CPDPRG7= <mlev>
##$CPDPRG8= <mlev>
##$CPDPRGB= <>
##$CPDPRGT= <>
##$D= (0..31)
0 1.2 0 0 0 0 0 0 0 0.06 0 0.03 0 0 0 0 0.0002 0 0 0 0 0 0 0 0 0 0 0 0 
0 0 0 
##$DATE= 1599207298
##$DBL= (0..7)
120 120 120 120 120 120 120 120 
##$DBP= (0..7)
150 150 150 150 150 150 150 150 
##$DBP07= 0
##$DBPNAM0= <>
##$DBPNAM1= <>
##$DBPNAM2= <>
##$DBPNAM3= <>
##$DBPNAM4= <>
##$DBPNAM5= <>
##$DBPNAM6= <>
##$DBPNAM7= <>
##$DBPOAL= (0..7)
0.5 0.5 0.5 0.5 0.5 0.5 0.5 0.5 
##$DBPOFFS= (0..7)
0 0 0 0 0 0 0 0 
##$DE= 6
##$DECBNUC= <off>
##$DECIM= 32
##$DECNUC= <off>
##$DECSTAT= 4
##$DIGMOD= 1
##$DIGTYP= 9
##$DL= (0..7)
0 120 120 120 120 120 120 120 
##$DP= (0..7)
150 150 150 150 150 150 150 150 
##$DP07= 0
##$DPNAME0= <>
##$DPNAME1= <>
##$DPNAME2= <>
##$DPNAME3= <>
##$DPNAME4= <>
##$DPNAME5= <>
##$DPNAME6= <>
##$DPNAME7= <>
##$DPOAL= (0..7)
0.5 0.5 0.5 0.5 0.5 0.5 0.5 0.5 
##$DPOFFS= (0..7)
0 0 0 0 0 0 0 0 
##$DQDMODE= 0
##$DR= 18
##$DS= 0
##$DSLIST= <SSSSSSSSSSSSSSS>
$$ [...]
##$SUBNAM2= <"">
##$SUBNAM3= <"">
##$SUBNAM4= <"">
##$SUBNAM5= <"">
##$SUBNAM6= <"">
##$SUBNAM7= <"">
##$SUBNAM8= <"">
##$SUBNAM9= <"">
##$SW= 16.880792210976
##$SWIBOX= (0..15)
0 0 2 0 0 0 0 0 0 0 0 0 0 0 0 0 
##$SW_h= 3378.37837837838
##$TD= 16384
##$TD0= 1
##$TE= 0
##$TE2= 300
##$TE3= 300
##$TEG= 300
##$TL= (0..7)
0 120 120 120 120 120 120 120 
##$TP= (0..7)
150 150 150 150 150 150 150 150 
##$TP07= 0
##$TPNAME0= <>
##$TPNAME1= <>
##$TPNAME2= <>
##$TPNAME3= <>
##$TPNAME4= <>
##$TPNAME5= <>
##$TPNAME6= <>
##$TPNAME7= <>
##$TPOAL= (0..7)
0.5 0.5 0.5 0.5 0.5 0.5 0.5 0.5 
##$TPOFFS= (0..7)
0 0 0 0 0 0 0 0 
##$TUNHIN= 0
##$TUNHOUT= 0
##$TUNXOUT= 0
##$USERA1= <user>
##$USERA2= <user>
##$USERA3= <user>
##$USERA4= <user>
##$USERA5= <user>
##$V9= 5
##$VALIST= <valist>
##$VCLIST= <CCCCCCCCCCCCCCC>
##$VD= 0
##$VDLIST= <DDDDDDDDDDDDDDD>
##$VPLIST= <PPPPPPPPPPPPPPP>
##$VTLIST= <TTTTTTTTTTTTTTT>
##$WBST= 1024
##$WBSW= 4
##$XGAIN= (0..3)
0 0 0 0 
##$XL= 0
##$YL= 0
##$YMAX_a= 65851
##$YMIN_a= -67273
##$ZGOPTNS= <>
##$ZL1= 120
##$ZL2= 120
##$ZL3= 120
##$ZL4= 120
##$ABSF1= 10
##$ABSF2= 0
##$ABSG= 5
##$ABSL= 3
##$ALPHA= 0
##$AQORDER= 0
##$ASSFAC= 0
##$ASSFACI= 0
##$ASSFACX= 0
##$ASSWID= 0
##$AUNMP= <proc_1d>
##$AZFE= 0.1
##$AZFW= 0.1
##$BCFW= 1
##$BC_mod= 2
##$BYTORDP= 1
##$COROFFS= 0
##$CY= 11.3945322036743
##$DATMOD= 1
##$DC= 2
##$DFILT= <>
##$DTYPP= 0
##$F1P= 16.9975609425685
##$F2P= -3.02152046262296
##$FCOR= 0.5
##$FTSIZE= 0
##$FT_mod= 4
##$GAMMA= 1
##$GB= 0.15
##$INTBC= 1
##$INTSCL= 1
##$ISEN= 128
##$LB= 0.24
##$LEV0= 0
##$LPBIN= 0
##$MAXI= 10000
##$MC2= 0
##$MEAN= 0
##$ME_mod= 0
##$MI= 1.114404
##$NCOEF= 0
##$NC_proc= 0
##$NLEV= 6
##$NOISF1= 3.799351
##$NOISF2= 2.8
##$NSP= 1
##$NTH_PI= 0
##$NZP= 0
##$OFFSET= 15.70392
##$PC= 1
##$PHC0= -9976.942
##$PHC1= 16.6009
##$PH_mod= 1
##$PKNL= yes
##$PPARMOD= 0
##$PSCAL= 0
##$PSIGN= 0
##$REVERSE= no
##$SF= 200.130013532006
##$SI= 16384
##$SIGF1= 3
##$SIGF2= 2
##$SINO= 400
##$SIOLD= 16384
##$SREGLST= <1H.CDCl3>
##$SSB= 0
##$STSI= 0
##$STSR= 0
##$SW_p= 3612.71676300578
##$SYMM= 0
##$S_DEV= 0
##$TDeff= 0
##$TDoff= 0
##$TI= <>
##$TILT= no
##$TM1= 0
##$TM2= 0
##$TOPLEV= 0
##$USERP1= <user>
##$USERP2= <user>
##$USERP3= <user>
##$USERP4= <user>
##$USERP5= <user>
##$WDW= 1
##$XDIM= 8192
##$YMAX_p= 0
##$YMIN_p= 0
$$ End of Bruker specific parameters
$$ ---------------------------------
##NTUPLES= NMR FID
##VAR_NAME=  TIME,          FID/REAL,        FID/IMAG
##SYMBOL=    X,             R,               I
##VAR_TYPE=  INDEPENDENT,   DEPENDENT,       DEPENDENT
##VAR_FORM=  AFFN,          ASDF,            ASDF
##VAR_DIM=   8192,          8192,            8192
##UNITS=     SECONDS,       ARBITRARY UNITS, ARBITRARY UNITS
##FACTOR=    0.000296,      1,               1
##FIRST=     0,             0,               0
##LAST=      2.424536,      0,               0
##MIN=       0,             -67273,          0
##MAX=       2.424536,      65851,           0
$$ Real data points
##PAGE= N=1
##DATA TABLE= (X++(R..R)), XYDATA
$$ [...]
1776B5p80j84P56K17J08j039N41j73P84j50m69o5J53N43r9K31q03J72N06J31k91
1797A14m32L59Q4P96r34m9k28O24L24k05k56n65Q31K2l7j72l99K05N68J82q62
1818c0J85r5O42k29k12j48n28R66n64M56q64K23K65L86l62o00K68Q6N09l52m56
1839d54l56P29K47k58j40q58Q26j94P16m94m87L34L39J72m85J70p84Q91K96k71
1859f1m87m7N58J54K77o50l80O32M21j56o11L56m07Q18J10o68m3L55K43J04N1
1880E69q20K35J92M75M5l91k98J39P91o80j5k05J72O8J11j31o54O84j07L94q49
1901b75j0J5L68M35p07n0r3K79P5Om93k06P57j40J20n91m3J63N19Q7p33K97l40
1924e60Q40l10j16q04P05K98j09J06o98J18rR99m64m81R8K33L17k01pn80P00L02
$$ plain form
1776 25 -755 -939 -183 34 142 -897 -356 -529 255 105 -364 -429 -276 267 168 399 -404 -232 274 405 114
1797 114 -318 41 125 921 -13 -62 -290 334 658 453 197 -368 463 485 448 276 -123 82 650 832 -30
1818 -30 155 60 702 473 261 113 -415 551 -13 443 -421 -198 67 453 91 -509 -241 -155 354 2 -454
1839 -454 -810 -81 166 -92 -232 -1090 -264 -458 258 -236 -723 -389 -50 122 -363 -193 -977 -86 210 -61
1859 -61 -548 -595 -37 117 394 -256 -636 -4 417 261 -350 6 -401 417 527 -141 -184 171 414 518 569
1880 569 -251 -16 176 651 696 305 7 146 937 257 242 37 209 277 388 257 -397 287 180 574 -275
1901 -275 -285 -270 98 533 -174 -224 -317 -38 37 43 -450 -656 101 -39 81 -510 -553 -390 129 216 -517 -220 -560
1924 -560 280 -30 -146 -950 -245 53 -56 50 -648 -530 -539 460 -4 -485 -387 -154 163 -38 -45 -625 75 377
1946C77j35l99k14L05M54L76o98j05K34L09o6R6n75k68J012k38j89m79K87K41
1966C25L36l47l68J97Q1J42o3j94l28K14L91j73j42n56N05J54j2l86k89L74p6
1987b15L67k02m23j54O19K09m21Q0l84N01o5K55p48P0K7K86M89n69k9k30O76r7
2009D2j07k59j76N33k3j6n42K59L17K49k55p5K3j55Q36n24j78m6J01M67o6j39
2031B66k33N45k95J35m14l2P7M2O17p20K09m07M96K38j12l50n10Q04n2o0n16n8
2053c30L40q3M44p24K78l17P49m63J47m71q5N06j13Mn29M70k53N09l17l29J71
2074c96L89J18l84R5l63L23L53j85Q6m86L56n0M30n29N5J06Q0M27n07n8j46O67
2096C81j10rk98j14M27j39L39o92L00j47P22l02m03R2J31K74k3j50j70j1L48K7
$$ plain form
1946 377 242 -157 -371 -66 388 764 66 -39 195 504 438 534 -41 -309 703 465 276 -203 84 325
1966 325 661 314 -54 143 224 366 303 109 -219 -5 386 213 71 -485 20 174 162 -224 -513 -139 -215
1987 -215 152 -50 -473 -627 -8 201 -220 -140 -524 -23 -88 167 -581 -511 -484 -198 291 -278 -307 -537 139 42
2009 42 -65 -324 -500 33 10 -6 -548 -289 28 277 22 -53 -30 -185 651 127 -51 -97 4 471 405 266
2031 266 33 578 283 418 4 -28 49 91 708 -12 197 -210 286 524 412 62 -448 356 304 244 -272 -330
2053 -330 10 -73 371 -353 -75 -392 357 -106 41 -430 -515 -9 -122 -118 -647 -177 -430 79 -238 -567 -396
2074 -396 -7 111 -273 -178 -541 -218 135 -50 36 -450 -94 -144 286 -243 -188 -82 -2 425 -82 -140 -286 381
2096 381 271 262 -36 -150 277 138 477 -215 85 -62 660 358 -45 47 178 452 429 279 109 98 446 473
2118D73n7q29O55K3K55l81k5j99j37N88m16N0n00N44K3P7k30k98K18M9M20p48
2140d45o9K13K82P4j73j98l14O31j71K5o58L65L53j9J51n83O1J74O88l50l32J52
2162a43k3N86n78K68m74K22K10K49l30l75N28R2J10k21K5k73N95J36j92l06k01
2183i5K57K44l7k78j86M05J41J59m85J2j9M43j82m65j7k59O63j91N3m95N11o2
2205A17m3pn17J91j64N31p6j90k91L00K88o1j63n96R13l27J11j34j37J73j26L61
2227A53n82q3R2M18J70l68K9n5P3Q4K54m59J65j97P01j59n24P0Q5M21k72K68p79
2250d95M21M61m8j55l35L36M3L22k82k66Q2jM46m63L51o50N79j6k20Lp7M5j1K24
2274B94l00l17J75K34J54k57l00L6N89L3k87l52j19K96n0J95p94L42K48L09k21
$$ plain form
2118 473 416 -413 242 265 520 139 114 -85 -222 366 -50 0 -500 44 67 144 -86 -384 -166 -117 303 -445
2140 -445 -514 -301 -19 55 -118 -316 -630 1 -170 -145 -803 -438 -85 -104 47 -536 -475 -301 387 37 -295 -143
2162 -143 -166 420 -158 110 -364 -142 68 317 -13 -388 140 232 342 121 146 -127 468 604 412 106 -95
2183 -95 162 406 369 91 -95 310 451 610 125 137 118 561 379 -86 -103 -362 301 110 163 -332 179 117
2205 117 74 67 -450 -259 -423 108 32 -158 -449 -149 139 78 -85 -681 232 -95 16 -118 -255 -82 -208 153
2227 153 -429 -512 -420 -2 168 -200 -171 -226 -153 -69 185 -274 -109 -306 395 236 -288 -218 -133 288 16 284 -495
2250 -495 -74 387 339 184 -151 185 228 550 268 2 84 83 529 66 417 -233 346 330 110 113 36 81 70 294
2274 294 -6 -323 -148 86 240 -17 -317 -281 308 341 54 -298 -417 -121 -171 24 -770 -428 -180 129 -92
2295i2m60K18J43L77j85J0m58L06n9Q7k5l68M79j9J34j60L9l64M96J51m15J14
2317e1k18M00PJ76k53n08O85k11M49l64l03r5P92j23k73J29m04N13R2k6k68j1
2339A35K3O3K55m52M7L8L17k48j81j1n1K70k85L15n78M66jj00K2l57J49M6N68
2362D50o57j47N5L63m5k26m6l03O24k18J94n55K9K07K28L70p09J88k94N21j71
2383a42J40l88J42M95j80j9l93L31J40J36j03k09J22l42N69R8m02q3L67M1j05
2404B15n4m20N70j96K76k72J10K00j85J99m88k0j55N21j8j04k07j88L08R1L3l69
2426a53L20l14M09j02k23j03J16K39j84J45o25K98J64J9j94m75M99K8N8l2R5k86
2448c01m9N62m54L30m35L07k0N4q0k77L73P7K63m10L5mK25J16n11P5n4M81k31
$$ plain form
2295 -92 -552 -334 -191 186 1 11 -447 -141 -200 -113 -138 -506 -27 -46 88 -72 -33 -397 99 250 -165 -51
2317 -51 -269 131 138 314 61 -447 238 27 476 112 -191 -286 506 383 110 239 -165 348 440 414 146 135
2339 135 158 221 476 24 71 109 426 178 -3 -14 -65 205 -80 235 -343 123 122 22 44 -313 -164 -118 450
2362 450 -207 -354 -299 64 19 -207 -253 -556 68 -150 44 -511 -482 -275 -47 323 -386 -198 -492 29 -142
2383 -142 -2 -390 -248 247 67 48 -345 -14 126 262 159 -50 72 -270 299 397 -5 -88 279 320 215
2404 215 161 -259 311 115 391 119 229 429 244 443 -45 -65 -220 301 283 179 -28 -216 92 183 216 -153
2426 -153 167 -147 262 160 -63 -166 -50 189 5 150 -475 -177 -13 6 -188 -663 -164 -136 -78 -110 -15 -301
2448 -301 -350 212 -242 88 -347 -40 -60 -6 -86 -363 10 87 350 -60 -25 -29 196 312 -199 -124 -178 303 72
2471G2R3k19k2J58r9N58p41L60n6K79j97j69r9J52M02l70j1k46J26M08k03J7j21
2494G2p0N6M16m99m1PL12N6j41Mm69M40p7R0k37k45K50J08J0k49L6o4K55J09m26
2519b97n1K92J36k64J16j74N7k5L13k28p6J1J43K11l12oJ66j35J99J50k08k65
2541b47L61k34K45r7m38O00j11K26k63J54k90M21J14l51J56l58O29j81P5n93Q2
2562a00L32K8n4o1p2k77N90k92J58l37K00Pk57K51l23K85j71lJ64k64J93k03L57
2585A51l07j24j35J00K97q9J05o5j75K87j37k30Q6K10m9L9k67J16P8MJ50k88K7
2608b16Q6K15r0M8j74K21j8j4K08k80K3j76K14J33k99K38j88K94n4L02o22J93
2630D4M38j09l48k64M03j93K87l9J07l95L12k77p1L22l29J97K05j54l2o3j10K02
$$ plain form
2471 72 165 -54 -76 82 -17 541 -200 160 104 383 186 17 -82 70 472 102 91 -155 -29 379 176 193 72
2494 72 2 58 474 -25 -66 -59 253 309 168 172 -297 143 66 156 -81 -326 -76 32 42 -207 -171 -235 20 129 -297
2519 -297 -348 -56 80 -184 -68 -242 -185 -210 103 -125 -201 -190 -47 164 -148 -154 12 -123 76 226 18 -247
2541 -247 114 -120 125 28 -410 190 79 305 42 196 -94 327 441 90 246 -112 517 336 411 -182 -100
2562 -100 232 260 206 145 73 -204 386 94 252 -85 115 122 -135 116 -207 78 -93 -96 68 -196 -3 -206 151
2585 151 -156 -280 -415 -315 -18 -107 -2 -67 -242 45 -92 -322 -236 -26 -75 -36 -303 -187 -109 -105 45 -243 -216
2608 -216 -130 85 -5 43 -131 90 72 58 266 -14 9 -167 47 180 -119 119 -69 225 171 473 -149 44
2630 44 482 373 25 -239 164 -29 258 219 326 -69 243 -34 -105 217 -112 85 290 136 104 41 -69 133
2652A33m0l45J95n3n2M08k84j13o9J73J77N0n01L17j1K4k08j1K73m20O10o83K24
2675b06K6L0P1J08M0m54L49j13L72j29l37N1L16L25n94K6j97N70k9n4o0l29L97
2698A79k75L05j58R2j39J10q8q2Q0J56J86r7L8j28n6%J52j88j30O2l4J87O6j95
2722D3l37N54K47n77L70l52Q7q1K12l44P5K8P3J66j60j54J5M9J43l20J83j67N63
2745C16k70K3l63M15k55j70J93q7K8%K07m0k40j01M16l7M7J44m32J32O6L8K25
2768B55m03K08j00L92j91o6n3O6M3J53l26k5K91J4P1k80KJ20n6L47l87J15j19
2791G1M0K0j14j12J9J30R1J14m01K38k49J59N5j01R6j23J23Nj61J62j18J17j20
2814e9k7l64M13k00K34J62k94P8r7J76k46Lj14K20J93q9j95p9L67m9p5m7r8N29
$$ plain form
2652 133 93 -252 -57 -110 -162 246 -38 -151 -220 -47 130 180 -321 -4 -15 9 -199 -210 63 -357 253 -430 -206
2675 -206 -180 -150 -79 29 69 -385 -36 -149 223 94 -243 -192 124 449 -145 -119 -316 254 225 171 111 -218 179
2698 179 -96 209 51 143 4 114 26 -56 24 180 366 269 307 179 123 123 275 87 -43 19 -15 172 238 43
2722 43 -294 260 507 -70 300 -52 35 -46 166 -178 -103 -75 -2 164 4 -150 -135 -86 57 -263 -80 -247 316
2745 316 46 69 -294 121 -134 -304 -111 -198 -170 -170 37 -3 -243 -344 72 35 82 226 -206 -74 -8 30 255
2768 255 -148 60 -40 352 161 95 42 108 151 304 -22 -47 244 258 329 49 51 171 115 462 75 190 71
2791 71 111 131 17 -95 -76 54 145 259 -142 96 -153 6 61 -40 56 -67 56 61 -100 62 -56 61 -59
2814 -59 -86 -450 -37 -237 -3 159 -135 -57 -154 22 -224 -221 -335 -115 78 -11 -206 -285 82 33 -42 -89 -187 342
2838C42l01J87k26j27R2J89j79r5L3P7K51m8P9n52M56k60M70l3m30L10k45K34
2860B24k12K45j35P0P6n1J81k61J1j32J23l06K04j06J89J5l05J72LL6J92l40O
2883a01o2L1K8J87M9m02J10kJ14l8K4M7j61LK16l68J90K2Q3K77o50J19K58O7j5
2908B6J9m12K91M02l18M0O5q7R6j12o1J01M5k35L84k98j1lK57n7k37Q9q1L16l1
2933A88J4l10j73M27Q2o7p5j55o5J2Q5k1n7K57J46j51Ol61J29K0L58l66qO2K8
2958Em3j05J21j56j09N33m73K22j15L55l68J20j18k3Q1k2K11l33J15N0J30P7k06
2981e1J36l45K09J28j32j28L91m41K82J08n19M15j79K17n6P0J6n4K99k10r8q6
3003b8J86O2j94j8M1j99K77J48m22L25j76M3K65k88j33m9L91k78N4j31N9R5q0
$$ plain form
2838 342 41 228 2 -125 -33 156 -23 -118 -85 -8 243 195 274 -278 178 -82 388 355 -75 235 -10 224
2860 224 12 257 122 192 268 217 398 137 148 16 139 -167 37 -69 120 135 -170 2 5 41 233 -107 -101
2883 -101 -163 -132 -104 83 132 -270 -160 -162 -48 -86 -62 -15 -176 -173 43 -325 -135 -113 -30 247 -403 -284 -26 41 26
2908 26 45 -367 -76 326 8 48 113 26 122 10 -51 50 95 -140 244 -54 -65 -68 189 132 -105 -16 -97 219 188
2933 188 202 -108 -281 146 228 161 86 -69 -134 -122 -37 -58 -115 142 288 137 143 -218 -89 -69 289 -77 -85 -23 5
2958 5 -38 -143 -22 -178 -287 246 -227 -5 -120 235 -133 -13 -131 -154 -73 -95 116 -217 -102 -52 78 155 -51
2981 -51 85 -260 -51 77 -55 -183 208 -233 49 157 -362 53 -126 91 35 105 121 67 366 156 58 -28
3003 -28 158 220 26 8 49 -150 127 275 -147 178 2 45 310 22 -111 -160 231 -47 7 -124 -65 30 -50
3026e0K70j04L8l31L31j81K20j52j12rp4K79k54L2M9J07r5k8p5O0Q3l00K58k87
3050c25L17J21l53K29l01K60l8J22k6r7l9m5J35j69J70j53K93K9k07J94l1m6L5
3073G5K28m02K13J10j33Q6k72L07j25J61j51k41j64L84M1m1K12l89K9M5K73k19
3095B7J50p9l09J10J85j87O7Q5j95R6M9p2j9j33K98k65K71j65L3J25j45O8j51
3118a56L20l34j44R9K8J08N9J81k36n0qK61R9k65k39J38L09m34K62o5R2j85J59
3141am2j02O2K54N8k03q2n7L38j26p3J74l26K85Q7j30k37K15O2J82j51j29rm7
3165BJ52j22m0L4j29J99M18m77j37j5M0RP6l55lJ07L33l07L19m29J26K24k85R6
3189a64j52K78K57r3k63O1j32J04J27k13L18k44j73L18j90P2qK30l13L57k00J65
$$ plain form
3026 -50 220 116 154 -177 154 -27 193 41 -71 -80 -154 125 -129 -97 -48 59 -36 -64 -139 -79 4 -296 -38 -325
3050 -325 -8 113 -240 -11 -312 -52 -90 32 6 -91 -130 -175 -40 -209 -39 -192 101 130 -77 117 86 40 75
3073 75 303 -99 114 224 91 177 -95 212 87 248 97 -144 -308 76 117 76 288 -101 -72 -27 246 27
3095 27 177 98 -211 -101 84 -103 -36 49 -146 -50 -1 -73 -92 -225 73 -192 79 -86 -53 72 -73 -5 -156
3118 -156 164 -170 -314 -215 -187 -79 -20 161 -75 -125 -133 128 227 -38 -277 -139 170 -264 -2 -67 25 -160 -1
3141 -1 -43 -145 -83 171 229 26 -56 -113 225 99 26 200 -126 159 246 116 -121 94 156 338 187 58 49 2
3165 2 154 32 -8 26 -103 96 514 37 -100 -115 -75 -66 10 -345 -348 -241 92 -215 104 -325 -199 25 -260 -164
3189 -164 -316 -38 219 126 -137 -76 -208 -104 23 -190 128 -116 -289 29 -161 -89 -97 133 -180 177 -23 142
3211A42j87j41L34o6M5l37L66j73J10k01L45k54M8j9J6K43l75K44j87K86q1j01
3233E7J06k04J27k56L97r1J6r5j45J26J77r3o2J00k88R3L21j92l25L60j34k13
3255b18J29J10j25J31j28J76j59J14j76J36N2m6J19k26L18k17K96j17l00k4m1
3276a96J12k69L43J10j14m9k37N35m05L07j14j13K58k8j46r1Q0p7J07Q3J14k51
3298d1j51J35M58m3k58N2kq1n24O84k84M6L37m49L31k88R5j04K41j98L40k66J81
3321B11N3q5j01l60O47j54j75l9k8K0O7J70l52m5O5N6J22k27K4k18M17L1q5j22
3345a08j19M7k7K08j84M4m1L59k82L1j52J28j54J80j01m9J53K67L8j2k33J26j16
3368CK15r6j39J25Q5r1j90J69O6J07m04K06J68k04j29K44n2K09m63k1L95n1l64
$$ plain form
3211 142 -45 -186 148 82 127 -210 156 -17 93 -108 237 -17 31 12 28 271 -104 140 -47 239 158 57
3233 57 163 -41 86 -170 227 136 152 57 -88 38 215 122 60 160 -128 -35 286 94 -231 129 -5 -218
3255 -218 -89 21 -104 27 -101 75 -84 30 -146 -10 42 -4 115 -111 207 -10 286 169 -131 -155 -196
3276 -196 -84 -353 -10 100 -14 -63 -300 235 -170 137 23 -90 168 140 -6 -97 -17 -94 13 96 210 -41
3298 -41 -192 -57 401 358 100 152 150 69 -455 229 -55 -9 328 -121 210 -78 17 -87 154 -44 296 30 211
3321 211 264 179 78 -282 365 211 36 -3 -31 -11 56 226 -126 -171 -106 -50 72 -155 -131 -349 68 99 14 -108
3345 -108 -227 -180 -207 1 -183 -139 -180 179 -103 -72 -224 -96 -250 -70 -171 -220 -67 200 238 226 -7 119 3
3368 3 218 122 -17 108 193 102 -88 81 147 254 -150 56 224 20 -109 135 83 292 -171 -192 203 152 -212
3391b12J44O6J99j8j12J79k10j51J86r4j70P1j89N14O9l17j8J60M7r3J9j91K70
3414A49l73J66j28J93j29k9j30K19p7NK05J45j42k06j25M12j79k6N6n5J4K86k49
3437Bp8m1O1J66R8k47J04K94l01N8P3k28p9K94q6O0k81L21j08L04k44J30k39j97
3461a64J69K53r6k80K24n5M0k70J07J37r9J69l63Q7J4P2o8J22J09m09J32J44r7
3484a22P4j44M7J06j4j69J89M3j65K42J4L3k76J58j27K81j96k70K83k3q6J20k28
3507b30P2L26q0r5J0j17P3J06n1r1O2J4R5o5j1J58l0j93K21J1j60K6N9J3j34P4
3533F3j37L8J92j78K17l13J55J49k0l8j06J72l33Q3j22L24jj28j39r2J26O2r5
3556a21J73j09pqk02K30m3j91J34N7M7j11M6J01j6R2Pj26l43N43l59o6L95k00
$$ plain form
3391 -212 -68 -2 197 179 67 246 36 -115 71 -23 -193 -122 -311 203 272 -45 -63 97 144 51 70 -121 149
3414 149 -224 -58 -186 7 -122 -151 -281 -62 -139 -134 71 216 74 -132 -257 155 -24 -50 6 -49 -35 251 2
3437 2 -76 -117 -56 110 208 -39 65 359 58 116 189 -39 -118 176 90 150 -131 190 82 386 142 272 33 -164
3461 -164 5 258 162 -118 106 51 91 -179 -72 65 -34 135 -228 -141 -127 -55 -123 -1 108 -301 -169 -25 -122
3484 -122 -48 -192 -145 -39 -53 -222 -33 10 -155 87 101 134 -142 16 -111 170 -26 -296 -13 -36 -122 -2 -230
3507 -230 -158 168 88 -7 3 -114 -41 65 14 -77 -15 -1 94 29 18 176 146 -47 174 185 25 51 110 123 -11 63
3533 63 -74 -36 156 -22 195 -118 37 186 166 128 22 194 -139 -56 -178 146 145 17 -122 -214 -88 -26 -121
3556 -121 52 -57 -64 -72 -274 -44 -87 -278 -144 -87 -40 -151 -105 -4 -20 72 79 -47 -390 153 -206 -272 123 -77
3580g7J11k56M14k61R6k04M06k52P8K0N2j87J23j05N2j02l2L06N4l72P8J33o9
3603FO2k06K35j91J43o2j01q0M38k69J27p8j19L9K45j14n3j13K21r7J27m78L21
3626Cj93J57m0N9l14K27J92j23K29k39or7J31M4k06J9J17K9p6N5k09K89k60J34
3650g8m3m1K19j66J23K8j82K47k77J65K8j85kn1j54M44l49L36r1n5K94l59J2M
3674a33J50J52k35j41K70J07P5j35q3L2K7j7k6O4q9l1J99q2q2Lp0k5J7M3j67K30
3700E3K2Lj04lk4o6J92n8j47J47j08Lk31L79nk36O0j56J19R3K29q4k28J35l7K9
3726b3J28m11J65K58r5p6m7R6k14L22j31m0O5J17N0m10J05J22N5%P8M1j20k2J12
3751A25k6k34L43p1k21P3J37j91J71n7J29n0k92Q2J98J13j75M8j20j5J6J29j61
$$ plain form
3580 -77 34 -222 192 -69 27 -177 229 -23 55 75 127 -60 63 -42 10 -92 -124 182 236 -136 -58 75 6
3603 6 68 -138 97 -94 49 -13 -114 -194 244 -25 102 24 -95 -56 189 75 22 -91 130 33 160 -318 3
3626 3 -190 -33 -73 -14 -328 -101 91 -32 197 -42 -48 -145 -14 30 -176 -157 -40 -11 -87 -32 -241 48 -212 -78
3650 -78 -121 -162 57 -109 14 42 -140 107 -170 -5 23 -162 -164 -215 -369 75 -274 62 -29 -84 210 -149 -137 -133
3674 -133 17 169 -66 -207 63 170 245 110 27 59 86 69 43 107 18 -13 186 104 22 25 -45 -70 -53 -10 -177 53
3700 53 75 78 -26 -29 -53 -119 73 15 -132 15 -93 -90 -321 58 53 -183 -123 -279 -160 -67 162 78 -150 -15 -52 -23
3726 -23 105 -306 -141 117 22 -54 -101 -5 -219 103 -28 -68 -3 114 164 -246 -141 -19 36 36 114 155 35 13 125
3751 125 99 -135 208 137 -84 -11 126 -65 106 49 178 128 -164 -82 116 229 54 102 -18 -33 -17 112 -49
3774d9k98L09qQ0l1m6l7N8j25J6k0R2m3J78q2j15K37Q3j32j41J4J32j72p2J23
3799d9K41j37n8j72J95k9k2j7K4l5K9J0K0k7Pl4k45L05k74L35J7rq0k3J7J12m0
3826F1pll4P1k81K64J2n1K5J62l20J7J27M5j14J43j85Q6L3J13o1j89J23l16K46
3851c3l7J40l73J78K11k72K95k08Rk6J37l8J30k74R2k8M5n2J13J26n5q1L4j66
3875a33J23m9j0pJ04J53j77RK61k50o2J63K04k0m19N4L27m85K53j89J67Qj18K05
3899A12k38J89j24K09m6l4j15J91k25K39J52n21J85M0J41r4m1J75k68K64j84J0
3921A7j1lj85L31j68k56L49j48P6%J72k49J10k70O2K09Nl1pk2K96k28j63L30m86
3946b70K47Q6j75J51l7l2n5j34J68j26J45J57j63Qn8L95k57L3m7rJ8M5k7j44K46
$$ plain form
3774 -49 -347 -38 -46 34 3 -43 -80 -22 -147 -131 -151 -59 -102 76 -6 -121 116 199 67 -74 -60 72 -100 -172 -49
3799 -49 192 55 -3 -175 20 -9 -31 -48 -24 -59 -30 -20 0 -27 -20 -54 -299 6 -268 67 84 75 -5 -28 -11 101 61
3826 61 54 51 17 88 -193 71 83 32 57 219 -101 -84 43 88 -26 117 -68 18 51 164 103 -86 37 -279 -33
3851 -33 -70 70 -303 -125 86 -186 109 -99 -90 -116 21 -17 113 -161 -69 -97 -52 -104 9 135 80 -1 33 -133
3875 -133 -10 -59 -69 -76 28 181 4 13 274 24 -38 125 329 309 -110 -56 271 -214 39 -150 17 25 -93 112
3899 112 -126 63 -61 148 102 68 -47 144 -81 158 310 -211 -26 14 155 61 20 195 -73 191 7 17
3921 17 6 3 -182 149 -19 -275 74 -74 2 2 174 -75 35 -235 -173 36 41 10 3 -19 277 49 -114 216 -270
3946 -270 -23 63 -112 39 2 -30 -85 -219 -51 -177 -32 125 -38 -30 -88 307 50 83 36 27 45 90 63 -81 165
3971A65k25J38o2m7J21N3k01Q9K1r3K40q2J02l22j35K10j79K24pj65L74j56k5
3994C8jpQ6N7l00K2J38L2k87L82k36K2K6R3p2NN9k16MN7P2J96j97j11O8l5O4J19
4022G8j62L32m62Q3N9j69M23k96J95k86Q5K35k28K2J19K30l38J31K5m1K25k3j70
4045F7o9J09m5J11j62k8oN2N1J32j48p5K3N8j42q9J49J10J32m4j28L2k28J46k46
4070b38l8M97j49J4nj52k7K53j82j0lM6R6q3o3j23J34J3J07j48j65K82l04K23
4094b5J37Kk71K38J64j61p0M8k15m8R6j85L74L6j94r7J35j72O7Q9j32K83k84j45
4118c30J68j5K30Pn6J56K5j32j04n0O0j56J46r8k07L84Q1n4o8N7j94M3K25n1n44
4143d77N51j32J88j78L86k97k92J63J22R4k51J5n9K5K70j5k33Q7L50k20l73L77
$$ plain form
3971 165 -60 78 16 -31 90 143 -58 31 52 -41 199 117 219 -103 -238 -28 -207 17 10 -155 219 63 38
3994 38 37 30 116 173 -127 -105 33 65 -222 160 -76 -54 -28 65 -7 -2 57 -159 -155 -98 -26 170 -27 -138 -70 -105 -41 78
4022 78 -84 248 -214 -131 -72 -241 182 -114 81 -205 -120 115 -113 -91 28 258 -80 51 76 35 260 237 67
4045 67 -2 107 62 173 11 -17 -23 29 80 212 64 -11 12 70 -72 -161 -12 98 230 186 58 90 -138 8 -238
4070 -238 -276 221 72 86 81 -71 -98 155 -27 -37 -40 6 102 19 -44 -167 -33 -20 87 -61 -226 56 -248 -25
4094 -25 112 114 -157 81 245 84 14 62 -153 -201 -105 -290 84 120 -74 -171 -36 -208 -141 -52 -184 99 -185 -330
4118 -330 -162 -177 53 60 4 160 185 53 -51 -101 -41 -197 -51 -149 -356 28 109 55 -13 44 -150 -107 118 67 -477
4143 -477 74 -58 130 -48 338 41 -251 -88 34 128 -123 -108 -167 -142 128 113 -120 -33 317 97 -276 101
4165A01j46k56L86j34j9P5J50j99J36j00j00K5r6K16R9k41JR3J3o2Q8K2k3qO0
4190H1J5l70K01l7J2L2J92N7m71M37l23J82j34P7J69R5j49j07R9j2j48j10L59
4213A47k3j24ln2j49K01R9P4m03K79j84J04K69k84K01j23m4J35q9p8r8J06k54
4236b93M91j66%K29j45J94j30m25K05J79MJ1k29MQ1j10k63M05l87J70L03j96J53
4259H5j82J89j66l0j6K42o5j60J04j77J33j4O1J2J2J20j09J28j30K2k69M06m18
4282b22K27K82j84n9J85l59j7K09l3Q1q5k5R1m3O3j42L9j9q3N0J80K0l35J83k40
4307b36L01j59pm1N1L29l16J12r5J39n0l4j7k12J81K5k46J09J66J19k76J49P5
4330F7k34k0J17K46l97J47j40J92k2j40L31Nl9q3O6l0j75j7J87m8j79J70J45k32
$$ plain form
4165 101 -45 -301 85 -49 -68 7 157 -42 94 -6 -106 -81 -177 39 138 -103 -102 -9 4 -58 30 52 29 21 81
4190 81 96 -274 -73 -110 -98 -66 126 183 -288 149 -174 8 -126 -49 120 215 66 -41 58 46 -102 -212 147
4213 147 124 0 -3 -55 -204 -3 96 170 -233 46 -138 -34 235 -49 152 29 -15 120 31 -47 -145 -39 -293
4236 -293 198 32 32 261 116 310 180 -245 -40 139 143 154 -75 -71 10 -100 -363 42 -345 -175 128 -68 85
4259 85 -97 92 -74 -104 -120 122 57 -103 1 -176 -43 -57 4 16 28 148 39 167 37 59 -210 196 -222
4282 -222 5 287 103 44 229 -130 -147 62 29 110 25 0 91 48 111 -31 8 -11 -94 -44 136 156 -179 4 -236
4307 -236 65 -94 -101 -142 -91 238 -78 34 -61 78 28 -6 -23 -235 -54 -29 -275 -166 0 119 -157 -8 67
4330 67 -167 -187 -70 176 -221 -74 -214 -22 -44 -184 147 152 113 30 96 66 -109 -126 61 13 -166 4 149 -83
4354h3K66j04j50j1J76j64N6J06k53J20J09K05l82L2K51k23K0Q1l08L45q3J37
4376A43k78J58kK26k24m36N98l76L30j61j52M2n9J06MJ30j00O5j64J57q1J85k63
4399a52J09O5J44j44k17M25k42j18K31J34r7k49K13m53K85L86j89j11KL7r3J45
4421A11k81K41R4K4KM7j98j15J41j78R5j41K89j67J05j33J40M1k4l36J50K17j79
4444e5K59k09k0j55jL90N2k60R9M1o9j98K61k47K67K0j86J4P2p3j05J8k06J56
4468a35R2o9PKK84J19k98q5j7m8J06r8Q4j84J53m1K64l2j07q2J75j22k9J59l85
4493b87M89k32J87j91J12NN2q8K13j58j83O4N8j67K9K04j50K61k1n7l96J89j49
4516b16L01k91K31j52N4J64n5m6K00j17O7j06o8K99l91o8K79k28K65j8P3n4k06
$$ plain form
4354 -83 183 79 -71 -82 94 -70 -14 92 -161 -41 68 273 -109 -77 174 -49 -29 52 -256 89 6 143
4376 143 -135 23 21 247 23 -413 185 -191 139 -22 -174 -132 -191 -85 -81 49 -51 14 -150 7 -74 111 -152
4399 -152 -43 22 166 22 -195 230 -12 -130 101 235 138 -111 102 -351 -66 320 131 20 22 59 -34 111
4421 111 -170 71 165 189 191 238 40 -75 66 -112 -17 -158 131 -36 69 -64 76 117 93 -243 -93 124 -55
4444 -55 204 -5 -25 -180 -181 209 261 1 100 141 72 -126 135 -112 155 175 -11 3 75 2 -103 -85 -291 -135
4468 -135 -43 -112 -105 -103 181 300 2 -83 -100 -148 -42 -140 -56 -240 -87 -128 136 104 -3 -85 90 -32 -61 98 -287
4493 -287 202 -30 157 -34 78 83 135 47 260 102 -81 -17 41 -126 -97 107 -43 218 197 140 -256 -67 -216
4516 -216 85 -206 25 -127 -73 91 36 -10 190 73 140 34 -34 265 -126 -194 85 -143 122 104 177 123 -83
4539h3P2o3j28K25o4K19k81J42k33J05J60k31R6RJ55j87K83K1k65o0P1J47l64
4562b54K91j10K34q0k08J6N41m69J72l68J73L04m16K88j9m4J3Q2J2k13J69k57
4584a43m8K03J07r1l8P3j12R6Km0P9j28N4k0M5K9m0j54J99jJ7N6k96L84l14K27
4610A46j88J29o1k11L40l03L24j10k54K46k10J06l1J67jj31Q0j29j1K46k09KO
4633e7J6Q8J05l77J11R8j49K63M0m9r4j85R3K31o8r9oo4K55j60M2J72k32k27L85
4658A32Rj12J1K5q4L5M1O2j51J31l15K40j15R6mj6J55m49L03R9J97l12K9J3L07
4683C27k95l2N6k33L31j70j20K9K57K13l59J10r3o1RJ09l15K04o7m2K75o9j44
4706h0P6K01k28L38k29o9L2k13K38n9J40P2l53L76k4m54L69l66K38kK9L2K6K5
$$ plain form
4539 -83 -11 -74 -202 23 -41 178 -103 39 -194 -89 71 -160 -64 -55 100 -87 196 217 -48 -108 -37 110 -254
4562 -254 37 -73 161 81 -127 -111 430 -39 133 -235 -62 242 -174 114 95 51 64 146 158 -55 114 -143
4584 -143 -191 12 119 28 -10 63 -49 47 49 9 88 -40 14 -6 39 68 28 -126 73 72 89 145 -151 233 -81 146
4610 146 -42 87 26 -185 155 -148 176 66 -188 58 -152 -46 -77 90 89 -42 38 -91 -102 144 -65 -63 -57
4633 -57 -41 47 152 -225 -114 -16 -165 98 138 89 -5 -190 -97 134 66 -33 -39 -103 152 -8 34 206 -26 -253 132
4658 132 141 29 40 65 -19 16 57 119 -32 99 -216 24 -91 5 1 -15 140 -309 -6 93 290 -22 7 20 327
4683 327 32 0 56 -177 154 -16 -136 -107 150 363 4 114 21 -40 -31 78 -237 -33 -100 -142 133 64 -80
4706 -80 -4 197 -31 307 78 9 41 -172 66 7 147 219 -134 242 218 -236 133 -233 5 3 32 64 90 115
4730A15j44K48l53K61j31J99k76K07j62K93k34o5o0J33R2j70Q8q4k1P5p6r4O6
4753i3r2J35k93L91n6J89K6m20K73j37Q8jj1M7J85m45J76J69k52J23n2j23m6K08
4777a1L51l27j3j37M42j20k31N4L9k49q6L53K38k61J80j55l38L90j11Kj06N4P1
4800B9j57K99k67j01P9J04M9k04K08n2r0L91k39j25R9n1p0qJ10j2K22j59p1qM3
4825A9o8q9jK24k14K24Q3p3r2R8l5k68J87O1P2k78K77j54L6J80l99K07j80K02
4849A9j0j27J68L7j52J62Q%j1k26J20k2J21j25K7J64l49L91j45o4J76k41J57k33
4873a55N0j53K47k34J87Q4M4p9m5m4j17M30j84OP8j74R3q9k5P3J79M4l00J73K8
4898A17jj51R2j21J05q4q6N2j18J95R5q8M4R3r8k57L29m32K01K3J2K60o3k11r6
$$ plain form
4730 115 -29 219 -134 127 -4 195 -81 126 -36 257 23 -42 -102 31 123 -47 41 -43 -64 11 -65 -159 -93
4753 -93 -185 -50 -343 48 -8 181 207 -213 60 -77 11 10 -1 46 231 -214 -38 131 -121 2 -50 -173 -219 -11
4777 -11 340 13 0 -137 305 185 -46 8 47 -202 -288 65 303 42 222 67 -271 119 8 10 -96 -42 29
4800 29 -128 171 -96 -197 -118 -14 35 -169 39 -13 -103 288 49 -76 23 -28 -98 -106 4 -8 214 55 -16 -24 19
4825 19 -49 -138 -139 85 -129 95 178 105 13 111 76 -192 -5 56 128 -150 127 -27 9 189 -210 -3 -183 19
4849 19 9 -118 50 87 -65 97 105 105 94 -132 -12 -34 87 -38 -11 153 -196 195 50 -14 162 -79 78 -155
4873 -155 -105 -258 -11 -245 -58 26 70 -9 -54 -98 -215 215 31 37 115 -59 34 -55 -80 -7 172 216 -84 89 117
4898 117 116 -35 57 -64 41 -43 -129 -77 -195 0 95 7 51 144 46 -211 118 -314 -113 -90 -78 182 119 -92 -188
4923a88J54K23j47j04L29j97j54m0J62M12l20j79L2l1O8j32R7J73j58q7%J92j07
4946bL7J50l00L90l61J24MK7j47o7Q0J69r4j05JK92k40K92m18L46L0k62p2L0L11
4971B15m36K73Q2k0j92j21R0K54l82J88K18j27l66L21k13n5L40r3j12O0k88M38
4993G4rj96n8L8K97j80J3J20k37K10l11J96J76K0j02j9Jp8P4j56Q3P2J2lj51o5
5019a79J03K52j55j18N4J17J45l25m5N2J03P8k13N6O0k10K39J06j74J30j35R8
5041C9j58J19J5j87J90p5J25j98q3J27K46l14K58l31M98o4l15K55k51J44j15J44
5063F9j58N4j52o8J64J10l26K29L1J30p9M9j43j12Q3J54j05k8l2o5P5K32m5j8
5087D9M7j30K2J06J03l44K80j27r8m6J21m2L0J29k17J48l75L60M9j37P1K07j08
$$ plain form
4923 -188 -34 189 42 -62 267 70 -84 -124 38 450 130 -49 -17 -48 20 -112 -15 158 0 -87 -87 105 -2
4946 -2 35 185 -115 275 -86 38 42 69 -78 -145 -65 104 10 -95 -94 198 -42 250 -168 178 208 -54 -126 -96 215
4971 215 -221 52 134 114 -78 -199 -109 145 -237 -49 169 42 -324 -3 -216 -271 69 -24 -136 -76 -364 74
4993 74 65 -131 -189 -151 146 -34 -21 99 -138 72 -239 -43 133 153 51 32 33 -45 29 -127 -44 28 40 37 -114 -179
5019 -179 -76 176 21 -97 -43 74 219 -106 -151 -99 4 82 -131 -75 -15 -225 14 120 -54 76 -59 39
5041 39 -119 0 15 -172 18 -57 68 -130 -213 -86 160 -154 104 -227 271 207 -108 147 -104 40 -75 69
5063 69 -89 -35 -187 -255 -91 19 -307 -78 -47 83 4 53 -90 -202 -119 35 -70 -98 -130 -195 -120 112 67 49
5087 49 96 -34 -12 94 197 -147 133 6 -92 -138 -17 -59 -29 100 -117 31 -344 16 65 -72 -1 206 98
5110I8JM7J1j92k20K62j0O2l25J02o8L08j14L37l00l5j10n4J37K86k24r0K18q5
5134D2m0m8lL3J29K9J3l6k17P4j66J04Q0J21j63o8k8K55M1j07K3%j97J44M7J51
5160B13l77L08K0o1o0M2J05j29p0K81l4j45p4J14k25P4N9J04K7k84K39j08M8l24
5184b57K45J73k5j81K7MQ3j34P5Lo3N1j04K41p1l52M06j36rj19N7n1L78j79o1
5209Ak2k5k0j23J17J12J43l69L41l79J72J98r3j03R7o1O3k10J55J21lKj47o2K03
5234A08j02rJ03j09K8n0K12l47N8J69j85K11o7M7l0M4J83j99O5j18K07m6k71J90
5258I2j90j3K94o5r5k21L00j99J65N9l25J03L9K51j80l67K97K71j22k95J65p1
5280a07K39j32k47M5K24O8o4o3N9O7n3J04j49L2j51J84j07k21L23K3k2j21j73
$$ plain form
5110 98 99 146 157 -35 -255 7 -3 59 -266 -164 -232 76 -38 299 -1 -36 -146 -200 -63 223 -1 -91 127 42
5134 42 2 -46 -49 -16 113 142 155 119 -98 -24 -190 -86 -6 115 -48 -116 -144 111 152 45 68 68 -129 15 62 213
5160 213 -164 144 164 103 43 85 190 61 -9 272 238 93 19 133 -92 -18 41 145 172 -112 127 19 67 -257
5184 -257 -12 161 136 -45 -18 -14 69 -65 10 13 -50 1 -103 138 67 -285 121 -15 -24 -143 -86 -137 241 62 1
5209 1 -21 -46 -66 -189 -72 40 183 -186 155 -224 -52 146 53 -50 47 -14 49 -161 -6 115 112 114 -33 -95 108
5234 108 6 -3 100 -9 19 -31 181 -166 -108 61 -124 87 20 67 37 81 264 65 130 12 219 173 -98 92
5258 92 -98 -111 183 118 23 -198 102 -97 68 127 -198 -95 -56 195 15 -352 -55 216 94 -201 -36 -107
5280 -107 132 0 -247 -202 22 90 26 -37 22 89 36 140 -9 23 -128 56 -51 -272 51 74 52 -69 -242
5303b42J75l5J69o5J14k31L2L4N2N4r2M4pRj74L91l57L3k9Q6P4Q8l72K80JL2K09
5330B73k45k02M8K95m93L35P1rK0o2P6j1Jl41mK93r2k73L38j7o2K65j07j84P9
5355hp8K45k32R8Oj47Q9n1J15j29O7m3k6j36L00n4L9n1R9l61R1L32l38J95j32
5380a10L4p9L65l66R5L1J05n2J58j0l75P3j2M85n46P1n0N8L01q7j27q6j30m5J82
5405a17O2r1K80O3k71L9n2J74J20k59j06K61k27R9p9L37j96J81j51r7J03O7k08
5428f8n3J4K36k3L3k61J41O6j64L6L0L2K16k19j07J07n6J7R4j48J60J0q2o7J36
5453H0j05J95m50L48p7J3K17k29N1r2J89k08J69n9oLj97N0j15L46l40M39k78j26
5477a82j59L63K38l10j84k5K68O6j02M1q9j26K64l1pJ92j91j07L4n0J24P6j87
$$ plain form
5303 -242 -67 -102 67 2 116 -115 -83 -49 3 57 -35 9 2 11 -163 228 -129 -96 -125 -39 35 123 -249 31 32 64 273
5330 273 28 -174 -126 169 -324 11 82 73 93 31 107 96 97 -244 -248 45 -47 -320 18 1 -61 204 97 -87 -8
5355 -8 -86 159 -73 25 31 -116 -27 -78 37 -92 -25 -68 -94 -230 70 16 55 4 103 -258 -167 165 -173 22 -110
5380 -110 -76 -155 210 -156 -61 -30 75 23 181 171 -204 -131 -143 342 -204 -133 -183 -125 176 89 -38 -124 -254 -299 -117
5405 -117 -55 -146 134 197 -74 -35 -87 87 207 -52 -158 103 -124 -25 -104 233 37 218 67 -30 73 140 -68
5428 -68 -121 -107 129 106 139 -122 19 85 -79 -43 -13 19 235 16 -91 16 -40 -23 71 -77 83 93 11 -56 80
5453 80 -25 170 -280 68 -9 4 221 -8 43 -49 140 -68 101 42 36 39 -158 -108 -223 123 -217 222 -56 -182
5477 -182 -341 22 260 -50 -234 -259 9 75 -27 14 -75 -201 63 32 25 217 26 -81 -47 -97 27 103 -84
5500h4K2K11q7l49K85R8j46R7j39l3K46o9j81J48J53m04L86k06K51j03j12l7M11
5523C58n52K15J58j92O4k11J65J56j36q9K57l25L23l18Q8K83j54l3R7J98k00N7
5545B09R4k95k49L84j24k08K12k17J52oo2J46M7k04k2R0L1kL16l04rJ39l02K41
5569E7j0k67J36j10K99Rk12n6M9J53P6j07k4J40k45m7K29j09M4m1K97k52p8P3
5593DR9j23j44K38J74j86pk8m5j85K79j18l7K09R4l95L61p2k51L39m03M19l20
5616i8n6L93j47n4j94J65J27j6q6n8j03M61m68J01l06K18L9J38o9j11K66k43K06
5639A05j08K13j93M7J4J8J3O1j13j16J26N0j95L10j48m6k20J47m0J69j6k43J70
5662EL5k85m7L65l72L93r7r2J50J9lk80J32n0J22k16L20n8m13M61o6L1K6N5j93
$$ plain form
5500 -84 -62 149 62 -287 -2 96 -50 47 -92 -125 121 52 -129 19 172 -232 154 -52 199 96 -16 -53 358
5523 358 -194 21 179 -13 51 -160 5 161 25 -64 193 -132 191 -127 -39 244 90 57 154 352 152 209
5545 209 303 8 -241 143 19 -189 23 -194 -42 -48 -110 36 83 -121 -143 -53 -22 -24 292 -12 -21 118 -184 57
5569 57 47 -220 -84 -194 105 114 -98 -154 -105 48 124 17 -7 133 -112 -159 70 -39 5 -36 261 9 -69 4
5593 4 103 -20 -164 74 248 62 55 27 -18 -203 76 -42 -79 130 224 -171 190 118 -133 206 -197 222 -98
5616 -98 -154 239 92 38 -156 9 136 120 34 -24 -127 334 -134 -33 -339 -121 -82 56 -13 -124 142 -101 105
5639 105 -3 210 17 64 78 96 109 170 57 -59 67 117 -78 232 84 38 -182 -35 -75 94 78 -165 5
5662 5 40 -245 -292 73 -299 94 -3 -95 55 74 71 -209 -77 -127 -5 -221 99 41 -372 89 23 54 80 135 -58
5687e8M0JJ19j11M4J09l1L9k32K79j89q9l9J64K8k03L09l84J25J67k12k1j1K53
5711I7p1l15L77j81K00k18L5K29q7k39J21J10m4J8J9K8k12J60jm8q7N5j4K31m04
5736b41J46M2K03m61J73L10m7q7Om7nj24K01J10n6o2q4J35l12K23p8N1R1k50O7
5761i6m9J65j7k04J52J48k63M42k62k77M15j01j82J57k73K04J31n2j99K4J63k38
5783b12J64K27J4L8m3q8j38n1MJ10J14l59J99J80nr4J0j30n8M90m82J94l51O6
5807b01K99o8j19K16J42j70k81j9K69j38M6k08K26P1o1j10K28j78p8K91m18L94
5829A33j53j0J48j5j95J11RR3p4J72j29k58K06J52k58J16r7q3K43p5j43l0Q2k
5853e7m2N8N6q1o6j07K82j46J43j50L39k73k2J2N6R7j75L54k03l18K01O3k20J27
$$ plain form
5687 -58 -18 -17 102 -9 35 144 113 152 -80 199 10 -79 -118 46 74 -129 180 -204 -79 88 -124 -145 -156 97
5711 97 26 -289 88 -93 107 -111 -76 153 66 -173 -52 58 14 32 51 79 -133 27 26 -22 -109 -54 -68 163 -241
5736 -241 -95 -53 150 -311 -138 172 125 38 44 -3 -8 -132 69 179 123 61 -23 112 -200 23 -55 -4 87 -163 -96
5761 -96 -145 20 3 -201 -49 99 -164 278 16 -261 154 53 -129 28 -245 -41 90 38 -161 -137 26 -212
5783 -212 -48 179 193 231 188 100 -38 -89 -85 25 139 -220 -21 159 154 60 70 -60 -118 372 -110 84 -267 -201
5807 -201 98 30 -89 127 269 99 -182 -201 68 -70 -24 -232 -6 65 4 -106 122 -56 -134 157 -261 133
5829 133 -20 -30 118 103 -92 19 28 121 47 219 90 -168 38 190 -68 48 -49 -132 111 36 -107 -137 -55 -57
5853 -57 -99 -41 15 -66 -132 -239 43 -103 40 -110 229 -44 -66 -54 2 99 -76 278 75 -243 -42 21 -199 -72
5877g2q4J27n7J08j35K71k89K50j99K9J30j50J69l44L11p4J27j61L7L9k9P0l0
5900D4%J02l10R4Q5K3r7J91j53oRO7k8l60M43j0j27P7N9n4j38jl6P0J49l1l62
5927c00K30J04N8j15L8n8P1o4J02k41J87j6J79j67J77p3R7k02N0j23j09K4P6J1
5951f4J0NR1n5l5j7%J27M6O6k63J09r4L0K97l13j76K91j68K47k3Q3j55J6o9J27
5977A13k53O3K33j67Q2j91O3K67o9j51j11p3K81l7o9R2j29N7j36J06J45j68P2
6000B0n4K68j81O4l5k64K23q7n4M3p2KM8J6l6m1J06J32k04K20j47J33j7j33J45
6025I5j27N9J58j59k00J62r6J4n8J38P6j49N4JJ71j41j90K74J2j89J71j53L42
6048B65k10L07n88K25J21l56L57k52J52L5N8j48j28L29R7o6r8j11M57l41J09m08
$$ plain form
5877 -72 -156 -29 -86 22 -113 158 -131 119 -80 -51 79 -71 98 -246 65 -9 118 -43 -6 33 4 74 44
5900 44 44 146 -164 -70 15 38 -59 132 -21 -27 -18 49 21 -339 104 94 -33 44 103 49 -89 -90 -126 -56 93 62 -300
5927 -300 -70 34 92 -23 15 -43 28 -36 66 -175 12 -4 175 8 185 112 209 7 57 -66 -175 -151 -75 -64
5951 -64 -54 -49 42 -13 -48 -65 -65 62 108 174 -89 20 -74 -44 253 -60 -236 55 -113 134 111 194 39 55 -14 113
5977 113 -140 -77 156 -11 71 -120 -57 210 141 -10 -121 -194 87 50 -19 73 -56 1 -135 -29 116 -52 20
6000 20 -34 234 53 117 82 -182 41 -46 -100 -57 -129 -127 -79 -63 -99 -140 -34 98 -106 114 -33 100 83 -50 95
6025 95 -32 27 185 26 -174 -12 -108 -94 -152 -14 62 -87 -33 -32 139 -2 -192 82 94 -95 76 -77 265
6048 265 55 362 -226 -1 120 -236 121 -131 21 56 114 -34 -162 167 264 198 100 -11 446 105 214 -194
6070a94J98J23O9j82n9J34k25J85j47n6M3J18J19j19J41j95M1J50k14K81l57J31
6092a5k89K57O5l48K58J87J1J33k78R6m11L62J7q9j2R8J1k69M72m11Q5m0j53L80
6116A17k34j0L50k40N2j48P1M7l0m9k88M10K40n28L83r5j87J98J2q0R1mk6j17
6140f5J23J2j92j46M15q1m18M60k42L58p2j77p6l6J04M6j48J65K8Kl29R8K35L0
6164I4k78N6K79j59M4j27J64j98K36K9j68o5j48J69R0j42L9K95k87R3k14J97j11
6187a12L23k60J36j10j61l0K78N1lo7J03j89J83k90J40J53n6q0k26oJ63OJ85j25
6211FJ64j40k00L10M3l06J4K72l19J67q2J35j88J9n5J12K27j70j30Q6Q0L81l42
6234H4k1r0j00J90j07K24l02P2Q6j35J03N7J28l35K18n2j84K07j38J76k3O6l3
$$ plain form
6070 -194 4 127 196 14 -45 89 -136 49 -98 -154 -111 7 126 7 148 -47 -6 144 -70 211 -146 -15
6092 -15 -304 -47 18 -330 -72 115 126 259 -19 77 -334 28 45 -44 -56 42 53 -216 256 -155 -70 -110 -263 117
6116 117 -117 -127 223 -17 35 -113 -42 5 -25 -74 -362 48 288 -240 143 48 -139 59 71 -9 82 78 52 -65
6140 -65 58 70 -122 -268 147 66 -352 108 -134 224 152 -25 -101 -137 -33 13 -135 30 58 60 -269 -171 64 94
6164 94 -184 -128 151 -8 36 -91 73 -125 111 140 -28 -93 -241 -72 18 -124 -85 210 -77 16 -198 -1 -112
6187 -112 211 -49 87 -23 -184 -214 64 115 112 45 148 -41 142 -148 -8 145 89 9 -217 -223 -60 -54 131 6
6211 6 170 30 -170 140 183 -123 -109 163 -156 11 -71 64 -124 -105 -160 -48 179 9 -121 -35 45 426 84
6234 84 63 -27 -127 63 -44 180 -122 -50 36 -99 4 61 189 -146 72 20 -164 43 -95 81 58 124 91
6257I1o8J59j19j62M0L7J83m99L26J68l83J55P6Pj21k0J28LJ24q1m16L62j5N0
6281B5J5m1l9k2N2J06R5l41K96j56o8R8k17J79J25J5l5j00j31j59L97k51J47m3
6305e3J39j23J76q2P4kj10n9J19lk25J29QoK23j34L02k72k06K91k85J58n5J63
6329A67k95M0J37J1l04K37k6J45j44l3J35k77K13J05J38k77n3Q5J07Q0k50m5j
6352a05R8J26k16L8O1k5l3p5PJ89JN1k71PL6K63l75K46k07M20j99M3r1j28J77
6377C8k29K95j17M8K6J39j67k40K40J27k02O4p9K73r1l64J64j02J14J57M7k67
6399a26K28j13J61q8j70P5j28N8J49N9k69M09m24K93l8P6j42q4r2L86j49j68K43
6422A46o3J10k28L02j68k5J14m29J41K03m86M00J26j28j27J07M6j78K68k57K83
$$ plain form
6257 91 23 182 63 -99 -59 -22 161 -338 -12 156 -227 -72 4 11 -110 -130 -2 1 125 44 -372 -10 -25 25
6281 25 40 -1 -40 -62 -10 96 191 -150 146 -10 -78 20 -197 -18 107 122 87 -13 -144 -303 94 -157 -10 -53
6305 -53 86 -37 139 57 131 129 19 -40 79 76 -149 -20 -12 -18 205 71 373 101 -105 186 -99 59 4 167
6329 167 -128 -88 49 60 -244 -7 -33 112 -32 -65 70 -207 6 111 249 -28 -81 4 111 191 -59 -104 -105
6352 -105 -7 119 -97 -59 2 -23 -56 -131 -124 65 66 117 -154 -147 -111 152 -223 23 -184 236 37 80 -11 -139 38
6377 38 -191 104 -13 35 61 200 33 -207 33 160 -42 22 -57 216 125 -239 -75 -177 -63 94 141 -126
6399 -126 102 -11 150 62 -108 -33 -161 -103 46 105 -164 245 -179 114 76 152 10 -74 -166 220 71 -97 146
6422 146 83 193 -35 267 99 74 188 -241 -100 103 -383 17 143 15 -112 -5 41 -137 131 -126 157
6443A57j32Kj08lO5P3r0L4J60j15m2M5n1jM1N4K1k4j05m1L5J38r9j14k5J43j46
6470a28K48k7k61o8K58j25Q0K58j05k52K90j65KJ17Pj28j23j6m4L77r9j40l7M4
6494c7k6J50j52k0K24K17m64J54k60L14q3j58O8P7J39l42M07l8K3m08M49l19K64
6517A79j63O4r4R5j86J93j46N5K30j29n7n0j5j11M7J01j43L05q2j13J27k48Q1
6540f0P2k22L83N0l5O4k12k7l6k6K30J72m38J00Q4r0Qp7j5oJ69m5J09k36L2J47
6566I5p7J66j12q1K8o1K09j44l8p5rJ16k38M37k53M5J35k53J42O0k5Qj32K66m36
6591b27L28k11j70O4N3K04O9j3op1K0L4q9l8J0p4J85r1l4mJ57M2l83K50J66m10
6617b39L63q8j89L38l29K95p4j22N4n3J01M3r3j35K47j05J6j34L63l16j64J91
$$ plain form
6443 157 25 27 -81 -84 -19 54 -36 -2 158 43 1 46 -5 -6 35 89 110 86 -19 -60 -25 113 14 -100 -125 18 -128
6470 -128 120 93 -168 -236 22 -103 -23 235 130 -122 168 3 5 122 129 1 -122 -138 -182 195 96 -44 -81 -37
6494 -37 -63 87 -65 -85 139 356 -108 46 -214 100 17 -141 -73 4 143 -199 208 170 193 -215 234 -85 179
6517 179 16 80 -14 81 -105 88 -58 -3 227 98 41 -9 -24 -135 -88 13 -130 175 93 -20 107 -141 -60
6540 -60 12 -210 173 223 188 252 40 13 -23 -49 181 353 -85 15 99 9 17 -60 -75 -81 88 43 152 -84 -52 95
6566 95 18 184 72 -9 19 -42 167 23 -15 -90 -99 17 -221 216 -37 8 143 -110 32 92 67 75 -57 209 -227
6591 -227 101 -110 -280 -216 -163 41 110 97 91 20 40 74 -15 -53 -43 -117 68 -23 -57 -61 96 138 -245 5 171 -239
6617 -239 124 36 -153 185 -144 151 77 -45 9 -44 57 100 7 -128 119 14 30 -104 259 -57 -221 -30
6639c0K44k78Q1j26r2K20k23J00K81m06K42Kj6j69J74J10o6k06J85%j46N1J4J30
6663G6l4O4p3L1Q1l50L10m2K06p6Ok67l5J39Q8j80q4P1l3l3L24k62QOk4OR8M8
6691F9k06M3O4j1JO0l7P4j28J55m6j39J17K5p0R4P8J25k11N2j42O9o4k02K6N4
6717a50k4M9J22O1j72K08J50k37k44K46Pj35P8N7j03J05j5K51m20K13K4j30L14
6740B55j54j72K71k72J1O6%M9j02n3K3K80j13R9k08J92m49N1L97N7j06k69J63
6763A6j64L8J9oO3M2J45k13j14J33N1Ml1J5KO2j53l9J02O8L7M3k23K27j66j42
6789a84L12k39K12r9K1p9k04L73k28j3K08P4o2J14j55j2j72L52j75P3j01m01K45
6812a40J50n5k05K04J39q1j22K87l88M17k8k13kQ5p7j14m2K62n8m0j66K81j38
$$ plain form
6639 -30 214 -64 17 -109 -201 19 -204 -104 177 -229 13 15 -1 -170 4 114 48 -158 27 27 -119 -68 -54 76
6663 76 42 106 33 64 145 -205 105 63 269 193 199 -68 -103 36 124 -56 -140 -69 -102 -135 189 -73 -65 -59 -83 -77 21 69
6691 69 -137 -94 -30 -41 -40 20 -17 57 -71 84 38 -101 16 41 -29 65 143 268 57 109 -33 36 -28 -230 -204 -150
6717 -150 -174 -125 -3 58 -114 94 244 7 -237 9 16 -119 -41 16 -87 18 3 254 -166 47 71 -59 255
6740 255 101 -71 200 -72 -61 5 5 54 -48 -101 -78 202 89 188 -20 172 -277 -226 171 228 122 -147 16
6763 16 -148 -110 -91 -97 -34 8 153 -60 -174 -41 10 14 -17 -2 0 62 -91 -130 -28 40 77 120 -103 124 -42 -184
6789 -184 128 -111 101 2 23 -56 -260 113 -115 -128 80 154 92 206 51 39 -133 219 44 117 16 -385 -140
6812 -140 10 -45 -250 -46 93 12 -110 177 -211 206 178 -35 -37 48 -29 -143 -185 77 19 -21 -187 94 -44
6835d4J42j13L74m17N6j43N2J39j24K24j26M6J04j10J31Jj57n9L0O1K8q5k3J10
6859I7L3m45J05K03j7O2M2J0J47l08J74j19j97L66L2k64J98q1J52Oj33Q8p7J06
6883A80m37J11K06p0j7n9J7J07k24J99J52k19n5J80K28j59k45K06j17r4m5L77
6905B22l28J81j60J8N0J74j93K55k28p7K93k71L0L6M1j63L18j51O9K5j39pJ14
6928A09J82l45o5J8j47J61J37J24l57M7O6j19L51k21n0L56l09K8K3j08K34q3j50
6951a18Q0J64j91K65p0j83j2J50l24K54q2p9R2J69j51J89p2j71J32J52r0Q1j21
6974F4J0K08l54M2J5J34l2l4k04L03j95J58P7j54J97k63j14L69k53J7o7O2j8K13
6998A81l09J32m0j5Q8o6K30r2O8kk92J99l7J26j50l01L76j97J6K58l83Q8O9J59
$$ plain form
6835 -44 98 -15 359 -58 -2 -145 -93 46 -78 146 20 66 170 60 191 192 35 -24 6 67 95 10 -13 97
6859 97 130 -315 -210 -7 -24 38 80 90 237 -71 103 -16 -213 153 185 -79 119 38 190 196 63 151 74 180
6883 180 -257 -146 60 -10 -27 -86 -69 38 -186 13 165 -54 -109 71 299 140 -105 101 -16 -110 -155 222
6905 222 -106 75 -85 -67 -17 157 -36 219 -9 -86 207 -64 -34 2 43 -120 198 47 116 141 2 -5 109
6928 109 291 -54 -119 -101 -248 -87 50 174 -183 -136 -70 -189 162 -59 -109 247 -62 -34 -11 -119 115 32 -118
6951 -118 -38 126 -65 200 130 -53 -65 85 -239 15 -67 -146 -54 115 -36 153 81 -90 42 194 104 185 64
6974 64 74 282 -72 -30 -15 119 87 53 -151 152 -43 115 192 38 235 -28 -142 227 -26 -9 -76 -14 -32 181
6998 181 -128 4 -36 -51 37 -29 201 109 177 175 -117 82 45 171 21 -280 96 -101 -85 173 -210 -122 -53 106
7022A06j60N4J70j50M6k13M41l74K78k77K07k49K65j08k6k32K61j2j10P0j90J68
7044c5K39K5o8k36J49j43j10M37j42j03j09j9j9J90L1J85k93M8MK18l04op4J57
7068B2J2j41p4L39l15R0%K33j51k7K6r3L8J81j04K1j96L93Q9l04K40n37L58j96
7092i6J29o1J68j75K51k61L9r9N1Q7O2m18L30K33l14L59r9k32Q7Rj0K52l71k6
7116a05K22k38J89j10K0R1j26q2J17k81K54n6j50ML27l4k02K04N2o2q9J33k30
7139a52J18J02j43o7K30Qk29k9L14k80J23k7J23k00j44L76k06RJ45k7M8l93M99
7162A98l44J1J29l3q5J62Q3Ml21L77l36K65j01jj70K04o5j35K13J50k67jK64j05
7186I6K2k82K41R8k15J91J08k97j53L01j64r3N7K33l04O5J61m4k94r1K35qN4o1
$$ plain form
7022 106 -54 0 170 20 66 -147 294 -80 198 -79 128 -121 144 36 10 -222 39 27 -83 -13 -203 -35
7044 -35 204 229 161 -75 74 -69 -179 258 116 13 -96 -115 -134 56 87 272 -21 27 31 249 -55 -61 -135 22
7068 22 34 -107 -181 158 -157 -67 -67 166 15 -12 14 -79 -41 140 36 57 -139 254 343 39 279 -258 100 -96
7092 -96 33 -28 140 -35 216 -45 -6 -105 -54 33 95 -323 7 240 -74 285 186 -46 41 50 40 292 -79 -105
7116 -105 117 -121 68 -42 -22 69 -57 -139 -22 -303 -49 -105 -255 -251 76 42 -160 44 96 34 -55 78 -152
7139 -152 -34 68 -75 -142 88 96 -133 -162 152 -128 -5 -32 91 -109 -253 123 -83 -74 71 44 92 -301 198
7162 198 -146 -135 -6 -39 -124 38 121 125 -196 181 -155 110 9 8 -162 42 -23 -158 55 205 -62 -63 201 96
7186 96 118 -164 77 175 -40 151 259 -38 -191 110 -54 -147 -90 143 -161 -96 65 21 -273 -364 -129 -137 -83 -144
7210a44K29K6k03R7J13k98K49l3k10K33k02j83L46j91J09K37k69n5J13J27j15
7231b4L09l70K33j86N6Q7j49M2j04o6K74q8l17L23o1m7J33J09l1j23k05K67o1
7254AP7l8j5K93l21K8Mk41M00l99O0K39j49M7J70p7Q6j11o1J6j50J88l6O5m1m8
7280a3K43j20l2k26L41j15j09J29o5l8j96K30J81j60l0K10k26J6n7M1p1J49K3
7303A05k34J53j70O8J80j59p8K05p8om3k10L97k89J55N4l4n4j7qm3J34J14j98
7327e6J73j12P4Q7k43K3K49l03M2k00K81o9q6J5k4J94j91K60l52J87l8L16k18
7350Ij72K43P9j59j47K32J3j19k05K99q8O2j05J45k80L78Nk30J16j99J95n5k37
7373b20N4J17N6j32K62l24K00L1m7o0J86j13M4j8j57J26k04K18ON3k11L44l98
$$ plain form
7210 -144 85 111 -92 5 118 -180 69 36 -174 59 -143 -326 20 -171 -62 175 -94 -149 -36 91 -24
7231 -24 285 -85 148 -38 18 105 -44 -2 -106 -172 102 14 -303 20 -41 -88 45 154 123 0 -205 62 1
7254 1 78 40 25 318 -3 25 29 -212 188 -211 -151 88 -61 -14 156 79 165 54 -7 9 -141 47 11 76 35 -13
7280 -13 230 110 78 -148 193 78 -31 98 33 -5 -201 29 210 50 20 230 4 20 -37 4 -67 82 105
7303 105 -129 24 -146 -78 102 -57 -135 70 -8 -14 -57 -267 130 -159 -4 50 16 -38 -55 -63 -106 28 142 -56
7327 -56 117 5 79 166 -77 -54 195 -108 -66 -266 15 -54 -140 -125 -149 45 -146 114 -238 -51 -89 227 9
7350 9 -163 80 159 0 -147 85 98 -21 -226 73 -15 47 -58 87 -193 185 190 -40 76 -123 72 17 -220
7373 -220 -166 -49 7 -125 137 -187 13 44 -3 -63 123 10 54 36 -121 5 -199 19 25 78 -133 211 -187
7396a87P9K14n0j70M05k35N7Q1j49k7O3j17j14k5K94j89N3J5Q1j91L02j22j66
7419i8l3qK08l8l7l8J53k25K76r3m6p0r2J48o0j87J45K20j79KJ79k6n5k52M15
7444B09k41J05K19k37oJ57j99J9lj4j03K50j70J35o0j36j6L5K71n7j51o8Q2k8
7468gK77j68J46m4j99j33K82k69NK33j00J2m7J42j25m3R2j9p8p5m7J51j22L2K06
7493A02j24K08j56J02J69j52j25j2p0RK77k81J49k91L05R7k78J69k5l1j41J63
7515F4qj51J29j45P1K8N5r2m7J91n6j93m6J77l8J09l24O2K54j86L78q6K38l06
7539G8k44K1K73k51K4nJ76j24J34K42k41K94l40K66j77k59J25o4Q9J16K9L8k23
7562b3P5o4J6l7mN6j39K30q6p7rJ15k51J05K77l97R1J39k7l0L7l9J0K01p4k51
$$ plain form
7396 -187 -108 106 56 -114 291 56 113 194 45 18 81 -36 -150 -175 119 -70 -17 -2 79 -112 190 68 -98
7419 -98 -131 -139 69 31 -6 -44 109 -116 160 67 21 -49 -141 7 -53 -240 -95 125 -54 -52 127 101 46 -206 209
7444 209 -32 73 292 55 49 206 7 26 23 9 -94 156 -14 121 61 -75 -91 -56 215 158 7 -61 21 -7
7468 -7 270 102 248 204 5 -128 154 -115 -110 123 23 35 -12 130 5 -38 54 35 -43 -118 -165 -14 -136 -104 102
7493 102 -22 186 30 132 301 149 24 12 -58 -49 228 -53 96 -195 110 207 -71 98 73 42 -99 64
7515 64 56 -95 34 -111 -40 -12 43 -49 -96 95 39 -154 -200 -23 -61 48 -276 -214 40 -146 232 146 384 78
7539 78 -166 -145 128 -123 -99 -104 72 -52 82 324 83 377 37 303 126 -133 -8 -72 17 133 162 200 -23
7562 -23 52 -12 4 -33 -37 19 -120 110 24 -53 -62 53 -198 -93 184 -213 -122 17 -10 -40 -3 -42 -32 169 95 -156
7588a56J18J37o4q5J53k81K95j53J34o1p5J83j01j23J05r7J7K3j33L25k97J1L9
7611h6K1K24k52M5j19K39n7o9L6J6J13j51K45m28R2K9N5J73j63q0J13q7k09M11
7635A11j14N7J20m94L07L10k90L21k93j44L29l57L8J42j55J72q8n1Mr4q0M44j59
7658C6l07L47p0J47m1l01K29N4k30J67O1K15m09K77k95L62j33j37J58j22j29J49
7680B8m8p6J47q2K83k77M1o5pJ11J44j37j69J07J58j5r4j66Q7R1k58K34O3O2m30
7705b68K57j53L64l39L09k02j07K31R0k27M15k87k29J11p2M29l18k02J34J91j76
7726d9J67n6m0j14J75J3k51j9M05k2j74k5J4j25J8J11K77k77j6n5O0K3j37p4M25
7751B54j56k86K08K88l09j50J84oO2j30l7M6j1J57k47Q8j56K93l38J74L5N5j43
$$ plain form
7588 -156 -38 99 35 -50 103 -178 117 -36 98 37 -38 145 44 -79 26 -71 -54 -31 -164 161 -136 -125 -86
7611 -86 -65 159 -93 -48 -167 72 15 -54 -18 -2 111 -40 205 -223 -131 -102 -47 126 -37 -117 -4 -91 -300 111
7635 111 -3 54 174 -320 -13 297 7 328 35 -109 220 -137 -99 43 -112 60 -28 -79 -75 -169 -249 195 36
7658 36 -271 76 6 153 112 -189 40 94 -136 31 92 307 -102 175 -120 242 109 -28 130 8 -121 28
7680 28 -20 -96 51 -31 252 -25 16 -49 -56 55 199 62 -107 0 158 143 49 -117 -30 61 -197 37 100 162 -268
7705 -268 -11 -164 200 -139 170 -32 -139 92 182 -45 370 83 -146 -35 -107 322 4 -198 -64 127 -49
7726 -49 118 62 22 -92 83 96 -155 -174 231 209 35 10 24 -101 -83 28 305 28 12 -43 17 40 -97 -171 254
7751 254 98 -188 20 308 -1 -151 33 27 89 -41 -78 -32 -43 114 -133 -45 -201 92 -246 -72 -37 18 -125
7774a25J13R6r8K9j16J92k78rJ05K04k27K06M4l17K38j01L10j60l84L22p4j82
7796b12K80J5j17L00k51k39M58J57m07M1J1J79k77p9J06L9R2J7j86J27L0l88K99
7819eJ72k84M26k28O4j14Lj91J30j19K2J77o8P7k14K44p2M0K76l73J7j15%L3K10
7844A08J62k37R2j59O2o1J7K04m80K59RN9p8l4M2l1J40N5k28J88j63Q6j98J26
7868f0J31l01J89rR0Nj48K21m4j74K61k41rM5r3M0q2M14k82r3k4q6K03l4J22j3
7894B8n0p6j06K41j27n8O9K36L6j29k26J08J23P6j77r4J76J49k83R8mk6J59K1
7918A64j03j60Q8O3R3j83m2J52j13j7L7k5J16m9n1J89j57j47P1J24nl8j9J35k40
7943a17M7R6k26K07O6m5k5J64m6k36k5L4K45R0l43K6PJ8J0j2j76j15L48l3l6P9
$$ plain form
7774 -125 -12 84 -14 15 -101 91 -187 -196 -91 113 -114 92 136 -181 57 -44 266 106 -278 44 -30 -212
7796 -212 68 83 -34 266 15 -224 234 391 -16 25 36 215 -62 -141 -35 4 96 113 -73 54 84 -304 -5
7819 -5 167 -117 309 81 145 31 34 -157 -27 -146 -124 53 -15 62 -152 92 20 60 336 -37 -20 -135 -135 -102 108
7844 108 270 33 125 -34 28 -33 -16 188 -292 -33 -24 35 -43 -77 -35 -66 74 129 -99 89 -74 12 -186 -60
7868 -60 71 -230 -41 -50 40 45 -103 118 74 -100 161 -80 -89 -44 -137 -97 -179 235 -47 -140 -164 -250 -47 -81 41 28
7894 28 -22 -98 -204 37 -90 -148 -79 157 193 64 -162 -54 69 145 -32 -126 50 199 -84 14 10 -16 143 164
7918 164 61 -99 -11 52 145 -38 -80 72 -41 -58 -21 -46 70 21 -30 159 2 -145 -74 50 45 7 -12 123 -117
7943 -117 -70 26 -200 7 73 28 3 167 121 -115 -140 -106 139 229 -114 -88 -81 -63 -53 -65 -241 -356 -8 -41 -77 2
7969Bn3J44O3k86L3K67l68L98l50J89N8lL5j09q5k35L31j35L8K92r3k03p0J10
7993c0k5J73j40K01L3j04J00j57R8l15L7K20k65J07K62k55K68l18J54j40O2K6
8015hJ29j63Q7o3p4P4N6nJ59k73j45J75Q5K2K3L6j36k33K05K07j10J15l98O9N4
8040a12L2j15J39QJ52k03J37k6o7J72l16J89q0J08j20J66k08K52r7l42J19J41
8062g1R3J20M0k05q0J35L6k9J16l82M91rm9k53p7K75k27K15l29J13J55k83K85
8085H0R7l62M45k19l9J97j66nN4j11L0%j1n7K85k70r4K64n4q6J13k45K02N7j68
8110f3J44l18L51k68J26j5K1K42j88j38M8J10j67K94l71K70k10MK37l45L91n6
8132I9k19l7L5J02M1r0L1L04l68N1N4j42L42M0k48L4l21K98q1J15j53j4J14n7
$$ plain form
7969 2 -51 93 156 -130 -97 170 -198 200 -150 39 97 94 129 20 -65 -300 31 -104 -66 226 133 -70 -140 -30
7993 -30 -55 118 -22 179 212 108 208 51 149 -166 -129 91 -174 -67 195 -60 208 -110 44 -96 -34 -8
8015 -8 121 -42 45 -18 -92 -18 38 33 192 -81 -226 -51 34 56 79 115 -21 -254 -49 158 48 163 -235 -166 -112
8040 -112 -80 -195 -56 -48 104 -99 38 12 -55 117 -199 -10 -90 18 -102 64 -144 108 11 -331 -212 -71
8062 -71 22 142 182 -23 -103 32 68 39 155 -227 264 255 206 -47 -124 151 -76 139 -190 -77 78 -205 80
8085 80 177 -185 260 41 2 199 33 28 82 -29 1 1 -10 -67 218 -52 -146 118 64 -22 91 -154 48 105 -63
8110 -63 81 -237 114 -154 -28 -43 -22 220 32 -106 -58 52 -115 179 -192 78 -132 -128 109 -236 155 99
8132 99 -120 -157 -122 -20 21 -69 -38 266 -102 -51 3 -139 203 243 -5 29 -292 6 -75 40 -113 -127 -13 -70
8156g0K74j25k45K09l5k14J78j47J7o4k8L11pn9o0N7L00j79R7j98M4l3o1Kq9J92
8182F7%L8j14J29j93K3M7l12J93
$$ plain form
8156 -70 204 79 -166 43 8 -206 -28 -175 -158 -222 -250 61 54 -5 -65 -8 292 113 210 12 56 23 -38 -36 -125 67
8182 67 67 105 -9 120 -73 -50 -3 -315 -122
8191a22
$$ Imaginary data points
##PAGE= N=2
##DATA TABLE= (X++(I..I)), XYDATA
0@%%%%%%%%%%%%%%jRj6J6j6J6k4L2l2M0m8N6o4P2q8J04j20J36j52J68j91K16k41
37a28K72l05L38l75M17m61N12n67O25o90P62q41R27j020J124j238J365j509J668
56H76j849K056k298K582k918L328l841M501n385O640q572J1945j9478O7068j7720
71C6935j04208J00347m730m9748L0288J2399l3236J6507j5990K5241J2312n7259
83c1142R531O0456l7069l4494N4501j9832k8461M1419k653k1706J599M583R380
96F112J4145l9041R044K7676k3235N594R648j8394J758J3416j0758J7545k1487
109g977k1006M8592r609l3559J9565J1731k7977J7929J5150k6827k034J2992O258
122C228m442l405j2660J9989M017j7651J7070o037j5032J9646J5959k9775L603
$$ plain form
0 0 0 0 0 0 0 0 0 0 0 0 0 0 0 0 -1 8 -8 8 -8 8 -16 16 -16 24 -24 32 -32 40 -48 56 -64 72 -80 88 -103 113 -128
37 -128 144 -161 177 -198 219 -242 270 -297 328 -362 400 -441 486 -534 590 -648 717 -792 876
56 876 -973 1083 -1215 1367 -1551 1777 -2064 2437 -2948 3692 -4880 7065 -12413 54655 36935
71 36935 -67273 33074 28344 -21404 8884 21283 -11953 4554 -11436 13805 26117 -31142
83 -31142 -21611 38845 1776 -32718 21783 1951 -26510 14909 12256 -9450 -7851 -3268 6112
96 6112 20257 -18784 -9740 17936 -5299 295 9943 -8451 -6693 6723 -4035 13510 -7977
109 -7977 -28983 19609 10000 -23559 -3994 7737 -20240 -2311 12839 -13988 -16022 -3030 3228
122 3228 -1214 -4619 -17279 2710 6727 -10924 6146 109 -14923 4723 20682 -9093 -5490
135e490J6149j2310P491P753j3524j1835K5359Q7j6638M972L131p001N380J2179
149A5703j9846n2L986N657O828j8250k408J5871m198j0417K0482j5939j3262K4876
163I031L093j6008k832J0111n394P981k623o605J965l032R574L281j4408n526
177a1392K0515j0948j450J1991k1917M088J8756j0008r777J2262j3609P185J3638
190I334j9240L839K680m480R971M611k2379R631J3036j3799J0333j067j3867Q729
204b668J5307j5826K497N120j4324J7788L749j6044J743Q113o754J0543l501j3881
218h138J4617n743J174R487j2876r944K1521n33j5487J0474n573j540P252K243
232F934p659k078l0O644P859j8278K592R312n122n1P555j1225n642J7093n060
$$ plain form
135 -5490 10659 -1651 5840 13593 69 -11766 13593 13680 -2958 2014 5145 -1856 3524 15703
149 15703 -4143 -4195 -209 5448 12276 -5974 -8382 7489 3291 -7126 13356 -2583 -15845 9031
163 9031 12124 -3884 -6716 3395 -1999 5982 3359 -3246 -1281 -4313 5261 8542 -5866 -11392
177 -11392 9123 -1825 -3275 8716 -13201 -9113 9643 -365 -10142 2120 -11489 -4304 9334
190 9334 -9906 -6067 -3387 -7867 2104 6715 -15664 -6033 7003 -6796 3537 2470 -11397 -2668
204 -2668 12639 -3187 -690 4430 -9894 7894 11643 -4401 -2658 5455 -1299 9244 5743 -8138
218 -8138 6479 736 1910 11397 -1479 -11423 10098 9565 -5922 4552 -1021 -2561 4691 6934
232 6934 -725 -2803 -2833 3811 11670 -6608 -4016 5296 174 123 7678 -3547 -9189 7904 2844
247B844j870l871l370P869L003o477j252O67n580J3196l765p985J050J246M476
262A81J371l842q011Q509R13J300j551n219J773L314N528n194k032l805Q382M412
278F029o991l56p45J957K692N074j0525O45L525J766N108r670j169M181K769j735
294B555L423r233r05J2170n039n2l587j662L797O284o039l447K649k942Q724j878
310D818o540j835N725Q0J645p79j1015R022K960l040n44j549n472Q409M330j1004
326d789L625l860K538P248n080o831M221J190r87P391j0956j006O693K87L76j217
342a157m773r0J0987n487j440m30j939M630M049l987n400N568k693P704j050j0016
358e524M052N070j625K38J057r037P781K693k208L37o860L616O514j267p247M470
$$ plain form
247 2844 974 -2897 -6267 1602 4605 -1872 -3124 -2457 -8037 5159 1394 -6591 -5541 -4295 181
262 181 1552 -2290 -10301 -1792 -879 421 -1130 -6349 -4576 -1262 4266 -928 -2960 -6765 1617 6029
278 6029 -962 -1318 -2063 -106 2586 7660 -2865 -2220 1305 3071 8179 -1491 -2660 1521 4290 2555
294 2555 5978 -3255 -4160 8010 2971 2919 -668 -2330 1467 7751 1712 -1735 914 -2028 6696 4818
310 4818 -1722 -3557 2168 2248 3893 3114 -7901 1121 4081 1041 497 -1052 -6524 1885 6215 -4789
326 -4789 -1164 -5024 -2486 4762 -318 -7149 -2928 -1738 -2725 4666 -6290 -7296 -603 -316 60 -1157
342 -1157 -5930 -6020 4967 -520 -1960 -2390 -4329 301 4350 363 -5037 531 -2162 5542 4492 -5524
358 -5524 -1472 3598 1973 2211 3268 -5769 2012 4705 2497 2834 -4026 -410 6104 4837 -2410 2060
374B060k922J762O536n891l099k1N233m38J328p300J89P161k703O94k476k696
390b583J62Q439m848l203J043l236P725q09m718k454L316K68L251l078n741N235
406a231j240L608n35n004j791O205J694l319p21m445O778J804l065q10M94k555
422d133L154Q187j0838j625N516K460j640q42k588J041M471l970N412m401o087
437e883P518O268o550n991O148J014M54k911L325k903l979P957K698p080n591
452e506R045Q73j577k635j255L274k179K097K433l331r494J1397O170j3011M58
467c241N258k545n77N956p828l75K613l39M966n297n336M235O968o671n20J143
483a590k316K630J939j58o334K324K508K321j429l619M84J321N816m672k539J698
$$ plain form
374 2060 -862 900 7436 1545 -1554 -1575 3658 3220 4548 -2752 -2563 4598 1895 2589 113 -2583
390 -2583 -2421 6018 1170 -2033 -990 -4226 3499 2690 -2028 -4482 -1166 -898 2353 -725 -6466 -1231
406 -1231 -2471 1137 602 -4402 -6193 12 1706 -1613 -2334 -6779 -1 1803 -1262 -2072 -1578 -4133
422 -4133 -979 7208 -3630 -5255 261 2721 1081 239 -2349 -1308 3163 -807 4605 204 -5883
437 -5883 1635 7903 1353 -4638 1510 2524 2978 67 3392 489 -3490 4467 7165 85 -5506
452 -5506 3539 4412 2835 200 -1055 2219 40 2137 4570 1239 -8255 3142 9312 -3699 -3241
467 -3241 2017 -528 -1105 4851 -2977 -3352 -739 -1078 3888 -1409 -6745 -2510 4458 -2213 -2733 -1590
483 -1590 -3906 -1276 663 505 -5829 -3505 -997 1324 -105 -3724 -3240 -1919 3897 -775 -3314 -1616
499a616J264m51L845j145r143P429L261k203j020j217k473O918J737q681N696
514B201j623k350O118J841r324K7Q244k116n41l260Q98J129J806q16o36o68m675
531c745P465K266n772n142O057M084o050L36K352k548l736J0228k313r334L293
546b559M130J71k373r11k726N868k603p20L930p033o44Q475M53j0380M611K201
562a10k388L148m59l756n93N677j855J195l336j813N337N15j134k846Q63K62L979
579B686j232k093r51o8N204k062j305j426Q26J522L013k597m703M886p8J167o08
596B181k286j583L710K055l242J132l858K267L917n69o096J635L225k433K693
611B748j722k075j274M315J525l842l213K087M704l868M28j038o46K52K377J357
$$ plain form
499 -1616 -352 -803 3042 1897 -7246 183 3444 1241 221 -996 -3469 3449 5186 -3495 2201
514 2201 578 -1772 4346 6187 -3137 -3110 5134 3018 2477 -783 115 1244 3050 2234 1598 930 -3745
531 -3745 3720 5986 214 -4928 1129 5213 -837 -501 1851 -697 -4433 5795 3482 -5852 -2559
546 -2559 1571 1742 -631 -1542 -4268 1600 -1003 -1723 2207 -4826 -5470 3005 3458 -6922 -2311 -110
562 -110 -2498 650 191 -3565 -4158 1519 -336 859 -2477 -4290 1047 1562 428 -2418 -1555 -1293 2686
579 2686 1454 -639 -1590 -1658 3546 1484 179 -1247 -421 1101 4114 1517 -3186 1700 1622 2789 2181
596 2181 -105 -1688 2022 4077 835 1967 -1891 376 4293 3724 -2372 -737 2488 55 2748
611 2748 1026 -1049 -2323 1992 3517 -325 -3538 -1451 3253 -615 -187 -1225 -1871 -1619 758 2115
627B115n321q05L168M264n831o03K031j378J667J585j146m826L658J946P94k648
643a330k556K748J565K99j841R59l150L229K938k990j025j189K848J739M6m744
659b454K279R64J49K378l386q75N10L353n44q58l043J052M683k449m76q81p19
676c17N05M301k317m085K343r0K836j505k168j432L311QMk6n354M101J905j108
694I12j815m12q36K336K220m385M79q87K132J264j007k858j02L162o61J186l440
711b712l01K104J746j395p85o99j343N075j182k103p24J020J859O70j024k682
727b476K249m80L077j088l289J046K069J274k142K94k199K678J340k54j631j973
743a505K990N02J333l677M54p9J601J706k577j103l33L239n93M7k694n35K825
$$ plain form
627 2115 -3206 -4011 -843 3421 -2410 -3013 -982 -2360 -693 892 -254 -5080 -1422 524 1318 -1330
643 -1330 -3886 -1138 427 726 -1115 -156 -3306 -77 2861 -129 -1154 -2343 505 2244 2290 -2454
659 -2454 -175 789 938 3316 -70 -945 -435 2918 2374 1516 -1527 -475 4208 1759 1283 402 -317
676 -317 188 4489 2172 -1913 430 340 3176 1671 -497 -1929 1382 1390 1394 1368 -3986 115 2020 912
694 912 -903 -1315 -2151 185 2405 -1980 -1501 -2388 -256 1008 1 -2857 -2959 203 -458 728 -2712
711 -2712 -3013 -909 837 -558 -1343 -2042 -3385 1690 508 -1595 -2319 -1299 560 1230 206 -2476
727 -2476 -227 -707 2370 1282 -2007 -961 1108 2382 240 534 -1665 1013 2353 2099 468 -1505
743 -1505 1485 1987 3320 -357 97 18 1619 3325 748 -355 -688 2551 1958 2005 -689 -1224 1601
760A601k07L75k870J03O07K960k145j458j41m97L561j310j367j754J593Q14J054
777I19j371k926K197L67K141k267j427m75K521J295k275L51k169K244J526J54
793H05k971J10J361N68J731l576N31N19J354R72r71k182N10L736j545j5j992L67
811f88K062N21k11k316P65k43L458j548k132j97J503J690j366j00k347K226M82
828A559N23r94k302Q80K004J115l236L79q60J681J027j496o02j652K393N18N67
845A504l588O13J168N94Q41l040P92k71J769m19m07k090K76L485j216q92j501
862b382Q92N44K155j587j980J516l77K255q73j163j659K994R32j189j8k415K735
879C80N69N58j851n98N80J330J366k231l87o51L037J70j715q48M28J151k24K150
$$ plain form
760 1601 1394 1769 -1101 -998 -391 2569 424 -1034 -1175 -1672 1889 579 -788 -2542 -949 -135 919
777 919 -452 -3378 -1181 -814 1327 -940 -2367 -2842 -321 974 -1301 -950 -3119 -875 651 805
793 805 -2166 -2056 -695 -127 1604 -1972 -1441 -922 432 1404 433 -1749 -1239 2497 952 937 -1055 -688
811 -688 1374 1895 1684 -632 133 -110 3348 1800 -332 -529 974 2664 1298 1198 -1149 1077 1559
828 1559 2082 1088 -1214 -334 1670 2785 -451 -72 -932 749 1776 280 -322 -1974 419 937 1504
845 1504 -2084 -1471 -303 291 1132 -1908 -1116 -1387 382 -37 -444 -2534 -2258 1227 11 -881 -2382
862 -2382 -1490 -946 1209 -378 -2358 -842 -1219 1036 163 -1000 -2659 335 1267 78 60 -2355 380
879 380 949 1507 -344 -942 -362 968 2334 103 -284 -935 2102 2272 557 -291 137 1288 1064 3214
897C214l827j70K011J083m01j781q12N40L613l184k59P46j662J296K701k338l865
914c095L714K76k8q17j062k95J404Q62j589O69k740J405K717q40l105J98K714
931C88j283J069j239m58o01K132J235k737j24j36K244l48o5k314J091J678p66
948b34Q01j435p15P29L483k403j696J402l79J697q0m74k729K596R70o05M75k108
966g05L98J498J945l569N41N80l53K086r89j580p93K783o01k9j93k043O08K479
984B063J28m316K504m60K49J304j481j421M74K316j398J245l065Q6K355K50j687
1001h54r55J334j156K165k82j726p36J588J522j608J8j591K088j55M72n40j362
1018a778P55Q16J371j584m78q86K860J84k011P85j152J075J171P90l188O20J506
$$ plain form
897 3214 -613 -783 1228 2311 1910 129 -683 -143 3470 286 27 773 -889 407 3108 770 -3095
914 -3095 619 895 867 50 -1012 -1307 97 959 -630 39 -2701 -1296 1421 581 -2524 -2326 388
931 388 -895 174 -1065 -1523 -2124 8 1243 -1494 -1618 -1754 490 142 77 -2237 -1146 532 -234
948 -234 567 -868 -1583 -854 2629 226 -1470 -68 -447 1250 1170 696 -2033 563 1533 928 1403 -705
966 -705 -307 1191 3136 -433 108 688 335 2421 1432 -148 -941 1842 1241 1212 1019 -1024 -416 2063
984 2063 2191 -2125 379 -81 168 1472 -9 -1430 -956 1360 -38 1207 -1858 -1772 583 833 -854
1001 -854 -1809 -475 -1631 534 252 -1474 -2210 -622 900 -708 -690 -2281 -193 -348 124 -416 -1778
1018 -1778 -1023 -207 1164 -420 -898 -1784 1076 1260 -751 34 -1118 -43 1128 1918 -1270 -650 856
1035H56l65J476k095p46Q86K401j954O45q28j145K871K1j333j517J699n08J420
1052A784m63k239J073M34Q80q48m39j288J379J377j215l91j259J500J15N38j898
1069i60m51P22N34J217j895m12k48J901j41l33j534j68K051l73J18j792M16N76
1087g72J145k53j679L32Q7J989q27n77j107J181J073k73P9j915J190N74J227j417
1105E7o82L30M13J800j838j41o26J522M57j56j033r72J960J78L58j422k83J02
1123B4J512K32j846J55m69J662j28l5k159O11J518m27O85k077L9N54J562j168
1141B45p36o3k86K111j209p07j074J399N74L17q56j710J475J63Q60j305l75j11
1159a288J181P58j386l7j097J521O86k20j446R8P64O97Q80k082m0P00Q49K93r65
$$ plain form
1035 856 491 1967 -128 -874 12 2413 459 1104 276 -869 2002 2023 690 -827 872 364 1784
1052 1784 1321 -918 155 589 1469 621 182 -1106 273 1650 435 44 -1215 285 400 938 -960
1069 -960 -1411 -689 -155 1062 -833 -1245 -1493 408 267 -66 -1600 -1768 283 -90 28 -1764 -1348 -772
1087 -772 373 120 -1559 -1227 -1140 849 22 -555 -1662 -481 592 319 398 -1517 -327 247 1474 57
1105 57 -625 -295 118 1918 80 -61 -687 835 1292 1136 103 -869 1091 1269 1627 205 -78 24
1123 24 1536 1768 -78 77 -392 1270 1142 1107 -1052 -441 1077 650 1335 -742 -703 -149 1413 245
1141 245 -491 -554 -840 1271 62 -645 -1719 -320 254 571 -285 -1995 -520 -357 503 -802 -1177 -1288
1159 -1288 -107 651 -735 -772 -1869 -348 338 118 -1328 -1230 -466 231 1111 -971 -1011 -311 538 831 -134
1178a34o34j13K261o19j66j460P12P15R18p88j413J134m82J666p44j006j11J018
1196G54P35o36O5j823J486Q58k23j005o49N57O30R14k062M5j33J225L16q14o48
1215d08q70J910m86M73j569j90R47L70K11j446r6j78J890n85r85k73R7J782o32
1234c8k59j650R78P76M56n80j000O23K47J398j472k89m47J149P93m14o08r04J415
1253A74K26N52j123p79Q83J047M02j572L23m46J446Q6p83n25k4J000P8N62j939
1272d12M09P94N80m99o94m98J32K074j295l92p46M03R10L8n24j458J256J99P73
1291A050r54j077K37M86J198j295j82p81J552J30m92n04o77Q17L84M84j834N33
1309i25M43L69M74j469k3J34J273n68L11q62k97J613j86p1j291Q03r1J183o22
$$ plain form
1178 -134 -768 -881 1380 761 595 -865 -153 562 1480 692 -721 413 -69 1597 853 -153 -264 754
1196 754 1489 853 918 -905 581 1439 1216 211 -438 119 749 1663 -399 -354 -487 738 1054 240 -408
1215 -408 -1278 632 146 619 -950 -1140 -193 177 388 -1058 -1154 -1332 558 -27 -1012 -1285 -1188 594 -38
1234 -38 -297 -1947 -969 -193 263 -317 -1317 -694 -447 951 -521 -810 -1257 -108 685 271 -337 -1241 174
1253 174 400 952 -171 -950 -67 980 1382 -190 133 -313 1133 1219 436 -89 -113 887 965 1527 -412
1272 -412 -3 791 1371 872 178 -320 -188 1886 591 199 -547 -144 766 804 280 -1178 78 277 1050
1291 1050 96 -981 -744 -258 940 -355 -537 -1318 234 364 -128 -632 -1309 -492 -108 376 -1458 -925
1309 -925 -482 -113 361 -1108 -1131 -997 276 -292 19 -843 -1140 473 287 216 -1075 -272 -363 820 198
1328A98p96O5L55J173n40m28q75J215N63K21o92q21R84J23O59r37n45k31J291
1347I82L56j127M66j193J339K04j65j138J32Q46j97O57j541k15M68J016n72o21
1365c03r2j88J020l29j28j178Q44L84P1q9j276N50K50J138j127n53J77J09Q38
1384A18M9p44j186J546P5L76o80p61O22P88K71j436Q35o16O40J028n80j245L94
1403e06J405p83O21j124l36J261M25k85j049N82m83J605l83q92n08P04P39n01
1421D92L97j415R41M46Q4n87n08M09j41J288j133k50o13J036L59o16k91q11R80
1440F7M68o8j200K32J41K58O25j122k96J11J053l07k06o34o03J382K38l75r84
1459a220P68r2M21K48j277J05Q29O20q35L23j022M46J460m28r09m26R94l9P84
$$ plain form
1328 198 -598 -533 -178 995 455 27 -848 367 930 1151 459 -362 622 745 1404 467 -78 -309 982
1347 982 1338 211 677 -516 823 1027 862 -276 -144 702 505 1162 -379 -594 -126 890 318 -303
1365 -303 -395 -583 437 108 -20 -1198 -354 30 101 12 -1264 -714 -464 674 -453 -1006 -829 -720 118
1384 118 167 -577 -1763 -217 -142 234 -446 -1207 -585 203 474 -962 -127 -743 -103 925 345 -900 -506
1403 -506 899 116 737 -387 -723 538 963 678 -371 211 -272 1333 950 58 -450 254 993 492
1421 492 889 -526 415 861 945 358 -150 259 118 1406 273 23 -590 446 805 189 -102 -913 67
1440 67 535 467 -733 -501 -360 -102 523 -599 -895 -784 269 -38 -244 -878 -1481 -99 139 -236 -1220
1459 -1220 -452 -544 -123 125 -1152 -1047 -218 402 -433 -110 -1132 -686 774 346 -563 -989 5 -34 750
1478G50p17o32L31O84K67m84Kq77J394L09n66q7k37L82NO97j618O47L7N90N23
1499A400j502O6j55J377l07n25q37K07R41o6j27r85K70L34O07n51p56M63n1P47
1519E50n54n00m03Q50R2Q8k31j588J482K17J38r15O6n94J024N28j272L26k43P07
1539b32M6N01j328M17N57M1K22q17k72N05J054k81r16M87l38J206n00j06o25N90
1559B11L63J51M0j306P71J29O81o46l79k5M16P74p24j72l74N81J17M32r66l82
1579c08P40j02O04j214j48L25O51K57l85q04j63J184k57k46o09K6J45O73j80j195
1599a006L55R7P49l92l68o28P65P68n57J37j019N12K65N46p46j75K54r2J347r81
1619a69k87j52R51k43j11j52o38J202j79N02r75J00K18J93N34j022K28N0O90P2
$$ plain form
1478 750 33 -599 -268 416 683 199 201 -676 718 1027 461 374 137 519 524 1221 -397 250 287 877 1400
1499 1400 -102 -36 -191 1186 879 354 -483 -276 665 599 472 -513 -243 91 698 147 -609 -146 -197 550
1519 550 -4 -504 -907 -57 35 123 -108 -1696 -214 3 141 -774 -708 -1302 -278 250 -1022 -696 -939 -232
1539 -232 -186 315 -1013 -596 -39 2 224 -593 -865 -360 694 413 -503 -16 -354 852 352 246 -379 211
1559 211 574 725 765 -541 230 359 1040 394 15 -10 406 1180 456 284 -90 491 608 1040 74 -308
1579 -308 432 330 934 -280 -428 -103 548 805 420 -384 -547 637 380 134 -475 -449 -304 369 189 -1006
1599 -1006 -651 -554 195 -197 -565 -1193 -428 340 -217 -80 -1099 -587 -322 224 -522 -697 -443 -535 812 -169
1619 -169 -456 -608 343 100 -11 -163 -801 401 222 724 -251 -151 67 260 794 -228 0 50 740 812
1639H12m09q95N68Q07l66J72j009K07O77M37m36n77J64k93R54m41m13k53K69N35
1659E10p2l65r19J154k58M78n98m95J37M84N34q02j15o61R87K45n35m1m62O40
1679a54L4P2r18M18n8O28K20q42P1k9Q82o08N9o31L83O27Ok42p35Q40j33J013
1701I03q52l13j4M59P20q37m4l87M88N68r1m77n61Q69J13L52o45l66K27M89J85
1722G86l68k66k88R31j22k74m56k15O63N6J34p47o5J96R51m71m64m84L8Q22j80
1743A77k25q75P06L86p9l55m81N27q7Q15r38j64ML99N22n75r9o01Q28k3K34n07
1765d11k23M61J19L37q49L75o6M72K00p13J04j21Q32m23K05p10L54L83K96j83
1785D39o18r8N68N54o29j07N2j5P55l73O0n78R5J90O37n52q12N78K20M54q54K98
$$ plain form
1639 812 403 -492 76 883 517 689 -320 -113 564 1001 565 -12 152 -141 813 372 -41 -294 -25 510
1659 510 438 73 -846 308 50 528 -70 -565 -428 56 590 -212 -327 -988 -1 244 -291 -332 -794 -154
1679 -154 -120 -48 -966 -548 -606 22 242 -600 -529 -558 324 -284 -225 -856 -473 154 160 -82 -817 23 -110 903
1701 903 51 -262 -276 183 903 66 22 -365 123 691 600 123 -438 431 544 896 251 -115 112 601 786
1722 786 418 152 -136 795 673 399 -57 -272 391 447 581 -166 -231 -35 916 445 -19 -503 -465 357 177
1743 177 -48 -923 -217 169 90 -265 -746 -219 -306 509 -429 -593 -589 -190 332 -243 -342 -943 -115 -138 96 -411
1765 -411 -634 -173 -54 283 -566 -191 -257 215 415 -298 -194 -315 517 94 299 -411 -57 326 622 439
1785 439 -179 -277 291 845 216 109 161 146 901 528 588 10 105 295 932 380 -432 146 366 820 -34 264
1807B64o79O36L49l96l97m90P90p7L89p15l05L92N9M41q73L10j22L31K77o21j51
1828e88nO24m07L37q73K31L29N42m52l02J82n5Q69n43j17l53P06L1q0p3o63O28
1850c2L94J56o77j86J88O94J85p09q1j56N83J09j77j27m00Q51J1j56k94j57l6
1871a7O48k2n62O3j44O10l51J68p54K34R04m39lr58O05j12O72n40m80L51l8N55
1893C90m73k4n36N66K31r0l87j47J42J50M66p19k11L16J15K93m41lm24R31l88
1914b43J68m95K81K32O0K72j013N71N7K71P1k25j64l55Q91k21m6k19J27L40J4
1935C74J6o14L18K24L47m52lk60L83N28n69j23l69M36L10J00p41m7L01M3L32m42
1957I2k96l73R39j13k80k27l5M95j78j22m98K47K06J51L5n09J19l0M99n25R7P1
$$ plain form
1807 264 -415 221 570 174 -223 -713 77 0 389 -326 -631 -239 -180 261 -612 -302 -424 -93 184 -437 -588
1828 -588 -593 31 -376 -39 -912 -681 -352 190 -262 -564 -382 -437 432 -111 -228 -581 125 156 76 3 -660 -32
1850 -32 362 518 -159 -345 -157 537 722 13 -68 -224 359 468 291 164 -236 615 626 470 176 19 -17
1871 -17 631 609 47 110 -34 576 225 393 -361 -127 777 338 335 -623 -18 -130 542 2 -478 -127 -165 390
1893 390 -83 -107 -643 -77 154 64 -323 -470 -328 -178 288 -431 -642 -326 -211 82 -359 -362 -786 145 -243
1914 -243 -75 -570 -289 -57 3 275 -738 -167 -110 161 232 7 -157 -512 379 158 112 -107 20 360 374
1935 374 390 -224 94 318 665 213 210 -50 333 861 292 169 -200 236 546 646 -95 -142 159 202 534 92
1957 92 -204 -577 362 249 -31 -258 -293 202 24 -98 -596 -349 -143 8 43 -466 -347 -377 122 -403 -306 -235
1979b35q5M27k0m37m93P25o4J67j33n75N27J54M08o15K27n74O75p3l9j21m77P08
2001G7j09K01n88K10J63O21k45m78J88l3L89o1R8m88n3O81k73J44n26K39P1L93
2023F21m03k69N5J2P05l91l60k23L90L17l79K6m71L36K78P4n96q5L57J88j7m78
2045c13J17m58P17k32M15m70j16M00k74J38j99k5l8N26l44l65m3K4P99k49j96
2066a86k42J97M31k56L30o66K83L9O45n04l16L24m3M43n37K56l90N49Q2j50k16
2087G3j40O63k57K60l88p0j39M02K81n70J09m16Q02l09L5m93K2M90J29q4n79K92
2109A13j63M14m00k46j94J35O18j77j42l40L23j48K27L4m46J79R1K17j14k99k19
2130e37K25L31j64K0m16N62j69k7j08K0J43l9L65p08M08l15O77k46j83r3N7O08
$$ plain form
1979 -235 -320 107 87 -350 -843 -118 -182 -15 -148 -723 -196 -42 366 -249 -22 -596 79 6 -33 -154 -631 77
2001 77 -32 169 -419 -209 -46 575 330 -148 40 7 396 335 433 -55 -108 573 300 444 -82 157 228 621
2023 621 218 -51 4 16 721 330 -30 -253 137 454 75 101 -370 -34 244 318 -278 -363 -6 182 165 -313
2045 -313 -196 -654 63 -169 246 -224 -340 60 -214 -76 -275 -300 -338 188 -156 -521 -564 -540 259 10 -186
2066 -186 -428 -231 200 -56 274 -392 -109 -70 575 71 -245 79 36 479 -58 198 -192 357 439 289 73
2087 73 -67 596 339 599 211 141 2 404 685 115 224 -192 610 301 336 -157 -135 355 484 400 -179 113
2109 113 -50 364 -36 -282 -476 -341 277 100 -42 -382 -59 -207 20 54 -392 -213 -122 95 -19 -318 -537
2130 -537 -312 19 -145 -125 -541 21 -148 -175 -283 -263 -120 -159 206 -502 -94 -409 268 22 -161 -254 -197 411
2152D11j98J68o03J62L00K96l07l10M9J39N91k87k25j38K40K67k35k11l42P03
2172D70k14J82j36l73J92K43M6m57j03j21L22K43j58k90j07L84m1K94o61rK74
2193b0jJ42n38N4j53N78k39Jj13P0K58j45J72p33N63RJ75k02m44L19j26N78l31
2216a26j02k87K98M89l72J02o22N05K42K22p43R4L92J38K49k07k57Q4M80l31j58
2237I0J5j06K09R6M06o48j10J95K97Rp06J51K2O93l90q5m16J56N61m5l48j94K54
2260A06j22L09n02q1K57k7L84n13j38k43L54K03lj97k66L39P7J89n82L00j15K14
2282e7J83n06L15m26N38K17l05k96j61N22k6lk09mn4M87J70m96Q7k40O11J59n75
2305f9k37L74K20k16J84m35N99k78L30n57K92LJ67jm5k73l58O04j08J54j87m30
$$ plain form
2152 411 213 381 -222 -60 240 536 229 -81 -32 107 698 411 186 48 288 555 320 109 -233 470
2172 470 256 438 302 -71 121 364 410 -47 -150 -271 51 294 136 -154 -261 123 82 376 -285 -294 -20
2193 -20 -21 121 -417 -363 -516 62 -177 -176 -289 -219 39 -106 66 -667 -104 -95 80 -122 -566 -247 -373 205 -126
2216 -126 -228 -515 -217 272 -100 2 -620 -115 127 349 -394 -300 92 230 479 272 15 99 579 248 90
2237 90 105 -1 208 304 710 62 -48 147 444 453 -253 -102 -80 613 223 138 -278 -122 439 394 46 -148 106
2260 106 -16 293 -209 -290 -33 -60 324 -189 -327 -570 -216 -13 -16 -213 -479 -140 -63 126 -456 -156 -271 -57
2282 -57 126 -380 -65 -491 47 264 -41 -337 -498 24 -2 -5 -214 -218 -272 215 385 -111 -24 -264 347 506 -69
2305 -69 -306 68 288 72 256 -179 420 142 472 -85 207 210 377 376 331 58 -300 304 196 350 163 -267
2327b67O78j32L6p20O30k9J9k03pj62j72O64o09K03j56QJ82J91o4m07J95j85M59
2350A52k45o9l24K27L64j02j41l24J78J40K37l83k67L95k33M87j82L64o35L23
2370c8K00j53r7n2J54oM02n58l9L36J13L9k38k04O0O31l65l4j27nM99k7l02l49
2394a60O05k55J54l48m7J07q6J77o1J19l33L10J5m4j78j39K14M2J26k07j87J71
2416ej11L82q9m40j69N65K55k63o74J64N03l52M45m73n4K72j98K97n84M79k27
2437b77J54q0j36J6K31Q2l8J91n51M09k9K44l90K30j0j43L68k27j04k3M04j46
2459A75J65k57l96N41OJ06m09J13J20K64j45l18J79k43N48k82M8j04k86K41J70
2480B36j05j44k05J09L71j88r2j04k8J37n7M6n1k64K55J18k84j56M63j52K45m63
$$ plain form
2327 -267 411 279 315 -405 225 196 215 12 5 -157 -329 335 -274 -71 -227 -219 -37 154 90 -317 -122 -307 152
2350 152 -93 -162 -486 -259 105 3 -138 -462 -284 -144 93 -290 -557 -162 -395 92 -90 274 -361 -38
2370 -38 162 9 -88 -140 14 8 410 -148 -187 149 262 301 63 -141 -81 550 185 151 24 19 518 491 189 -160
2394 -160 445 190 344 -4 -51 56 -30 147 86 205 -128 182 197 153 -25 -164 50 92 218 11 -176 -5
2416 -5 -116 266 177 -263 -432 133 388 125 -549 -385 118 -234 211 -262 -316 -44 -242 55 -529 -50 -277
2437 -277 -123 -203 -339 -323 -92 -10 -48 143 -408 1 -28 216 -174 56 46 -97 271 44 -60 -83 321 175
2459 175 340 83 -313 228 234 340 -69 44 164 428 283 -35 144 -99 449 167 215 111 -175 66 236
2480 236 131 -13 -218 -109 262 74 -18 -122 -150 -13 -70 -24 -75 -339 -84 34 -250 -406 57 -95 150 -313
2502c13qR1lK22k65j9J17N6K8J34l78J43K24K2L9n17K20l7L62j44l37K66j27L34
2526A10R6K01m10J18K25k74L03m91L11k99N29l50J96k08Q9K37l10J01l41M12M3
2547B88m09L42o4k53K47L63m95Q0n8J34k42j25J39k42L00J3L5l38K3K38P0q9j98
2570b41J97j81O2N8j22k19L23L3K87j95m74K96Q1L8j05P4l14J27M52l85J01K28
2592A21r2P7j98J34k79N13k52Q2n09N39j21J03O6k89J96j60N77j68j20l11K02
2613A11Q3j01K60k31K07j39L03l03pl09JO45n50M82m55J15Q5j94Pk91M30o8J81
2636B62l38j2rl9N27n50K68o00O64l59K02j12N2j28K12N5m46J73j96K72N2L6n0
2659f4m0K23k83L33l83J60K06m3n6l02K13j26L48kj96O4O3l2P9j79j53M14J25
$$ plain form
2502 -313 -321 -230 -233 -11 -276 -295 -178 -122 -94 40 -338 -195 29 51 90 -427 -207 -244 118 -26 -363 -97 -224 110
2526 110 206 407 -3 115 340 66 369 -122 189 -110 419 69 265 57 146 383 73 174 -167 245 288
2547 288 -121 221 157 -96 151 514 19 99 41 175 -67 -192 -53 -295 5 18 53 -285 -262 -24 46 -43 -241
2570 -241 -44 -225 -163 -105 -227 -446 -123 -90 197 2 -472 -176 -95 -57 -162 -88 -402 -275 177 -208 -107 121
2592 121 29 106 -92 42 -237 276 24 106 -403 136 15 118 184 -105 91 -69 508 340 220 -91 111
2613 111 194 93 353 122 329 190 493 190 183 -126 -125 520 -30 452 -3 112 197 3 10 -281 149 81 262
2636 262 -76 -88 -97 -136 391 -159 109 -491 173 -186 16 -96 -44 -172 40 95 -351 -178 -374 -102 -50 -14 -64
2659 -64 -104 119 -164 169 -214 -54 152 109 53 -249 -36 -162 186 184 -12 52 115 83 162 -17 -170 244 369
2682C69j70l9j32J98j58M01m62n0K28p1qk33J01l5L05N7K8m53pN11k75L36o45
2705b04Om1K95o3Q2j06j32M31l92j46n5M26k57K29o1j47oPK11l39lk08K37K38
2729Bj31M0n1J72k52L48m55M6L48j20P2j53pj54M56j91q4M59l22n7L92l53kK6
2753B9P1P7K9k23L0N9K24l01K01o0J5J94j61k6N0n1k00K39j3o2M3j0J85j48k40
2778d9J57kJ9J35r0l37R1k6K64k61J89o4p6M3j8j86j79N75l33K27l49N2J36j34
2802b16o3m4K52jm2O6l00K07m26P51l06m8M0O6L1J78k16l71L71J85m8O4k50M2
2826g8J17K76l98M8j30L90M1j16O5j25L2j34L37j74n5q9K29n6j74P2k29L32k3
2849A58j0m45N08o1J66L6o92K37q0J33j3J08k24M7J59j57N1j78K07J8P5J1k74
$$ plain form
2682 369 199 160 28 226 68 469 7 -43 185 114 106 -127 -26 -61 244 301 329 -124 -131 380 105 441 -204
2705 -204 -198 -239 56 -7 75 -31 -163 268 -124 -270 -325 101 -156 73 12 -135 -141 -134 77 -262 -265 -473 -236 2
2729 2 -129 -89 -140 32 -220 128 -327 -281 67 -53 19 -134 -141 -295 161 -30 -114 345 23 -34 358 5 3 29
2753 29 100 177 206 -17 13 72 296 -5 196 136 151 345 184 158 208 157 -43 196 183 121 164 154 339 191 -49
2778 -49 108 106 125 260 170 -167 -76 -102 162 -99 90 26 -50 -7 -25 -211 -390 185 -148 79 -270 -218 -82 -216
2802 -216 -279 -323 -71 -72 -114 -48 -348 -141 -567 184 -122 -170 -130 -64 -33 145 -71 -442 -71 114 66 130 -120 -78
2826 -78 39 315 -83 -35 -165 225 266 150 215 90 122 -12 325 151 96 7 236 180 6 78 -151 181 158
2849 158 148 -297 211 150 316 352 -340 -103 -183 -50 -63 45 -179 -132 27 -130 -79 -257 -50 -32 43 54 -220
2872b20j10L30K26l78R0P5j40L09j02p8o7K75k81n0K04j53K0k40J98o6J88k69
2894b39L12k49P8J20j67K66k54K21k01K19n5KJ7j71R3m8L78m1k70j68K09K14l37
2917g1L02k72P4L8L4j71Q2lLL09m06n9j49L10O3k48J36q2rJ33o3k9J94l29K84
2942G1k4j89oj75L80m86M04k00O9K83PJ9m88K05j19L14k88K59m1q9K11k29j1O3
2966f0k38K92n0J16l45J39K08q5j87J72p9J75Q4l34J14N4K62j94J33l78K78j56
2988g9K71J53m11K12j9j20K67j88R4l34L60l7P3j28k65K77j12j33j62K33j66K10
3010dN3j87J50M9p1j35O1j19J86P1l33J94j72L04Q1j59j56p5L4K68l00L00j20
3033h0o6P8j7L25l32L8K42j44j14j59M65k68K10k62r6K43k6K41k91J25m0l1J97
$$ plain form
2872 -220 -330 0 226 -152 -62 13 -127 182 80 2 -65 210 -71 -121 83 -70 -50 -290 -92 -158 30 -239
2894 -239 73 -176 -98 22 -145 121 -133 88 -113 106 51 53 70 -101 -8 -56 322 281 11 -157 52 266 -71
2917 -71 231 -41 33 71 105 -66 16 13 16 325 -81 -140 -289 21 84 -164 -28 -110 -119 14 -49 -78 116 -213 71
2942 71 47 -142 -148 -323 57 -429 -25 -225 -156 127 134 153 -335 -130 -249 65 -223 36 -5 -94 117 -112 -123 -60
2966 -60 -298 -6 -56 60 -285 -146 62 -23 -210 -38 -117 58 142 -192 -78 -24 238 44 177 -201 77 -79
2988 -79 192 345 -66 146 127 7 274 86 180 -154 206 169 242 114 -151 126 14 -119 -281 -48 -214 -4
3010 -4 49 -138 12 61 -10 -145 -84 -203 -17 54 -279 -85 -257 47 128 -31 -187 -262 -228 40 -260 40 -80
3033 -80 -146 -68 -85 240 -92 -54 188 44 -70 -229 236 -32 178 -84 -180 63 37 278 -13 112 72 41 238
3056B38O9k33o2J34RR5J68l39n2L4K1k7J28l22L88m27O09n53J12J47J4J93m22
3079g8J96k11M4O7j66O7j86L24p4k10L09j76%j6J92j09M9j84L15r8l74K18P7J04
3103H0l44J18n3Q8J33O7j85j89L93l16M88m87L27k23O2J1O8j20K5K45j79J55j67
3126cJ82j83k3N8j56L37l06L64k22J38q2j36K55m7j14k13L31j85Q5J49k06MJ08
3149A35J31l74L86l84p6N59m03l58K23K33j38K99l88K83q1JJ93l05j60K69L7p5
3171Gn5k23K49J28k58J71k14K98k22J0R1q6j18j7K70N6k12O5J41n1Pm4l40L83
3195C6J24J56m02k1O2K77J25k43J4j31L9K25o8k62p6L02p0q3K98M9l56P7j67J19
3219B4J6lL2J01M23o64L68l10J99L8k46J43L4j34k15K34k55J08L63l08L5j19J25
$$ plain form
3056 238 307 74 12 146 155 250 418 79 27 61 82 55 183 -139 249 -178 431 -122 -10 137 151 344 -78
3079 -78 118 -93 -49 18 -148 -81 -267 57 -17 -227 82 -94 -94 -110 82 -27 22 -162 153 55 -319 -101 -24 80
3103 80 -264 -146 -199 -111 22 89 -96 -285 108 -208 280 -207 120 -103 -41 -30 38 -82 -57 188 9 164 -3
3126 -3 179 -4 -27 31 -125 212 -94 270 48 186 104 -32 223 176 62 -151 180 -5 80 229 23 27 135
3149 135 266 -108 278 -106 -182 377 -26 -384 -161 72 -66 233 -155 128 47 48 241 -64 -224 45 82 7
3171 7 -48 -271 -22 106 -152 19 -195 103 -119 -109 -18 -104 -222 -239 31 87 -125 -60 81 30 37 -7 -347 36
3195 36 160 316 -86 -107 -45 232 357 114 128 -3 36 261 193 -69 -145 157 87 4 302 351 -5 72 -95 24
3219 24 40 37 69 170 593 -71 297 -13 186 224 -22 121 155 21 -194 40 -215 -107 256 -52 -17 -136 -11
3242a1k75J46J20k55M53k15p6j0j28J17Q3q2J31j54Q8J36j68K46k39n2j1J20L04
3265B68j36j53J49N5j94L3j0J5K01q7L6l57L11J2J02j85l05J44J56K72k92m5j02
3288a12K21L6q5K29k98Q1o5K68m80M6K95j04J45j79M2k43L25mk8K0l47J82J27
3311G2j02n8n1L86k85K07j87M6k69J58j20J49J1j37P0K1K04k3p9l3j49L2R5P2
3335C0J4J08k21J24NJ00l28M53k70k02K23J65pk67J51J09l02MR7J50O9r9j23n7
3359g4L67m66K04J27r7K7J75l73K55j71L26k29j67K83j88Q6P7q0kr4r0p4K50J
3383G3l21J30K08r6J12k38Q1L8j7O2n5j97K20q7P7l3K4k23L2J73q5K86j00j94
3407a30J63P7j87j38K71p3P7k14j52L01k0J2K32m13J23l0J84K64j18l19l7L28
$$ plain form
3242 -11 -286 -140 -20 -275 178 -37 -113 -123 -251 -134 -51 -133 -2 -156 -68 68 -100 146 -93 -145 -156 -36 268
3265 268 132 -21 128 183 -11 22 12 27 228 141 177 -180 131 143 245 60 -245 -101 55 327 35 -10 -112
3288 -112 109 145 60 289 -9 72 7 275 -205 -159 136 32 177 -2 40 -203 122 118 90 110 -237 -55 72
3311 72 -30 -88 -139 247 -38 169 -18 28 -241 -83 -203 -54 -43 -180 -110 -89 115 92 13 -20 -169 -137 -42 30
3335 30 44 152 -69 55 60 160 -168 285 15 -187 36 201 194 -73 78 187 -115 -111 -14 136 205 106 -17 -74
3359 -74 293 -173 31 158 61 88 263 -110 145 -26 300 71 -96 187 -1 85 162 82 80 -14 -104 -178 72 73
3383 73 -248 -118 90 -6 106 -132 -51 -13 -30 32 -23 -220 0 -87 -10 -43 -19 -242 -210 -37 -122 164 64 -130
3407 -130 33 110 -77 -215 56 -17 60 -154 -306 -5 -25 -13 219 -194 -71 -101 83 347 229 -90 -127 201
3429B01m9L1l07J35k55J36k4J48J10O3k02J60j89J47k32J56j21J99j35R3j51K75
3451A89n8l52L82j96r9J31N4k87K58J61j45l9j57j5J86j40K15k77N4o8L24k19
3473i8j0K68l67L22k54J04L7k7J54M1l02k67J14J97K10l83K24r4j3K90j31M8K1
3496H4k3j44J35j84J19o9O7o9L6J45k7J52l31J82j05P6n1L1J24j41M3p5K44k65
3520d6j17J68J40q4Jj90M0K48m3J55k87j07K24j04j74O2k43L81P9j38j01J20Q9
3543G3j2o4k79N09l11K55k74K51k48o9Q4K1Q6Q4l91K25J50r8k20M5J36K21n4N8
3567A78m00L5K94Q2l69K09K10j01J18m09L56J39l66J48m8l60J71K27j6N1j91J29
3589H7k7P3o7o1pK7J26l13L51k55P4m4K7K49n09J58J67k0J04k29J76m5l74L90
$$ plain form
3429 201 152 183 -124 11 -244 -108 -132 16 126 189 -13 147 -42 105 -127 29 -92 107 -28 65 -86 189
3451 189 131 -221 161 -35 -134 -3 51 -236 22 183 38 -1 -158 -173 13 -127 88 -189 -135 -203 121 -98
3473 -98 -108 160 -207 115 -139 -35 2 -25 129 170 -132 -399 -285 -88 122 -261 -37 -131 -144 146 15 63 84
3496 84 61 -83 52 -132 -13 -82 -15 -84 -48 97 70 222 -109 73 -32 44 -7 24 148 7 50 -25 219 -46
3520 -46 -163 5 145 61 62 -128 -88 160 117 272 -15 -122 102 -2 -176 -114 -357 24 103 -35 -136 -16 73
3543 73 61 -3 -282 227 -84 171 -103 148 -100 -169 -85 -64 22 106 -285 -60 90 -8 -228 -183 -47 174 120 178
3567 178 -222 -187 107 189 -180 29 239 138 256 -153 203 342 -24 124 76 -284 -113 114 98 149 -42 87
3589 87 60 133 66 5 -2 25 151 -162 189 -66 8 -36 -9 240 -269 -111 56 36 140 -89 87 42 -332 58
3613E8j46jlq1L16k39k59J29K8J80j2m9r6J42j46m6J47p9K34j96J63R2j65J21
3637I2M5j0j90j12kK57m5p8Q9K7P5j07j09J94R2k93K45l1m9j89M5J91k55K79n2
3662A09j06m0J15J30o0M4k18J53L1r9R9m3l5M8o0p8J75k86J55n3m6n7j05L73l28
3687a82n2K96q3q0K3J07j24J02J08qn14M48O6j33%l0j64K63n6j18N3j13J66J21
3711I6j69j68Q6J43N8j46K58l53J51J0L5k9q1l8L73l56K56Q1k04P9K57l22q8K32
3735A61k65J20J5n2k4K76m1Lj37rJ15k3J70k98J0j66J93rJ1R6l40O9J28M4j42
3760i5J35l12L23j97K81j94P3n3K36q0m60M56j41J03pj62O4N3o3MO0J2p6J75j01
3785C4p6J19j25J12O5k69K15j01j8r0J25J9J71j54L1r3l66L56J64L9j13j25K51
$$ plain form
3613 58 -88 -89 -92 -173 143 -96 -355 -226 -198 -18 -30 -79 -175 -33 -179 -225 -78 -157 77 -119 44 136 -29 92
3637 92 137 127 -63 -175 -177 80 35 -43 46 73 148 41 -68 126 218 -75 170 139 90 -99 -54 137 -118 161 109
3662 109 3 -37 78 208 148 192 -26 127 158 59 158 115 80 128 68 -10 165 -121 34 -19 -65 -122 -227 146 -182
3687 -182 -234 62 -21 -101 -78 29 -95 7 115 107 -407 41 107 -26 -26 -56 -220 43 -13 -131 -78 -191 -25 96
3711 96 -73 -241 -155 -12 46 -100 158 -195 -44 -34 1 -28 -109 -147 226 -130 126 207 3 82 339 17 -71 161
3735 161 -104 16 31 -21 -45 231 190 193 56 47 162 139 309 11 21 -145 48 39 50 146 -194 -125 3 47 -95
3760 -95 40 -272 51 -146 135 -59 14 -39 197 117 -343 113 -28 75 68 -94 -30 23 -40 -36 24 36 -40 135 34
3785 34 -42 77 -48 64 129 -140 75 -26 -44 -134 -9 10 181 27 58 -35 -401 -45 119 158 45 -80 171
3808A71p2pk81J27J31j62J88k13Q1O3L0K4l3n6L7R5K36j84j78K57j66J14j78r4
3832g0q6L60k79K0J96j86K0j50J19K29l48O4r3K8j34J91j36J10J90j09J11j15
3854f8Nj44J35j85K39K06k73J50k13Q9J82j09J96k12j27K94j97K13k47K72j07
3875I9p2j36J56n1lK51j43j89M1M6R3O7j25m9R6q8o1J13J98p5K3l21J89J12j27
3900D4J93k74J55J56k74q7P5K34n0k92J10J88k95j23K82j3k15J80k02K4J32P2
3922B0K3l58L65k48M11r2j05o0K6j41K10k47K2K37k93K08J40k18J47j03Oj35K37
3945E2k16K04q2L09k88Pq8L27q5kj87K3%J75K2j03j1O5K7m3j15J2oJ3J37J17j85
3972G9l5R4l67M23l70RK64l72M15j45q9J88M8l21L3N1j13J43nj2J44k6j49K06
$$ plain form
3808 171 99 92 -189 -62 69 -93 95 -118 -37 26 56 80 47 -9 28 123 359 175 -3 254 88 202 24 -70
3832 -70 -156 204 -75 -55 141 -45 -25 -175 -56 173 -175 -111 -204 -176 -310 -119 -255 -145 45 -64 47 -68
3854 -68 -63 -207 -72 -257 -18 188 -85 65 -148 -59 123 14 210 -2 -129 165 -32 181 -66 206 99
3875 99 27 -109 47 -4 -7 244 101 -88 -47 -1 92 159 34 -15 81 -7 -68 45 243 168 191 -130 59 171 44
3900 44 237 -37 118 274 0 -87 -12 222 172 -120 -10 178 -117 -240 42 29 -186 -6 -208 -184 -52 20
3922 20 43 -315 50 -198 213 121 16 -44 -18 -159 51 -196 -174 63 -230 -22 118 -100 47 -56 -50 -185 52
3945 52 -164 40 -42 267 -21 -14 -102 225 140 138 -49 -26 -26 149 171 68 57 122 149 106 -9 3 -3 10 147 264 79
3972 79 44 138 -229 194 -176 -167 97 -275 140 -5 -94 94 142 -179 -146 -95 -208 -65 -70 -82 62 36 -113 93
3996I3K5j82j89J31L1RN5R7j23R0n1p0J8J37o3K7P1J0o6R0j57k07K67OO9j78Q6
4023B6n6O3J90J5k8J14k34L44k54o5l17K87J36n5j47K04j81n4l0j83M26J6k01
4046A6R3P8k56j8J21J58r5l24K35J7r7R4l9J2j07K58j09J48k46nJ85k46L2J1N1
4071c3j94L29k24J19m1n7K09l83J58l6J92Q4j92J7J36r6R0K4n7j52j07J09K04
4094I9k92J96L00j22r5J93k62R5l87L32K29m4l00J04L2q3K39j67k65J64K43n5
4116A54k40K52j3k88R4J47RM5K28k36l25J17K8K13j89M8j47N0J45p2j0L3j8k46
4140b21J84Q8Q3q2j97K02J88r3o7j29J23P1j80o4q5J26L2P2j38N9m6j57K5M1J42
4165b3l08L64J52j73M3k0L41k65j23j24J87J31k0j48l1k0J61j09P2j54mL36l88
$$ plain form
3996 93 118 -64 -253 -122 -91 -82 -27 70 -53 37 -14 -84 -66 71 8 35 106 116 50 140 -17 -224 43 49 118 -60 26
4023 26 -30 33 223 238 210 324 90 434 180 115 -202 85 221 166 19 223 42 -12 -42 -225 201 217 16
4046 16 109 187 -69 -87 34 192 97 -227 8 25 -72 22 -17 -5 -112 146 37 185 -61 -66 119 -127 -95 -84 -33
4071 -33 -227 102 -122 -3 -44 -101 108 -275 -117 -153 39 123 -69 -52 84 -12 78 102 45 -107 -214 -105 99
4094 99 -193 3 303 181 86 279 17 112 -275 57 286 242 -58 46 78 -5 234 67 -198 -34 209 154
4116 154 -86 166 153 -135 -41 106 115 160 388 152 -173 -56 -28 185 -4 44 -103 -53 92 20 10 43 25 -221
4140 -221 -37 51 134 52 -145 57 245 152 85 -44 79 150 -30 -94 -179 -53 -21 51 -87 -28 -74 -231 -206 -165 -23
4165 -23 -331 33 185 12 55 35 376 111 -12 -136 51 182 162 14 -17 -37 124 15 87 -67 -71 265 -123
4188a23K76m9j98R4L2J30k05J35j78J93j81K60k54J28l2n1J20p8j63pj78K57n6
4211a28K26k53L6K89k11j35P6L1M1J7j1QJ0k72J50k1R5J36j89K09j4j21PK4J19
4236A19j86L3m2J66j05k11K80k07K07k36MJ1L00j20J2j27J04P4j53L12p6k62K60
4259A57j26j36Q0n3J45k11K26j94K45j97L4K08J1j36k6m8k9l0K17O3k78k7j09
4282b14K54L3j29K28o6r2k68J55J82J45k77p0M3j20L38k42Q0pL1o4K42j45O0l15
4306b18P7K97k63K00k06K40j67P6J35k74J14O1j19j35J19O3J70j55n7L44n32J67
4328f3P9j2N5q4K12j69K44k65K14k10K62m01K08j12J43q9qJj05K93j72m7m8K05
4352A31j31N4k52K16j23nP4J87j80K1k30K84p7K2j8l1J83n13M28k94L70k31q6
$$ plain form
4188 -123 153 104 -94 0 32 162 -43 92 -86 107 -74 186 -68 60 28 -23 97 19 -144 -151 -329 -72 -128
4211 -128 98 -155 -119 170 -41 -176 -100 -69 -28 -11 -22 -14 -4 -276 -126 -147 -52 84 -105 104 90 -31 -24 0 119
4236 119 -67 -34 -76 90 -15 -226 54 -153 54 -182 -178 -167 133 13 25 -102 2 76 -77 235 159 -103 157
4259 157 31 -105 -25 -78 67 -144 82 -112 133 -64 -30 178 189 53 27 -21 -50 -80 137 200 -78 -105 -214
4282 -214 40 73 -56 172 106 14 -254 -99 83 228 -49 -119 -76 -196 142 -100 -20 -27 4 -60 182 37 97 -218
4306 -218 -141 156 -107 93 -113 127 -40 36 171 -103 11 72 -47 -182 -63 0 170 15 -42 302 -230 -63
4328 -63 16 4 59 -25 187 18 262 -3 211 1 263 -138 70 -42 101 12 4 5 -100 193 21 -26 -74 131
4352 131 0 54 -198 18 -105 -110 -36 151 -29 -8 -238 46 -31 -9 -27 -58 125 -388 40 -254 116 -115 -201
4375b01K03l16N06j41k82K07J66l36K66K8l68L74k62K08L0J73j61q1O6l00K24
4396Cm7j6L05l38K12k31R7K2N1J9o4j22Q9L22j03j16k00L55k7k75J67k7k2J2j39
4421g3K41l06QP0k02J83J44Nj5k49K00l59L47j6P5K0j18J07k34K45o9j62L16l15
4445a57J34k5l9O7J05j46lj14O8M7J30k39L75l10J34M4k89L38k07Q8J57L8K24
4468D20k97n4P6k20LR2rJ14j75K81m24L92j35j3j60J20PK62k01j16K11k51J71
4491I4j24J27J23k69J51K50n05K33l30M05r3J0J54k63l4l7j0J61r4J5R2j62p2
4514a78L24l45K81n9k51J92K4M1O4k4l1k66L23j20R9P3J2rj65l2m3P9l62K97J03
4539B7J22k15j83J94J11J61j9k15k95J60j25K13pj4O1j22L17j79n9m0K40j88R5
$$ plain form
4375 -201 2 -314 192 51 -231 -24 142 -194 72 100 -268 106 -156 52 82 255 94 13 79 -221 3
4396 3 -44 -60 245 -93 119 -112 -15 7 58 77 13 -109 -20 302 199 83 -117 238 211 -64 103 76 54 66 -73
4421 -73 168 -138 -130 -60 -262 -79 65 70 55 -194 6 -353 -6 -22 53 73 -45 62 -172 73 4 -158 158 -157
4445 -157 -23 -48 -87 -20 85 -61 -64 -178 -110 -63 67 -172 203 -107 27 71 -218 120 -87 1 158 196 420
4468 420 123 69 145 -75 -72 20 11 125 -50 231 -193 199 64 51 -109 11 18 280 79 -37 174 -77 94
4491 94 -30 97 220 -49 102 352 -153 80 -250 155 62 72 226 -37 -71 -108 -118 43 -51 -36 56 -106 -178
4514 -178 146 -199 82 23 -228 -36 -12 29 93 69 38 -228 95 -25 74 147 159 150 -15 -47 -90 -11 -373 -76 27
4539 27 149 -66 -249 -55 56 217 198 -17 -312 -152 -277 -64 -71 -85 -24 -146 171 -8 -67 -107 133 -55 40
4562D0n6j45L26k29m7Q7RoJ16j54O2J20j05j69K25R6l01K22J61k43j08j00L9O5
4586i5M1P7Q8j21j29Q8j50L63r4j72O4J28j94Rk3l8n8pK99j86m2M40k14Jp2Q2
4612H5n5l70K74MJ77O4j74j02j6j23J06m0K20L8L2P2k6Lm33K78r2K20M6j66k7
4637el8j46K92k0O7M0m7j33m2R9Q5j56k8%J11n07K76L0J89j66k8P0K78k11P3O2
4663A45o3m4j57P7J95r8k64J84K62l42l3LN4L10k70J92j92j15M1J81j49P3j4r1
4687a15%J84J7j3r0r0M4J57J03j05K57j75k86J49m3O3j97J38K8l19L05j41K08
4710G9k32J70P6j05qj11N0j83L86m5J3r0Q8M3j87J21j56L13Kj79j4N0K0k19L1
4735h7Q3k45j3K62J31p7J11j65N2Q0l32J82q6P0k38K35K37n2l47p1K88J6j38p
$$ plain form
4562 40 -16 -161 165 -64 -111 -24 -15 -21 95 -59 3 123 18 -151 74 170 -131 91 252 9 -99 -199 -160 -95
4586 -95 -54 23 111 -10 -139 -51 -201 162 68 -104 -40 88 -106 -97 -120 -158 -216 -223 76 -110 -152 288 74 75 3 85
4612 85 30 -340 -66 -62 115 179 5 -97 -113 -236 -130 -170 50 88 120 192 166 169 -264 14 -78 142 188 22 -5
4637 -5 -43 -189 103 83 150 190 143 10 -32 67 152 -4 -32 -32 79 -428 -152 -122 67 -99 -127 -57 221 10 83 145
4663 145 82 38 -119 -42 153 55 -209 -25 237 -105 -138 -135 -81 229 -41 151 -41 -156 -115 66 -83 -10 -24 -115
4687 -115 -115 69 86 73 -17 -107 -63 94 197 92 349 174 -112 37 -6 57 -140 -2 26 -293 12 -129 79
4710 79 -153 17 93 -12 -20 -131 -81 -264 122 77 90 0 88 131 -56 65 -91 222 224 45 31 81 101 -118 -87
4735 -87 -4 -249 -262 0 131 54 165 0 52 132 -200 -18 -104 -34 -272 -37 200 148 -199 -270 18 34 -104 -111
4759a11J01JJ7j9j50K44J60j21n2n7j0J36m8l51J89jK75k39j34K64K38m99J33
4782c4N3j81L38K5k70J54Q7j28r9Jp7L01j18j63K30j81N1P7l6q3k8L6J53k19K15
4807A04k32L20k54O4r3J12k62L63j95m2P0J41m48L95J48l11lR5o8K16kk13nJ3
4831h7k4J34J03K7m3n2q6j85K88N1l05K94Q1k91L25r0o6M4L4P0k53Q2J13M1k84
4856g9N0K7o2L9J07J18k54J08L0j62j17j2L79l39L00mk72K43j10J36j05M9j9n
4880D6n8j18m1L6J60j47J50p4o2J69P6j12l3j01j43M13j53m8O8o7mk33L87j14
4904cJ71j53N1j7j72JR2j47J40j2p8Q1J34O5j64j14K08m3J15k00M9K6k36J7J05
4929h4M1q9J79k1P1j8J51p1j70L0n1K90k81J05j44L5K39l11J95k12L75m31K61
$$ plain form
4759 -111 -10 -9 8 -11 -161 83 243 122 70 13 3 139 91 -260 -71 -72 203 -36 -170 94 332 -167 -34
4782 -34 19 -162 176 201 -69 85 172 44 -55 -54 -131 170 52 -111 119 -62 -11 66 30 -53 -81 -45 108 -111 104
4807 104 -128 192 -62 2 -91 21 -241 122 -73 -115 -45 96 -352 43 191 -120 -123 -28 -96 120 118 -95 -100 -87
4831 -87 -111 23 126 153 110 58 -28 -213 75 126 -179 115 196 -95 230 140 74 118 152 222 -31 51 164 205 -79
4856 -79 -29 -2 -64 -25 82 200 -54 54 84 -78 -195 -207 172 -167 133 129 -143 100 -10 126 21 70 51 46
4880 46 -12 -130 -171 -135 25 -122 28 -46 -108 61 137 25 -8 -109 -252 161 8 -40 28 -39 -43 -276 111 -3
4904 -3 168 15 66 49 -123 -122 -30 -177 -37 -49 -127 -46 88 153 -11 -125 83 40 155 -45 4 30 -206 -189 -84
4929 -84 -43 -132 47 26 97 79 230 159 -11 19 -32 258 -23 82 -62 -27 212 -99 96 -116 259 -172 89
4952H9n3j98K74r2J01k44Q5R6l42L09J86j80n8o4O8J78m14L97j39J5l5r1J66O9
4976A23k49o6Q6L7L1K01j98o9L98j21j51J01n3M2j47J21J17j20k08o0J92j47Q0
4999f0N2Q0K06j60j0j37o1J53Q5p1j32j74M43k09k01L28j33K74j49m8j0j62J20
5022B4J27K0j25j8j97P8l4J51Q9j5j7j4j53O9O5j27O9J51k15j09K73j17K2J96
5046A93j04p5K0k45O7K23j14q7J4K34k61K26j45R1j15J09LJ95k34j4k6K8J3K46
5070B42m14J18L2J44k8p8l0m2Q2J65k30j55L41q1p5K15k35J39o9k6p4j8J60k02
5094a19J14J26l8k44J74j18J07j32J73k37j1K00l17L17K18k28m8R7J79q8J7j87
5116d5K81j83L7j81J34Rj20j76L42j75L25j62l2j68k8j26J55K05j85N7q0J26j93
$$ plain form
4952 89 36 -162 112 20 121 -123 -38 58 -284 25 211 31 -27 -91 -23 155 -259 138 -1 14 -21 -112 54 123
4976 123 -126 -192 -106 -69 -38 163 -35 -104 294 173 22 123 70 112 -35 86 203 83 -125 -185 7 -140 -60
4999 -60 -8 72 278 118 108 -29 -90 63 148 77 -55 -229 214 5 -196 132 -1 273 124 76 66 -96 24
5022 24 151 171 46 28 -169 -91 -125 26 115 100 83 69 -84 -15 50 -77 -8 143 -72 -181 92 -25 -3 193
5046 193 89 14 34 -211 -144 79 -35 -122 -108 126 -135 91 -54 37 -78 31 34 229 -5 -19 -45 -17 -4 242
5070 242 -172 -54 -22 122 94 16 -14 -56 26 191 -39 -194 147 66 -9 206 -29 110 41 15 -59 -77 83 -119
5094 -119 -5 121 83 -161 13 -105 2 -130 43 -194 -205 -5 -322 -5 213 -15 -63 34 213 125 142 -45
5116 -45 236 53 90 -91 43 52 -68 -244 98 -77 248 86 54 -114 -142 -268 -113 92 -93 -36 -116 10 -183
5139a83K95k84M1J55N3j85J60K56k50J9j42K41m33L38p4n3K25m8M4j68j59j26
5161b78K11JJ21q3k05K7Q0J72p4J77k79J53N1j21J71m3j47R6O1o6L0o8r6L7k2
5186i4J59j14j31K23J20k37j5j6K64q1k58J80j3n4l38N02L4k57J14J89J10m99
5208b12j30K81JQ9m15L94j20m6K28j34L72l36K35q4m25L50O5k54J00l4N0j53J43
5231c5Or6o6L06p6Q6J42q9k26K7J0j23j0K62M6k19l2K04%j60j17K92k06k6O0O1
5257B1k64L88n5j07Q0j7p7r6L35m17M3K27n4P7K13k12j19k56K03j5qK79k63m7
5281a41J58O4k08L8J92o7j58K01j89LL4Q6j4L3m4J41j78Q1j07m4Q7Q0l3nK2j1
5307B1L5J71r2k6kJ92m28J61N3N5q2q0n7Q6P0k09P4j02J71k15J83J53Olj13j51
$$ plain form
5139 -183 112 -172 -131 24 77 -108 52 308 58 77 -65 176 -257 81 7 -46 179 131 175 7 -152 -278
5161 -278 -67 -66 55 -28 -233 -206 -126 46 -28 149 -130 23 74 -47 124 81 -66 30 91 25 55 -13 -109 -72 -94
5186 -94 65 -49 -180 43 163 -74 -89 -105 159 78 -180 0 -13 -67 -405 97 131 -126 -12 177 287 -212
5208 -212 -342 -61 -60 29 -386 8 -112 -158 70 -64 308 -28 207 123 -302 48 113 -141 -41 -75 -25 -178 -35
5231 -35 -29 -125 -191 115 39 125 267 178 -48 -21 -11 -134 -144 118 164 -55 -87 117 117 -43 -160 132 -74 -100 -40 21
5257 21 -243 145 90 -17 63 46 -31 -127 208 -209 -166 61 7 84 297 85 -34 -290 -87 -102 -110 169 -94 -141
5281 -141 17 81 -127 -89 103 36 -122 79 -110 -107 -73 13 -1 32 -12 129 -49 32 -75 -119 -32 48 15 10 32 21
5307 21 56 227 135 109 107 299 -129 32 85 140 58 -22 -79 7 77 -132 -58 -160 11 -204 -21 132 138 135 22 -129
5333a29J95K3L2m01K91J75r6k46J5J59q6O8RQm0L1j15J32R3r6j18p1NQ8L3J27
5359H6j02J8PJ9jq1MN7NL8o7k1Lj0J82k47M4n6J69K1q4R0k76K87oj85O9K82l72
5388a27J42KR0r9j7l1j3O8j49J23R0k30n0K13J1j73K15R6k48j0pJ88o2m7l9R2
5414B8n3J98j36m5J63k36L09k01j47J97R4k76O5J1O6K77l99J60l5Oj24O5p9K1
5438g1M5k93M10o6j82LK18k92K88nk21K42J99j85O0l04P9j0K8L18q3k65J9K16
5462A48j00k65L06L1N5l62J87N5r2N0k90O8L99m35N5L89j63J14k51L9o3K6R4k8
5486c3j99K17j48P8J49m4Pj95k5Q8Q9j8p1Q0J21l3M8o4L2j60K25k22j8K38j6n
5512A21M7l02N8P5J59j59kR4j06J34j31P9j17r3K6mO8R3k54K47j00J12k82L92
$$ plain form
5333 -129 66 89 121 -280 11 186 90 -156 -141 18 -68 0 9 17 -23 8 -107 25 118 22 -96 -167 -162 -74 -41 86
5359 86 -16 2 9 28 27 -54 -50 7 12 50 -17 -38 -35 -45 137 -110 -66 -122 47 68 -16 74 -202 85 79 -106 -37 245 -127
5388 -127 15 17 107 8 -9 -40 -53 15 -134 -11 79 -151 -201 12 23 -150 65 161 -87 -97 -104 84 22 -25 -64 28
5414 28 -25 173 37 -8 155 -81 228 27 -120 77 171 -105 -40 -29 37 314 -85 75 40 46 -78 -13 -92 -71
5438 -71 -26 -319 91 25 -157 -154 64 -228 60 55 -166 76 275 90 150 -154 -75 -85 -57 261 178 -87 -68 148
5462 148 48 -217 89 120 175 -187 0 55 -37 13 -277 -209 190 -245 -190 199 36 150 -101 -62 -125 -99 -5 -33
5486 -33 -232 -15 -163 -85 64 20 27 -168 -193 -105 -16 -34 -105 -25 96 63 111 47 79 -81 144 -78 -96 142 126 121
5512 121 168 -134 -76 -1 158 -1 -3 91 -15 119 -12 67 -50 -143 -117 -121 -53 40 -214 33 -67 45 -237 155
5536A55j22q6OJ47J15k33K7K92l27N9p6J90j20P4j05j56o0N3K07j4j48ol1O1K33
5561A35Qk44M65l21j26L26k77k0O7J36l62R7RL0P3J9J16o4m9K7Q4Rl56K94j97
5586a21K17p1P3j93O3K0%J25Q9j65J39j15n2j7J39j30j90J96m7k2K28j50j2p1
5610f7N8J92k52K9L19m48K39j26K47j91j93K79k80M89l33K96m01J99L6q9Q1k22
5632a38L10p4j14k9J96k12J33j19l3J62J6j01p8Q1k34K53Q4k55o3K14J40j77j42
5655a80J36K43k09j32oR2J2K00l09Q0k4J16k4j07L09j52Pj34J09j58N0P7J02p5
5679B3L4j26J23j06l0J75k8N8%k94n3L24j25J25r1j22l4m6K34J18r8rj13Q4j07
5704h4J19J03j3p2m0j84K21k18J99m4j03K53j58L9j71K12k05L07k21J66j85r7
$$ plain form
5536 155 33 -53 -47 100 215 -18 9 301 -26 33 -43 147 27 101 -4 -160 -220 -167 40 26 -122 -128 -159 -98 135
5561 135 143 -101 364 43 -83 243 -34 -54 13 149 -213 -116 -107 -77 -4 15 131 67 18 45 129 138 -218 76 -121
5586 -121 96 25 98 -95 -32 -12 -12 113 202 37 176 61 9 -8 131 1 -189 7 -40 -62 166 16 4 -67
5610 -67 -9 183 -69 -40 279 -169 70 -56 191 0 -193 86 -194 295 -38 258 -143 56 92 3 84 -138
5632 -138 172 98 -16 -45 151 -61 72 -47 -80 82 98 -3 -81 0 -234 19 103 -152 -215 -1 139 -38 -180
5655 -180 -44 199 -10 -142 -148 -56 -44 156 -153 -73 -97 19 -5 -112 197 45 52 -82 27 -131 -81 -4 98 23
5679 23 57 -69 54 -52 -82 93 65 123 123 -171 -224 100 -25 100 9 -113 -147 -193 41 159 61 52 -61 23 -84
5704 -84 35 138 125 53 13 -171 50 -168 31 -13 -116 137 -21 18 -153 59 -146 161 -60 106 -79 -176
5726a76K95J43k97K60j58n7j09Q0j03J94op6N0J81j7nK1Np4r8j17J03o8P3j51
5751a07P3oRp1M0K65k21j36pK43lJ48k88K21kk83J72j78K61k68K38k16PO3k11
5776b57J23J21P5K8o7O5J2k8j21P6m8J35m7O3j87j12K74m3J4p0J21l12K25N8k14
5801a16K54l87K58pJ09j74J22k8r1k7Q4m9O6K5j01Q9J27r8L4k62K09l2O1j26K35
5826A75k68m9L51k87o4nL3J55O6j22K37k97K14lp2J35oq7k47Q5k21L27j70K13
5850I3M6k77J15o5l5r3k2L00j52P7N4k70K39j41J87q5K40o1k99L49j73o9j01K32
5874H9O8j73N0l3J27k06lo4MR6J27j65Jr5R7R8j48L03l90R1k8J40k39K37j76J17
5900g5K63r0n3l9J6m2k3j08J15KQ8l6m4M08k36j03n7j07K21l50J50j07L24K9n3
$$ plain form
5726 -176 119 262 -35 225 67 10 -99 -19 -122 72 66 -10 40 221 204 199 220 225 151 53 -64 39 -29 44 -107
5751 -107 -34 -40 -31 -102 -62 203 -18 -154 -161 82 79 227 -61 160 158 -125 47 -131 130 -138 100 -116 -109 -46 -257
5776 -257 -134 -13 62 90 23 88 100 72 -49 27 -21 114 67 130 -57 -169 105 62 76 6 127 -185 40 98 -116
5801 -116 138 -249 9 2 111 -63 59 31 -60 -87 -3 -52 14 39 -62 27 154 56 90 -172 37 5 66 -60 175
5826 175 -93 -142 209 -78 -142 -147 -114 41 107 -15 222 -75 139 136 64 199 193 106 -141 -56 -277 50 -120 93
5850 93 139 -138 -23 -88 -123 -216 -238 62 -90 -13 41 -229 10 -131 56 -29 211 150 -149 200 27 -42 -143 89
5874 89 157 -16 34 1 128 -78 -81 -145 -141 -45 82 -83 -82 -177 -80 18 -130 173 -217 -126 -154 -14 -253 -16 -192 -75
5900 -75 188 98 45 6 22 -20 -43 -151 -36 -34 54 18 -26 382 146 43 -14 -121 100 -250 -100 -207 117 146 93
5925I3Rl91K91L2k24J90J55j32j61K36k3m55N56l8k21k44K37O7K43k06o5K37r
5948A77n6j82R4j87K16j66R1MK9j45R9m1n6Q4J54JL0m10K87m1j56O65n84J60m5
5973B2k6n7K35k10J84k30J03J68k48M30m74J39J10r4l10M04J6k22J6j64K87J2
5995I1o9m8R4j30l7k63L85j2r9j10J06J09P6k58J21J90k75K41k4J8oj63J98j57
6019b2P2k29K89k67K75k89o2L93k65J25j56J8M7J56k7J49j86j31q8M53n02M25
6041A78j84R0j73Q5m4P3J90l97J32J25K3n5Q8nj37j16J60J45j24Q6k86K18j26
$$ plain form
5925 93 102 -289 2 34 -190 0 155 23 -138 98 75 -380 176 138 -83 -327 -90 -23 220 14 -51 186 177
5948 177 121 -61 33 -154 62 -104 -13 -9 20 -125 -26 -67 -123 -39 115 116 146 -264 23 -18 -174 491 -93 67 22
5973 22 -4 -61 174 -36 148 -82 21 189 -59 371 -103 36 146 52 -258 146 162 -60 -44 -208 79 91
5995 91 22 -26 68 -62 -99 -362 23 11 -88 -198 -92 17 93 -165 -44 146 -129 112 88 106 100 -63 135 -22
6019 -22 50 -179 110 -157 118 -171 -233 160 -105 20 -136 -118 -71 85 58 207 21 -110 -198 255 -247 178
6041 178 -6 84 -89 -4 -48 25 215 -182 -50 75 98 43 131 126 -11 -127 33 178 54 140 -146 72 -54
$$ [...]
8191H9
##END NTUPLES=NMR FID
##END=
