##TITLE=1H_Pr 4687-20
 CDCl3, 8 sc, 
 4.9.2020
##JCAMPDX= 6.0         $$ Bruker NMR JCAMP-DX V2.0
##DATA TYPE= NMR FID
##DATA CLASS= NTUPLES
##ORIGIN= UXNMR, Bruker Analytische Messtechnik GmbH
##OWNER= root
$$ XWIN-NMR		Version 3.5
$$ Fri Sep  4 09:19:12 2020 Russian Standard Time (UT+4h)  she@DPX200
##.OBSERVE FREQUENCY= 200.1315066352
##.OBSERVE NUCLEUS= ^1H
##.DELAY= (6, 6)
##.ACQUISITION MODE= SIMULTANEOUS
##.ACQUISITION SCHEME= undefined
##.AVERAGES= 8
##.DIGITISER RES= 18
##SPECTROMETER/DATA SYSTEM= spect
##.PULSE SEQUENCE= zg30
##.SOLVENT NAME= CDCl3
##.SHIFT REFERENCE= (INTERNAL, CDCl3, 0, 15.7039)
##AUDIT TRAIL= $$ (NUMBER, WHEN, WHO, WHERE, WHAT)
$$ ##TITLE= Audit trail, XWIN-NMR		Version 3.5
$$ ##JCAMPDX= 5.01
$$ ##ORIGIN= Bruker BioSpin GmbH
$$ ##OWNER= she
$$ F:/spectra/data/she/nmr/H-F/1/audita.txt
$$ ##AUDIT TRAIL=  $$ (NUMBER, WHEN, WHO, WHERE, WHAT)
(   1,<2020-09-04 09:17:37.60 +0400>,<she>,<DPX200>,
      <created by zg, POWCHK disabled, PULCHK disabled
       configuration hash MD5:
       00 E9 B6 7A A2 85 ED C7 34 08 36 98 17 FE 4E 26
       data hash MD5: 16K
       B4 E8 FB 87 39 94 90 4D 73 6A FD 62 91 2D 81 4C>)
$$ ##END=
$$ 
$$ hash MD5
$$ DD 1A 05 57 B9 79 70 3D C6 34 9B 98 CB E1 4F 9C
##$RELAX= 
##$RELAX= 
##$RELAX= 
##$RELAX= 
##$RELAX= 
##$RELAX= 
$$ Bruker specific parameters
$$ --------------------------
##$DU= <F:/spectra>
##$EXPNO= 1
##$NAME= <H-F>
##$PROCNO= 1
##$TYPE= <nmr>
##$USER= <she>
##$AMP= (0..31)
100 100 100 100 100 100 100 100 100 100 100 100 100 100 100 100 100 100 
100 100 100 100 100 100 100 100 100 100 100 100 100 100 
##$AQSEQ= 0
##$AQ_mod= 1
##$AUNM= <au_zg>
##$AUTOPOS= <>
##$BF1= 200.13
##$BF2= 200.13
##$BF3= 200.13
##$BF4= 200.13
##$BF5= 200.13
##$BF6= 200.13
##$BF7= 200.13
##$BF8= 200.13
##$BYTORDA= 1
##$CFDGTYP= 0
##$CFRGTYP= 5
##$CHEMSTR= <none>
##$CNST= (0..31)
1 1 145 1 1 1 1 1 1 1 1 1 1 1 1 1 1 1 1 1 1 1 1 1 1 1 1 1 1 1 1 1 
##$CPDPRG= <>
##$CPDPRG1= <>
##$CPDPRG2= <>
##$CPDPRG3= <>
##$CPDPRG4= <mlev>
##$CPDPRG5= <mlev>
##$CPDPRG6= <mlev>
##$CPDPRG7= <mlev>
##$CPDPRG8= <mlev>
##$CPDPRGB= <>
##$CPDPRGT= <>
##$D= (0..31)
0 1.2 0 0 0 0 0 0 0 0.06 0 0.03 0 0 0 0 0.0002 0 0 0 0 0 0 0 0 0 0 0 0 
0 0 0 
##$DATE= 1599196657
##$DBL= (0..7)
120 120 120 120 120 120 120 120 
##$DBP= (0..7)
150 150 150 150 150 150 150 150 
##$DBP07= 0
##$DBPNAM0= <>
##$DBPNAM1= <>
##$DBPNAM2= <>
##$DBPNAM3= <>
##$DBPNAM4= <>
##$DBPNAM5= <>
##$DBPNAM6= <>
##$DBPNAM7= <>
##$DBPOAL= (0..7)
0.5 0.5 0.5 0.5 0.5 0.5 0.5 0.5 
##$DBPOFFS= (0..7)
0 0 0 0 0 0 0 0 
##$DE= 6
##$DECBNUC= <off>
##$DECIM= 32
##$DECNUC= <off>
##$DECSTAT= 4
##$DIGMOD= 1
##$DIGTYP= 9
##$DL= (0..7)
0 120 120 120 120 120 120 120 
##$DP= (0..7)
150 150 150 150 150 150 150 150 
##$DP07= 0
##$DPNAME0= <>
##$DPNAME1= <>
##$DPNAME2= <>
##$DPNAME3= <>
##$DPNAME4= <>
##$DPNAME5= <>
##$DPNAME6= <>
##$DPNAME7= <>
##$DPOAL= (0..7)
0.5 0.5 0.5 0.5 0.5 0.5 0.5 0.5 
##$DPOFFS= (0..7)
0 0 0 0 0 0 0 0 
##$DQDMODE= 0
##$DR= 18
##$DS= 0
##$DSLIST= <SSSSSSSSSSSSSSS>
$$ [...]
##$SUBNAM2= <"">
##$SUBNAM3= <"">
##$SUBNAM4= <"">
##$SUBNAM5= <"">
##$SUBNAM6= <"">
##$SUBNAM7= <"">
##$SUBNAM8= <"">
##$SUBNAM9= <"">
##$SW= 16.880792210976
##$SWIBOX= (0..15)
0 0 2 0 0 0 0 0 0 0 0 0 0 0 0 0 
##$SW_h= 3378.37837837838
##$TD= 16384
##$TD0= 1
##$TE= 0
##$TE2= 300
##$TE3= 300
##$TEG= 300
##$TL= (0..7)
0 120 120 120 120 120 120 120 
##$TP= (0..7)
150 150 150 150 150 150 150 150 
##$TP07= 0
##$TPNAME0= <>
##$TPNAME1= <>
##$TPNAME2= <>
##$TPNAME3= <>
##$TPNAME4= <>
##$TPNAME5= <>
##$TPNAME6= <>
##$TPNAME7= <>
##$TPOAL= (0..7)
0.5 0.5 0.5 0.5 0.5 0.5 0.5 0.5 
##$TPOFFS= (0..7)
0 0 0 0 0 0 0 0 
##$TUNHIN= 0
##$TUNHOUT= 0
##$TUNXOUT= 0
##$USERA1= <user>
##$USERA2= <user>
##$USERA3= <user>
##$USERA4= <user>
##$USERA5= <user>
##$V9= 5
##$VALIST= <valist>
##$VCLIST= <CCCCCCCCCCCCCCC>
##$VD= 0
##$VDLIST= <DDDDDDDDDDDDDDD>
##$VPLIST= <PPPPPPPPPPPPPPP>
##$VTLIST= <TTTTTTTTTTTTTTT>
##$WBST= 1024
##$WBSW= 4
##$XGAIN= (0..3)
0 0 0 0 
##$XL= 0
##$YL= 0
##$YMAX_a= 156439
##$YMIN_a= -120659
##$ZGOPTNS= <>
##$ZL1= 120
##$ZL2= 120
##$ZL3= 120
##$ZL4= 120
##$ABSF1= 10
##$ABSF2= 0
##$ABSG= 5
##$ABSL= 3
##$ALPHA= 0
##$AQORDER= 0
##$ASSFAC= 0
##$ASSFACI= 0
##$ASSFACX= 0
##$ASSWID= 0
##$AUNMP= <proc_1d>
##$AZFE= 0.1
##$AZFW= 0.1
##$BCFW= 1
##$BC_mod= 2
##$BYTORDP= 1
##$COROFFS= 0
##$CY= 11.3945322036743
##$DATMOD= 1
##$DC= 2
##$DFILT= <>
##$DTYPP= 0
##$F1P= 16.9975609425685
##$F2P= -3.02152046262296
##$FCOR= 0.5
##$FTSIZE= 0
##$FT_mod= 4
##$GAMMA= 1
##$GB= 0.15
##$INTBC= 1
##$INTSCL= 1
##$ISEN= 128
##$LB= 0.24
##$LEV0= 0
##$LPBIN= 0
##$MAXI= 10000
##$MC2= 0
##$MEAN= 0
##$ME_mod= 0
##$MI= 1.114404
##$NCOEF= 0
##$NC_proc= 0
##$NLEV= 6
##$NOISF1= 3.799351
##$NOISF2= 2.8
##$NSP= 1
##$NTH_PI= 0
##$NZP= 0
##$OFFSET= 15.70392
##$PC= 1
##$PHC0= -9976.587
##$PHC1= 18.20089
##$PH_mod= 1
##$PKNL= yes
##$PPARMOD= 0
##$PSCAL= 0
##$PSIGN= 0
##$REVERSE= no
##$SF= 200.130013532006
##$SI= 16384
##$SIGF1= 3
##$SIGF2= 2
##$SINO= 400
##$SIOLD= 16384
##$SREGLST= <1H.CDCl3>
##$SSB= 0
##$STSI= 0
##$STSR= 0
##$SW_p= 3612.71676300578
##$SYMM= 0
##$S_DEV= 0
##$TDeff= 0
##$TDoff= 0
##$TI= <>
##$TILT= no
##$TM1= 0
##$TM2= 0
##$TOPLEV= 0
##$USERP1= <user>
##$USERP2= <user>
##$USERP3= <user>
##$USERP4= <user>
##$USERP5= <user>
##$WDW= 1
##$XDIM= 8192
##$YMAX_p= 0
##$YMIN_p= 0
$$ End of Bruker specific parameters
$$ ---------------------------------
##NTUPLES= NMR FID
##VAR_NAME=  TIME,          FID/REAL,        FID/IMAG
##SYMBOL=    X,             R,               I
##VAR_TYPE=  INDEPENDENT,   DEPENDENT,       DEPENDENT
##VAR_FORM=  AFFN,          ASDF,            ASDF
##VAR_DIM=   8192,          8192,            8192
##UNITS=     SECONDS,       ARBITRARY UNITS, ARBITRARY UNITS
##FACTOR=    0.000296,      1,               1
##FIRST=     0,             0,               0
##LAST=      2.424536,      0,               0
##MIN=       0,             -120659,         0
##MAX=       2.424536,      156439,          0
$$ Real data points
##PAGE= N=1
##DATA TABLE= (X++(R..R)), XYDATA
0@%%%%%%%%%%%%%%%qJ6j6J6j8K6l2L9m7N4o2P2q7J01j16J33j50J68j92K21k51
$$ 0 0 0 0 0 0 0 0 0 0 0 0 0 0 0 0 -8 8 -8 8 -10 16 -16 23 -24 30 -32 40 -47 54 -62 71 -79 89 -103 118 -133
36a33K82l15L54l98M44m94N48o08O74p48Q29r12J005j108J219j342J480j634J800
$$ -133 149 -166 188 -210 234 -260 288 -320 354 -394 435 -477 528 -580 639 -703 777 -857 943
55I43j986K199k439K710l025L395l832M365n029N881p019Q629j1108J5558l9798
$$ 943 -1043 1156 -1283 1427 -1598 1797 -2035 2330 -2699 3182 -3837 4792 -6316 9242 -30556
70c0556J77405m8824j46484O2476r4468l4463J61200N1238n8542n2920j06721
$$ -30556 146849 98025 -48459 14017 -80451 -114914 46286 97524 38982 -13938 -120659
81a20659Q3725J01834n3194K5690M4048j69432j4894J65997j0121j6858K0876
$$ -120659 -36934 64900 11706 37396 81444 -87988 -102882 63115 52994 36136 57012
92E7012r3033m1325P3648M0330N2801j9302j51908P214Q3314J4621M2797l154
$$ 57012 -36021 -77346 -3698 36632 89433 70131 -81777 -74563 8751 23372 66169 63015
104F3015j21763k2851O1695L7289O8972n8030j03269M0879K2618k1358R9704L682
$$ 63015 -58748 -81599 -19904 17385 86357 28327 -74942 -34063 -11445 -32803 66901 70583
116G0583j39315K6656L9981k5511O5549K7736q1885j2581o275r919J10996m69
$$ 70583 -68732 -42076 -2095 -27606 37943 65679 -16206 -28787 -35062 -44981 66015 65546
128F5546q7114Q251k5857k6311J25038K7254j17011N471j1469k3984J04175L3044
$$ 65546 -21568 -13317 -39174 -65485 59553 86807 -30204 -24733 -36202 -60186 43989 77033
140G7033r9213j3148J0239k2916P5002K3390n1515j3740j8523m754O2482P957
$$ 77033 -22180 -35328 -25089 -48005 26997 50387 -1128 -14868 -33391 -38145 24337 32294
152C2294l1245K7323n3639l6656Q1152K8885l3811R264l3742n0717O2177M3311
$$ 32294 1049 28372 -25267 -61923 19229 48114 14303 23567 -10175 -60892 1285 44596
164D4596j902k0881n8013j0038N6414J8532J530M875p6742r723O9173K377o542
$$ 44596 42694 21813 -36200 -46238 10176 28708 30238 35113 -41629 -51352 17821 20198 13656
177A3656J5247m9942k7377N8085j506J831K2305m2140k4871K7142M803J6850L1252
$$ 13656 28903 -21039 -48416 9669 8163 9994 32299 -9841 -34712 -7570 -2767 14083 45335
190D5335n2612k4116J9134l932L7533L1260n6042l8458K8597j202L4755K7770
$$ 45335 -7277 -31393 -12259 -16191 21342 52602 -3440 -41898 -13301 -14503 20252 48022
202D8022n5444l0357J9350P964K4422K4785n0092j8090J7104k779K3274J6243
$$ 48022 -7422 -37779 -18429 -10465 13957 38742 -11350 -29440 -12336 -15115 8159 24402
214B4402k5941j2499L750j7309L3785K1697k7697K475r342k9595L1564M7087k7549
$$ 24402 -1539 -14038 -10288 -27597 6188 27885 188 2663 -6679 -36274 -4710 42377 14828
227A4828j6325j0212j8774L1615L0854p868k0102k4095j3095M8401J5872k6640
$$ 14828 -1497 -11709 -30483 1132 31986 24118 4016 -20079 -33174 15227 31099 4459
239D459L490j6990k0569L3382K5626k6942J404n025j9621J9257R677O6Q139j4241
$$ 4459 7949 -9041 -29610 3772 29398 2456 3860 -1165 -20786 -1529 8148 8214 16353 2112
253B112k7976K0560J0141K623K0766k5756l0397J4683K0024N841J5903k9980l0510
$$ 2112 -25864 -5304 4837 7460 28226 2470 -27927 -13244 6780 12621 28524 -1456 -31966
266c1966K4012J2612P906Q481k3573k7238K2982J1007J089J0418k2636j0073J1445
$$ -31966 -7954 4658 12564 21045 -2528 -29766 -6784 4223 5312 15730 -6906 -16979 -5534
279e534R2K983J9466j8023j2901J1920j3596R312K5569q631k1505J786q241J3866
$$ -5534 -5442 -2459 17007 -1016 -13917 -1997 -15593 -6281 19288 10657 -10848 -9062 -17303 -3437
293c437K9385j5952j6375o932l689K0091K5259k1138j7415L475q081K1190J5528
$$ -3437 25948 9996 -6379 -13311 -17000 3091 28350 7212 -10203 -6728 -14809 6381 21909
306B1909j8062j1443N925q776J1261J6145j7463K673L89j3786N453J6722n142
$$ 21909 3847 -7596 -1671 -10447 814 16959 -504 2169 2558 -11228 -5775 10947 5805
319E805K673l228k4008J2248J5556J739K439j1051k4612J4392K3510o089L121
$$ 5805 8478 5250 -18758 -6510 9046 10785 13224 2173 -22439 -8047 15463 9374 12495
332A2495j5473j7117J5575J8430o787k27q887j7060J9491O535o467M811m610j3236
$$ 12495 -2978 -20095 -4520 13910 7123 6896 -1991 -19051 440 6975 508 5319 709 -12527
346a2527R001M047n948J6086p678j3659M341l73J188K0079m726k5117N826J859
$$ -12527 -3526 521 -5427 10659 2981 -10678 -6337 -6710 -5522 14557 9831 -15286 -9460 -7601
360g601Q057J5847r688j9579K669M481P832J8181k0172j3968J1108N75J745J3586
$$ -7601 456 16303 6615 -12964 -10295 -5814 2018 20199 27 -13941 -2833 -2258 -513 13073
374A3073r676j4161J2271n243J536J0392n357k667L565j1984j062K2000o052l577
$$ 13073 3397 -10764 1507 -3736 -2200 8192 2835 168 3733 -8251 -9313 12687 6635 3058
388C058l12j4434L028K1371k94j0099j768j5040J0554J9080n785q314l232p340
$$ 3058 2746 -11688 -8660 12711 12417 2318 550 -14490 -3936 15144 9359 1045 -2187 -9527
402i527P431J5923j1104j323r23r149P911P954q538J826O844j5110K233N363j472
$$ -9527 -2096 13827 2723 1400 477 -8672 -761 7193 -1345 481 7325 -7785 -5552 -189 -1661
417a661R318j901j4775J312O989m291J7232k919k5575M935J4098j236M433j42
$$ -1661 7657 5756 -9019 -7707 -718 -5009 12223 9304 -16271 -11336 2762 1526 5959 5817
431E817j8804N742P665K22R365r733j4245J2861Q292j5896J1546N991j6041K172
$$ 5817 -12987 -7245 420 642 10007 274 -13971 -1110 7182 -8714 2832 8823 -7218 -5046
445e046O925m176J025P174m564Rr528j205K0125m49j3856Q10J711p341J5331O535
$$ -5046 1879 -2297 -1272 5902 1338 1347 -8181 -9386 10739 10290 -3566 -2756 -1045 -8386 6945 13480
461A3480j2533q530k03J2351N467p516m820N614q858K995J4927j0109o557P385
$$ 13480 947 -7583 -7786 4565 10032 2516 -2304 3310 -5548 -2553 12374 2265 -4292 3093
475C093j902m672P236m438L105O341j5600O25J0850m466N62J0235j8116n906J8325
$$ 3093 1191 -3481 3755 -683 2422 8763 -6837 -6212 4638 172 734 10969 -7147 -13053 5272
490E272k006j72K124j4360k629J9617m890m557O881j3549j043J5373j994q433
$$ 5272 3266 3094 5218 -9142 -11771 7846 2956 -1601 5280 -8269 -9312 6061 4067 -4366
504d366O216n514r59Q497p510J202P146n236n899O818l109N83Q526n036m866l327
$$ -4366 1850 -3664 -4623 3874 -3636 -2434 4712 -524 -6423 395 -2714 -2131 6395 1359 -3507 -6834
520f834L742R518J294j2805O65L531l435J0789J294j0607l535M736L884N509o346
$$ -6834 -3092 6426 7720 -5085 -4420 -889 -4324 6465 7759 -2848 -6383 -1647 2237 7746 1400
535A400p621J1433m962o000J3110j217j4308J1274N091j6253P523O830m083P40
$$ 1400 -6221 5212 250 -5750 7360 6143 -8165 3109 8200 -8053 -530 6300 2217 2957
549B957l436o921J0536K758p816Q786q656j0305J6162P807j4778J014K697q570
$$ 2957 -479 -7400 3136 5894 -1922 6864 -1792 -12097 4065 11872 -2906 -1892 805 -7765
563g765J0582L849p890j188J033k514O639j67p941P539j536m480L492k56k365
$$ -7765 2817 6666 -1224 -2412 -1379 -3893 2746 2579 -5362 2177 641 -3839 -347 -603 -2968
578b968O145j426p600M667j957L203N667o222o544M768J548J728N992j1774j962
$$ -2968 3177 1751 -5849 -1182 -3139 64 5731 -491 -7035 -2267 -719 1009 7001 -4773 -6735
593f735P816q69J023L927q799k813J0833m399j99L723o793J974P085q224j542
$$ -6735 1081 212 1235 5162 -3637 -6450 4383 -16 -215 3508 -3285 -1311 5774 -2450 -3992
608c992J1196p608p92O132p651j460J0266j558n641J693n740O670N947p370j073
$$ -3992 7204 -404 -1196 4936 -2715 -4175 6091 4533 -1108 585 -5155 1515 7462 92 -981
623i81K421o407M996J0477j1813l315O394j735O76K682m262r91M064m333M247
$$ -981 1440 -4967 29 10506 -1307 -4622 1772 37 713 3395 -867 -1858 2206 -2127 2120
638B120p27o064O391K996q709N05O016n247M813M88p954K336L986q52K466j673
$$ 2120 1393 -4671 1720 4716 -3993 -3488 2528 -2719 2094 2582 -5372 -3036 950 98 2564 891
654H91r304P533M377m472K012k173m377N624L771o561L294j735l029P225j385
$$ 891 -8413 -880 3497 -975 1037 -1136 -5513 111 3882 -2679 615 -1120 -4149 3076 1691
669A691o132M684K761n734M434j408m875O784J006l596L86j390j427Q820k887
$$ 1691 -4441 243 3004 -2730 1704 296 -4579 2205 3211 -385 1 -1389 -2816 6004 3117
684C117o557M037j968P86O159k739p959O065M16j157M562n155k741N138J27l370
$$ 3117 -3440 597 -1371 -585 5574 2835 -5124 941 1357 200 4762 -393 -3134 2004 2131 -1239
700a239M337m363l16O128m546k205L256q14n24M949o991j568O486j854Q9J096
$$ -1239 3098 -1265 -1581 4547 1 -2204 1052 238 -286 4663 -2328 -3896 2590 736 825 1921
716A921n418q37Q500k764k224J080m746L227M391l285k303K986l866L126L877
$$ 1921 -3497 -4334 4166 1402 -822 258 -4488 -1261 3130 -155 -2458 528 -3338 -212 3665
731C665p332J415L768k362l07K630n138K257N115m828M12k76j657L933K942o727
$$ 3665 -3667 -2252 1516 -846 -1153 1477 -3661 -1404 3711 -1117 -705 -981 -2638 1295 4237 -2490
747b490L81K570k493N321l09o248R81M713k805K796p41n895N120J876l068J279
$$ -2490 -2109 461 -2032 3289 2980 -3268 -2287 2426 -379 2417 1676 -4219 901 2777 -291 988
763I88j04l127M669Q95o020L568k90o43L202j572n332M623K387l714L120l499
$$ 988 884 -2243 2426 3321 -2699 869 579 -64 3138 1566 -3766 857 3244 -470 2650 -849
779h49k546N325J683m330J495j730j589O299k377l380K090n44q49M254l267l838
$$ -849 -3395 1930 3613 -717 778 -952 -2541 3758 1381 -1999 91 -453 -1302 2952 -315 -4153
795d153O180k021q69J907k760j613N413j132l511K804l300J980M261l460l191
$$ -4153 2027 6 -863 1044 -1716 -3329 2084 952 -2559 245 -3055 -1075 3186 -274 -3465
810c465L426q06M6M292n802q51L919o12o8J385l828M61N432m233K72J197k608
$$ -3465 -39 -845 -799 3493 -2309 -3160 759 147 79 1464 -2364 -1903 3529 -704 -432 765 -1843
827a843J803L445m187j766M353k482K504K55m512J506L533k216L66J453o020L889
$$ -1843 -40 3405 -782 -2548 1805 -677 1827 2082 -2430 -924 2609 393 759 2212 -3808 81
843H1M434m630l07R67k027K689K793o079J985J116k242L322J87n197J976M369
$$ 81 4515 -115 -422 545 -1482 1207 4000 -2079 -94 1022 -1220 2102 2289 -2908 -932 3437
859C437m711K244n20l324L611J756m017N40J605l010M568n07m873K232J435j247
$$ 3437 -1274 970 450 -2874 737 2493 -1524 -984 621 -2389 2179 1672 -3201 -969 466 -781
875g81J939p50m731M360P26j299J453k398j748M109J249m264K350j630P0L791
$$ -781 1158 408 -4323 37 763 -536 917 -1481 -3229 880 2129 -2135 215 -1415 -1345 2446
891B446k964j825K959n25j596M279m166j780N378j009j762J282k237k86N602l325
$$ 2446 -518 -2343 616 91 -1505 2774 -1392 -3172 2206 1197 -565 717 -1520 -1806 3796 471
907D71k242L435l332J066N242l709m666N734j269r53L200l295j234L371p72j738
$$ 471 -1771 1664 -1668 -602 4640 931 -3735 1999 730 -223 2977 -318 -1552 1819 1047 -691
923f91K963l822L78N024l867k317L196j07j281K955l167j460K810k81R35n55l163
$$ -691 2272 -1550 -1172 3852 -15 -2332 864 757 -524 2431 -736 -2196 614 333 1268 713 -2450
940b450P17M284k329l59L13k618K268J846k098l81Q41k234L346K92m413K791R60
$$ -2450 -1733 2551 222 -137 176 -2442 -174 1672 -426 -807 34 -2200 1146 1438 -2975 -184 776
957G76k305J977L75m586L860J917m027K088l49k481M200J599o023K048J766l000
$$ 776 -1529 448 823 -3763 97 2014 -2013 75 -274 -2755 1445 3044 -2979 -931 835 -2165
973b165M591k45m812J641L239l089K502j66m850M062J796l379R33J236k870K769
$$ -2165 2426 2181 -2631 -990 2249 -840 1662 1496 -3354 708 2504 -875 58 1294 -1576 1193
989A193J050l654J678L10n95J724o60l521L133J723k283J155j892q21K623P68
$$ 1193 2243 -1411 267 577 -18 1706 1046 -2475 658 2381 98 1253 -639 -1460 1163 1931
1005A931j989K91j890L02M335k769j557J938j240l80L309k633k018L755j985L47
$$ 1931 -58 233 -1657 -1355 2980 211 -1346 592 -648 -1028 2281 -352 -2370 1385 -600 -253
1021b53J305k721J09L632k515j680L417k971Q85L377l110k514L348n80j51K634
$$ -253 1052 -1669 -1560 2072 -443 -2123 1294 -1677 -792 2585 -525 -3039 309 -271 -422 2212
1037B212m364j40L222p53m08J599l272k82M629k375p29J125j409L74K714k709
$$ 2212 -2152 -2292 930 177 -231 1368 -1904 -2186 2443 68 -661 464 -945 -571 2143 -566
1053e66p93K930j997Q70R82k661M38K937j771k57O63k826K965J813k480q10M98
$$ -566 -1359 1571 -426 444 1426 -1235 -797 2140 369 112 775 -2051 914 2727 247 -563 -65
1070f5j009K361J728m379J016M40o56K069n2l072J042J932k184J979p09k040K356
$$ -65 -1074 1287 3015 -1364 -348 92 -564 1505 1453 -1619 -577 1355 -829 1150 441 -1599 757
1087G57M93k531P70J153j966L097j445l057K309R46j028J407r70l298L562O47
$$ 757 1250 -1281 -511 642 -1324 1773 328 -2729 -420 526 -502 905 -65 -3363 199 846
1103H46j094N08j351r66K810P15k560J438j498p6K774j228k068J824J94j094K066
$$ 846 -248 260 -1091 -2057 753 1468 -1092 346 -1152 -1228 1546 318 -1750 74 268 -826 1240
1120A240j833q55K930q57j105N94o65l95L174j953j402J391n92Q21J849j968k014
$$ 1240 -593 -1448 1482 625 -480 114 -551 -946 2228 275 -1127 264 -328 493 2342 374 -1640
1137a640K387n26L72J103k116m51J957n87l37J210k646J047K141k056j46P60n12
$$ -1640 747 221 593 1696 -420 -871 1086 499 162 1372 -1274 -227 1914 -142 -288 472 -40
1154d0J09J833l103L07J784r73R05m65k005O05L012k010J2k16j607K100J325k279
$$ -40 69 1902 -1201 -894 890 -83 822 357 -1648 -1043 1969 -41 -29 -245 -1852 248 1573 -706
1172g06l74J109j339J728O11k762R67J051n28R7M65k339J993R00j590O69n07n48
$$ -706 -1080 29 -1310 418 1029 -1733 -766 285 -243 -146 319 -2020 -27 873 -717 -48 -555 -1103
1190a103J641R34k736N89N57m53J750p24j804Q82J198r59J340j154j725K559J99
$$ -1103 538 1472 -1264 -675 -118 -571 1179 455 -1349 -467 731 -228 1112 -42 -1767 792 991
1207I91r71M49r6j144K228l90k012J405n13K44J165r32j866K307K20j042J183
$$ 991 20 469 373 -771 1457 1067 -945 460 -53 191 1356 424 -1442 865 1085 43 1226
1224A226k347J86J918K16j756O25r70M61K493j786q53K15k22N35J649j900j169
$$ 1226 -1121 -935 983 1199 -557 68 -902 -441 2052 266 -587 -372 -594 -59 1590 -310 -1479
1241a479K028p53K54M93j258l77J958j027o76J091j189J417N44j886q19J741m77
$$ -1479 549 -204 50 543 -715 -1092 866 -161 -837 254 -935 482 1026 -860 -1679 62 -415
1258d15N52P64k558P26J311k98L32k10j742P58K126j545M12k94r01J240J001j758
$$ -415 137 901 -1657 -931 380 82 414 204 -1538 -780 1346 -199 213 -81 -982 258 1259 -499
1276d99J07J119j212J357l20j569R11J405j193k7L62j679K187O11j399l60O5k39
$$ -499 -392 727 -485 872 552 -1017 -106 1299 106 79 441 -1238 949 1560 161 -199 -134 -373
1294c73J562L84k608J385j55k30J130m75j683Q93Q40j057J136j004k56J217j97
$$ -373 1189 1573 -1035 350 195 -35 1095 620 -1063 -170 670 -387 749 -255 -511 706 509
1311E09j196O77l2o92J996j211j145R83L2J91N53j183j380K405l24l97J005j847
$$ 509 -687 -10 -42 -734 1262 51 -1094 -111 -79 112 665 -518 -1898 507 183 -214 791 -1056
1329a056q2K179o31j349J339j351L80J502j316n89J290k40o24J706k136J77J704
$$ -1056 -1138 1041 410 -939 400 -951 -571 931 -385 -974 316 76 -548 1158 -978 -801 903
1346I03o77m8Mq69L9K355j748o35N17j28Q49P46j422o30J204p19P22O19j617P0
$$ 903 226 178 182 -687 -648 1707 -41 -676 -159 -287 562 1308 -114 -744 460 -259 463 1082 -535 -465
1366d65J142k38o4M88j728J032J208j585N59k04m64R77M11k269R79Q31j131J289
$$ -465 677 439 375 863 -865 167 1375 -210 349 145 -319 658 1069 -1200 -221 610 -521 768
1384G68k24j999J188J569j689N69Nj866K237L84j595K08Q26j523J680K41k058
$$ 768 544 -1455 -267 1302 -387 182 187 -1679 558 942 -653 -445 381 -1142 538 779 -1279
1401a279Q23P70o17M32J3j503J161Q71j441O39p9m22J087K87j651N64M48m81J570
$$ -1279 -456 314 -303 129 142 -1361 -200 671 -770 -131 -210 -632 455 742 -909 -345 103 -378 1192
1420A192j373q51R27N11l28P53j288o00J749j54k58J90r29l09K201j042q43J289
$$ 1192 -181 -1032 -105 406 78 831 -457 -1057 692 538 280 470 -459 -768 1433 391 -452 837
1438H37j093K73J084j199m85J446p57k77J074j246J10J465m24j063P06r68J19
$$ 837 -256 17 1101 -98 -583 863 106 -171 903 -343 -233 1232 808 -255 451 -517 -398
1455c98K056j640o58R20n06L9J621j826o71J619j040L78P95j240k04J626r56m45
$$ -398 1658 18 -640 280 -226 -187 1434 -392 -1063 556 -484 -106 689 -551 -755 871 -85 -530
1473e30J074j144N37O63j158l63J153m69M03L48j865O29J239l47J89k91j159P86
$$ -530 544 -600 -63 600 -558 -921 232 -237 166 514 -1351 -722 517 170 359 68 -1091 -305
1491c05J490j315L90n49o59R62R90j589N50M52r94J194M4j346Q65M98p79L82M4
$$ -305 1185 -130 260 -289 -948 14 1004 -585 -35 417 -577 617 661 -685 180 678 -101 281 325
1510C25j020J400J24j326K60Nl07J656J62k142J058j0j87R53n70j533J270M64
$$ 325 -695 705 829 -497 -237 -232 -539 1117 1279 -863 195 185 -2 951 381 -1152 118 582
1528E82q98P73n72q13J293M2p59O09k46m54J189o20j001J184j54n95R97q41q75
$$ 582 -316 457 -115 -928 365 407 -352 257 11 -443 746 126 -875 309 155 -440 557 -284 -1159
1547a159J867m69p5K96j217K26J129k08j000O70q60N06J303j022n24N06j73j67
$$ -1159 708 239 164 460 -757 -531 598 390 -610 60 -800 -294 1009 -13 -537 -31 -204 -371
1565c71J146j453O1J181o40j44M56o13J83J149r77k66M87o83Q05Q64j331m34J129
$$ -371 775 -678 -617 564 -76 -220 236 -377 -194 955 -22 -288 199 -484 321 1185 -146 -580 549
1584E49q19J054L6j554O56Q62n95n4O10j526P13O78n80j52Lj96O93N14j660O26
$$ 549 -270 784 820 -734 -78 784 189 135 745 -781 -68 610 30 -122 -119 -315 378 892 -768 -142
1604a42N24n25L62j34q09M45R90q13L7j05o98J357J62j044j02L82n22J154j00
$$ -142 382 -143 219 85 -724 -279 711 -102 -65 -170 -868 489 651 -393 -495 -113 -635 519 419
1623D19j222O59L2j22M38k64r72J155k0n70M01m17o2J130l37j011O21k90K62Q73
$$ 419 -803 -144 -112 -234 204 -60 -1032 123 103 -467 -66 -483 -545 585 248 -763 -142 -432 -170 703
1643G03p84o31P88J64l77P76j001m47J236j87k87M48n41m40J406p16m14O78n85
$$ 703 -81 -712 76 240 -137 639 -362 -809 427 240 -47 401 -140 -580 826 110 -304 374 -211
1662b11L22M08k70q34J130l78k71O96j083K01R96j84q01P59j033L95J123j033
$$ -211 111 519 249 -585 545 167 -104 592 -491 -290 706 522 -279 480 -553 -158 965 -68
1680f8k4K42l83K43R26j380K90N21o68O01k3o67J98O88o63JK78p60P62K49q46
$$ -68 -92 150 -233 10 936 -444 -154 367 -301 300 277 -390 -192 496 -167 -166 112 -648 114 363 -483
1701d83n4P71o61P02J69j351N97J60N0Q5K99j158P42P11q15N56m69l59Q74K51
$$ -483 -537 234 -427 275 444 -907 -310 -150 -100 -15 284 -874 -132 579 -236 320 -149 -508 366 617
1721F17j136N94j3m83J035m93p52P39N00p03M92k66q48J249j91j48k16Nm20J360
$$ 617 -519 75 62 -421 614 121 -631 108 608 -95 397 131 -717 532 341 193 -23 -18 -438 922
1741I22k87j263P30k35K44N55l58p51R42k40l39P09p22m22J157n61l03N19o32
$$ 922 635 -628 102 -133 111 666 308 -443 499 259 -80 629 -93 -515 642 81 -222 297 -335
1760c35L1J092r32m51O43j59K04L89p67m28J095n50J10L07o90j53J079l48n61
$$ -335 -304 788 -144 -595 48 -111 93 482 -285 -713 382 -168 -58 249 -441 -594 485 137 -424
1779d24M81o82L47P16o77l22L60j15K48M93j047L29M13k81l4N53q07L97Q62j189
$$ -424 57 -625 -278 438 -239 -561 -201 -316 -68 425 -622 -293 120 -161 -195 358 -449 -52 810 -379
1799c79J46K66k78N83J96o77k86Q89p23J024l35r31O55J89k16R0K27j041Q24K96
$$ -379 -233 33 -245 338 534 -143 -429 460 -263 761 426 -505 150 339 123 213 440 -601 223 519
1819E19n89N0q0m9N07K40j122N21L98k34K49m77m14M73N69r81O02o62lR29j24
$$ 519 -70 -20 -100 -149 358 598 -524 -3 395 161 410 -67 -481 -8 561 -420 182 -480 -483 446 322
1840C22n11j40q2j6R06l48o64M19k27o8Q96m19n81O65j03m24N77n65M07L47m79
$$ 322 -189 -329 -411 -427 479 131 -533 -114 -341 -409 487 68 -513 152 49 -375 202 -363 44 391 -88
1861h8m27N57l29M67N26q57k57P30l71j22Q32r79k78R40j12k05K8l74j10R64m66
$$ -88 -515 42 -287 180 706 -151 -408 322 -49 -171 661 -318 -596 344 232 27 55 -319 -429 535 69
1882F9k28O08r31N24M20m21m28R08m01j94N35p44L91O29n18l56N34m48K76N23
$$ 69 -159 449 -482 42 462 41 -387 521 120 -74 461 -283 108 737 219 -137 397 -51 225 748
1902G48r43J00j40K05K10K59q18J82M49m24N62l39k69P0N06l84J45k09n24J060
$$ 748 -195 -95 -235 -30 180 439 -379 -197 252 -172 390 51 -218 -148 358 -26 119 -90 -614 446
1922D46m7o46J55n3k99P62N7j199P80K03n04L24J16p51R04j13k87J27k54r6R14
$$ 446 399 -247 -92 -145 -444 318 375 -824 -44 159 -345 -21 95 -656 248 135 -152 -25 -279 -375 539
1943E39j48p11P7K61n52P83j02l77K98oj77M32l66o48R35j21k03J23J22k72P54
$$ 539 391 -320 -243 18 -534 249 147 -230 68 62 -115 317 -49 -697 238 117 -86 37 159 -113 641
1964F41l39l27M07l57Q5K05m61n3K00K14l24N34o94k31R22k4o23L48l38j9P27
$$ 641 302 -25 382 25 110 315 -146 -199 1 215 -109 425 -269 -500 422 398 -225 123 -215 -234 493
1985D93o36l1J60j05q6N10m38l91Q96m75Qj3l40K60Q26q35k31K93n9N01L2m70
$$ 493 -143 -174 -14 -119 -205 305 -133 -524 372 -103 -95 -108 -448 -188 638 -197 -428 -135 -194 307 339 -131
2007a31j86M17l77N57J35r56M00K77k50J57J54o02K16M49m23J68J85m38M90N5
$$ -131 -317 100 -277 280 415 -541 -141 136 -114 43 197 -405 -189 260 -163 5 190 -248 242 297
2027B97m86j08P62p13N88k60m62M24K73k66R1K2q17J060J14o43P4R9k57N66J71
$$ 297 -189 -297 465 -248 340 80 -382 42 315 49 140 162 -655 405 519 -124 -50 49 -208 358 529
2048E29p97M53j39n1K42j68Ro1J7q8L96l12l11L65k6m48K38K88l67P50n28o21
$$ 529 -268 185 46 -5 237 69 78 17 34 -54 342 30 -281 84 58 -390 -152 136 -231 519 -9 -630
2070f30N93P6L7m9k60n29O77M4K2J91n32KL34J96k52K46k63k0M71m42k19L88N1
$$ -630 -37 39 76 27 -233 -762 -85 -41 -19 172 -360 -358 -24 172 -80 166 -97 -117 354 -88 -307 81 132
2093A32l18K49m67J20O23l85R4j06j53k2O53m08j87K40k71N12Q5k76l97L61J0
$$ 132 -186 63 -404 -284 339 -46 48 -58 -211 -233 420 12 -175 65 -206 306 391 115 -282 79 89
2114H9N7L73r62Q10m9m56M05K88m88j81M21k53p9J46k72M49Q0o38j5M20k96M39
$$ 89 146 519 -443 367 318 -138 267 555 67 -114 307 54 -25 121 -151 298 378 -260 -275 145 -151 288
2136B88m05m52M98L72n29L18j61l98P64j99l88r9K54K5L08L5n07L97N4l34J59
$$ 288 -117 -569 -71 301 -228 90 -71 -469 295 96 -292 -391 -137 -112 196 231 -276 121 175 -159 0
2157@k93k70O41Q0n90N88o00M20M02j43q17M30L8o9N05k66k60K03K39m11L69n11
$$ 0 -293 -563 78 158 -432 156 -444 -24 378 235 -582 -152 -114 -183 322 56 -204 -1 238 -173 196 -315
2179c15MM97l24P4J34n3m6L78n4m06N31m45L03J11n30l79P03m2k3K59o25R6N54
$$ -315 -311 186 -138 -64 70 17 -29 349 295 -111 420 -25 278 389 -141 -520 183 141 118 377 -248 -152 402
2202D02q2m94L43m17J44N66l50l14L1j19K77L91n13PK55k27J09j38j09L72L33
$$ 402 320 -174 169 -248 -104 462 112 -202 -171 -290 -13 378 -135 -128 127 -100 9 -129 -238 134 467
2223D67m83l63M27l87N30n0m36M4L71k26J18N8o39L93L90k59L29J6o94M55K06
$$ 467 -16 -379 48 -339 191 141 -295 -251 120 -106 12 70 -569 -176 214 -45 284 300 -394 61 267
2244B67k68J72J64o02L91M9l70J10J55k47M56%k23j10M28k82k02J83k58N58n6
$$ 267 -1 171 335 -267 124 173 -197 -87 68 -179 277 277 54 -56 372 90 -112 71 -187 371 315
2265C15n47J72Q0o7K90J45n55J33lKO10o92m3J01N06m96L23m70J21K60m10J9J88
$$ 315 -232 -60 20 -47 243 388 -167 -34 -37 -35 575 -117 -160 -59 447 -49 274 -196 -75 185 -225 -206 -18
2288a8ml34N15k99k38O95j55k42M34n35l29J001k22k97L7l68NN53j45j94K37m52
$$ -18 -22 -356 159 -140 -378 317 162 -80 354 -181 -510 491 269 -28 9 -359 -354 199 54 -140 97 -355
2310c55L40M69n56j62j06L47m0K78l70p3L87m3r6k25K32K8K85k30j42J82k88L87
$$ -355 -15 454 -102 -264 -370 -23 -63 215 -155 -228 159 116 20 -205 27 55 340 110 -32 150 -138 249
2332B49m3j80n7J83N7j03P2m10L77N9j26J49O0m66J4O07n98L35K4k62J44J48o42
$$ 249 206 26 -31 152 209 106 178 -232 145 204 78 227 287 -179 -165 442 -156 179 203 -59 85 233 -409
2355d09M17K26k64J70m13k02M71K60l55L00k82j6N50l67l91K47Q1j0J61j65l55
$$ -409 8 234 -30 140 -273 -475 -4 256 -99 201 -81 -97 453 86 -305 -58 23 13 174 9 -346
2376c46K88P7m0O8k97k54O65j10j33L50p03K55L96k69l53M61k5k2K89m52j3J59
$$ -346 -58 19 -21 47 -250 -504 161 51 -82 268 -435 -180 216 -53 -406 55 30 8 297 -155 -168 -9
2398iK43k86J74j36n8M14k29p4k6j89k09O83j11k42Q7r7K59K06n09J22K89k34
$$ -9 234 -52 122 -14 -72 342 113 39 13 -176 -385 298 187 -55 32 -65 194 400 -109 13 302 68
2420F8j61L01k04J30N6l54m2K29k96M95J28j16j62m97N30j23M06p64N1M33l57
$$ 68 -93 208 4 134 190 -164 -206 23 -273 222 350 234 72 -425 105 -18 388 -376 -325 108 -249
2441b49N62j38n48L45j25k13K81J44l92L68j40r1j03L45j3J52q6o08N95J97n7
$$ -249 313 175 -373 -28 -153 -366 -85 59 -333 35 -105 -196 -299 46 33 185 99 -509 86 283 226
2462B26k79O5m12N24K78n21K69l70m1N28k70Nk8k0j56O59k47j40k41N7J38Q3j46
$$ 226 -53 12 -400 124 402 -119 150 -220 -261 267 -3 2 -26 -46 -202 457 210 70 -171 -114 24 107 -39
2485c9k43N72k3n67K99j26K71K25k44m29L65j83n1K99l52j13K60Q4r1M15l84k8
$$ -39 -282 290 267 -300 -1 -127 144 369 125 -304 61 -122 -173 126 -226 -339 -79 5 -86 329 -55 -83
2507h3M17l75K40j00j59j83M89l66m6L33l04J60J36m56R2M23j76j68J51l48J93
$$ -83 334 -41 199 99 -60 -243 246 -120 -166 167 -137 23 159 -297 -205 218 42 -126 25 -323 -130
2528a30L80j13l89J12j98L19K11m36J33K90l30J19J10k24P7J20Q1j17j29Q2M0
$$ -130 250 137 -252 -140 -338 -19 192 -244 -111 179 -151 -32 78 -146 -69 51 132 15 -114 -32 8
2549HJ62m20K49mr7K86p5k53q1M69l24M38k95k75L51J44o6J02n0n06M85k02j8
$$ 8 170 -250 -1 -5 -102 184 109 -144 -225 244 -80 358 63 -212 139 283 217 319 269 -237 248 46 28
2572B8J40j57K8J49j16k51K08j94N8K57k70R0J06J86n5m7k26l4M72k85k16k60
$$ 28 168 11 39 188 72 -179 29 -165 -107 150 -120 -30 76 262 207 160 -66 -100 372 87 -129 -389
2594c89L20l6K84j83l08J18L5N0M90m85l44L70J01j08K14j23j66K58k11j60K37
$$ -389 -69 -105 179 -4 -312 -194 -159 -109 381 -104 -448 -78 23 -85 129 6 -160 98 -113 -273 -36
2615c6j53Q4L29l74j86L90r7j25Q6K7k3J69j18L08j12k82j08M48k43J01l1k04
$$ -36 -189 -105 224 -150 -336 54 -43 -168 -82 -55 -78 91 -27 281 169 -113 -221 227 -16 85 54 -150
2637a50K46o8n3R6N6q1o9J73l16K10P5q0N3p5p1J81N3m46K91j55J65M7qk92PK93
$$ -150 96 28 -25 71 127 46 -23 150 -166 44 119 39 92 17 -54 127 180 -266 25 -130 35 82 74 -218 -211 82
2663H2r1L42m15k9O2L78n00rK00k12K43K78o81P9L58j99K91q2m29K02L30j88J5
$$ 82 -9 333 -82 -111 -49 329 -171 -180 20 -192 51 329 -352 -273 85 -114 177 95 -334 -132 198 10 25
2686B5m1j38L46j76m7L37n84K23L52j86j38OJ9K8L36k45j56o4L13j94j22J21p9
$$ 25 -16 -154 192 16 -31 306 -278 -55 297 111 -27 -21 -2 26 362 117 -39 -103 210 16 -106 15 -64
2709f4M48l78j13K1R2j83N71m18r1K37k09J64K08m13J08l6j1O0K38m50L4K85R
$$ -64 384 6 -107 -86 6 -177 394 -24 -115 122 -87 77 285 -128 -20 -56 -67 -7 231 -219 -185 100 109
2732A09L2l9l9k06L89l34P4Q7k34N8J63k31J5K95r7k2j50l30M85%j94j54M23l71
$$ 109 141 102 63 -143 246 -88 -14 73 -161 -103 60 -171 -156 139 42 20 -130 -460 25 25 -169 -323 100 -271
2756b71M05p9m27L23Q0q5M7J55k85L19j7l72K54j64j21K47k27J43L1J46k54M55
$$ -271 134 55 -372 -49 31 -54 -7 148 -137 182 165 -207 47 -117 -238 9 -218 -75 -44 102 -152 303
2778C03k42k03K44M5q7L03k99k94M94J4k61OR2j53K19N3l21k6j1P3L45k62k4Q3
$$ 303 61 -142 102 147 60 363 64 -230 264 278 17 23 115 -38 181 234 -87 -113 -124 -51 294 32 8 91
2802I1q8j2Q4K5k80P5J22k49L68L6k25L3O3m0l67K64r0K25J9j28r6J08J31L8k38
$$ 91 3 -9 75 100 -180 -105 17 -232 136 172 -53 -20 43 3 -364 -100 -190 35 54 -74 -170 -62 69 107 -131
2827a31p4M87l22k1Q8j39O7jj38L4K17jj97J83k53J73L22k43j63J18q6j48M25
$$ -131 -205 282 -40 -61 27 -112 -45 -46 -184 -150 67 66 -131 52 -201 -28 294 51 -112 6 -80 -228 197
2850A97o8n3l36l0J21L73k93L9j24K11N8k00J85k44J56k10K89Q2j90J41K5k34
$$ 197 129 76 -260 -290 -169 204 -89 -50 -174 37 95 -105 80 -164 -8 -218 71 153 -37 104 129 -105
2872a05L86k15k24K52k38j2O4K82j62n1J81k75O9O7l85K83r6R2r3L68k82j58K81
$$ -105 281 66 -158 94 -144 -156 -92 190 28 -23 158 -117 -48 19 -366 -83 -179 -87 -180 188 -94 -252 29
2895B9j69J54n7J09nk92P4J45k57j04N04k46J59p9k30K57K1rj34j0j2k05L57J55
$$ 29 -140 14 -43 66 61 -231 -157 -12 -269 -373 131 -115 44 -35 -265 -8 13 4 -130 -140 -152 -357 0 155
2919A55k44q1J27k14L18m7j7K19k45L9J39j60l9j49L73J7k18M47m47J59p7K5J7
$$ 155 -89 -170 -43 -257 61 14 -3 216 -29 10 149 -11 -50 -199 174 191 -27 420 -27 132 55 80 97
2942I7o8l9J39j61r7J15j81L04J74o35N13Q2q3j38j72j59K59K05l70J26K09l01
$$ 97 29 -10 129 -32 -129 -14 -195 109 283 -352 161 243 160 22 -150 -309 -50 155 -215 -89 120 -181
2964a81L06N2l49J34M8l02K15N6j2K5j62R0r3K83q5m6Rq8M14n70J80k07J91N8
$$ -181 125 177 -172 -38 10 -292 -77 -21 -33 -8 -170 -80 -173 110 25 -21 -12 -100 314 -256 -76 -283 -92 -34
2988c4p9K79l27K84j04k22L20J54k07J20l03P1q0J88k00j65N21k07P0K9l09M44
$$ -34 -113 166 -161 123 19 -203 117 271 64 184 -119 -48 -128 60 -140 -305 216 9 79 108 -201 243
3010B43j52o6q2J16q7L29k22k73L14k58J61J01j55KK11m37K41J71%k15L1k31R
$$ 243 91 25 -57 59 -28 301 79 -194 120 -138 23 124 -31 -29 182 -255 -14 157 157 -58 -27 -258 -249
3033b49N75l91MK21q4j86J44o2K02l31L6K2J36Mj1j22J40m77M81j44r1J90l4J99
$$ -249 326 -65 -61 160 76 -110 34 -28 174 -157 -121 -99 37 41 30 -92 48 -429 52 -92 -183 7 -27 172
3057A72N9j98l1J73l55J57J02m6l3O8k7j57K82l49K17j1l3J99J34l58K69J25k79
$$ 172 231 33 2 175 -180 -23 79 33 0 68 41 -116 166 -183 34 23 -10 189 323 -35 234 359 80
3080H0jJ99k34K93P1l71NL24n21M63j19j56k17J80o3K02nn8O8j96jK01rk53J54
$$ 80 79 278 44 337 408 37 42 366 -155 308 189 33 -184 -4 -67 135 130 72 140 -56 -57 144 135 -118 36
3105C6J57j77r7J71j87R6L7j53J95j26j33J98N6j67K65j39p5k0J94k73K89j67
$$ 36 193 16 -81 90 -97 -1 36 -117 78 -48 -181 17 73 -94 171 32 -43 -63 131 -142 147 -20
3127b0o3J99j83J29q5N5l26M67j43k25K28K6N2p7Mj53J1K30k15N1o3n8J36P0O2
$$ -20 -83 116 -67 62 -23 32 -294 173 30 -195 33 59 111 34 38 -115 -104 126 -89 -38 -101 -159 -23 47 109
3152A09k2j14l2J63j02J7k3r2R9J41j42j16L22l45R6K06o9j70L99k72R5J2m34
$$ 109 87 -27 -59 104 2 19 -4 -96 3 144 2 -114 208 -137 -41 165 96 -74 325 53 148 160 -274
3175b74K63r9M0j67o2M14P4K05l09j62P3k19N32l12k39J99o6l6J70J2l68K76o8
$$ -274 -11 -110 -70 -237 -299 115 189 394 85 -77 -4 -223 309 -3 -242 -43 -109 -145 25 37 -331 -55 -123
3198a23J11j8J15k04J54J16k83N1K06l60M54j82j57K04jk05J73j19r3L38j48o5
$$ -123 -12 -30 85 -119 35 151 -132 -81 125 -235 219 37 -120 84 83 -122 51 -68 -161 177 29 -36
3220c6o9R8o7L06l0m16M18J3j61Q4N4k87J95R9k79K38k55k18M92l49J39K54k08
$$ -36 -105 -7 -74 232 202 -214 204 217 56 140 194 -93 102 201 -78 160 -95 -313 179 -170 -31 223 15
3243A5K18J66n56O9L09q3O1Ol52pN8J35Q8k08jj46K64j44J17J10n7r1k06L54K1
$$ 15 233 399 -157 -88 221 138 199 205 -147 -154 -96 39 127 -81 -82 -228 36 -108 9 119 62 -29 -235 119 140
3268A40j82R4P1m83L40o3j6kM6l3Jj34L98k20j61L22l30L09L0k67K8K7J09R3l5
$$ 140 -42 52 123 -360 -20 -83 -99 -101 -55 -88 -87 -221 177 -43 -204 118 -212 97 127 -140 -112 -85 24 117 82
3293H2k06K15Q8l52K29r1J15k07K35k38Q1J01n90N35J51k88J02j12J65Q8j68l18
$$ 82 -124 91 179 -173 56 -35 80 -127 108 -130 -49 52 -538 -3 148 -140 -38 -150 15 103 -65 -383
3315c83O52j79K50j94k0k97K51q7pj2L4j7Q6l7k14K76k0j30J66k80l9J94K5O0
$$ -383 269 90 340 146 126 -171 80 -7 -14 -26 8 -9 77 40 -174 102 82 -48 118 -162 -201 -7 18 78
3339G8O5j04M3J52k36J41j64J18k41L1o6n0J10r2M08j06Nj04p4J38k83M48l51
$$ 78 143 39 82 234 -2 139 -25 93 -148 -117 -183 -233 -123 -215 193 87 92 -12 -86 52 -231 217 -134
3362a34J29K21m53K45J44j92J70j12j33R7J07j2k00K93j35r8P8qP3k41K67k01
$$ -134 -5 216 -237 8 152 -40 130 18 -115 -18 89 77 -123 170 35 -63 15 7 80 -161 106 -95
3384i5L95k79q6J06M9N1j0j73Q7j8k03L29k24j00K80j58J59j7r5o4K20J67n10
$$ -95 300 21 -65 41 90 141 131 -42 45 27 -176 153 -71 -171 109 -49 110 93 -2 -66 154 321 -189
3407a89K51j21j32J87j91j7J19j45k0K74M3k16J58m6l10L86K2Rj6k59J50R6j06
$$ -189 62 -59 -191 -4 -195 -212 -93 -238 -258 16 59 -157 1 -45 -355 31 53 62 46 -213 -63 33 -73
3430g3Nj33M48o20L47k76K31N8Q2k40J98m8q6L71k84M7J40O2k14J50k27J03n4
$$ -73 -68 -201 247 -373 -26 -302 -71 -13 69 -171 27 -21 -107 264 -20 27 167 229 15 165 -62 41 -13
3453a3k26K26J66k73o0K5N3M5K29k81N9K48j04O0q9j78n6K19p3J60J3j68Q8k34
$$ -13 -239 -13 153 -120 -180 -155 -102 -57 172 -109 -50 198 94 154 65 -113 -169 50 -23 137 150 -18 70 -164
3477a64n3N9L19k77K64q9n6J28k5j77J37L4j95M6m9J50J6k04O2j38L19p6j37Q1
$$ -164 -217 -158 161 -116 148 59 3 131 106 -71 66 100 -95 -49 -98 52 68 -136 -74 -212 107 31 -106 -25
3501b5j67J52J23o2O2l1J04j90N6O2l1J0j00R0Q1r3k41J81M5j7q8R4j56J47o2
$$ -25 -192 -40 83 21 83 52 156 -34 22 84 53 63 -37 53 134 41 -200 -19 26 9 -79 15 -141 6 -56
3526e6P8R7k42L39k90K9N0K00j97J19l32K33K05j49j95R2L8K1J7K3j00J95k2j86
$$ -56 22 119 -123 216 -74 -45 5 205 8 127 -205 28 233 84 -111 -19 19 40 57 80 -20 175 153 -33
3550c3j78L68l27K32JO5r4k34K23r9J84j36Q5j65M5J58mj05R4j99K29j58l6J67
$$ -33 -211 157 -170 62 63 128 34 -200 23 -76 108 -28 57 -108 -63 95 91 -14 80 -119 110 -48 -84 83
3574H3k1j06K5J74k49m8N57m32j26K9J04N7K6q1k39K68J87q9J8j36r5J28j02J46
$$ 83 62 -44 -19 155 -94 -142 415 -17 -143 -114 -10 47 73 -8 -247 21 208 119 137 1 -94 34 -68 78
3598G8k9k34L4J15r6J71LN6M3K8j05l4N6O1Q5j60J5MqrK0j53j4J80k5m4J51j92
$$ 78 49 -185 -151 -36 -132 39 42 98 141 169 64 30 86 147 232 72 87 91 83 74 94 -59 -73 107 82 38 189 -3
3626cJ25J39n7k74r8K33k0N8j30n4J95j18m9L49l95M3j36J30P3k4J25l22J97k92
$$ -3 122 261 204 -70 -168 65 45 103 -27 -81 114 -4 -53 296 -99 -56 -192 -62 11 -13 112 -210 -13 -305
3650c05K72k11L68j52J98k65PP6K31j94j66M7K2K40j8q0j45o4J72K42j17j57j9
$$ -305 -33 -244 124 -28 170 -95 -88 -12 219 25 -141 -94 -72 168 150 70 -75 -139 33 275 158 1 -18
3673a8j07K48Q7l83R0J62q1rL74l53l6J3N6jl8L42k17q2N0k74L50j66J52k09j61
$$ -18 -125 123 210 -173 -83 79 -2 -11 363 10 -26 -13 43 42 4 346 129 47 97 -177 173 7 159 -50 -211
3698b11l3K75l7j60K50j75j62L18j64K3L42k44J4j49p8J53o9M42n03L15k29O9
$$ -211 -244 31 -6 -166 84 -91 -253 65 -99 -76 266 22 36 -113 -191 -38 -107 335 -168 147 -82 -13
3720a3Kj41L10k29m8J25J9p4Q6j78OJ84Q6p5k8l31K93Q9r1k22L01Oj41M7j87J27
$$ -13 -11 -152 158 -71 -119 6 25 -49 37 -141 -135 49 135 60 32 -299 -6 83 -8 -230 71 77 -64 -17 -204 -77
3746g7K1J36m99M19k7K12M1l32Q5J1J25j82Q7K12k16r0J71j93Q5Q4K35l85K94
$$ -77 -56 80 -419 0 -27 185 226 -106 -21 -10 115 -67 20 232 16 -74 97 -96 -11 73 308 -77 217
3769B17k44O6j46Q5n8k3p4J12R8kK16k67j09o5K56j60L35l12j40K98k4k34m1J45
$$ 217 -27 39 -107 -22 -80 -103 -177 -65 33 31 247 -20 -129 -194 62 -98 237 -75 -215 83 59 -175 -216 -71
3793g1r4K13q7J86k53MM4m6J42j74M1K6L9j40J6K03j74O2K47l89K80M8k9j53l0
$$ -71 -165 48 -39 147 -106 -102 -58 -104 38 -136 -95 -69 -30 -170 -154 49 -125 -63 184 -205 75 123 94 -59 -89
3818h9R4j2M5o6j46P9J87k64L50k20l5J30o8j78J31L9l9J27j22Q6Q8j37o1N0j36
$$ -89 5 -7 38 -28 -174 -95 92 -172 178 -42 -77 53 -15 -193 -62 -23 -62 65 -57 29 117 -20 -81 -31 -167
3843a67L7K21k43J46k9J38j37L24p5n3j61J83k72J8n4N4J85j05k83J35L9K2K93
$$ -167 -130 91 -152 -6 -35 103 -34 290 215 162 1 184 -88 -70 -124 -70 115 10 -273 -138 -99 -77 216
3866B16m40L00K05l13P1kp0K7j48P3pJ7J26p1L64l23l1J12l72K12n6n3J98M7j01
$$ 216 -224 76 281 -32 39 37 -33 -6 -154 -81 -88 -71 55 -16 348 25 -6 106 -266 -54 -110 -163 35 82 -19
3891a9J27J8q8m0n3J52K7P2k79J05j75K83j47J3N7j15J62l90P6M02Mk16M1p9J73
$$ -19 108 126 38 -2 -55 97 124 196 -83 22 -153 130 -17 -4 53 -62 100 -290 -214 188 192 -24 17 -62 111
3916A11O2n31O89n78L15J51j99j3Q6j32k36K75N1k48K09J69q3j77J90k23J83j36
$$ 111 173 -358 331 -247 68 219 20 7 93 -39 -275 0 51 -197 12 181 98 -79 111 -112 71 -65
3938f5N6K5j21J75q2J54k75J04j48j56L34p8j4l7K59j02l0J04m29K67j1P1J58
$$ -65 -9 16 -105 70 -12 142 -133 -29 -177 -333 1 -77 -91 -128 131 29 -1 103 -326 -59 -70 1 159
3961A59j49L8j92Q0R1q3K26j60J58j56q2R7J21n9K50l46j05J36J3k06J65nM6J9
$$ 159 10 48 -144 -64 27 -56 170 10 168 12 -70 27 148 89 339 -7 -112 24 37 -169 -4 -9 37 56
3985E6m1o6J94K6k59J74m7J9j66o0L35n8j5oJ00m94K08K5nl9K59J20k21q3k9Q0
$$ 56 15 -51 143 169 -90 84 37 56 -110 -170 165 107 92 86 186 -308 -100 -75 -80 -119 140 260 39 -44 -73 7
4011GO9j44O5k34K00J23J14j63P5k51J63P4j01J3M6j90J74K46l19P0j61j5N3j61
$$ 7 76 -68 -3 -237 -37 86 200 37 112 -139 24 98 -3 10 56 -134 40 286 -33 37 -124 -139 -86 -247
4035b47K26k40L99p9j72P5p0J25j98J86j2k0M1k6J7K24q0r5J27l91J79K17l79
$$ -247 -21 -261 138 59 -113 -38 -108 17 -181 5 -7 -27 14 -12 5 229 149 54 181 -210 -31 186 -193
4058a93K19o0J06MO5k37n1K71k06M1L31k26q5Q2l01M90k56KJ46q1Q5k12n4j09
$$ -193 26 -34 72 76 141 -96 -147 124 -82 -41 290 64 -21 61 -240 250 -6 -4 142 61 146 -66 -120 -229
4082b29K75j5J36j16K1l29L15L0k29QK5K57l6R2k60R6j12K60j42r3j81M26r7j12
$$ -229 46 31 167 51 72 -257 58 88 -141 -133 -108 149 113 205 -55 41 -71 189 47 -46 -227 199 102 -10
4106a0j36K92k03J79k50o5J30j49K81p5o6K3J40q9J25q2o0j92L33j91M6J63l46
$$ -10 -146 146 -57 122 -128 -193 -63 -212 69 -6 -72 -49 91 2 127 45 -15 -207 126 -65 -19 144 -202
4129b02L44m21J16K37k48K59K5j30l0K35l62J14L0P1m8P1l8k05R4Q8j02M12j95
$$ -202 142 -279 -163 74 -174 85 110 -20 -50 185 -177 -63 -33 38 -10 61 23 -182 -88 0 -102 310 115
4152A15j90j67K20%q1K03J7j08k06MJ56j04R2j62L18k13R6J8J81K9j57m4p5K82
$$ 115 -75 -242 -22 -22 -103 100 117 9 -197 -193 -37 -141 -49 -211 107 -106 -10 8 189 218 61 17 -58 224
4176B24l27P2R9j07K4N3J9K13k78N7K7j45J7%j03M27l21k17L48N6j42J78j38J19
$$ 224 -103 -31 68 -39 -15 38 57 270 -8 49 76 -69 -52 -52 -155 272 -49 -266 82 138 -4 174 36 155
4200A55O0k81R6p3K55j02l03J97J54r3K9k6n1J23j20K1o6q4K7K87n9k56J71j86
$$ 155 215 -66 30 -43 212 110 -193 4 158 65 94 68 17 140 20 41 -25 -109 -82 205 146 -110 61 -125
4224a25L48j54O5p9J05l42J07J48p7Q4l5J4J04k88j66J92J03j35K53k91K02N7
$$ -125 223 69 134 55 160 -182 -75 73 -4 80 45 59 163 -125 -291 -99 4 -131 122 -169 33 90
4246I0k0k73J88j3j83J93p7p2PJ45P2J18j32q2j01J69oK7J63k34K27m3l8k45J58
$$ 90 70 -203 -15 -28 -211 -18 -95 -167 -160 -15 57 175 43 -39 -140 29 23 50 213 -21 206 163 125 -120 38
4271C8j06K48k27J5M5j01K7J47j96J67k1m3N4J1J42k51J22Rl88M23Q1k12K3J49
$$ 38 -68 180 -47 -32 13 -88 -61 86 -110 57 36 -7 47 58 200 -51 71 80 -308 115 196 -16 7 156
4295A56l25K57k17L01n8O5j19J63j96j52J65P8R0k36J84l13K4L71l20N8q3O7J05
$$ 156 -169 88 -129 172 114 179 60 223 27 -125 40 118 208 -28 156 -157 -133 238 -82 -24 -107 -40 65
4318F5k35J52J02j28J69l0k10J63j06K15j87J65l23K18K3O9k17J70j10L1M1N9
$$ 65 -170 -18 84 -44 125 95 -115 48 -58 157 -30 135 -188 30 53 122 -95 75 -35 -4 37 96
4340I6k47J03J04O5l2J8m56M05j36J61J10j00m6l3k35n1L84j81j82L66J15m75
$$ 96 -151 -48 56 121 89 107 -349 56 -80 81 191 91 45 12 -223 -274 110 -71 -253 113 228 -247
4362b47M03j47MP9r0q3J32prl5l41M87k7k3j91M7L9n6J33k3Q7n6K0k24J30Kj7
$$ -247 156 9 13 92 2 -81 51 44 35 0 -341 146 119 96 -95 -48 -9 -65 68 45 132 76 96 -128 2 4 -13
4389a3J24Jk1j71Q7J2k5l8j19K37o7k80K27o4L0o1J31KJ25j46J92p1J9j69L9J82
$$ -13 111 112 91 -80 7 19 -6 -44 -163 74 7 -273 -46 -110 -80 -141 -10 -8 117 -29 163 92 111 -58 -19 163
4415A63j03p6k72M75l45K06j84K95k34L5J79j50J31j06L56m46M8j00K21m5k16
$$ 163 60 -16 -288 187 -158 48 -136 159 -75 -40 139 -11 120 14 370 -76 -28 -128 93 48 -168
4436a68J34j3o6K51k56J38j02K48j21L9k08K40j4k40N0K24k82R9Qk1J23r2j04
$$ -168 -34 -47 -113 138 -118 20 -82 166 45 84 -124 116 102 -138 -88 136 -146 -47 -39 -60 63 -29 -133
4459a33J31j48J93o8J18j25j02J14j8J41j04o8J6J48j26J79j51k34N5L26j12K8
$$ -133 -2 -150 43 -25 93 -32 -134 -20 -38 103 -1 -69 -53 95 -31 148 -3 -237 -182 144 32 60
4481F0k54N9K7J3M7J53n5l25K67j4j91M6K20q2J8l3m5J75j38k68M20L7k71P6k8
$$ 60 -194 -135 -108 -95 -48 105 50 -275 -8 -22 -213 -167 53 -29 -11 -44 -89 86 -52 -320 100 137 -134 -58 -86
4506h6pj5N2j0L05l40r6K98J01k98K6L5L4j90M25k88K40o7P4k66j19l4J50R3q7
$$ -86 -93 -108 -56 -66 239 -101 -197 101 202 -96 -70 -35 -1 -191 234 -54 186 119 193 -73 -192 -226 -76 17 -70
4531g0J63l18N8K88q1j09K52l36N4n3Q0L32l22J49p1j05j00J59J24k19N2j47K71
$$ -70 93 -225 -167 121 40 -69 183 -153 -99 -152 -72 260 -62 87 16 -89 -189 -30 94 -125 -73 -220 51
4554E1j63J05o5j22K40r5L26m41R5rJ3L12m35K8K3K48m0p0m8j37J37P1k02J34
$$ 51 -112 -7 -72 -194 46 -49 277 -164 -69 -78 -65 247 -188 -160 -137 111 71 1 -47 -184 -47 24 -178 -44
4578d4O6j69L01j66Q9o1J0m2J65J62m63J34j96j4K23J1J54l93O9J75J64q5K36
$$ -44 22 -147 154 -12 77 16 26 -16 149 311 -152 -18 -214 -228 -5 6 160 -233 -164 11 175 90 326
4601C26l99J17O3j75K00j52R3l0l9J1o5OL02q9o8j74J17j28J79r1m6K51k65Q5
$$ 326 -73 44 107 -68 132 -20 73 43 4 15 -50 -44 258 169 101 -73 44 -84 95 4 -42 209 -56 29
4625B9n1L5O4o8O7k65J09k0J46j61j08K25J25k28J11K7J84j71q5n1N0k7K38m6
$$ 29 -22 13 77 9 76 -189 -80 -100 46 -115 -223 2 127 -101 10 37 221 50 -35 -86 -36 -63 175 129
4649A29M6j65k8j43K09j29J19J22j87q6o1n5P3K45j50K21l58L03j00pJ8l3j12
$$ 129 175 10 -18 -161 48 -81 38 160 -27 -113 -174 -229 -156 89 -61 160 -198 105 5 -2 16 -17 -129
4672a29M8M9l24M04j17q3K4J00j9J23n7j33Q0R0K00m23K27K8j71J08j01J8J19
$$ -129 -81 -32 -356 48 -69 -152 -128 -28 -47 76 19 -114 -34 56 256 -167 60 88 -83 25 -76 -58 61
4695F1n3j54JJ33m7N6j49P5pp8K11r4J93k18J34j61J25j25r7M60j70j28Q0m6K9
$$ 61 8 -146 -145 -12 -59 -3 -152 -77 -84 -162 49 -45 148 -70 64 -97 28 -97 -194 266 96 -32 48 2 31
4720C1k25K35j97K00o1j62m0J3O9M7K06q6n4p3j38J46J05N3j16j09J36r9J31l0
$$ 31 -194 41 -156 44 -17 -179 -219 -206 -137 -90 116 30 -24 -97 -235 -89 16 69 -47 -156 -20 -119 12 -18
4744a8j30J35J82j12j59K60k31M7l1l5r7J18O9m4j38J80l7J80k67R5k36J65K01
$$ -18 -148 -13 169 57 -102 158 -73 -26 -57 -92 -189 -71 -2 -46 -184 -4 -41 139 -128 -33 -269 -104 97
4767I7j91K00k02J10O8O5n7j35R5k18K81k78K50J24k99O7j39J97O3k97L08k26
$$ 97 -94 106 -96 14 82 147 90 -45 50 -168 113 -165 85 209 -90 -23 -162 35 98 -199 109 -117
4789a17J60k58J46J2J21j73p3J79j86n2L57k95K51L6k07o3O1Pj15R4N9Q7K89l19
$$ -117 43 -215 -69 -57 64 -109 -182 -3 -189 -241 116 -179 72 108 -99 -162 -101 -94 -209 -115 -56 31 320 1
4813AJ6j15K42p3q2J90k17J74j28k1L41k97J29k45Q6K26k73P9k7Pj22K90J10k08
$$ 1 17 -98 144 71 -11 179 -38 136 8 -13 328 31 160 -85 1 227 -46 33 6 13 -109 181 291 83
4837H3k72L01j45M2j19J33K2m5j20J36Q8k08K52l02m2J91o8J10Q6j71k12K99N5
$$ 83 -189 112 -33 9 -110 23 45 0 -120 16 104 -104 148 -154 -196 -5 -73 37 123 -48 -260 39 94
4860I4j66O8j0o3P3N6j67j9n6O7J33M4j9Q9j01K2K20k14j02k3N2j92K44MP9J77
$$ 94 -72 -4 -14 -77 -4 52 -115 -134 -190 -123 10 54 35 124 23 45 265 51 -51 -74 -22 -214 30 34 113 290
4886B90k64Q1j10j4q6K48p2r7Q9j13m9m1J8qo7K7J69l1l2l3J51k9lM4q4j64J45
$$ 290 26 107 -3 -17 -103 145 73 -24 65 -48 -97 -138 -120 -128 -195 -168 1 -30 -62 -95 56 27 24 68 -16 -180 -35
4913c5J84k36J15k75L5L2J47o5J82k33M1O4rLjJ12o5J34j80r4P4J08j58L31P5
$$ -35 149 -87 28 -247 -212 -180 -33 -98 84 -149 -108 -44 -53 -50 -51 61 -4 130 -50 -144 -70 38 -120 211 286
4938B86k69j66pN2O7p0K05j24K91k37j39R9ko9J98J47o0j24j32J86l81M80k72
$$ 286 17 -149 -156 -104 -37 -107 98 -26 265 28 -111 -12 -14 -83 115 262 202 78 -54 132 -249 231 -41
4961d1J44K0j54J29pj03jq2N8P5j17J64j0j39n3J06L6M1l20M23j84p3l7R5J8J59
$$ -41 103 123 -31 98 91 -12 -13 -95 -37 38 -79 85 75 -64 -117 -11 25 66 -254 169 -15 -88 -125 -30 -12 147
4987A47k74J98r7RJ33j85j2J29k64K77J65k17P1L6P6l17K83o7k47R1J78rJ41l70
$$ 147 -127 71 -26 -17 116 -69 -81 48 -216 61 226 9 80 116 192 -125 158 91 -156 -65 113 104 245 -125
5011a25K32p4J9m1o7J81J3k95J02J36p3K51m67M17k06M3j2j61Oj68K79l87N96
$$ -125 107 33 52 11 -56 125 138 -157 -55 81 8 259 -208 209 3 46 34 -127 -121 -289 -10 -397 199
5034A99R9k64j33j0K83k18j44J03J19k7J09j40j11K67J7k62q5K63n6p6K62j49
$$ 199 298 34 -99 -109 174 -44 -188 -85 34 7 116 -24 -135 132 149 -113 -198 65 9 -67 195 46
5056D6n1p2J3K07l56J04J05J79o8j67P4R1k42K40n1n0J07j60J20j02p9k1M5j11
$$ 46 -5 -77 -64 143 -213 -109 -4 175 107 -60 14 105 -137 103 52 2 109 -51 69 -33 -112 -133 -88 -199
5080a99J66L97m05j86J66j21K09J17k05j79J83J38j10K4L8k17K36j2k33K13j00
$$ -199 -33 364 -41 -227 -61 -182 27 144 -61 -240 -57 81 -29 -5 33 -184 52 40 -193 20 -80
5101h0J8K69l86K67j39nN3J08j87J67J51q2J34j75j49R7r2L54n14K43j47R8j28
$$ -80 -62 207 -179 88 -51 -56 -3 105 -82 85 236 154 288 113 -36 61 -31 323 -191 52 -95 3 -125
5124a25J87M0k18O6k00K17lJ08j22j43K66N1L8r9j57k27N35j78j2LJ7nk58K48
$$ -125 62 102 -116 -50 -250 -33 -36 72 -50 -193 73 124 162 63 -94 -321 214 36 24 27 44 39 -219 29
5148B9q7J19j22j00L64l31L02J99l45m8m8K20l30K12k3q5%M4K47J0k31q2J13j11
$$ 29 -58 61 -61 -161 203 -128 174 373 28 -20 -68 152 -178 34 11 -74 -74 -30 217 227 -4 -86 27 -84
5172h4l7J44j22j5J33R6j12Q2J2k53K46l9k3j08O9J83m9r4j09J39N1k1r8Q2M0
$$ -84 -121 23 -99 -114 19 115 3 85 97 -156 90 51 28 -80 -11 172 123 29 -80 59 110 89 -9 73 113
5197A13j10j03L08j72Q5j12o9k6M3P9n3kQ0j06j32K22l61L65l4j48K01j32qJ3
$$ 113 3 -100 208 36 121 9 -60 -86 -43 36 -17 -19 61 -45 -177 45 -316 49 15 -133 68 -64 -72 -59
5221e9R4M9p9j65K95k48L25l36Q6M6p3J7j4J80J98l41j74Q2N0L4QJ3P3r0LJ13
$$ -59 35 84 5 -160 135 -113 212 -124 -38 8 -65 -48 -62 118 316 -25 -199 -117 -67 -33 -25 -12 61 -29 -26 87
5247H7j88O0J37J10N5k48j97J44J36l6M0J22m80Q4J94mn0O7o0m0j62J7K80K28
$$ 87 -101 -41 96 206 261 13 -184 -40 96 60 100 222 -258 -174 20 16 -34 33 -27 -67 -229 -212 68 296
5271B96l44L12k83L6q9K9R0K7j33K00j41o6J15m1M0k14K22m8J28j66k82K18J20
$$ 296 -48 264 -19 17 -72 -43 47 74 -59 141 0 -66 49 8 48 -166 56 8 136 -30 -312 -94 26
5294B6L7R9n1j21q4o0J39J22j58m5J66q1Q8j79J72P1j40J0J67m49K53J48J8J1
$$ 26 63 162 111 -10 -94 -154 -15 107 -51 -96 70 -11 77 -102 70 141 1 11 178 -271 -18 130 148 159
5318A59n1k19p2L55j48Q8k2n6j41J51m8kJ93l28p2K66j79J61J3r1m5J40l4K8o8
$$ 159 108 -111 -183 172 24 112 90 34 -107 44 -4 -6 187 -141 -213 53 -126 35 48 -43 -88 52 18 46 -22
5343b2j1j58K07Q0j06q7L1r7J3J41P5N8lj33q4K47j16K28l17K20k87P5l3R7qQ
$$ -22 -33 -191 16 96 -10 -97 -66 -163 -150 -9 66 124 121 -12 -96 151 35 263 -54 166 -121 -46 -79 18 10 18
5369A8pk71L05J15j84m9J36j90J86M28m78J1K54j82L9j83k23L22o5N0J34j48k19
$$ 18 11 -260 45 160 -24 -73 63 -127 59 487 9 20 274 92 131 -52 -275 47 -18 32 166 18 -201
5392b01M58l92K4LR4p9K72k38r5M1Q9j93L11l4k02K3k3J97k63J89j25J14j82M29
$$ -201 257 -135 -111 -108 -14 -93 179 -59 -154 -113 -24 -217 94 60 -142 -119 -142 55 -208 -19 -144 -30 -212 217
5416B17k92k1J60nr2j04L16k33j02J70J75j54o1j33J98q0J26M0k02j23K42J06
$$ 217 -75 -96 64 59 -33 -137 179 -54 -156 14 189 35 -26 -159 39 -41 85 125 -77 -200 42 148
5438A48r2Q6j45Ol8p5J30K83l51k3K50P1k32k5m3J15R6j36J68j52j13L79m07M8
$$ 148 56 142 -3 3 -35 -110 20 303 -48 -71 179 250 18 -7 -50 65 161 25 193 41 -72 307 -100 -52
5462e2K05qj18K42k73O6L5k19K45o2j04J45j13j5qp5K48M9J10l41k07J44J39n0
$$ -52 153 145 27 269 -4 62 97 -122 123 61 -43 102 -11 -26 -34 -109 139 188 298 -43 -250 -106 33 -17
5486a7Jj5J06R0j88Pr1J68n1N4m6p4J13J7J32k32l06K96M46l36k55K97l9k3k7
$$ -17 -16 -31 75 165 -23 -16 -107 61 10 64 18 -56 57 74 206 -26 -332 -36 410 74 -181 116 77 54 27
5511B7J04k03K15l4P3q8q5n1j30L17j39q5J59J31l38j47R2J47J77p7Q1j71J67
$$ 27 131 -72 143 109 182 94 9 -42 -172 145 6 -79 80 211 -127 -274 -182 -35 142 65 146 -25 142
5534A42k68k7L69j75L8M3j84L12k12j39K9L0J29P5r6j34N5n0K48m98K16M5l27
$$ 142 -126 -153 216 41 79 122 -62 250 38 -101 -72 -42 87 162 66 -68 -13 -63 185 -313 -97 -52 -379
5557c79L89R7l22L62j98l2j58J58J07k7M5r7L37l32O8K02O3j52Q4j17mr0j04J11
$$ -379 10 107 -215 147 -51 -83 -241 -83 24 -3 42 -55 282 -50 18 220 283 131 215 98 94 4 -100 11
5581A1r1L5Q3m0j54J99N9j48j73K80p6K08l05J12j47P1J12Q5k50o6J85l0J8kL6
$$ 11 -80 -45 38 -2 -156 43 102 -46 -219 61 -15 193 -112 0 -147 -76 36 121 -129 -195 -10 -40 -22 -24 12
5606A2j07J75m0j12J9J76j70J52j81J17Q9O0l67J88q8R9j49K68o7jj97J46L4J5
$$ 12 -95 80 40 -72 -53 123 -47 105 -76 41 130 190 -177 11 -77 22 -127 141 74 73 -124 22 56 71
5630G1J64j35k03o6L03l19K49k03L35l64K55j50J61j14r6J50J02j91j73K38Q1
$$ 71 235 100 -103 -169 134 -185 64 -139 196 -168 87 -63 98 -16 -112 38 140 -51 -224 14 95
5651I5k02K49j49M38o19Q4O1Nk1n4m0J35k2J09k5r0j1J95k5j23J56l1j78J92r4
$$ 95 -107 142 -7 431 -188 -104 -43 -38 -59 -113 -153 -18 -40 69 44 -46 -57 138 113 -10 146 115 -63 129 35
5676C5K96m50q0J93r1m6J13J6N0p1N9n5J33j77J74j33mL6K5j2j0N2j30K39q7p9
$$ 35 331 -119 -199 -6 -97 -143 -30 -14 36 -35 24 -31 102 -75 99 -34 -38 -2 23 11 1 53 -77 162 75 -4
5702dL2j27l9J92K43l75R6j38K36l73L56L0m12J30L25j02j69K68j17q5N1j12j23
$$ -4 28 -99 -138 54 297 -78 18 -120 116 -257 99 129 -283 -153 172 70 -99 169 52 -33 18 -94 -217
5725b17J90l1O2M0l2R7l14J87j77K48J6j72J16K98m86J69O7k90J86O6j63J16N6
$$ -217 -27 -58 4 44 12 109 -205 -18 -195 53 69 -103 13 311 -175 -6 61 -229 -43 23 -140 -24 32
5748C2l48K13Q9kn0N7l1j3k45M67j61p9J69r1K14k22M3J83l39J09m3J34k94K44
$$ 32 -316 -103 -14 -16 -66 -9 -40 -53 -298 169 8 -71 98 7 221 -1 42 225 -114 -5 -48 86 -208 36
5772C6j76K00K85k26k78Q7K85j69j24K58j53j06R9k0J41j57J78l2j28r6L14j76
$$ 36 -140 60 345 119 -159 -72 213 44 -80 178 25 -81 18 -2 139 -18 160 128 0 -96 218 42
5794D2K12k78P0k9k1J29l2k02O3r4L24k63J07o2j51L61m23K34O1j45J99j13j07
$$ 42 254 -24 46 17 -4 125 93 -109 -46 -140 184 -79 28 -34 -185 176 -247 -13 48 -97 102 -11 -118
5817a18j35L27j43J66j20O7l2j06J95k29J01J94j89K90m23O8J07j7p3N5nK2k03
$$ -118 -253 74 -69 97 -23 44 12 -94 101 -128 -27 167 -22 268 -155 -87 20 3 -70 -15 -20 2 -201
5840b01M81l34N6J05j12j59K45k8j12j5J70J89l32j09Rm6L19n2k42L09n0j1p4
$$ -201 280 -54 2 107 -5 -164 81 53 -59 -74 96 285 -47 -156 -147 -193 126 74 -168 141 91 80 6
5863Fl2M9L9j47J70m4j54J52N4m2Q6k66J15m4O1n3N0k10J24j16K56j28J42m0j74
$$ 6 -26 23 62 -85 85 41 -113 39 93 51 137 -129 -14 -58 3 -50 0 -210 -86 -202 54 -74 68 28 -146
5888a46J6J46M7j89J5J83l13L06j25Q2J10m6k21J83o6rJ62l2m2J82m04M6L7k7
$$ -146 -130 16 63 -126 -111 72 -241 65 -60 22 132 86 -135 48 -18 -27 135 103 61 243 -161 -115 -78 -105
5912a05J45p2J74j80p6Q3Q5J9J76j87Q9l12J38nJ21j72R1k54K44J30k17K6O8J15
$$ -105 40 -32 142 -38 -114 -31 54 73 249 62 151 -161 -23 -28 93 -79 12 -242 2 132 -85 -59 9 124
5936A24k79J23J55k63M6l8O4J5k5p4K15n2K52j82j90K14j27j88L56Q2k29l5l6
$$ 124 -155 -32 123 -140 -94 -132 -68 -53 -78 -152 63 11 263 81 -109 105 -22 -210 146 228 -1 -36 -72
5959g2K04k1k44J94k23J33o2K02jo7n8l5KJ13j02o8n1L80m02K47M1j69m3nm3L12
$$ -72 132 111 -133 61 -162 -29 -91 111 110 43 -15 -50 -48 65 -37 -105 -156 224 -178 69 110 -59 -102 -107 -150 162
5985A62p2j49k9K32k43M7Qj17P8J67n0K21m09J69p7M5m3l5Q7K51m56L95j21Op6
$$ 162 90 -59 -88 144 -99 -52 -44 -161 -83 84 34 255 -154 15 -62 -17 -60 -95 -8 243 -213 182 61 67 -9
6010ij55K47q6o8L8K15k06J11J43j40n3j25j1K1K18M4j81n1K10j99Q8J73j53M3
$$ -9 -164 83 -3 -71 -33 182 -24 87 230 90 37 -88 -99 -78 140 184 3 -48 162 -37 51 224 71 114
6034A14J2k14K43o1k85J35J56k51j16L56J09o6j7J10k05k6j43K67k1Q1j94j27
$$ 114 126 -88 155 94 -191 -56 100 -151 -267 89 198 132 115 225 20 -6 -149 118 97 178 -16 -143
6056a43K47j07k23J38L55k32m0O1J71j02j87J1q6K4R2K36m33J29J08o0j47J89
$$ -143 104 -3 -226 -88 267 35 -5 56 227 125 -62 -51 -137 -113 -21 215 -218 -89 19 -41 -188 1
6078AJ05k70K53l4j31k7O4o1J12m5J27j43j4j71M99l84L1j14J51j87J06L09j90
$$ 1 106 -164 89 55 -76 -103 -39 -100 12 -33 94 -49 -63 -234 265 -119 -88 -202 -51 -238 -132 177 -13
6101a3k4n1R7L6j08J52k36r8O1J26r0n3K07J21k53j42K88J55k18M0K56j58L3Q8
$$ -13 -37 -88 9 45 -63 89 -147 -245 -184 -58 -148 -201 6 127 -126 -268 20 175 -43 -3 253 95 128 216
6125B16Q1l92R2P1p1j2l0M5l3l1J68k57J62j53j01K00J7M3J63m2j37p8L8r4r2
$$ 216 297 -95 -3 68 -3 -15 -45 0 -33 -64 104 -153 9 -144 -245 -45 -28 15 178 136 -1 -79 -41 -135 -227
6150b27J68l8J49j00l4J35O9l35K10L2j29j39J35K55n4j72J57l09L89k83M5J27
$$ -227 -59 -97 52 -48 -82 53 122 -213 -3 29 -100 -239 -104 151 97 -75 82 -227 162 -121 -76 51
6172E1J5j99J85r2J48N4j30j9j75L26j71P8k1j72K57j8j42J46j44l2o6M6L2J11
$$ 51 66 -133 52 -40 108 162 32 13 -162 164 -7 71 50 -122 135 117 -25 121 -23 -55 -121 -75 -43 68
6196F8l53L26Nj04J5J05j21J08M6k97L19L0l89L57k48J47L4k36O0M1N2J05p8j3
$$ 68 -285 41 46 -58 -43 62 -59 49 95 -202 117 147 -242 115 -133 14 48 -188 -128 -87 -35 70 -8 -21
6220b1J34N3j79M3P1n5j3L4K6j97N5J52j56Q7k46J48R6r7M09k84L4j9k42K84j77
$$ -21 113 166 -13 30 101 46 33 67 93 -104 -49 103 -53 34 -212 -64 32 -65 344 60 94 75 -167 117 -60
6245f0J44p7n7J39r2j58j00K58j92K3K03j70K18K5L5r7j58K6K9j48L4R5m2k0J74
$$ -60 84 7 -50 89 -3 -161 -261 -3 -195 -172 31 -139 79 104 139 42 -116 -90 -61 -209 -175 -80 -122 -142 32
6270C2P8j76J3J71j41J6J2o9r2J98q1j21K60j27l6J23q7J12k76M84m13K39L7j19
$$ 32 110 -66 -53 118 -23 -7 5 -64 -156 42 -39 -160 100 -27 -63 60 -27 85 -191 293 -120 119 156 37
6294C7L2k99J34L51k30l87M10j16n1J56k05Q2rK64j49J95k46j13J82O0M6j14n3
$$ 37 69 -230 -96 255 25 -362 48 -68 -119 37 -168 -86 -95 169 20 215 -31 -144 38 98 144 30 -23
6317b3J5J19q4O5l06K10Q4j31K67j92Pj48J24Jk11K15j6J14l34M10J20l19J42
$$ -23 -8 111 27 92 -214 -4 80 -51 216 24 31 -117 7 8 -203 12 -4 110 -224 186 306 -13 129
6340A29m83K65M36l72K88m89l9N06m31K61n0J84l7l04K50l05J94M6q8j45K64m07
$$ 129 -354 -89 347 -25 263 -226 -265 241 -190 71 21 205 168 -136 114 -191 3 49 -39 -184 80 -327
6362c27L93k80M27r3k23J47l2J02k59J85J18K3o6k83L5J80R3k63K12j6k21K57
$$ -327 66 -214 213 120 -103 44 12 114 -145 40 158 181 115 -168 -133 47 140 -123 89 73 -148 109
6384A09l7L5l25L36k03J07j49K26k02K21j61j04K78k85J85j56K73j24j59J13p2
$$ 109 72 107 -218 118 -85 22 -127 99 -103 118 -43 -147 131 -154 31 -125 148 24 -135 -22 -94
6405i4J58J47k66rn8J35j60J49J21J60l91M7J67q3p7R9j45K66j65j41M3J33k17
$$ -94 64 211 -55 -64 -122 13 -147 2 123 283 -108 -61 106 23 -54 45 -100 166 1 -140 -97 36 -181
6428a81L3K04M9k02j01K39L0J4j63P7K32k02k5R8m9l3N0K5M7l05L51k86M5J23
$$ -181 -148 56 105 -97 -198 41 71 85 -78 -1 231 29 4 102 53 20 70 95 142 -163 188 -98 -53 70
6452G0K1j11J0Jl25M26j72K39j47P1j93L53j48k41QL62k12r7J85k61P5O8J51k57
$$ 70 91 -20 -10 -9 -334 92 -80 159 12 83 -110 243 95 -146 -138 224 12 -85 100 -161 -86 -18 133 -124
6476a24J71k10J03P7o2L03k80k7K54p8j14P5j55k42L07q4J50j02k9k7J72P2p4
$$ -124 47 -163 -60 17 -45 258 -22 -49 205 127 13 88 -67 -309 -2 -86 64 -38 -67 -94 78 150 76
6499G6K65j74n5k87K22q7j41K99o6k67K26L6Q1j20k6R0n8J74j14j82N2q9K10K72
$$ 76 341 167 112 -175 47 -40 -181 118 52 -215 11 47 128 8 -18 72 14 188 74 -108 -56 -145 65 337
6523C37m23K0K95l90J70q6K46l9o8r3J40j14J44J03m01J11k9L18k10rp3J23o0
$$ 337 -86 -66 229 -161 9 -77 169 130 62 -31 109 -5 139 242 -159 -48 -77 241 31 22 -51 72 12
6546A2K0j56J74k0q4J08R3j40J65j33OM3j06j47K8K54j4L4j26J34j47O9j8k5K28
$$ 12 32 -124 50 30 -54 54 147 7 172 39 45 88 -18 -165 -137 117 103 137 11 145 -2 67 49 24 252
6571B52l34k30L78L03m27j20K96k06j45L13nm0k1K38l02K62l01j56K73j38J35
$$ 252 -82 -312 66 369 -58 -178 118 -88 -233 80 75 35 14 252 -50 212 -89 -245 28 -110 25
6592B5k4j82K52n5K9k7J24Q8r6j24R8Nj26L2N8j65K3J1M2P8j20o6J80J18j99k89
$$ 25 1 -181 71 16 45 18 142 230 134 10 108 113 -13 19 77 -88 -65 -54 -12 66 -54 -120 60 178 -21 -310
6618c10L62l2j20R9M2N1J06j60k9K6k3Q9j43N1J84l4j27j14Q9j22j47J76j83J85
$$ -310 52 20 -100 -1 41 92 198 38 9 35 12 101 -42 9 193 159 32 -82 7 -115 -262 -86 -269 -84
6642h4n3L2J27L5qm0j90J87j44K79k06L6N3M8Q1j14m8M0j36J6J98o5K7j84L46
$$ -84 -137 -105 22 57 49 9 -181 6 -138 141 -65 -29 24 72 153 39 -9 31 -105 -89 109 44 71 -113 233
6667B33l00N0R8m9j04J84p3J11j59L02l34o6J53j06K24l05M4j27Q9K94j36p4p6
$$ 233 -67 -17 81 32 -72 112 39 150 -9 293 -41 -107 46 -60 164 -141 -97 -224 -135 159 23 -51 -127
6690a27R3J08p1o1J51j32J38j20m3j67M1K95j10k07K18K86l71L1m2N0M8j88K4
$$ -127 -34 74 3 -58 93 -39 99 -21 -64 -231 -190 105 -5 -212 6 292 -79 -48 -90 -40 8 -180 -156
6713a56K18J82j99P4l52K13R7j90L53j40p6J24j7Q2k13K9j3j15j71J91k0q2R0
$$ -156 62 244 45 119 -233 -20 77 -113 240 100 24 148 131 213 0 29 16 -99 -270 -79 -99 -181 -91
6736i1O1PJ0j63J86m2q9pJ53r8R0j57J66j23J17L7%K01j83R5l85L21Oj19J25j91
$$ -91 -30 -23 -13 -176 10 -32 -121 -128 25 -73 17 -140 26 -97 20 57 57 258 75 170 -215 106 112 -7 118 -73
6762g3J23o7N9m4J0J93k18P2lQ9o8k28J24J21l8j54J19J01j44m9o5J05Q0n2m9
$$ -73 50 -17 42 -2 8 201 -17 55 52 141 73 -155 -31 90 52 -102 17 118 -26 -75 -140 -35 45 -7 -56
6787e6K94k88J55j99J28K8j05L7o1J5K14j82kj26O9J12j09R3r9L9j48NK5R4J70
$$ -56 238 -50 105 -94 34 62 -43 -6 -67 -52 162 -20 -22 -148 -79 33 -76 17 -82 -43 -191 -186 -161 -67 103
6812A03j8j40R9j25L07k10p6K40p4k76J08l3J95j92K20j00j34r0r2K49L0kj48
$$ 103 85 -55 44 -81 226 16 -60 180 106 -170 -62 -95 100 -92 128 28 -106 -196 -288 -39 -9 -11 -159
6835a59J31p0J47j58K37o3j19k1P2M5n3M9N5N9k44L43k21J89l45k4m0J22p7K69
$$ -159 -28 -98 49 -109 128 65 -54 -75 -3 42 -11 38 93 152 -92 251 30 219 -126 -150 -190 -68 -145 124
6859A24j41Qr7J95j05J91p6j19K16j29j81p9J30K68l30J90j70L9m2olJ8j35K79
$$ 124 -17 -9 -106 89 -16 175 99 -20 196 67 -114 -193 -63 205 -125 65 -105 -66 -108 -114 -117 -99 -234 45
6883D5n2j69L50l03j05J47J48J36k39J42R7p0k05J64r1j10J89K6o8m9K01k56O
$$ 45 -7 -176 174 -129 -234 -87 61 197 -42 100 197 127 -78 86 -5 -115 74 100 32 -17 184 -72 -66
6906f6O6k43J43J48j49O0k02K65J50j37p9j5L11j69k81K30j48P5j58J17l0J28
$$ -66 0 -243 -100 48 -101 -41 -243 22 172 35 -44 -59 252 83 -198 32 -116 -41 -199 -82 -112 16
6928A6P7R1j77l20K25q6L29l05K07m4q0K02l6j77R0%l6K49j88j58J88k47J61o9
$$ 16 93 184 7 -313 -88 -174 155 -150 57 13 -67 135 99 -78 12 12 -24 225 37 -121 67 -180 -19 -88
6952h8J8j57J91j2Q6O3R2n1j80J58kj67m6J07j3j7k29J87j11O0O3K3j51O3N9K5
$$ -88 -70 -227 -36 -48 38 101 193 142 -38 120 118 -49 -95 12 -1 -18 -247 -60 -171 -111 -48 -25 -176 -113 -54 -29
6978b9r3j36J21k5K28N7j46PJK5J29j19J91j12q1J4R0r4l15p6L53o8k04K81K84
$$ -29 -122 -258 -137 -162 66 123 -23 -16 -15 10 139 20 211 99 18 32 122 28 -287 -363 -10 -78 -282 -1 283
7003B83nl58J28j68K53j33K09j64P5q1k41P0J33r9J29pj22O1J62J74l83J57l4
$$ 283 278 -80 48 -120 133 0 209 45 120 39 -202 -132 1 -98 31 24 -98 -37 125 299 -84 73 39
7026C9K19l25j17o3M97k91J14j9r6L6o5L6k1K44L7k76j32P9L83k43l8J22j41P8
$$ 39 258 -67 -184 -247 250 -41 73 54 -42 -6 -71 -35 -56 188 225 -51 -183 -104 279 36 -2 120 -21 57
7050E7R7l72L84q2N3K73l95j61L32m6n0j11J70l9mk01R0K3O5o6L0p1L0j09m9Q3
$$ 57 154 -218 166 84 137 410 15 -146 186 140 90 -21 149 110 106 -95 -5 18 83 17 47 -24 6 -103 -152 -69
7076f9O2J18j88j12J91n5o4J10L6k01J04j38M17j55j79K62l19K24R5p4r8j40K29
$$ -69 -7 111 -77 -189 2 -53 -117 -7 29 -172 -68 -206 211 56 -123 139 -180 44 139 65 -33 -173 56
7099E6q9N5l6J66l32l2K01J10p8K81l64J3j7j13Q1K34P8l29p8J06l9q6L43j3k19
$$ 56 -33 22 -14 152 -180 -212 -11 99 21 302 -62 -49 -66 -179 -98 136 214 -115 -193 -87 -126 -212 131 118 -101
7124a01J46R4j54q1J41p7Q7j76K90k17J12Q4m6k10J32K6J51j87M5k50L15j39l06
$$ -101 45 139 -15 -96 45 -32 55 -121 169 -48 64 148 102 -108 24 50 201 14 59 -191 124 -15 -321
7147c21L43j4j27P8J21n4q4M5J6j4J2j80J80M7k23L97j73M3j59l6P3k5N1m9K17
$$ -321 22 8 -119 -41 80 26 -58 -13 3 -11 1 -179 1 48 -175 222 49 92 -67 -103 -30 -55 -4 -53 164
7172A64k34J26N3k68m42K7M43j57K58pj46J1K14l46M46j85j5J23n9o5R7j05j24
$$ 164 -70 56 109 -159 -601 -574 -131 -288 -30 -37 -183 -172 42 -304 142 -43 -58 65 6 -59 38 -67 -191
7195a91L1J33J1N7p3J53k87L17q9j70J44j05J75j38Q0J47k11J64p9Q2j15O5k85
$$ -191 -160 -27 -16 41 -32 121 -166 151 62 -108 36 -69 106 -32 48 195 -16 148 69 151 36 101 -184
7218a84J79N1q1k11K19j46J33K3Rl1lL3J93j28j86K28Lj94o6J82j55J04K5N4j25
$$ -184 -5 46 -35 -246 -27 -173 -40 -17 -8 -39 -42 -9 184 56 -130 98 101 -93 -159 23 -132 -28 -3 51 -74
7243g4J81q6k19M7J68j43L45k54J56j92O1J29Qj67J17J40l58K48l7k11N8j16J32
$$ -74 107 21 -198 -151 17 -126 219 -35 121 -71 -10 119 127 -40 77 217 -141 107 70 -141 -83 -199 -67
7266f7J71j66R6lk33K04j13jK13k05J78j44o0L13j95l0QK03R2J1j76l07jK89j6
$$ -67 104 -62 34 31 -202 2 -111 -112 101 -104 74 -70 -130 183 -12 -42 -34 169 261 272 96 -211 -212 77 61
7291F1J53j25j5l23N13k07k42O1rK62l31M1R8k39N98j88j39qo3J29nJ5k45K43
$$ 61 214 89 74 -249 264 57 -185 -124 -133 129 -202 -161 -63 -302 296 108 -31 -39 -102 27 22 37 -208 35
7315C5j7R8l35N12k77N7p6J21j95o3J72k97J42J37L8r5j09k6L68k52n6J96j60
$$ 35 18 116 -219 293 16 73 -3 118 -77 -140 32 -265 -123 14 52 -43 -152 -178 190 -62 -118 78 -82
7338h2J9K7k20M17j1j21k26K64J3j61O8k44M5J62N5j8L7Q6j68J29j49J75P9m57
$$ -82 -63 -36 -256 161 150 29 -197 67 80 -81 -13 -257 -212 -50 5 -13 24 110 -58 71 -78 97 176 -281
7362b81K44J36j29N2k24Q1K75j13J43l18L41k63jm8O1j46Q4q2J93J58k30J03j13
$$ -281 -37 99 -30 22 -202 -121 154 41 184 -134 207 -56 -57 -105 -44 -190 -106 -188 5 163 -67 36 -77
7385g7Q3J54k80O7N5J16j08p1K93l01Q2J24j33r0J19N1j27p5K52l16J78J99j34
$$ -77 6 160 -120 -53 2 118 10 -61 232 -69 13 137 4 -86 33 84 -43 -118 134 -182 -4 195 61
7408F1p1j24r3J96j74K8R6L07r0k43L0RK4K06l28J45jJ93P4p8N0k91j50J97m4
$$ 61 -10 -134 -227 -31 -205 -177 -81 226 136 -107 -77 -68 -44 162 -166 -21 -22 171 245 167 217 -74 -224 -27 -71
7433g1R0j55Q6L3j33J23r6PpJ71k39L10k36K31Kp2j72O6O7k1J00k53M31l33K8
$$ -71 19 -136 -50 -17 -150 -27 -123 -116 -123 48 -191 119 -117 114 116 44 -128 -62 5 -16 84 -169 262 -71 -43
7458d3J01pj81j10P7L48l73J20j09L41J03k14l15J25K68k40q7Q4M2L16m71R5P1
$$ -43 58 51 -130 -240 -163 185 -188 -68 -177 164 267 53 -262 -137 131 -109 -196 -112 -70 246 -225 -130 -59
7481e9J29k60K09J29j23j42J93L8j57j81J21q3K14j91J60Kk24J44L33k79j01L64
$$ -59 70 -190 19 148 25 -117 76 114 -43 -224 -103 -186 28 -163 -3 -1 -225 -81 252 -27 -128 236
7503B36R0n16J31m7J67q3j2K07j57PJ9n4K1K8j90L11l19J17O0%q5J06J33l3Q9
$$ 236 326 -190 -59 -106 61 -22 -34 173 16 23 42 -12 9 37 -153 158 -161 -44 16 16 -69 37 170 137 226
7528B26k45N7Q0Op7n0J25k79j04K73j40l1K18Q0P8k13N2K39k53j74J26J53j03
$$ 226 -19 38 118 124 47 -3 122 -157 -261 12 -128 -159 59 139 217 4 56 295 42 -132 -6 147 44
7551D4KK1r6L00l2k84J04k7j20kK06k70K32j42J54j08K01l00P2K06j45j38j48
$$ 44 46 67 -29 271 239 -45 59 32 -88 -90 116 -154 78 -64 90 -18 183 -117 -45 161 16 -122 -270
7574b70R8J22L1KJ4k2q6RJ26K1N6j65kJ09R6j55K23k76K01J3l28L32M6k48P0L18
$$ -270 -172 -50 -19 -17 -3 -25 -111 -102 24 45 101 -64 -66 43 139 -16 207 -69 132 145 -183 149 195 -53 17 335
7600C35k07J1K6q9r5J90j46l27J73J30j53K12j09J56J8p2j74N3j46M06m73N1K20
$$ 335 128 139 165 76 -19 171 25 -302 -129 1 -152 60 -49 107 125 53 -121 -68 -214 192 -281 -230 -10
7623a0j34J55J79k97R5j26J98j68P0P3O6p6JP2r3k43J59Q2P9j49J47k48K79n6
$$ -10 -144 11 190 -107 -12 -138 60 -108 -38 35 101 25 26 98 5 -238 -79 3 82 -67 80 -168 111 55
7647E5L6MMl0k11J00M4J13j41R2k35L87k19l1J89k73K08P9k50p2O8j9O2M7j51
$$ 55 91 95 99 69 -142 -42 2 115 -26 66 -169 218 -1 -32 157 -116 92 171 -79 -151 -83 -102 -40 7 -144
7672a44K68o3L8j14N3K6j28J41j73L41k17l30N21l7j59j05J00r7M9r8J88k5p5
$$ -144 124 61 99 -15 38 64 -64 77 -96 245 28 -302 219 182 23 -82 18 -79 -30 -128 60 35 -40
7695d0j60L25m3m6%J4J6l26L42n2j06K97q5q9k70K12J54n5j64J77K8pj68q4j3
$$ -40 -200 125 82 36 36 50 66 -260 82 30 -76 221 136 47 -223 -11 143 88 -76 101 129 122 -46 -130 -143
7720a43Q7N8MK71l01n8J01J51k47R6p9M1K08m0p9Q2j67k1P8k27K29p1j7M8k17
$$ -143 -56 2 6 277 -24 -82 19 170 -77 19 -60 -19 189 149 70 152 -15 -36 42 -185 44 -27 -44 4 -213
7745b13K86p7m0J03J4J6k92K20P0j21J8M7k15J33J51Q3l33J26Q5P2l05L45k1j35
$$ -213 73 -4 -44 59 73 89 -203 17 87 -34 -16 31 -184 -51 100 183 -150 -24 61 133 -172 173 152 17
7769A7L7j60M6o8J78p8j94O4J10J20K0l2j09J41j5k17L78l35J62k57K12k83J18
$$ 17 54 -106 -60 -128 50 -28 -222 -158 -48 72 92 60 -49 92 77 -140 238 -97 65 -192 20 -263 -145
7792a45L60j98Rl0j78R6J35L0j38LJ4j25K47q5J11R6k00p6K01j56Q6r6Q7q9j12
$$ -145 215 17 26 -4 -182 -86 49 79 -59 -56 -42 -167 80 -5 106 202 2 -74 127 -29 57 -39 48 -41 -153
7817a53q0K35L4j47J04m6J75q8J28j70J02j74k2l1K30M8p0j49J42j10o8J08K55
$$ -153 -233 2 36 -111 -7 -53 122 34 162 -8 94 -80 -102 -133 97 145 75 -74 68 -42 -110 -2 253
7840B53k35q1k65M96j93j14J6M6j97K26KK38m64K94J15j61L14l69M9O5k65J04
$$ 253 18 -63 -328 168 -25 -139 -123 -77 -274 -48 -46 192 -272 22 137 -24 290 -79 -30 35 -230 -126
7862a26J99j21r6O6L35j95k41J64M86n09K53j51j75J61j36O5N5k34L75j69P6q4
$$ -126 73 -48 -144 -78 257 62 -179 -15 471 -38 215 64 -111 50 -86 -21 34 -200 175 6 82 -2
7884bK54k48K03j90k00J89l23L45K6j79J52K37j55j2k5O9j07j16M0n0K40k97K53
$$ -2 252 4 207 17 -183 6 -317 28 54 -125 27 264 109 97 72 141 34 -82 -42 -92 148 -149 104
7907A04L1p1k6J52O4l18R0j49R3L6p9j9l6rK3M79j90j35r7k38L42J80l11M3OJ59
$$ 104 135 64 38 190 254 -64 26 -123 -30 6 -73 -92 -128 -137 -114 365 175 40 -57 -295 47 227 -84 -41 -35 124
7933A24j46j55K44K52j73l57K66j37o9j2K47J40k15o4K41j28j93OR0J78k02N6
$$ 124 -22 -177 67 319 146 -211 55 -82 -151 -163 84 224 9 -55 186 58 -135 -129 -39 139 -63 -7
7955gJ42k94Q2p9J89r0n5j5J20O3J42k51O6P7k58L06J23m45M2K15j00n0k2J23
$$ -7 135 -159 -77 -156 33 -57 -112 -127 -7 56 198 -53 13 90 -168 138 261 -184 -142 73 -27 -77 -99 24
7979B4K09l57m4J1J95j32J70k25P4J2J99Jk30o6K88J11r9j90P4r5k3J27n0k03
$$ 24 233 -124 -168 -157 38 -94 76 -149 -75 -63 136 137 -93 -159 129 240 141 -49 25 -70 -93 34 -16 -219
8003b19L44k30Q9n3j24K20K9p8J36k27np1J29J79n3k37l8K77N6k92M01n05K79
$$ -219 125 -105 -16 -69 -193 27 56 -22 114 -113 -118 -189 -60 119 66 -171 -209 68 124 -168 233 -272 7
8026Gj68o3L61j05Q7J0%J45l53m8M97k25J71j67J06j53L4j03j1n2K14j34O7Q9
$$ 7 -161 -224 137 32 119 129 129 274 -79 -127 370 145 316 149 255 102 136 33 22 -30 184 50 117 206
8050B06l85L44j00M1q8j62K66j71J26p5K3J6m2Q3k05J78k8j24J35p4K50k56K7
$$ 206 -179 165 65 106 18 -144 122 -49 77 2 25 41 -1 82 -123 55 27 -97 38 -36 214 -42 -15
8073a5k0J49K1n7j09L07k28j46L47l89J73j14j5k13N03l38K26J28l58J79j14O8
$$ -15 -35 114 135 78 -31 276 48 -98 249 -140 33 -81 -96 -309 194 -144 82 210 -148 31 -83 -15
8095a5J26j61J24q8Kj50M3J96j72m9K58nJ14m18K01m6j34J56j37J68O3m6j08J87
$$ -15 111 -50 74 -14 -12 -162 -119 77 -95 -144 114 109 223 -195 6 -40 -174 -18 -155 13 76 30 -78 109
8119A09k09J95l7Kj14K85k84o9J73p0j36K40k32R0Q7j50K5N6J90j23N1l50K51
$$ 109 -100 95 58 60 -54 231 -53 -122 51 -19 -155 85 -147 -57 30 -120 -95 -39 151 28 79 -271 -20
8142b0j40J09k68K75j02J81o6J75j00j03r8K53L3K59n6r9j72q4L08l05Q8j35J47
$$ -20 -160 -51 -319 -44 -146 35 -31 144 44 -59 -157 96 129 388 332 233 61 -23 285 -20 68 -67 80
8165H0J1q9ooK98q9j66l3j34J68J18l04M8K1j19K15j52J89K6k7j14j30J62l1p
$$ 80 91 2 -4 -10 288 199 33 0 -134 34 152 -152 -104 -83 -202 13 -139 50 76 49 -65 -195 -33 -64 -71
8190g1J84
$$ -71 113
8191A13
$$ Imaginary data points
##PAGE= N=2
##DATA TABLE= (X++(I..I)), XYDATA
0@%%%%%%%%%%%%qJ6j6J6k4L2l2M0n2O0p2Q8j04J20j36J60j84K08k40K75l15L56
$$ 0 0 0 0 0 0 0 0 0 0 0 0 0 -8 8 -8 8 -16 16 -16 24 -28 32 -40 48 -56 64 -72 88 -96 112 -128 147 -168 188
34A88m00M52n08N68o39P13p93Q82r77J081j196J324j461J611j775J956k156K374
$$ 188 -212 240 -268 300 -339 374 -419 463 -514 567 -629 695 -766 845 -930 1026 -1130 1244
52A244k615K884l185L524l910M351m860N460o177P051q143R552j1451J4162j8364
$$ 1244 -1371 1513 -1672 1852 -2058 2293 -2567 2893 -3284 3767 -4376 5176 -6275 7887 -10477
67a0477K5806m2825J50400L3535k70250Q6955m488l0377J37722N2045j40496m2150
$$ -10477 15329 -27496 122904 156439 -113811 -26856 -31344 -61721 76001 128046 -12450 -54600
79e4600m3227P6865J21315o8270n1591M9434j08240l0291J91405K322r9959J8616
$$ -54600 -97827 -20962 100353 32083 -19508 29926 -78314 -108605 82800 85122 -14837 3779
91C779n3506k7225R9440M8825j9935k5987j20681J6278J34701M996k0114j4800
$$ 3779 -49727 -76952 22488 71313 51378 25391 -95290 -79012 55689 60685 40571 25771
103B5771r5379j2762J09354K7660N729n0874j05566N3434P1340k8874L8325J5404
$$ 25771 -69608 -82370 26984 54644 60373 9499 -96067 -42633 28707 -167 38158 53562
115E3562j39355J3002J01040k8745K1412K5883q6111k3841N0936j305O9382Q092
$$ 53562 -85793 -72791 28249 -496 20916 46799 -39312 -63153 -12217 -13522 55860 63952
127F3952j15833O347L5330j4082Q3074L3605j39784j1149N9451j7382P0188K8824
$$ 63952 -51881 -45534 -10204 -24286 58788 92393 -47391 -58540 911 -16471 53717 82541
139H2541j13945k9398O2392q595M1622K6195p6991j8984J5168N903M5985J2001
$$ 82541 -31404 -60802 1590 -7005 34617 60812 -16179 -35163 -19995 -14092 31893 43894
151D3894n8385Q787j1408l5533P9772L4635o2822j3454M51l4548N9078N2828l9682
$$ 43894 -14491 -5704 -17112 -52645 27127 61762 -1060 -14514 -14063 -48611 10467 63295 23613
164B3613l1768l4790O283O4764K0183l4525p538m4034j1462Q4273N820l9937L186
$$ 23613 -8155 -42945 -36662 28102 48285 13760 6222 -37812 -49274 34999 40819 882 4068
177D068k5319k6683O2592J5787l3119J4829l0337k5097L9271J9496p971J5911
$$ 4068 -21251 -47934 14658 30445 -2674 12155 -18182 -43279 -4008 15488 7517 23428
189B3428m0071l3514M4930J0591J2810J7661n1410m0212M9572K1923L363J9190
$$ 23428 -16643 -50157 -5227 5364 18174 35835 -15575 -55787 -6215 15708 19071 38261
201C8261n4001l0780M0799K3332K500J0859m3008k6643M0287O039P199R590k8835
$$ 38261 -15740 -46520 -5721 17611 20111 30970 -12038 -38681 1606 7645 14844 24434 -4401
214d401j8728J8253k422J6368K5127l8463j0141Q865j5361K3031M3368l3640l6576
$$ -4401 -23129 -4876 -7298 9070 34197 -4266 -14407 -5542 -20903 2128 45496 11856 -24720
227b4720J1881l818K7271K7076k2286k9792p610L342L9784K0144m4767o549K940
$$ -24720 -12839 -16657 10614 37690 15404 -14388 -21998 -18656 21128 41272 -3495 -10044 -7104
240g104j2325K8385K6152l3956j5052J2637j5844J7453J5814j1238k539q422k0772
$$ -7104 -19429 8956 35108 1152 -13900 -1263 -17107 346 16160 4922 2383 -6039 -26811
253b6811J9535K3963j2782P201j7930k7521K2850K9062m912k946j8536k8338L2567
$$ -26811 -7276 16687 3905 11106 -6824 -34345 -11495 17567 12655 9709 -8827 -37165 -4598
266d598K3616p659k086j8414k0252K5841K3767j4432K563j5352j2150J9422O661
$$ -4598 19018 11359 9273 -9141 -29393 -3552 20215 5783 8346 -7006 -19156 266 6927
279F927m185J0009j1097k1026J9148j224kK1534j1212k6317N563R499N213K3563
$$ 6927 2742 12751 1654 -19372 -224 -1448 -1450 20084 8872 -17445 -11882 -2383 2830 26393
293B6393j8658k5382N733O803J5936J6104k1335k6807J5893L794J1283J3891k2702
$$ 26393 7735 -17647 -11914 -5111 10825 26929 5594 -21213 -5320 -1526 9757 23648 946
306I46j5141J1924K831J772J6509j8123p702Q939r929M448J6484n637j0034K340
$$ 946 -14195 -2271 560 2332 18841 718 -6984 1955 -7974 -3526 12958 7321 -2713 -373
320c73j6821J0019K2386p047p041p928j4299J2870K9301j3225j0589n189j2824
$$ -373 -17194 -7175 15211 8164 1123 -6805 -21104 -8234 21067 7842 -2747 -7936 -20760
333b0760J8501J9912j0790j2287m4j1205J7112J3597j4972M43o70r734O712J1997
$$ -20760 -2259 17653 6863 -5424 -5468 -16673 439 14036 -936 -493 -1163 -10897 -4185 7812
347G812r765P705j802j7821Q226P159m11R798k308k6914P412J5107R55R358j1239
$$ 7812 -1953 5752 3950 -13871 -5645 1514 1103 10901 8593 -18321 -10909 4198 5153 14511 3272
362C272j8976O223J4926J842Q845j5488j9097J8375P037k986O317n330j7451J2703
$$ 3272 -15704 -9481 5445 7287 16132 644 -18453 -78 6959 3973 10290 4960 -12491 212
376B12N166o270J0515n295p719L914l273l819J9953l382j5761M216p085L098J8938
$$ 212 5378 -892 9623 4328 -3391 523 -2750 -6569 13384 10002 -5759 -1543 -8628 -5530 13408
391A3408r73j9250n2k913O266K0248j0322j4451J26J400M740J4902j0352j0831
$$ 13408 12435 -6815 -6867 -9780 -3514 16734 6412 -8039 -7913 -6513 -1773 13129 2777 -8054
405h054O708o304O536Q950p895n028Q962r702k601J2683l844L443j054j2950J020
$$ -8054 -1346 -7650 -1114 7836 -59 -5087 3875 -5827 -8428 4255 411 3854 2800 -10150 -9130
420i130J3463l244M684J800k4965N523K1061k544n478J284j3741L153J6701m722
$$ -9130 4333 1089 5773 7573 -17392 -11869 9192 6648 1170 2454 -11287 -8134 8567 3845
434C845K361n755j3247J1529J3907j5512J653J2668j6830l01J1341k806k981O498
$$ 3845 6206 451 -12796 -1267 12640 -2872 -1219 11449 -5381 -5682 5659 2853 -128 6370
448F370m443l958j087k131J7447p02j8252l1Q973m239P231P978j7104o441N516
$$ 6370 1927 -2031 -3118 -5249 12198 11496 -6756 -6787 2186 -2053 5178 13156 -3948 -10389 -4873
463d873J1163L684r996o943O772j468k614J4894q389j1158Q634K229o238N678
$$ -4873 6290 9974 -22 -6965 -193 -1661 -4275 10619 2230 -8928 -294 1935 -4303 1375
477A375Q10m375P292j1380k661J4494k517o039P485r569j0059K1749P54r490K340
$$ 1375 2185 -2190 5102 -6278 -8939 5555 3038 -3001 4484 -5085 -15144 6605 7359 -2131 209
492B09q315k585J9003l36j4538P848o318l565J5790k56j2782M196K043m915R454
$$ 209 -8106 -10691 8312 7976 -6562 1286 -5032 -8597 7193 6937 -5845 -1649 394 -4521 4933
507D933m151l658P718l627p104O869K445m530P594m540o710J070M975O870j285
$$ 4933 782 -2876 4842 1215 -5889 980 3425 -1105 6489 1949 -4761 -3691 1284 8154 6869
522F869j1494k080J0130k764M833J972j2325k041Q103M216k76l731r346J0362
$$ 6869 -4625 -6705 3425 661 5494 7466 -4859 -6900 1203 5419 5143 1412 -7934 2428
536B428J265r402J0476K119j4857N835J1387j6271L018J2213p634k662O46m353
$$ 2428 3693 -5709 4767 6886 -7971 -2136 9251 -7020 -4002 8211 577 -2085 -1439 -5792
550e792O677O890j1584L628n92j0741J4341R334j6693m444J0673o504N347O612
$$ -5792 885 7775 -3809 -181 -773 -11514 2827 12161 -4532 -8976 1697 -4807 540 7152
564G152j0481k112M242n41K945K545r421M956L196o598L678J821k773K759J181
$$ 7152 -3329 -5441 -1199 -1740 1205 3750 -5671 -715 2481 -4117 -439 1382 -1391 1368 2549
579B549q216M558K962j155M606o093n628N623N154k341L183p754m931J1591J74
$$ 2549 -5667 -1109 1853 698 5304 -789 -6417 -794 4360 2019 5202 -2552 -7483 4108 4282
594D282l335K176m630m472J1565j537o062N293m317j137P337m426n649J1241l954
$$ 4282 947 3123 -1507 -5979 5586 4049 -2013 3280 -1037 -2174 5163 737 -4912 6329 2375
609B375o680Q216m932l255R671J55r546K464o88K206P329q184l732M652k176O58
$$ 2375 -4305 3911 -1021 -4276 5395 5550 -3996 -1532 -2220 -14 7315 -869 -4601 51 -2125 -1467
625a467R739r532p636J0417k74k554K409k153k983N364k458P8L076o765M480M420
$$ -1467 8272 -1260 -8896 1521 1247 -1307 1102 -1051 -4034 1330 -1128 -1050 2026 -4739 -259 4161
641D161p916j512Q614l472q41L612q026K246O114j317j312M11p127N113Q200p484
$$ 4161 -3755 -5267 3347 -125 -966 2646 -5380 -3134 2980 1663 351 762 -6365 -1252 6948 -536
657e36k30N75l371M231N166p022m67L713m861N965L68o821L111N052o343J163
$$ -536 -766 -191 -3562 669 5835 -1187 -1654 2059 -2802 3163 3531 -3290 -179 4873 -1470 -307
673c07L123n966N488K057n359l96J888j596N599l46r315M654J996j747M237j722
$$ -307 2816 -3150 2338 4395 -964 -1360 528 -1068 4531 4185 -5130 -476 1520 -227 4010 2288
689B288p675M377M900m586L078k996l491N172J521m665K056m3l616O922k870m489
$$ 2288 -5387 -1010 3890 -696 2382 -614 -4105 1067 2588 -2077 -21 -64 -3680 3242 372 -4117
705d117M155Q87k274K903l359l781Q244j196l181J891l068j279P499l47o651L228
$$ -4117 38 925 -1349 1554 -1805 -5586 2658 1462 -1719 172 -2896 -4175 3324 2977 -3674 -446
721d46k207J787M777l535l647L188m89l63N157o160j150N894k212k028K895k348
$$ -446 -2653 -866 3911 376 -3271 -83 -572 -935 4222 -1938 -3088 2806 594 -1434 1461 -887
737h87p00O410m639j908K304j036J979K531n328k141O305k645J979J274o722R28
$$ -887 -1587 4823 184 -1724 580 -456 1523 4054 -1274 -3415 2890 245 2224 3498 -3224 -2296
753b296N677j805j444K169n508L190M035m377j36J442k379J920L038o922K248
$$ -2296 3381 1576 132 2301 -3207 -17 4018 -359 -495 947 -1432 488 3526 -3396 -1148
768a148L145k608J963l91m910L073M859n384J134n50l182N284J973n052k79J932
$$ -1148 1997 -611 1352 961 -3949 -876 3983 -1401 -267 -817 -3999 1285 3258 -1794 -2073 -141
784a41k673N053m69n482K760J159j146K049o16n216N398J339m035K040q32j635
$$ -141 -2814 2239 1770 -3712 -952 207 -939 1110 494 -4722 676 2015 -2020 20 -812 -2447
800b447M113O36n609K996mp69M563l420l418L511J731k223L278l411k975N950
$$ -2447 1666 2302 -3307 -311 -315 -1084 3479 59 -3359 152 1883 -340 2938 -473 -3448 2502
816B502n37j880Q37j391j254N526k410l302L600k056K09L587l272l239N028p71
$$ 2502 1965 85 922 -469 -1723 3803 1393 -1909 1691 -365 -156 3431 159 -3080 1948 1177
832A177q95J680m169J062L936j674k243K529l790J470N399n044j790K605r30M50
$$ 1177 282 1962 -2207 -1145 2791 1117 -1126 1403 -2387 -917 4482 -562 -2352 253 -677 -227
848b27L372n081o10M372l084J599J016m078M87N230l945r88K780l514K664K460
$$ -227 3145 -1936 -2546 1826 -1258 341 1357 -2721 -2234 2996 -949 -1937 843 -2671 -7 2453
864B453m143r95L555k326J955J389n332J611L452j037n30L40l689K844L715l978
$$ 2453 -1690 -2685 870 -1456 499 1888 -3444 -1833 1619 582 52 392 -3297 -453 3262 -716
880g16R15l97j518K873J858m601P33J650j652L611j950k533K396J093k758K848
$$ -716 199 -198 -1716 1157 3015 -1586 -853 797 -855 2756 806 -1727 669 1762 -996 1852
896A852j210l919O013l0l788J288j58j136M655j737n016M617j318r31M527k715
$$ 1852 642 -3277 2736 2706 -1082 206 48 -1088 3567 1830 -3186 1431 113 -818 3709 994
912I94n616N525J922m466L275j816k390L733M93l280K287r10k138N337k642l810
$$ 994 -4622 903 2825 -1641 1634 -182 -2572 1161 1654 -1626 661 -249 -2387 2950 308 -3502
928c502L657J030k557K168j261k830L907K2n26n47j891L72M323j680k857K367
$$ -3502 155 1185 -1372 796 -465 -3295 612 634 108 -439 -2330 -1958 2365 685 -2172 195
944A95k108J411K675k588j278J556p70J433J927n230K112K815k858O89J510l688
$$ 195 -1913 -502 2173 -415 -1693 -137 -907 526 2453 -2777 -665 2150 -708 -19 1491 -2197
960b197J985L950m978O89J617k692K562K627n679L1M900l560K145J423n317R85
$$ -2197 -212 3738 -1240 -551 1066 -1626 936 3563 -2116 -2085 2815 -745 1400 2823 -2494 -1509
976a509M572k853k75K514n030K505L473l909l14K363k267K99K898m156R83J920
$$ -1509 3063 210 -65 2449 -2581 -76 3397 -512 -826 1537 -730 -431 2467 -1689 -706 1214
992A214j291P81l25k876J915L430l797L38Nj494K653R18k286o67O02o60L757j773
$$ 1214 -77 704 379 -2497 -582 2848 -949 -611 -606 -2100 553 1471 -815 -1482 -880 -1540 2217 444
1010D44l199K362j00p34K501r28l547L915M2k157K324j954l69L240j163l453L602
$$ 444 -2755 -393 -493 -1227 1274 346 -3201 714 756 -1401 923 -1031 -1400 1840 677 -2776 826
1027H26r43j119L805k481l174L725J228k420K343k805j573M614k19k149J347j198
$$ 826 -117 -1236 2569 88 -3086 639 1867 -553 1790 -1015 -2588 2026 1807 -342 1005 -193
1043a93j888M989j594k567K031r69N3J860j271j967L327j193p86J545k130L45
$$ -193 -2081 2908 1314 -1253 778 -191 -138 1722 451 -1516 1811 618 -168 1377 -753 -408
1059d08K483j375k043K102j907J372K076k900r50J296l7P49J602l797l71K742
$$ -408 2075 700 -1343 759 -1148 224 2300 -600 -1550 -254 -291 458 2060 -1737 -2108 634
1075F34j245J203J47k420M0L011k397N51J100k318J935J049k568N3K220j916J085
$$ 634 -611 592 739 -1681 -1641 1370 -1027 -476 624 -1694 241 1290 -1278 -1225 995 -921 164
1092A64N59l185K079J563j262M7J72k638K747K232l274M77l53p67K294J451l542
$$ 164 723 -2462 -383 1180 -82 -35 137 -2501 246 2478 -796 -319 -672 -1439 855 2306 -1236
1109a236O72J302j490K239n50k232J221J497j985J065K15k257L155n50j533L98
$$ -1236 -564 738 -752 1487 937 -1295 -74 1423 -562 503 718 -1539 1616 1066 -467 -69
1125f9M12r76K375n65l112J960M38JJ172j199k483K701P10j451J336k157m53K159
$$ -69 343 -633 1742 1177 -1935 25 463 464 1636 437 -2046 655 1365 -86 1250 -907 -1360 799
1143G99L27j912J012q23k51K476j634j339J258j5l63J194j682r42K976j198m25
$$ 799 1126 -786 226 -597 -848 1628 -6 -1345 -87 -102 -465 729 -953 -1895 1081 -117 -542
1160e42M35j336M57K496j233j909J821j550J395J440j936r00J402l68L39J466
$$ -542 -107 -1443 -986 1510 277 -1632 189 -1361 34 1474 -462 -1362 40 -328 11 1477
1176A477k940M91K151j061j99O11j564O63K323k420J4O64n62J154Q10k566j46
$$ 1477 -1463 -972 1179 118 -81 530 -1034 -371 1952 -468 -454 210 -352 802 1612 -954 -1100
1193a100K373j169J180m15k238J170J547p63j07J41k099K261P85j644M3K02q01
$$ -1100 1273 104 1284 869 -1369 -199 1348 585 478 619 -1480 781 1566 -78 -35 167 -634
1210f34J648L71k905J435O06p90P83m46j189J302J146j978R64j087o26K475j92
$$ -634 1014 1385 -1520 -85 521 -269 514 68 -1121 181 1327 -651 313 -774 -1400 1075 883
1227H83j849J00Q87q36K176j014k165J445N01n34J268r23k014K796m95o38N80
$$ 883 -966 -866 21 -815 1361 347 -1818 -373 128 -406 862 -61 -2075 721 226 -412 168
1244A68q48l95K060o99j931J797n41L62J189j320r81J467N82q51J185k244J36
$$ 168 -680 -1075 985 286 -1645 152 -389 -27 1162 -158 -1139 328 910 59 1244 -1000 -864
1261h64K319n45n29J10j387K96K416j630m74P94q55P77J232j594r17J818q05K04
$$ -864 1455 910 381 491 -896 -600 1816 186 -288 506 -349 428 1660 66 -851 967 162 366
1279C66M93j642Q44J063q93j055J281j276J151R28j792L4M28q3N33N94k305N14
$$ 366 859 -783 61 1124 231 -824 457 -819 332 1260 -532 -498 -70 -153 380 974 -1331 -817
1297h17J180p02R36k66j632O14J513j225L24J03j264J800n5j452K34P72q10J216
$$ -817 363 -339 597 331 -1301 -687 826 -399 -75 28 -1236 564 509 -943 -709 63 -747 469
1315D69j84j827J603M87n62J59m17j484K228M77j584J002q17l88J508L67k119
$$ 469 285 -1542 61 548 -14 145 -272 -1756 472 949 -635 367 -450 -838 670 1037 -1082
1332a082J168j59m65J685j032q56J060M21j093Q77l48j074K055n26j102M64K81
$$ -1082 86 -73 -538 1147 115 -741 319 740 -353 524 176 -898 1157 631 -471 -7 274
1349B74p61J955o80k128J711j74j5Q35q19j037J347O6n53Q65j436k49J550k57
$$ 274 -487 1468 788 -1340 371 197 182 1017 198 -839 508 574 21 886 -550 -799 751 494
1367D94p23M77q46K54J674j889J32O79l68J9P12j824K48K115j705M36J92j150
$$ 494 -229 248 -598 -344 1330 -559 -427 252 -116 -97 615 -1209 -961 1154 -551 -115 77 -1073
1385a073N21J875j454o01J059j937J765R81k016j05J440j073P95J166k553N84
$$ -1073 -552 1323 -131 -732 327 -1610 155 1136 -880 -985 455 -618 177 1343 -1210 -626
1401f26J461j175K50P77j567O16J639j931K63P66p58P10L87j430J45J484r58M75
$$ -626 835 -340 -90 687 -880 -264 1375 -556 -293 473 -285 425 812 -618 -473 1011 53 528
1419E28l93j035Q30J190q18R9l03j093J579L66q54o2L8o85J489K5j792J084p6
$$ 528 135 -900 -70 1120 302 401 98 -995 584 950 96 34 72 -613 876 901 -891 193 117
1438A17n18J139m92j340J722n7j465J473j011m02J823m72j705R00K36p25K045
$$ 117 -401 738 246 -1094 628 571 -894 579 -432 -834 989 517 -1188 -288 -52 -777 1268
1455A268j178j652J383K36m83J088r35j363J896j35p36J129q79n05J332l26j170
$$ 1268 90 -1562 -179 57 -426 662 -273 -1636 260 125 -611 518 -361 -866 466 140 -1030
1472a030J530o74k7P81j004k87R51p6l62Q26j349J94J620n42o10Oo33M74J849
$$ -1030 500 -174 -201 580 -424 -711 240 164 -198 628 -721 -527 1093 551 -59 -53 -686 -212 1637
1491A637j589l59N67o79P43P83j071n05J234j099O04P00j508M71J094r80l03Q65
$$ 1637 48 -311 256 -423 320 1103 32 -473 761 -338 266 966 -542 -71 1023 43 -260 605
1509F05j128R81P59j909M7Q91n55P37K38j796M71J434q29M50o62r73M99J648j179
$$ 605 -523 458 1217 -692 -645 246 -309 428 666 -1130 -659 775 -54 396 -266 -1239 -740 908 -271
1528b71L48kj170R87N97p46j99P78j072Q63j90r72R34O27o83J80k0j114J513N19
$$ -271 77 75 -1095 -108 489 -257 -456 322 -750 113 -77 -1049 -115 512 -171 9 -11 -1125 388 907
1548I07j559O60j87l60J159J14j625Q26K01m16J371j160o76R94J11k91P90q71
$$ 907 -652 8 -179 -539 620 734 -891 -65 136 -280 1091 -69 -745 249 360 69 859 -12
1566a2n50J244j58p00O09m03l85J217n58j139J457p11L68L98q73l62J078Q5l56
$$ -12 -562 682 524 -176 433 30 -355 862 304 -835 622 -89 279 677 -196 -558 520 605 249
1585B49M64j379J74J097j35r56O82o92J01J419j142m27P18l26L4O31r99l20J377
$$ 249 713 -666 -492 605 470 -486 196 -496 -395 1024 -118 -545 173 -153 -119 512 -487 -807 570
1604E70p44K86o1p16L86Q61p61n27Q04q89R13N45j152j71O71rQ1N22j404O78M71
$$ 570 -174 112 51 -665 -279 582 -179 -706 98 -791 122 667 -485 -656 15 6 87 609 -795 -117 354
1625C54l69J35j32l83N49N55r94K74j17n0O08J9q94L81P11q28J140r34o00Q54
$$ 354 -15 120 -12 -395 154 709 -285 -11 -128 -178 430 449 -445 -64 647 -181 959 25 -575 279
1645B79J99l42J5J08r75J579l97p26M48l37o2Q32K5j368R32j81l6K42k30o16R65
$$ 279 478 136 151 259 -716 863 466 -260 188 -149 -211 621 646 -722 210 29 -7 235 5 -611 354
1666C54J72j194J021p72k2J130m16j084O11rl4R84p55r56R72k00J17M59p55l10
$$ 354 526 -668 353 -419 -441 689 273 -811 -200 -209 -243 741 -14 -970 2 -198 -81 378 -377 -687
1686f87P15k72J46L96q73K18O63k97q00R36n90M33M67q64k39R47j93K5L86j163
$$ -687 28 -244 -98 298 -575 -357 306 9 -791 145 -445 -12 455 -409 -648 299 106 131 517 -646
1706f46N88O66m45Lo7p37L32J352j258J86K32n56Q68K37r95K37N67q62P88k3j015
$$ -646 -58 608 163 166 99 -638 -306 1046 -212 -26 206 -350 518 755 -240 -3 564 -298 490 467 -548
1727e48M70P65n80l74P87p43N78M22j111R6J76j11M83L40j518Q92J39l62N94p07
$$ -548 -78 687 107 -267 520 -223 355 777 -334 -238 -62 -173 310 650 -868 24 163 -199 395 -312
1747c12m50N86N22o44L73k49n99J152k67n85L04L59p76Q73k11p50P84j60j19M43
$$ -312 -762 -176 346 -298 75 -174 -773 379 112 -473 -169 190 -586 287 76 -674 110 -50 -169 274
1767B74o21n24J055J00o30M57m60%R73m94p87O00j89M0Q97p32l61L67K30l31O20
$$ 274 -347 -871 184 284 -346 111 -349 -349 624 130 -657 -57 -246 -206 691 -41 -402 -35 195 -136 484
1788D84o06k92R67m18l22L83n8j63Q79p52m92P15l24L88K74q03k83P36j73Q8N93
$$ 484 -122 -414 553 135 -187 196 138 -25 854 102 -390 325 1 389 663 -140 -423 313 140 228 821
1809H21j638O55P48k28n63L98p44M98R03j128J08J54k27K86M73j057K38O86o80
$$ 821 -817 -162 586 358 -205 193 -551 -53 850 -278 -170 -16 -243 43 516 -541 -303 383 -297
1828b97K27J29m45K68O93r81O9K17m65O98K80p62l15P09k58O05J54j336P99O0
$$ -297 -70 59 -386 -118 575 -406 -337 -120 -585 113 393 -369 -684 25 -233 372 526 -810 -11 49
1848D9j55K82O1o23M28L15p78P48l49j64P58m41n80N99J31k33M62q31K72L22K30
$$ 49 -106 176 237 -386 42 357 -421 327 -22 -186 572 131 -449 150 281 48 510 -321 -49 273 503
1869E03l42K8n88j57J351m66m03J56l09j45J261n64p99Q11l11O9K09j87n34Q25
$$ 503 161 189 -399 -556 795 329 -74 82 -227 -372 889 325 -474 337 26 95 304 117 -417 408
1889D08n8p76O18k85j22P62m89o93N98J1k38P24o32k68M66Q4P4j34l96m33J012
$$ 408 350 -426 192 -93 -215 547 58 -635 -37 -26 -264 460 -172 -440 26 110 184 50 -346 -779 233
1910B33l41L39j43n32K64L22l9l59L71p00P90N2p84L39P28q16L94J96p59M37J00
$$ 233 -108 231 88 -444 -180 142 103 -256 115 -585 205 257 -527 -188 540 -276 118 314 -445 -8 92
1931I2j48M3K8m34N83M63q71K26R1j78M99L17r02J06M74m99N60k66n12K37M57
$$ 92 -56 -13 15 -419 164 627 -244 -18 73 -105 394 711 -191 -85 389 -110 450 184 -328 -91 366
1952C66k55k58M44p63P92Q4p28L37J40l78K88O2r05J005K7n59L95l76j90O40K54
$$ 366 111 -147 297 -466 326 410 -318 19 159 -219 69 131 -774 231 258 -301 94 -282 -472 168 422
1973D22p52M35o47QP76J8o66J92J19m45J030k72p66N80l62R3L41k52k50P29k31
$$ 422 -330 105 -542 -534 242 260 -406 -214 -95 -540 490 218 -548 32 -330 -237 104 -148 -398 331 100
1994A00k97J96m88M97K15k55n04Q88m57J82L26o45j47O19Lm51N39m68o9O31l08
$$ 100 -197 -1 -489 8 223 -32 -536 352 -105 77 403 -242 -389 230 233 -218 321 -147 -216 415 107
2015A07q6P2k24l1O18l35m04L39j41M67j1l08l75O32k42Q2M6m52L96K17rm48L26
$$ 107 21 93 -131 -162 456 121 -283 56 -85 382 371 63 -312 320 78 160 206 -246 150 367 358 -90 236
2038B36n21M02L20p41K57O9l95N95J76r74M45L71l78N18l14n06K25O54q18M87
$$ 236 -285 117 437 -304 -47 22 -373 222 398 -576 -131 240 -138 380 66 -440 -215 439 -379 108
2058A08P5p52Q43k96n54M80L73p05Q03m69n09O00K80l21j49Jm23P33L86p26K65
$$ 108 183 -569 274 -22 -576 -96 277 -428 375 -94 -603 -3 277 -44 -193 -192 -615 118 504 -222 43
2079D3P8m31O23J7m78N1L75m15O27l85j70O0J36k47M15m74j80J012m56k93J63
$$ 43 121 -310 313 330 -148 -97 278 -137 490 105 -65 -5 131 -116 299 -175 -355 657 201 -92 71
2100G1Oq1O51m21n50M45l22M31l4k07m66O43n1m47O02o12k8N75l30L7K29m87K55
$$ 71 77 -4 647 226 -324 121 -201 230 196 -11 -477 166 115 -332 270 -342 -370 205 -125 -88 141 -346 -91
2123i1L94o93k3M57j78J47N5l53k15N86k51R3K3m73M14J77j70k41L20l22N06l2
$$ -91 303 -390 -413 44 -134 13 68 -285 -500 86 -165 -72 -49 -522 -108 69 -101 -342 -22 -344 162 130
2145A30o16K07J26L9M9K59p14M52L57m04L2No3K57J70n65K85J61k89O79k54p00
$$ 130 -486 -279 -153 -114 -65 194 -520 -68 289 -115 -83 -78 -141 116 286 -279 6 167 -122 557 303 -397
2167c97K05L38m4J16j8n61O74Rj75L77n62m49P53Lo62N06J6l23L86o5n29M96J22
$$ -397 -192 146 102 218 200 -361 313 322 147 524 -38 -487 266 269 -393 113 129 -194 192 127 -402 94 216
2190B16l23K75l44o2K38K16n00J51K9j74P12l43k39j62J58L0N87o16l23M54j28
$$ 216 -107 168 -176 -238 0 216 -284 -133 -104 -278 434 91 -148 -310 -152 -122 465 -151 -474 -20 -148
2211a48j05L87k27l79O90l41J79J15m29L50K7j71j55L22m20K02L05o00J52N31
$$ -148 -253 134 -93 -472 218 -123 56 171 -258 92 119 -52 -207 115 -305 -103 202 -398 -246 285
2231B85o5k65R1m13L53N28j20j06k8m32L12M77q24R5K71m46M22j19j21j8L72j84
$$ 285 220 -45 46 -367 -14 514 394 288 260 -172 140 617 -207 -112 159 -287 135 16 -105 -123 249 65
2253F5Q5Km80O44j8l74n6J64m36O72K59n85j93K94m7L55R7p88J55N06l52K30k75
$$ 65 150 152 -328 316 298 -76 -132 32 -404 268 527 -58 -251 43 -4 351 448 -340 -185 321 -31 199 -76
2276g6l88L92K63k82R1%m43O41r0k82J77Pq6o6K05l66L80q1j53K56j63j03L09
$$ -76 -464 -72 191 -91 0 0 -443 198 108 -174 3 10 -76 -142 63 -303 77 -4 -157 99 -64 -167 142
2299A42K49m97o9J2L34K58k7q78M51L28m24L49k04M8j0jj78K67k2l91N80j60l84
$$ 142 391 -106 -175 -163 171 429 402 -476 -25 303 -121 228 24 72 62 61 -117 150 128 -263 317 157 -227
2322b27L49p5o2L62l90j00L08m09K29K84j26l38L74P6j88k3m35J58P70o74J15
$$ -227 122 47 -15 347 -43 -143 165 -244 -15 269 143 -195 179 255 67 44 -391 -233 537 -137 -22
2343b2J48l40L1N75n29P1Q1o7N9K12o58J02O31m96K17k3j37K11P9k24l59M39j91
$$ -22 126 -214 -183 392 -137 -66 15 -52 7 219 -439 -337 294 -202 15 -8 -145 66 145 -79 -438 1 -190
2366a90N52k52l12J06j64M2L24J5l10K10J94j40p8j5l96K97L65m45K81%k60L06
$$ -190 362 110 -202 -96 -260 -218 106 121 -189 21 215 75 -3 -18 -414 -117 248 -197 84 84 -176 130
2388A30j80j86L06J39k96M26l77l53N78J22k40m7l8k38O18j46l51j3J08q2N10
$$ 130 -50 -236 70 209 -87 339 -38 -391 187 309 69 22 -16 -254 364 218 -133 -146 -38 -120 390
2409C90k53l34L89k48J11J38j83l4k35K88l67M72l33P6M00k69n6k25L56l74O18
$$ 390 137 -197 192 -56 55 193 10 -24 -259 29 -338 134 -199 -123 277 8 -48 -273 83 -291 327
2430C27n14k44K40j09K62R1k85l60Q02k97k4K63m94K12J28J70k71K63k28J81r7
$$ 327 -187 -431 -191 -300 -38 53 -232 -592 210 -87 -111 152 -342 -130 -2 168 -103 160 -68 113 16
2451A6k34J61Q2J35m15L86m45K95N45j34m14L6k70K81L72l47k06J11l9M35j63
$$ 16 -218 -57 25 160 -255 131 -314 -19 526 392 -22 14 -256 25 397 50 -156 -45 -84 351 188
2472A88k16j81L54r3k09K53k89K27q6P1p5L14j31j38J86m61L82j11J47J24j36
$$ 188 -28 -209 145 52 -157 96 -193 34 -52 19 -56 258 127 -11 175 -286 96 -15 132 256 120
2493A20m25L78J36j95K19o14J45L43J70k51J26m05l8L12P9m37K57j9q6K98p3k76
$$ 120 -305 73 209 14 233 -381 -236 107 277 26 152 -253 -291 21 100 -337 -80 -99 -185 113 40 -236
2515b36N02k87j0Q0k29j14M42P5m34K15l8J1O2J76l90J53Q4R5K66n42K0J00K85
$$ -236 266 -21 -31 49 -180 -294 148 223 -211 4 -34 -23 39 215 -175 -22 62 157 423 -119 -99 1 286
2538B86l94K46j07l90O05o4k33K05K5k28J35K6l10J85J8R7R1k41j8L51l28O9Q4
$$ 286 -108 138 31 -359 246 182 -51 154 179 -49 86 112 -198 -13 5 102 193 -48 -66 285 -43 26 110
2561A10j78K53j8l07J65k22M1M1N78o87J98J43m48O38j59m67K09L66l80Q2N5k67
$$ 110 -68 185 167 -140 25 -197 -156 -115 463 -224 -26 117 -331 307 148 -319 -110 256 -124 -42 13 -254
2583b54M16j4l28j03L85k18J98N3m17N9j23M46p4Q7l48K01N3k72L87k13l5k2J7
$$ -254 162 148 -180 -283 102 -116 82 135 -282 -223 -346 100 26 113 -235 -34 19 -253 134 -79 -114 -136 -119
2606a19J17K62k00n3J16l56K23R3pl25O13m02p2L18q9k4R7r8k94N52k26l33L84
$$ -119 -2 260 60 7 123 -233 -10 83 76 -249 364 -38 -110 208 119 95 192 94 -200 352 126 -207 177
2629A77l18K00K99l92j62K29j73L72l53J72j71R3J33j02J32k26K82m18K10j99
$$ 177 -141 59 358 -34 -196 33 -140 232 -121 51 -120 -27 106 4 136 -90 192 -226 -16 -215
2649b15P9N1J53p7q2k36N53l38qL24n00J36J24p0M9p8Q5o1L00j75K9q7j88L78
$$ -215 -136 -85 68 -9 -91 -327 226 -112 -120 204 -296 -160 -36 -106 -57 -135 -50 -111 189 14 43 -44 -232 146
2673A46O4n10K61Q0j7K28mn59L41K13k72j55kQ9J10L61k74k76J35J43J73q8n3
$$ 146 210 -300 -39 41 24 252 248 -311 30 243 -29 -184 -186 -97 13 374 100 -176 -41 102 275 187 134
2696A34o1r3R1J48j53k28L50j08l7J83P7o39M82J8l36K75j74j03K58j53l89K94
$$ 134 73 -20 71 219 66 -162 188 80 43 226 303 -336 146 164 -172 103 -71 -174 84 -69 -458 -164
2718a64K42l6P5k20k00M36q3j85J81l85K41K81l46K40m5j59m9L53k42k20L70k98
$$ -164 78 42 117 -103 -303 133 50 -135 46 -339 -98 183 -163 77 32 -127 -176 177 -65 -285 85 -213
2740b13K98p8p0Q2R5O4l41J76k89K34K26k33p7P0J37j57L09m19K83P4L0j49K2
$$ -213 85 7 -63 19 114 178 -163 13 -276 -42 184 -49 -126 -56 81 -76 233 -186 97 171 201 52 74
2763G4j29J28L05m20J83j93N2j3J35k27j3J93j7m8m9q5L37L2q6j12p9%j01K62
$$ 74 -55 73 378 -42 141 -52 0 -13 122 -105 -118 75 58 10 -39 -124 213 245 159 47 -32 -32 -133 129
2787A29j15O0j11j31K02K17l92L02j06j49K0K69m27R0L75l92K84j45K9j65K90
$$ 129 14 74 -37 -168 34 251 -141 161 55 -94 -74 195 -232 -142 233 -159 125 -20 9 -156 134
2808A34p0k24Q5j27L05l7l30L01J22o1j72k8j4J66l9jJ38j86j82N53j77n75J83
$$ 134 64 -160 -75 -202 103 66 -264 37 159 98 -74 -102 -116 50 11 10 148 -38 -220 333 156 -419 -236
2831b36J17J10J48j1l25K38j20j78L43k04J24o6M03l16Q4K07m55L11J6k95K51
$$ -236 -119 -9 139 128 -197 41 -79 -257 86 -118 6 -60 343 27 111 318 -137 174 190 -105 146
2852A46k19L32J11n04l2k7K66J57k80j27J97Qo4j85L90k41J48J68j15j01k71O4
$$ 146 -73 259 370 -134 -166 -193 73 230 -50 -177 20 28 -36 -221 169 -72 76 244 129 28 -243 -179
2874a79K16J19k11l49N25k00K86j79m08L48o2L4J15k17Q3L66R4n24J80j59j82
$$ -179 37 156 -55 -404 121 -79 207 28 -380 -32 -94 -60 55 -162 -79 287 381 -143 37 -122 -304
2895c04L27J24l36L14j58p9K40on85O15j48r6J9j11N6K54P5l57K55p2j0J44R8
$$ -304 23 147 -189 125 -33 -112 128 122 -463 152 4 -92 -73 -184 -128 126 201 -156 99 27 17 161 259
2918B59n60J14L18J15j05J92k77J37p1p0J21k12q1J71kl25J81K42k32o9K52n14
$$ 259 -301 -187 131 246 141 333 56 193 122 52 173 -39 -120 51 49 -276 -95 147 -85 -154 98 -416
2940d16L98j97L98j04k46K9M60k05l74L06l47L43K55l42j83M19o1m10J57K73l27
$$ -416 -18 -215 183 79 -167 -138 322 117 -257 49 -298 45 300 -42 -225 194 133 -277 -120 153 -174
2961a74J83k0j9Q5j21j72N10m17K33J11k60P8R7j45O4J1k08K74J3j30n4J99J08
$$ -174 9 -11 -30 55 -66 -238 272 -145 88 199 -61 17 114 -31 33 44 -164 110 123 -7 -61 138 246
2984B46j51n5j51j36K38J86L1l73J46r6J90j46K57k35p5J74K01l15K23P2k28P3
$$ 246 95 40 -111 -247 -9 177 208 -165 -19 -115 75 -71 186 -49 -124 50 251 -64 159 231 3 76
3006G6l63O5J71J68l57K05L2r3K76k3m11L87k13K86lj14k16J82KJ4Q4m31K73N9
$$ 76 -287 -222 -51 117 -240 -35 -3 -96 180 157 -254 133 -80 206 203 89 -127 55 57 71 155 -276 -3 56
3030E6J17k99L4q3K25Q2l40J11L20P6m31K87n06K46L27k29RPJ08q9K34j56k86
$$ 56 173 -126 -92 -175 50 132 -208 -97 223 299 -132 155 -351 -105 222 -7 2 9 117 28 262 106 -180
3053a80K88j51l1R3o8PJ7O6M7J58l00P2Q7J6k90K24J01k19m9k1J75J63j55j76
$$ -180 108 -43 -74 19 -49 -42 -25 41 88 246 -54 18 105 121 -169 55 156 -63 -112 -133 42 205 50 -126
3077a26L42m7n20M72L2O1l19K06l91N29j31j36J37j05Q1O4R6k07o4k99L85j13
$$ -126 216 169 -351 121 153 214 -105 101 -290 239 108 -28 109 4 85 149 245 38 -26 -325 60 -53
3099e3j86K51jm9Q2J38m82L34j2k68J44j04O1K06J00l88K72Pj55L13Q9l72j48
$$ -53 -239 12 11 -38 44 182 -300 34 22 -246 -102 -206 -145 61 161 -227 45 52 -103 210 299 -73 -221
3122b21L87j27n7M5j52J1J41PK36Qk10r3L97l36L6J03j44J5k8j19L3R4M1N6j96
$$ -221 166 39 -18 27 -125 -114 27 34 270 278 68 -25 372 36 72 175 31 46 18 -101 -68 26 67 123 -73
3147g3J13qP4J1k17j26L45n9j49nJ49j24J76p0Jl09L64l69J52J07J19j1j46J74
$$ -73 40 32 106 117 -100 -226 119 60 -89 -94 55 -69 107 37 38 -271 93 -276 -124 -17 102 91 -55 119
3171A19k28J30o7j80J75k40K46J06rj79J81k99J31J51q0P5n9j81K91j08j08J39
$$ 119 -109 21 -46 -226 -51 -291 -45 61 52 -127 54 -245 -114 37 -43 32 -27 -208 83 -25 -133 6
3193FN3j35P1j2K2o9L64l62p0o4O5L60j60j26J12kj68J56J20j99M0K9l5Q6N9r
$$ 6 59 -76 -5 -17 5 -64 300 -62 -132 -196 -131 229 69 -57 55 53 -115 41 161 -38 2 31 -4 82 141 132
3219A32k92L0RK10J13l47j10K65j50K63rm24O08j75j0lk0j64J27j56k20K76K4
$$ 132 -160 -130 -121 89 202 -145 -255 10 -140 123 114 -310 298 123 113 110 90 -74 53 -103 -323 -47 -23
3242b3NJ0J33m51K74P3K1L0p6j98p6L25P2j48o4Q2J70l82J34j37K47L0K95l04
$$ -23 -18 -8 125 -326 -52 21 42 72 -4 -202 -278 47 119 -29 -93 -11 159 -223 -89 -226 21 51 346 42
3266D2j9M5k19J24j88Q1K95ok06r4P9MN5N3l4j29K25l08J21P0M9j03K73k07k07
$$ 42 23 68 -151 -27 -215 -134 161 155 -51 -145 -66 -62 -7 46 12 -117 108 -200 -79 -9 40 -63 210 3 -204
3291b04L44k96M3J44n3j3K78j16P4o3l75J20L11k19L63l91J09l6p5J53j87P5j53
$$ -204 140 -156 -113 31 -22 -35 243 127 201 138 -237 -117 194 -25 338 -53 56 20 -55 98 -89 -14 -167
3314a67L1J13j90L54K7k24P2K13m21K90l73J27k9K76k00K80k3m13L66l82K05K22
$$ -167 -136 -23 -213 141 168 -56 16 229 -192 98 -275 -148 -177 99 -101 179 156 -257 109 -273 -68 154
3336A54j65N9j66N8j52L42L18n82O1qN5J54j60n3J38J30j70J81J31k77O4J36j82
$$ 154 -11 48 -118 -60 -212 130 448 -134 -73 -81 -26 128 -32 -85 53 183 13 194 325 48 112 248 66
3359F6k1K24k01j17L9P0J74l27J9N7l7J89J05l8k18M9k%J67j95j21J06k72L75
$$ 66 45 269 68 -49 -10 60 234 -93 -74 -17 -54 135 240 202 -16 33 31 31 198 3 -118 -12 -284 91
3383I1l1j59n9J0J89o5J97m55J25K18j26MKO3r9L91m18J27k02J31k41K85k20J00
$$ 91 60 -99 -158 -148 41 -24 173 -282 -157 61 -65 -61 -59 4 -95 296 -122 5 -197 -66 -307 -22 -242 -142
3407a42K54l23K52N2k25k8K17k91K62J23r3J4j01J03j13J58m00L76j17j52J68
$$ -142 112 -211 41 93 -132 -160 57 -234 28 151 58 72 -29 74 -39 119 -281 95 -22 -174 -6
$$ [...]
8191g5
##END NTUPLES=NMR FID
##END=
