##TITLE=1H_Pr 4687-2
 CDCl3, 8 sc, 
 12.05.2021
##JCAMPDX= 6.0         $$ Bruker NMR JCAMP-DX V2.0
##DATA TYPE= NMR FID
##DATA CLASS= NTUPLES
##ORIGIN= UXNMR, Bruker Analytische Messtechnik GmbH
##OWNER= root
$$ XWIN-NMR		Version 3.5
$$ Wed May 12 13:53:48 2021 Russian Standard Time (UT+4h)  she@DPX200
##.OBSERVE FREQUENCY= 200.131506
##.OBSERVE NUCLEUS= ^1H
##.DELAY= (6, 6)
##.ACQUISITION MODE= SIMULTANEOUS
##.ACQUISITION SCHEME= undefined
##.AVERAGES= 8
##.DIGITISER RES= 18
##SPECTROMETER/DATA SYSTEM= spect
##.PULSE SEQUENCE= zg30
##.SOLVENT NAME= D2O
##.SHIFT REFERENCE= (INTERNAL, D2O, 0, 15.7039)
##AUDIT TRAIL= $$ (NUMBER, WHEN, WHO, WHERE, WHAT)
$$ ##TITLE= Audit trail, XWIN-NMR		Version 3.5
$$ ##JCAMPDX= 5.01
$$ ##ORIGIN= Bruker BioSpin GmbH
$$ ##OWNER= she
$$ F:/spectra/data/she/nmr/H-F/1/audita.txt
$$ ##AUDIT TRAIL=  $$ (NUMBER, WHEN, WHO, WHERE, WHAT)
(   1,<2021-05-12 13:52:30.81 +0400>,<she>,<DPX200>,
      <created by zg, POWCHK disabled, PULCHK disabled
       configuration hash MD5:
       00 E9 B6 7A A2 85 ED C7 34 08 36 98 17 FE 4E 26
       data hash MD5: 16K
       67 1F 14 F2 AB C0 1C BE DD 76 13 66 D8 F1 78 7F>)
$$ ##END=
$$ 
$$ hash MD5
$$ 9A F5 FB 1E EA 3B B2 52 13 44 6C C2 96 1E 0D 6E
##$RELAX= 
##$RELAX= 
##$RELAX= 
##$RELAX= 
##$RELAX= 
##$RELAX= 
$$ Bruker specific parameters
$$ --------------------------
##$DU= <F:/spectra>
##$EXPNO= 1
##$NAME= <H-F>
##$PROCNO= 1
##$TYPE= <nmr>
##$USER= <she>
##$AMP= (0..31)
100 100 100 100 100 100 100 100 100 100 100 100 100 100 100 100 100 100 
100 100 100 100 100 100 100 100 100 100 100 100 100 100 
##$AQSEQ= 0
##$AQ_mod= 1
##$AUNM= <au_zg>
##$AUTOPOS= <>
##$BF1= 200.13
##$BF2= 200.13
##$BF3= 200.13
##$BF4= 200.13
##$BF5= 200.13
##$BF6= 200.13
##$BF7= 200.13
##$BF8= 200.13
##$BYTORDA= 1
##$CFDGTYP= 0
##$CFRGTYP= 5
##$CHEMSTR= <none>
##$CNST= (0..31)
1 1 145 1 1 1 1 1 1 1 1 1 1 1 1 1 1 1 1 1 1 1 1 1 1 1 1 1 1 1 1 1 
##$CPDPRG= <>
##$CPDPRG1= <>
##$CPDPRG2= <>
##$CPDPRG3= <>
##$CPDPRG4= <mlev>
##$CPDPRG5= <mlev>
##$CPDPRG6= <mlev>
##$CPDPRG7= <mlev>
##$CPDPRG8= <mlev>
##$CPDPRGB= <>
##$CPDPRGT= <>
##$D= (0..31)
0 1.2 0 0 0 0 0 0 0 0.06 0 0.03 0 0 0 0 0.0002 0 0 0 0 0 0 0 0 0 0 0 0 
0 0 0 
##$DATE= 1620813150
##$DBL= (0..7)
120 120 120 120 120 120 120 120 
##$DBP= (0..7)
150 150 150 150 150 150 150 150 
##$DBP07= 0
##$DBPNAM0= <>
##$DBPNAM1= <>
##$DBPNAM2= <>
##$DBPNAM3= <>
##$DBPNAM4= <>
##$DBPNAM5= <>
##$DBPNAM6= <>
##$DBPNAM7= <>
##$DBPOAL= (0..7)
0.5 0.5 0.5 0.5 0.5 0.5 0.5 0.5 
##$DBPOFFS= (0..7)
0 0 0 0 0 0 0 0 
##$DE= 6
##$DECBNUC= <off>
##$DECIM= 32
##$DECNUC= <off>
##$DECSTAT= 4
##$DIGMOD= 1
##$DIGTYP= 9
##$DL= (0..7)
0 120 120 120 120 120 120 120 
##$DP= (0..7)
150 150 150 150 150 150 150 150 
##$DP07= 0
##$DPNAME0= <>
##$DPNAME1= <>
##$DPNAME2= <>
##$DPNAME3= <>
##$DPNAME4= <>
##$DPNAME5= <>
##$DPNAME6= <>
##$DPNAME7= <>
##$DPOAL= (0..7)
0.5 0.5 0.5 0.5 0.5 0.5 0.5 0.5 
##$DPOFFS= (0..7)
0 0 0 0 0 0 0 0 
##$DQDMODE= 0
##$DR= 18
##$DS= 0
##$DSLIST= <SSSSSSSSSSSSSSS>
$$ [...]
##$SUBNAM2= <"">
##$SUBNAM3= <"">
##$SUBNAM4= <"">
##$SUBNAM5= <"">
##$SUBNAM6= <"">
##$SUBNAM7= <"">
##$SUBNAM8= <"">
##$SUBNAM9= <"">
##$SW= 19.0423571276983
##$SWIBOX= (0..15)
0 0 2 0 0 0 0 0 0 0 0 0 0 0 0 0 
##$SW_h= 3810.9756097561
##$TD= 16384
##$TD0= 1
##$TE= 0
##$TE2= 300
##$TE3= 300
##$TEG= 300
##$TL= (0..7)
0 120 120 120 120 120 120 120 
##$TP= (0..7)
150 150 150 150 150 150 150 150 
##$TP07= 0
##$TPNAME0= <>
##$TPNAME1= <>
##$TPNAME2= <>
##$TPNAME3= <>
##$TPNAME4= <>
##$TPNAME5= <>
##$TPNAME6= <>
##$TPNAME7= <>
##$TPOAL= (0..7)
0.5 0.5 0.5 0.5 0.5 0.5 0.5 0.5 
##$TPOFFS= (0..7)
0 0 0 0 0 0 0 0 
##$TUNHIN= 0
##$TUNHOUT= 0
##$TUNXOUT= 0
##$USERA1= <user>
##$USERA2= <user>
##$USERA3= <user>
##$USERA4= <user>
##$USERA5= <user>
##$V9= 5
##$VALIST= <valist>
##$VCLIST= <CCCCCCCCCCCCCCC>
##$VD= 0
##$VDLIST= <DDDDDDDDDDDDDDD>
##$VPLIST= <PPPPPPPPPPPPPPP>
##$VTLIST= <TTTTTTTTTTTTTTT>
##$WBST= 1024
##$WBSW= 4
##$XGAIN= (0..3)
0 0 0 0 
##$XL= 0
##$YL= 0
##$YMAX_a= 127355
##$YMIN_a= -111874
##$ZGOPTNS= <>
##$ZL1= 120
##$ZL2= 120
##$ZL3= 120
##$ZL4= 120
##$ABSF1= 10
##$ABSF2= 0
##$ABSG= 5
##$ABSL= 3
##$ALPHA= 0
##$AQORDER= 0
##$ASSFAC= 0
##$ASSFACI= 0
##$ASSFACX= 0
##$ASSWID= 0
##$AUNMP= <proc_1d>
##$AZFE= 0.1
##$AZFW= 0.1
##$BCFW= 1
##$BC_mod= 2
##$BYTORDP= 1
##$COROFFS= 0
##$CY= 11.3945322036743
##$DATMOD= 1
##$DC= 2
##$DFILT= <>
##$DTYPP= 0
##$F1P= 15.9154993809931
##$F2P= -4.1035820241983
##$FCOR= 0.5
##$FTSIZE= 0
##$FT_mod= 4
##$GAMMA= 1
##$GB= 0.15
##$INTBC= 1
##$INTSCL= 1
##$ISEN= 128
##$LB= 0.24
##$LEV0= 0
##$LPBIN= 0
##$MAXI= 10000
##$MC2= 0
##$MEAN= 0
##$ME_mod= 0
##$MI= 1.114404
##$NCOEF= 0
##$NC_proc= 0
##$NLEV= 6
##$NOISF1= 3.799351
##$NOISF2= 2.8
##$NSP= 1
##$NTH_PI= 0
##$NZP= 0
##$OFFSET= 15.70392
##$PC= 1
##$PHC0= -11128.41
##$PHC1= 9.801003
##$PH_mod= 1
##$PKNL= yes
##$PPARMOD= 0
##$PSCAL= 0
##$PSIGN= 0
##$REVERSE= no
##$SF= 200.130013532006
##$SI= 16384
##$SIGF1= 3
##$SIGF2= 2
##$SINO= 400
##$SIOLD= 16384
##$SREGLST= <1H.CDCl3>
##$SSB= 0
##$STSI= 0
##$STSR= 0
##$SW_p= 3612.71676300578
##$SYMM= 0
##$S_DEV= 0
##$TDeff= 0
##$TDoff= 0
##$TI= <>
##$TILT= no
##$TM1= 0
##$TM2= 0
##$TOPLEV= 0
##$USERP1= <user>
##$USERP2= <user>
##$USERP3= <user>
##$USERP4= <user>
##$USERP5= <user>
##$WDW= 1
##$XDIM= 8192
##$YMAX_p= 0
##$YMIN_p= 0
$$ End of Bruker specific parameters
$$ ---------------------------------
##NTUPLES= NMR FID
##VAR_NAME=  TIME,          FID/REAL,        FID/IMAG
##SYMBOL=    X,             R,               I
##VAR_TYPE=  INDEPENDENT,   DEPENDENT,       DEPENDENT
##VAR_FORM=  AFFN,          ASDF,            ASDF
##VAR_DIM=   8192,          8192,            8192
##UNITS=     SECONDS,       ARBITRARY UNITS, ARBITRARY UNITS
##FACTOR=    0.0002624,     1,               1
##FIRST=     0,             0,               0
##LAST=      2.1493184,     0,               0
##MIN=       0,             -111874,         0
##MAX=       2.1493184,     127355,          0
$$ Real data points
##PAGE= N=1
##DATA TABLE= (X++(R..R)), XYDATA
$$ [...]
1857a49L93K29k77J76k39l14M73j73O06o45j74K45k58P04k38j71R5n21K32L86
$$ -149 244 473 196 372 133 -181 292 119 725 80 -94 151 -107 597 359 188 283 -238 -6 380
1877C80p6J02l52O1o85O96Q5nj17J1n76P99l56Q1J67m43J68k26K88q5r6M39n98
$$ 380 304 406 54 115 -570 126 211 206 89 100 -476 323 -33 48 215 -228 -60 -286 2 -83 -179 260 -338
1900c38K0K59j00L95j65l59K68l72L15K52k96K50o56M56j33J57K82n29J00j57
$$ -338 -318 -59 -159 236 71 -288 -20 -392 -77 175 -121 129 -527 -71 -204 -47 235 -294 -194 -351
1920c51j69N80j42M2J3j96O3m1N44j97l01L34o04N59K00m80L12K9o67P14j87J44
$$ -351 -520 60 -82 -40 -27 -223 -160 -201 343 146 -155 179 -425 134 334 -146 166 195 -472 242 55 199
1942A99J74m07J50l51M98J51k61L42n57K03Q5k00M71l97j88J18j81N01j43Ll77
$$ 199 373 -34 116 -235 263 414 153 495 -62 141 226 26 497 100 -88 30 -151 350 207 210 -167
1963a67k07O78m36L70J36m17J9O6l01N17k26K49o11L68o3k95N40p2k24j03j20
$$ -167 -374 304 -132 238 374 -43 -24 42 -259 258 32 281 -330 38 -25 -320 220 148 -76 -179 -299
1984b99J42L19j15J67m55J68k21K99Q8k82P6n0l94N83k23n6K79l99K79J9k8J04
$$ -299 -157 162 47 214 -241 -73 -294 5 93 -189 -113 -163 -557 26 -197 -253 26 -373 -94 -75 -103 1
2006Aj39P9j96J18K97l08K67j35k08L65k79L09k1j89K28l41Q5M0p2M76p15K19
$$ 1 -138 -59 -255 -137 160 -148 119 -16 -224 141 -138 171 150 -39 189 -152 -67 -27 -99 377 -338 -119
2028a19J19N4K88l51K25j04q6k7K80K1r3k28J15j59J43J28k63J32j40K07J80k20
$$ -119 0 54 342 -9 216 112 26 -1 279 300 207 -21 94 -65 78 206 -57 75 -65 142 322 102
2050A02J68k96k08M32m06N08k37j28K00j81n8K92k96K59l52J05J5N3K72m23p3
$$ 102 270 -26 -234 198 -208 300 63 -65 135 -46 -104 188 -108 151 -201 -96 -81 -28 244 -179 -252
2071b52K08k01L2o5K45K13m83J26m7q8O16k98P0k86rK45k90P4pm2J50k41K96J56
$$ -252 -44 -245 -213 -278 -33 180 -303 -177 -224 -312 304 6 76 -210 -219 26 -264 -190 -197 -239 -89 -330 -34 122
2095A22j91P6k03J38J09P7P6k77J44L8l11O45k39k20K48m45K49R2r8L60k60j42
$$ 122 -69 7 -196 -58 51 128 204 -73 71 109 -202 443 204 -16 232 -213 36 128 30 390 130 -12
2117a2j67K39J25l5J83l59m8L81k22J99Pk72J51j29L19j89K9r4l37J83k3Q3K14
$$ -12 -179 60 185 150 333 -26 -74 307 85 284 291 19 170 41 360 171 200 106 -231 -48 -71 12 226
2140B26k83k73J81L7L65k55OJ66n25M21m49K30K23l02J82k1l0L91k36K1l25k6
$$ 226 -57 -330 -149 -112 253 -2 4 170 -355 66 -383 -153 70 -232 -50 -71 -101 290 54 75 -250 -276
2162b76J69n4J47J04k28J76m08L00P2k01L03o90K37K08MK16j01k03Q1j27R9K12
$$ -276 -107 -161 -14 90 -138 38 -370 -70 2 -199 104 -586 -349 -141 -137 79 -22 -225 -144 -271 -172 40
2184D0j73K04l4n8J73j78M68l63J91j77n7M07k77J72m97K63L6J13j74K52m31K91
$$ 40 -133 71 37 -21 152 -26 442 79 270 93 36 443 166 338 -159 104 140 253 79 331 -100 191
2206A91m07J71K83k33K51k69N3j92J27M45k10j51O8l23L37l0J69N4l73R9O6k01
$$ 191 -216 -45 238 5 256 -13 40 -152 -25 420 210 59 127 -196 141 111 280 334 -39 60 126 -75
2228g5R0N8j2p7k61K13j2J63j78k43J41j43L12J67m31L76k76J16K68j93J34k87
$$ -75 15 73 61 -16 -277 -64 -76 87 -91 -334 -193 -336 -24 143 -288 88 -188 -72 196 3 137 -150
2250a50r9l1L20Q3J44k27j06j11J68J20o7jl50K49j06L50M0k81J48l3k18L71n16
$$ -150 -249 -280 40 123 267 40 -66 -177 -9 111 44 43 -307 -58 -164 186 226 -55 93 60 -158 213 -303
2273c03M98l47m0M87m65M3M42l05J42k08n5L02l33N76k96k5K6k80L70L2k13J1
$$ -303 195 -152 -192 295 -170 -127 315 10 152 -56 -111 191 -142 434 138 113 139 -141 229 261 48 59
2295E9j91J61RK3L46o14J81K38j37J11k17RJ32m15M25m13N99k21j07J61m30P7
$$ 59 -132 29 38 61 407 -207 -26 212 75 186 -31 -22 110 -305 120 -293 306 85 -22 139 -291 -214
2317b14L17k41L1j98J37L65k66K38l78O5M5j20L13n6j37N7n32O13j27j52K48k86
$$ -214 103 -138 -107 -305 -168 197 -69 169 -209 -144 -99 -219 94 38 -99 -42 -574 39 -88 -240 8 -278
2339b78N9R5l6M52j86n1L0Q0p3r1O7Rm59N52j48J10N9j68K82o31nL76J7J00k40
$$ -278 -219 -124 -160 292 106 55 85 165 92 1 68 77 -382 170 22 132 191 23 305 -326 -331 45 62 162 -78
2364g8Q2J28k67K34n6J08J94k86j90L09j51J05M8J5l91J07M06l56Q7P3k45N6J83
$$ -78 4 132 -135 99 43 151 345 59 -131 178 27 132 180 195 -196 -89 317 -39 48 121 -124 -68 115
2387A15r5J67k51j29J03K47m5j70K75m78J16K49q4O6j17J01n7k8k15J30J2L94
$$ 115 20 187 -64 -193 -90 157 112 -58 217 -261 -145 104 20 86 -31 70 13 -15 -230 -100 -88 306
2409C06m91K35R6k04K77l72J21p0k4J64N6j14J4m52K18q2J36K81k76K03q7NK14
$$ 306 -185 50 146 -58 219 -153 -32 -102 -126 38 94 -20 -6 -458 -240 -322 -186 95 -181 22 -65 -60 154
2432A54l84L58N4k71J75j54J10o6J02kj95qL59l27L65k70L9q2P0K70l45J40m7
$$ 154 -230 128 182 -89 86 -68 42 -24 78 76 -119 -127 232 -95 270 0 39 -43 27 297 -48 92 45
2455D5l29M30l26J89K57l05L24l41P1J34o3j16K0k3K18kj73j55J06M9j51L82l00
$$ 45 -284 146 -180 9 266 -39 285 -56 15 149 86 -30 -10 -33 185 183 10 -145 -39 10 -141 241 -59
2478e9J79k3j49Q5p0P9J71j34j24j11n2K48r0j3k0j03J32r1L56k30j3q8n3Q5J80
$$ -59 120 97 -52 33 -37 42 213 79 -45 -156 -208 40 -50 -63 -83 -186 -54 -145 211 -19 -32 -120 -173 -88 92
2503I2j43q6J01l84N66l67J10J9L8L1n9J78o7OJ23j53L1r9N2K35k15l5L17n79
$$ 92 -51 -137 -36 -420 146 -221 -111 -92 -54 -23 -82 96 29 35 158 5 36 -63 -11 224 9 -26 291 -288
2527b88L35J94j31J1J9L4k54K99n7j03q5j38K15K37k79R8r5m0K15o6l3Q9k33J20
$$ -288 47 241 110 121 140 174 -80 219 162 59 -26 -164 51 288 9 107 12 -28 187 121 88 177 -56 64
2551F4j21K71j97N6P7l89L1J29m7L01Q0k89J73Q3o6l47J34R3j64K28j9k82L14
$$ 64 -57 214 17 73 150 -239 -208 -79 -126 175 255 -34 139 222 156 -191 -57 36 -128 100 81 -201 113
2574A13l6O6m36Q7R5j6M39l66mJ33l40M67J0o34L47j95K22O2k8j22Q3p4j73J45
$$ 113 77 143 -293 -206 -111 -127 312 -54 -58 75 -265 202 212 -422 -75 -270 -48 14 -14 -136 -53 -127 -300 -155
2598a55L17k61O1Q5j36J64j96j67M89k10J21m1k74L04j8K12n06J6M83m33L25r0
$$ -155 162 -99 -38 47 -89 75 -121 -288 201 -9 112 71 -203 101 83 295 -211 -195 288 -145 180 90
2620I0m5J84j79orJ02K4j29J57j82k5J95j45k90K02O0K15j79k81M46n57M74j6
$$ 90 45 229 50 44 35 137 161 32 189 7 -18 177 32 -258 -56 4 219 40 -241 205 -352 122 106
2643A06j93P7J2J1m1r8K25k49J45R7l52M91m27J27J73k45N7j0J33l5O9n2j17k1
$$ 106 -87 -10 2 13 -28 -126 99 -150 -5 92 -260 231 -196 -69 104 -141 -84 -94 39 4 73 21 -96 -117
2667a17L4Q9J39l42K34j9j05J66k09J32l1j19K87k31J05K45k90j94K2K32j1J10
$$ -117 -83 6 145 -197 37 18 -87 79 -130 2 -29 -148 139 -92 13 258 -32 -226 -204 28 17 127
2689A27j16j40J06P3k77K92k4k84M52k69J83j75o8K57j41j37K33j9J1j00N1R1
$$ 127 11 -129 -23 50 -227 65 41 -243 209 -60 123 -52 -120 137 -4 -141 92 73 84 -16 35 126
2711A26k17K03L9n1m4o2J87jj22jn7L2q8j05L10j52J07j48j9J06r9M5J19j47R9
$$ 126 -91 112 151 100 56 -6 181 180 58 57 0 32 -56 -161 149 -3 104 -44 -63 43 -56 -11 108 -39 60
2736F0k72M2R5k4K15k31J59q2j81L64j85o1J46k53K93m3Rn2j24Jj41K65O7k30
$$ 60 -212 -170 -75 -99 116 -115 44 -38 -219 145 -40 -101 45 -208 85 42 51 -1 -125 -124 -265 0 67 -163
2760a63j08L44k86M33j54k53J04K9J6p4J29j0J11j77o2L2K20j74J71k83K33j39
$$ -163 -271 73 -213 220 66 -187 -83 -54 -38 -112 17 7 118 -59 -121 -89 131 -43 128 -155 78 -61
2782f1n2Q8NNK02k11K79l58L71q8j87o2J36j14M32l25j29P7J35L46o55R1J08O6
$$ -61 -113 -25 -20 -15 187 -24 255 -103 268 180 -7 -69 67 -47 385 60 -69 8 143 489 -166 -75 33 99
2806I9k5j6k0J9n6j80J51K06k63L0K09k38O8q1k20O04k48N4k03j02R2O6J44k0
$$ 99 74 58 38 57 1 -179 -28 178 -85 -55 154 -84 -16 -97 -317 287 39 93 -110 -212 -120 -54 90 70
2830G0l80L31j03j47L95q6l58K59Rp6n2P0J05k56J82L8J19k30J16J16p8J8J51
$$ 70 -310 21 -82 -229 166 80 -278 -19 -10 -86 -138 -68 37 -219 -37 1 120 -110 6 122 44 62 213
2853B13l32J60n2Kj20K3L21r2j66m8J4J55j36J6J15k13L74j34j22L17k20o8L0
$$ 213 -119 41 -11 -9 -129 -106 215 123 -43 -91 -77 78 -58 -42 73 -140 234 100 -22 295 75 7 37
2876C7k56J46j8K68k40L49k37M0mK06Mj28ll5k06J4L58l06J54m76L44J06o8R2
$$ 37 -219 -73 -91 177 -63 286 49 89 85 291 295 167 164 129 -77 -63 295 -11 143 -333 11 117 49 141
2900A41l10K56l9o4O8j42N1j81L50l61M15j28k72J66kl0J44J70k63k41K88j50
$$ 141 -169 87 48 -16 52 -90 -39 -220 130 -231 184 56 -216 -50 -52 -82 62 232 -31 -272 16 -134
2922a34o7K09K0K1k36P5l5N7K53j62L2P9k20L88l50j30J23J46j44Q1rQ1j5Q9l00
$$ -134 -201 8 28 49 -187 -112 -147 -90 163 1 33 112 -108 280 -70 -200 -77 69 -75 6 -3 78 63 152 -148
2947a48L80j15j34J11n4J06k78Q2J86J01k62m3R2p0K11rP4k11O9j44o0K85jj1
$$ -148 232 117 -17 94 40 146 -132 -50 136 237 -25 -68 24 -46 165 156 230 19 88 -56 -116 169 168 157
2971A57O4l65K05K29k05R2l78L28j29J09p7n8K27k93KJ02j11J85K8j14M8m1o9
$$ 157 221 -144 61 290 85 177 -201 127 -2 107 30 -28 199 -94 -92 10 -101 84 112 -2 46 5 -64
2994f4J16j07p8J68J80k31j96L42j04r9n2j16J53o8Q0J10p9k49K13L6p1M6O5M5
$$ -64 52 -55 -133 35 215 -16 -212 130 26 -73 -125 -241 -88 -156 -76 34 -45 -294 -81 -45 -116 -70 -5 40
3018D0k0P8k36L70k08j48R2N3k04K24j53J85m0l1M6m9J15k89K77p0JJ12o2j42
$$ 40 20 98 -138 232 24 -124 -32 21 -183 41 -112 73 33 2 48 -1 114 -175 102 32 33 145 83 -59
3042e9K59m59K39J20J7o0l3N4P5l28qL5J05J29n6OJ04l0k10J72q7J49Lj55j78
$$ -59 200 -259 -20 100 117 57 24 78 153 -175 -183 -148 -43 86 30 36 140 110 -100 72 -15 134 137 -18 -196
3067a96L67k34J80K4k02J48k9m6j48R7J47m9J41j4k49n5q4j5L33k92K83Pj71j33
$$ -196 171 -63 117 141 -61 87 58 12 -136 -39 108 59 200 186 -63 -118 -202 -217 116 -176 107 114 -57 -190
3091a90K0N4j67K09K70k20k5J7q9J81j7om2j37J30j42M06m6j63J60O2l31P0k27
$$ -190 -170 -116 -283 -74 196 -24 -49 -32 -121 60 43 37 -5 -142 -12 -154 252 206 43 203 265 -66 4 -223
3115b23L43K8Q1l83R8O8K87k79J43l51M59J6k31l3j99K78j15p2K07k02J17J33
$$ -223 120 148 229 -154 -56 12 299 20 163 -188 271 287 56 23 -176 102 -13 -85 122 -80 37 170
3137A70j80j16rL35k34%K36l31L39j22j26K45k70R4l56K34K50k50R9J39k20J69
$$ 170 -10 -126 -135 200 -34 -34 202 -129 210 88 -38 207 -63 31 -325 -91 159 -91 8 147 -73 96
3159I6k19K22k56j49K48qJ4J43Kj23J45j71p8RJ39J74m04J83j03K46p7j13Q3l5
$$ 96 -123 99 -157 -306 -58 -66 -52 91 93 -30 115 -56 -134 -125 14 188 -216 -33 -136 110 33 -80 3 -32
3183c2j10K11J64m14K17q8K67k33J71k54n3K88k33O8N3r3J50j50J8K5j08K08K4
$$ -32 -142 69 233 -181 36 -52 215 -18 153 -101 -154 134 -99 -31 22 -71 79 -71 -53 -28 -136 72 96
3206I6m2J00k16J57L7j43M13l98J29o1r3L25k64R6r1Q3l6Q7k52lr0J91J46j12
$$ 96 54 154 -62 95 132 -11 402 4 133 72 -21 304 40 136 45 128 92 179 -73 -76 -166 25 171 59
3230E9j03N2R2M4k86N4K9J92k08j74L30j73J60j43K24K1k11J60q3p3J53l48P5
$$ 59 -44 8 100 144 -142 -88 -59 133 -75 -249 81 -92 68 -75 149 170 -41 119 36 -37 116 -232 -157
3253a57J81J14q1k00J21j49J0J32J82k81n9R1LRJ09j25Q6J10m26M93j70K1r9j1
$$ -157 24 138 57 -143 -22 -171 -161 -29 153 -128 -187 -96 -93 -84 25 -100 -14 96 -330 163 -7 14 -85 -96
3277i6M4J17l6N9j56L0j20r3K48J21k9N7j49Q6n9r3J81J48j48k6j36K97k67L04
$$ -96 -52 65 29 88 -68 -38 -158 -251 -3 118 89 146 -3 83 24 -69 112 260 112 86 -50 247 -20 284
3301B84q3j99R8j2j1K2J5j70k3J08J61k81k2J01lL2K9J02j24j87J28k05k9K55
$$ 284 201 2 100 88 77 99 114 -56 -79 29 190 -91 -113 -12 -15 17 46 148 24 -163 -35 -240 -269 -14
3325a4j89J49J83k40J74q1p4n2M4L5k51J64Q4NJ18j04K14j71J33R1l44N8J9n1
$$ -14 -203 -54 129 -111 63 -18 -92 -144 -100 -65 -316 -152 -68 -63 55 -49 165 -6 127 218 -126 -68 -49 -100
3349a00N9k1j32PM7K62r5j22J58R0k96J32J20k3q6p6J58j07q3K11q6j88M34k76
$$ -100 -41 -62 -194 -187 -140 122 27 -95 63 153 -143 -11 109 86 0 -76 82 -25 -108 103 17 -171 263 -13
3373a3J46k67K97j1j85J46j25K3n6J55j60K32j66l8L4j35O4J01oP9l19L54k05
$$ -13 133 -134 163 152 -33 113 -12 11 -45 110 -50 182 16 -22 12 -123 -59 42 36 115 -204 150 -55
3396e5J18J8j30L3J02p9k2J91j06j44k02L47j96K39K1M7l17J13o1M3n7J12J9j81
$$ -55 63 81 -49 -16 86 7 -15 176 70 -74 -276 71 -125 114 135 182 -135 -22 -83 -40 -97 15 34 -147
3420a47Q2j88K98k09L18k48Q2pk6%k08K05J69r3jj35j5J76q6O9J06k47J86L9k84
$$ -147 -65 -253 45 -164 154 -94 -12 -19 -45 -45 -253 -48 121 28 27 -108 -123 53 -33 36 142 -105 81 120 -164
3445a64K24j83O3q8J70K16j84ok5L9r2R4J05j64l4J75k02K85N3l07l3J78j3P9
$$ -164 60 -123 -60 -148 22 238 54 48 23 62 -30 64 169 5 -29 146 -56 229 282 -25 -58 120 107 186
3469A86P7k56q0K18n0q6Q6%k49K01N1mk27oK50j99J1J95k53K82l28J71N5N3K8
$$ 186 263 7 -73 145 95 9 95 95 -154 47 98 94 -133 -139 111 -88 -77 118 -135 147 -181 -10 45 98 126
3494A26r8nK50l23j3QN6N5j67J77j62M3O6j29K14J48l56j4J11J74o8p2j27K3l6
$$ 126 28 23 273 -50 -63 -55 1 56 -111 66 -96 -53 13 -116 98 246 -110 -124 -13 161 93 21 -106 -83 -119
3519a19K50l66L49m76L44J60o9j02k08M00k92L2J38j12N4J46k24L07j54m9j5q4
$$ -119 131 -235 114 -362 -18 142 73 -29 -237 163 -129 -97 41 -71 -17 129 -95 212 58 9 -6 -90
3541i0K00l4l7J2N9K05l61K54k05q2N5o3J80r5J3r9K21p0J73O7k34j50J28M9j33
$$ -90 110 76 39 51 110 315 -46 208 3 -79 -24 -87 93 -2 11 -88 133 63 236 303 69 -81 47 96 -37
3566c7L82k35j07m6m4K8J9o5J31k6m1J36k93M35k78M5J11j75j09N1J74j84J23
$$ -37 345 110 3 -43 -87 -59 -40 -105 26 0 -41 95 -198 237 -41 4 115 -60 -169 -118 56 -128 -5
3589eJ10k26k3K25k13K12R7k89J88l19L3K95K4Qq2Q2j08K2j78M40m71J45k2j58
$$ -5 105 -121 -144 81 -132 80 177 -112 76 -243 -210 85 109 117 35 117 9 31 -147 293 -178 -33 -55 -213
3613b13K44nj34J72K7L2j27q9P9K03j18J47k92N9j9J05J9j83K62j56J99j73j26
$$ -213 31 26 -108 64 91 123 -4 -93 -14 189 71 218 -74 -15 -34 71 90 -93 169 13 212 39 -87
3636h7j17J79J32j36j29J01p9J26j57L11o6r2L31l24O4Rj59J37j63RR0J93k0k04
$$ -87 -204 -25 107 -29 -158 -57 -136 -10 -167 144 78 -14 317 -7 57 66 -93 44 -119 -110 -20 173 153 -51
3660e1j57K49j11L1N3Q7j78l9K91j43p8J2J29L8m82K96J29l55J79P3%m3p3J55
$$ -51 -208 41 -70 -39 14 101 -77 -116 175 32 -46 -34 95 133 -349 -53 76 -279 -100 -27 -27 -70 -143 12
3684A2O5p2q9r8K03j63Q9K64j68o0m0J6K54k85Q1o9m2J72R3j55o4r0J60q3J80
$$ 12 77 5 -84 -182 21 -142 -53 211 43 -17 -57 -41 213 -72 9 -60 -102 70 163 8 -56 -146 14 -69 111
3709A11j07n6K39j90J30Q9l38P2P7K4o2m3K13k35O0L31k99K26j90j34M1O0P9j90
$$ 111 4 -52 187 -3 127 216 -122 -50 27 51 -11 -54 159 -76 -16 315 16 242 52 -82 -41 19 98 -92
3733i2L68k52p9J01p7O6J42j37j45J82j78J69q3m6L48n37P1L4K52l5j52n0m1K54
$$ -92 276 24 -55 46 -31 35 177 40 -105 77 -101 68 -15 -61 287 -250 -179 -145 107 72 -80 -130 -171 83
3757H3j0j29O9j08J68k10N7P2P1j34J01j44j01J68j68L88l62O9k2Q2P5j82K21
$$ 83 73 -56 13 -95 73 -137 -80 -8 63 -71 30 -114 -215 -47 -215 173 -189 -120 -142 -60 15 -167 54
3780E4r0l0p7J96j98L82k14J33j6q7O2j08j01J30j0Q2j82R1J96k59K09k74K86
$$ 54 -36 -66 -143 53 -145 237 23 156 140 53 115 7 -94 36 26 108 -74 17 213 -46 163 -111 175
3803A75L9j64nl9k4j33M5K12J3K8k82m5K19j45P8J39l89K27O9q6J88k71M01m54
$$ 175 214 50 45 6 -18 -151 -106 106 119 147 -135 -180 39 -106 -28 111 -278 -51 18 -68 120 -151 250 -204
3827b04P3K24j96Q3J61j01m5j82K74q8q5J57j50P4R2p4K08l13j13J20K17l75L77
$$ -204 -131 93 -103 -20 141 40 -5 -187 87 -1 -86 71 -79 -5 87 13 221 -92 -205 -85 132 -243 134
3850A34J60m03N5K77l45J78j60N2J92k02j05J92j93K51J90l01J54n16L71N4j14
$$ 134 294 -109 -54 223 -122 56 -104 -52 140 -62 -167 25 -168 83 273 -28 126 -390 -19 35 -79
3871g9K53k40J61m1j67K09j65K20Rj70J01l6K5K0k5J8j67k3P4J20J28l36R8J32
$$ -79 174 -66 95 54 -113 96 -69 151 160 -10 91 55 80 100 75 93 -74 -97 -23 97 225 -111 -13 119
3895A19j54lL63j00j56j79j0R4L9O8j33j32J16OJ5J4J4J8Nj05O0Pp7PO3J80J06
$$ 119 -35 -38 325 225 69 -110 -120 -26 13 81 -52 -184 -68 -62 -47 -33 -19 -1 4 -101 -41 -34 -111 -104 -41 139 245
3922B45k14l5J77m9k20K87q8m7j72K01q2J71k59j56M10k24N3J02l3q7J17j78R1
$$ 245 31 -4 173 124 -96 191 103 56 -116 85 3 174 -85 -241 169 -55 -2 100 67 -20 97 -81 10
3945A0L8j55M5K8K01k81J69Kk77Q7J72j44Q4Q0j66n7j7R8J64q4q7J12J07j94J49
$$ 10 48 -107 -62 -34 167 -114 55 57 -220 -133 39 -105 -21 59 -107 -164 -181 -83 81 -3 -90 22 129 -65 84
3970H4j16Q8l3j33J75j15Q5k0N0J05J8k21lop1J19j72J6J47j61K71q8k11M38q
$$ 84 -32 56 23 -110 65 -50 35 15 65 170 188 -33 -36 -42 -113 6 -166 -150 -3 -164 107 19 -192 246 238
3995B38l57k3L2j05K44K6j92J49L6k38K01j58J10J77l30L13k03j9J72q7j07K17
$$ 238 -119 -142 -110 -215 29 55 -137 12 48 -190 11 -147 -37 140 -190 123 -80 -99 73 -14 -121 96
4017I6J27m02K09r5j46J01N8N7j38Q1K1M5l0k64L77k97L86k1m38N43k87p8J8J04
$$ 96 223 -179 30 -65 -211 -110 -52 5 -133 -52 -31 14 -16 -280 97 -200 186 165 -273 270 -17 -95 -77 27
4041B7o6qp1k2P3R7q2J74Rq8J21l08J81l3j40J30K06k10K7J54j82j21K58j42l6
$$ 27 -39 -47 -118 -140 -67 30 -52 122 131 43 164 -144 37 4 -136 -6 200 -10 17 171 -11 -132 126 -16 -52
4066e2P5j11o8J10L1k8J55n4L2j94L3J72O4j03J53m08p9L23l13K24QJ42jq6J58
$$ -52 23 -88 -156 -46 -15 -43 112 58 90 -104 -71 101 165 62 215 -193 -272 51 -262 -38 -30 112 111 25 183
4091A83l40J64j09J00l38L20R1m3j19Q8J48k40q3J42k2K50j64J11j91J40j3j61
$$ 183 -157 7 -102 -2 -340 -20 71 28 -91 -3 145 -95 -178 -36 -58 192 28 139 -52 88 75 -86
4113h6n1Q3N9J87k26K24k74J62l18J44J04L2l0o0J34j03K02j11j84R2J26k63P6
$$ -86 -137 -54 5 192 -34 190 -84 78 -240 -96 8 40 10 -50 84 -19 183 72 -112 -20 106 -157 -81
4136h1k6J78j01k8J01l19N24j71K7j1j41P7P5l06J89R1j7N4j6L8j69J62J3j56
$$ -81 -107 71 -30 -58 43 -276 248 77 104 93 -48 29 104 -202 -13 78 61 115 99 137 -32 130 143 -13
4160a3J2K5j84J75l5K1j66J08N4K7k1op5J10k52K55j68J30J3n1J84j60q8L79j89
$$ -13 -1 24 -160 15 -20 1 -165 -57 -3 24 3 -3 -78 32 -220 35 -133 -3 10 -41 143 -17 -105 274 85
4185H5L3O3k69M0J39L2k0K0j14K3pj30J64p4j41L09m67K44J64k06J90k4l66K27
$$ 85 118 181 -88 -48 91 123 103 123 9 32 25 -105 59 -15 -156 153 -314 -70 94 -112 78 54 -312 -85
4209h5J80j40J71k98L92k31J42j82L13j31pk62L5J69m6N0k15J21R6o8%N0O1Q0
$$ -85 95 -45 126 -172 220 -11 131 -51 262 131 124 -138 -103 66 20 70 -145 -24 72 4 4 54 115 195
4233A95k48j18r4K13j1J07J2n2J18j48J12j86P5M2J8k49L81j80J4Oj40J00lj00
$$ 195 -53 -171 -265 -52 -63 44 56 4 122 -26 86 -100 -25 17 35 -214 167 -13 1 7 -133 -33 -36 -136
4257a36P7K7o5P7j25K93j95L4m9j08K41j68J88j12j53L66k11J79j55K20l53p2
$$ -136 -59 -32 -97 -20 -145 148 -47 -13 -62 -170 71 -97 91 -21 -174 192 -19 160 5 225 -128 -200
4279b00K19M3op6r5J81K7j13n9J93j56O3j31Q3o1k35N00l14K44l36J43J54j34
$$ -200 19 62 56 -20 -115 66 93 -20 -79 114 -42 21 -110 -27 -88 -323 177 -137 107 -229 -86 68 -66
4302f6Q7Ql1j6j45L15kk70K20J90k27j24Q6M4O1k06k9J97l8o3J85k69Q0p6J10
$$ -66 21 29 -2 -18 -163 152 150 -120 100 290 63 -61 25 69 130 -76 -105 92 54 -9 176 -93 -13 -89 21
4327B1j10J69J61l73L16n9j54MK01k31J99k8k55M26l11j75L02j1K7j84mL43k44
$$ 21 -89 80 241 -132 184 125 -29 -25 176 -55 144 116 -139 287 -24 -199 103 92 119 -65 -69 274 30
4350C0n9oj45LJ98O1j79j9P8q2J47J40j66J00J21l69J85k90K92j7j22J08j3J88
$$ 30 -29 -35 -180 -177 21 82 -97 -116 -38 -120 27 167 1 101 222 -147 38 -252 40 23 -99 9 -4 184
4374A84k94K25j89q7L2J24J71n7j04l8K03j6l7j10j62J59K17k04K30j94j18M7
$$ 184 -110 115 -74 -161 -129 -5 166 109 5 -33 170 154 117 7 -155 4 221 17 247 53 -65 -18
4396a8j46k6J64K07j57j85o1K3M17j90N4O8j02L2n8j03QO6K03l55R0n5L68%l16
$$ -18 -164 -190 -26 181 24 -161 -222 -199 218 28 82 150 48 80 22 -81 -73 -7 196 -159 -69 -124 244 244 -72
4421g2J96j05M6r4m2p9J71j48K8m5L82j68j72k1K32l8j83J40k44R9L07j21N5p0
$$ -72 124 19 65 -29 -71 -150 21 -127 -99 -144 238 70 -102 -123 109 71 -112 28 -216 -117 190 69 124 54
4445E4j02R8K9k09R7K21k57R3j50J98r5J10k6k2o3L9R2k9J68k96L0J5Q8k10P4
$$ 54 -48 50 79 -130 -33 188 -69 24 -126 72 -23 87 61 39 -24 15 107 78 246 -50 -20 -5 83 -127 -53
4470e3k3J66o9M0k16L51j45J22j70M6k11L0L78j68j24J81k32J04K1O7R0j88J1
$$ -53 -76 90 21 61 -155 196 51 173 3 49 -162 -132 246 78 -46 135 -97 7 28 95 185 -3 8
4493HJ70m67J6L58j11K38k68R5r8L4J09j45J19J57j11j17nP6K12l98K13j27K00
$$ 8 178 -289 -273 85 -26 212 -56 39 -59 -25 84 -61 58 215 104 -13 -18 58 270 -128 85 -42 158
4516A58M3k85J99p4L9j64M9J23l17R6J10NO9j7M0m5K1j92P8jJ6r9K36j60N5m2
$$ 158 201 -84 115 41 80 -84 -35 88 -229 -133 -23 -18 51 34 74 29 50 -142 -64 -65 -49 -148 88 -72 -17 -59
4542e9J4J12QN2j98J25j25J2R9J5L3k78L36l2k9r7R8o6J50o2o8m2k42J29K66k35
$$ -59 -45 67 75 127 -71 54 -71 -59 40 55 88 -190 146 114 85 -12 86 20 170 108 40 -2 -244 -115 151 -84
4568h4j35J57L7J04j25L0R8j57Q8n3J32r2R0J39j88j68J81M5k51J60K5J03l36
$$ -84 -219 -62 -25 79 -46 -16 82 -75 13 -40 92 0 90 229 41 -127 54 99 -152 8 33 136 -200
4591b00J89P3l29K38k7nJ92o9k3k18J73J87j39p7J02k5r1l6J07N0P6r2j63M4K86
$$ -200 -11 62 -267 -29 -56 -61 131 62 39 -179 -6 181 42 -35 67 42 -49 -85 22 72 148 56 -107 -63 223
4616B23k47j0M5q0j17J09lL3M6k10J04kkr0J01j07K89k6K5j43J80kr1m9M0K8M8
$$ 223 -24 -34 11 -69 -186 -77 -80 -47 -1 -211 -107 -109 -111 -201 -100 -207 82 56 81 -62 118 116 25 -24 16 44 92
4643I2k14jL68k71L00j72j56P1J68q6k38P9J0j0q9K05Qk5J30j47j1J04J6j58p4
$$ 92 -122 -123 245 -26 274 102 -54 17 185 99 -139 -60 -50 -60 -149 56 64 39 169 22 11 115 131 -27 -101
4668a01J20K28j69k06J37j28J17j16j7K48n9p9j68L61k21K56k77Mr4J88r1K07
$$ -101 19 247 78 -128 9 -119 -2 -118 -135 113 54 -25 -193 168 -53 203 -74 -70 -164 24 -67 140
4690A40j43J20l4r9K4J36j76P2J22l04K58j86J74k29Q5K2n3M3m5M8k6Q7R3l09
$$ 140 -3 117 83 -16 8 144 -32 40 162 -142 116 -70 104 -125 -40 -18 -71 -28 -73 -25 -51 36 129 -180
4714a80K59k%MOJ6J7j88n1K08L9l2N0Q3j10k21J83Q0j19M3j71J29q4P0Kpn3k0
$$ -180 79 77 77 81 87 103 120 -68 -119 89 128 96 146 229 119 -102 81 161 42 85 -86 43 -41 29 31 24 -29 -49
4742d9J17k09q3K03L9j14J15j11p0J52j36J10pq5J20j01R9J00j75J30k71L30j11
$$ -49 68 -141 -224 -21 18 -96 19 -92 -162 -10 -146 -36 -43 -128 -8 -109 -10 90 -85 45 -226 104 -7
4765gK4J20N6j41j04J68oj93L3K28l15J29N1j93K12L6j73J27Jm7j23J99j21J8
$$ -7 17 137 193 52 -52 116 110 -83 -50 178 -137 -8 43 -150 62 98 -75 52 53 6 -117 82 -39 -21
4789b1K20k59K27j94j20K64Jj60J30p2K3J9j54K16j18J23q2L1o2M5l48K11K85
$$ -21 199 -60 167 -27 -147 117 118 -42 88 16 39 58 -96 120 2 125 43 74 12 57 -291 -80 205
4812B05k05J7n3K3LMk14J65k5m5o3l3M8L24J1j86j21J40j9N2J45j20j3N2j05K64
$$ 205 0 17 -36 -13 -10 -6 -220 -55 -80 -125 -188 -221 -173 151 162 -24 -145 -5 -24 28 173 53 40 92 -13 251
4838B51l65j62J59O3K3m8j46L71j49K5j58J00k6j32N0J48q2J01n9K7Q5j11n1J46
$$ 251 -114 -276 -117 -54 -31 -79 -225 146 -3 22 -136 -36 -62 -194 -144 4 -78 23 -36 -9 76 -35 -86 60
4862F0M9j1j30J24j99J06Q5k10k8L38l60J56J38j83r4J41L73l73J19j19p2jK30
$$ 60 109 98 -32 92 -107 -1 84 -126 -154 184 -176 -20 118 -65 -159 -18 355 -18 101 -18 -90 -91 139
4885A39l49N17k20k65J03J89l35K32J45l69K50J82k59r0J09J00L1j99J12K4J75
$$ 139 -210 307 87 -178 -75 114 -221 11 156 -213 37 219 -40 -130 -21 79 110 -89 23 47 222
4906B22k22q2m0K7mL09l17n4K65J29k91Q6k04N1mQ9r9J67q0N0l5J8j10P4k5J4
$$ 222 0 -82 -122 -95 -99 210 -107 -161 104 233 -58 28 -176 -125 -129 -40 -139 28 -52 -2 -37 -19 -129 -55 -80 -66
4932f6K8J69j28p2J69k27J91j04J48j64r1K11j94j26K56Q7l23K57O9l5j12J16
$$ -66 -38 131 3 -69 100 -127 64 -40 108 -56 -147 64 -130 -256 0 87 -236 21 90 55 -57 59
4954E9o5j44J34J71L7j35j0j1k1m7J47R3j62j86qP3J90n5K6qk5p5k43J53P2K5
$$ 59 -6 -150 -16 155 192 57 47 36 15 -32 115 208 46 -140 -148 -75 115 60 86 78 53 -22 -265 -112 -40 -15
4980a5J7o9K68j20k52J00NQ3k38K07n7j8L0K99l25J09J07j17l2N7P5k22J02J33
$$ -15 2 -67 201 81 -171 -71 -66 17 -221 -14 -71 -89 -59 240 -85 24 131 14 -18 39 114 -108 -6 127
5004A27jk29K18J9j00q4J43L2l08L14j38r7n3Q9J52m5k3P3k49K29J21j15O7j59
$$ 127 126 -103 115 134 34 -50 93 125 -183 131 -7 -104 -157 -68 84 39 16 89 -160 69 190 75 142 -17
5028a7O0j96J63K3k71o4K61KJ27o3m9j4m1l8K09k51k4K65J6k34K40K33l32p3m
$$ -17 43 -153 10 33 -238 -302 -41 -39 88 25 -24 -38 -79 -117 92 -159 -183 82 98 -136 104 337 5 -68 -72
5053g2K35N4l6j18j65K32j94L2j06J62j13J32r7JO3M3o8O9j13nK22k66q6K8O5
$$ -72 163 217 181 63 -102 130 -64 -32 -138 24 -89 43 -54 -53 10 53 -15 54 -59 -64 158 -108 -194 -166 -101
5078a01JQ4J85k9j78o9R2Pj07k8K7K06r1q9R9r3L15k21K49k10j44J14O8j22j73
$$ -101 -100 -16 169 140 -38 -107 -15 -8 -115 -143 -116 90 -1 -90 9 -84 231 10 259 49 -95 19 87 -35 -208
5103b08M1L20j08j23j04L86l6k10J64o0j53o9J46J05k49J97j70K98m3k49L59l65
$$ -208 -167 153 45 -78 -182 204 168 -42 122 62 -91 -160 -14 91 -158 39 -131 167 124 -125 234 -131
5125a31J42J14k96K31j9m7j5J43j5j93K06j74l1L6P1j39L90l01j5PK3lm8k7J94
$$ -131 11 125 -171 60 41 -6 -21 122 107 -86 120 -54 -85 -49 22 -117 273 -28 -43 -36 -13 -16 -64 -91 103
5150A03j15n1rJ93m5k08o8K80Q3l51K07O2j1k30L01p4K00j27k13r0K19k24J6K05
$$ 103 -12 -63 -72 121 76 -132 -200 80 163 -188 19 81 70 -160 141 67 267 140 -73 -163 56 -168 -152 53
5174E3r6%q7K47j62L6o2N2J4j4k36J63J62p7R0j68N2M6r3K16j08R4m0O7l10K20
$$ 53 -43 -43 -130 117 -45 -9 -71 -19 -5 -19 -255 -92 70 -7 83 -85 -33 13 -80 136 28 122 82 149 -161 59
5200E9P3l0j8j44m8MJ31R8k55J24J68o3k23P4K4l8K20kk53M3J99r7J50l01l2K51
$$ 59 132 102 84 -60 -108 -104 27 125 -130 -6 162 99 -124 -50 -26 -64 156 154 -99 -56 143 46 196 -105 -137 114
5226A14j47M7r4K76J5Qj25k95J24p7K16k37K33j67L20k43J74j83R4k07K06j32
$$ 114 -33 14 -80 196 211 219 94 -201 -77 -154 62 -175 58 -109 211 -32 142 -41 53 -154 52 -80
5248h0J46j34P1jJ10k10n5O0L1nK58l47R7J99j89K53j96n8P0k13P4J89j22J14
$$ -80 66 -68 3 2 112 -98 -153 -93 -62 -67 191 -156 -59 140 -49 204 8 -50 20 -193 -119 70 -52 62
5272F2k93J96k3J08O5k16J99k86J3L7Q9R1j41J87j09J80j07O1l09L21j35J1p7
$$ 62 -231 -35 -58 50 115 -101 98 -188 -175 -138 -49 42 -99 88 -21 159 52 113 -196 125 -10 1 -76
5295g6K59r3k73MN8K38k19K7K06l29K2K15O8J43l53K7j0K7J76k18p6P6J69r3J10
$$ -76 183 90 -183 -179 -121 117 -102 -75 131 -198 -176 39 107 250 -103 -76 -86 -59 117 -101 -177 -101 68 -25 85
5320H5r5J22J8j92O3J56m2J12l96J84q5K07k26k0J3j4J84OL3j21L5J10k05K8j52
$$ 85 -10 112 130 -62 1 157 115 227 -169 15 -70 137 -89 -109 -96 -110 74 80 113 -8 27 137 -68 -40 -192
5345a92J00Q9M3J01k93M7r9J40J20j37J2r1J75m3L7J13j28j2K8J64L7l12j51K15
$$ -192 -92 -3 40 141 -152 -105 -204 -64 56 -81 -69 -160 15 -28 9 122 -6 -18 10 174 211 -101 -252 -37
5369c7O3k7j0k2P7JK67k35J79n04L19j00r4K54r1k26K86k04J62n8J43P2l22J44
$$ -37 26 -1 -11 -33 44 45 312 77 256 -248 71 -29 -123 131 40 -186 100 -104 58 0 143 215 -107 37
5393C7k11k8K00K67m16J48p1q5lJ31O3K4O0k5k55K04J2j04N8j15J36j4k44J71
$$ 37 -174 -202 -2 265 -151 -3 -74 -159 -162 -31 32 56 116 91 -164 40 52 -52 6 -109 27 13 -231 -60
5417f0K62j06n2j43K22K6j19j55KJ1J59Q2m49K36M4J53k1k04n9P8k4K10k72K53
$$ -60 202 96 44 -99 123 149 30 -125 -123 -112 47 129 -320 -84 -40 113 92 -112 -171 -93 -117 93 -179 74
5441G4j3m0R5l66J72J27k14J39J36o1k40j8J66J88j30m6j14M67k85k8n57K91L95
$$ 74 61 21 116 -250 -78 49 -165 -26 110 49 -191 -209 -43 145 15 -31 -145 322 37 9 -548 -257 138
5464A38m44L33j16L56N34o44k3l3j20j72r2K74K92k69j90K07O2r5j12K42O7j67
$$ 138 -306 27 -89 267 801 157 134 101 -19 -191 -283 -9 283 14 -176 31 93 -2 -114 128 195 28
5486B8k4l8j42J50k29J63j37L09L6o5k2k11K22j60R8l1L69l17L9qj89L22j50j59
$$ 28 4 -34 -176 -26 -255 -92 -229 80 116 51 29 -182 40 -120 -22 -53 316 -1 38 30 -159 163 13 -146
5510a46J36Lo3n1L42k25J28k34j09L11j5k25Q3J16j04k11K46M5M2l73M30p6K21
$$ -146 -10 -7 -70 -121 221 -4 124 -110 -219 92 77 -148 -65 51 -53 -264 -18 27 69 -304 126 50 271
5533B71k58PRj22K08k02J80j35p2J24J31j0J27n15K90P5J8k02n0J90k64K73k2
$$ 271 13 20 29 -93 115 -87 93 -42 -114 10 141 131 258 -257 33 108 126 -76 -126 64 -200 73 51
5556E1n9K64l81K82q8M6o9q3L7l0Q2l1o5Q1n4j95K6M43l42K13k14J48Nk09J52
$$ 51 -8 256 -125 157 69 115 46 -37 0 -30 52 21 -44 37 -17 -212 -186 257 -85 128 -86 62 67 -142 10
5581A0j57M5J12LJ04o5j13O4n0P3J2j36K07L8k13p4j01K06Q8R8k61L3J75P8k74
$$ 10 -147 -102 10 13 117 52 -61 3 -47 26 38 -98 109 147 -66 -140 -241 -35 53 151 -110 -77 98 176 -98
5606i8M7j62J22R8r6J00k2P1j95mQL27Ok67K3Oj08n0K42q3p5L7j8J85p2J15j65
$$ -98 -51 -213 -91 7 -89 11 -11 60 -135 -139 -131 196 202 -65 -42 -36 -144 -194 48 -35 -110 -73 -91 94 22 137 -28
5633b8K02l61r7J38K77n6q7j43K43jJ24m05J26L7j77K64k06L39l00J57j70L3K48
$$ -28 174 -187 -284 -146 131 75 -12 -155 88 87 211 -194 -68 -31 -208 56 -150 189 -111 46 -124 -91 157
5656A57q7P7j06K25m11J98k1M5K4k23K08L3k3j54L6J03j78Q7M2j6N5j3n4r7J30
$$ 157 70 147 41 266 -145 53 32 77 101 -122 86 119 96 -58 -22 81 -97 -10 32 16 71 58 4 -93 37
5681C7J2l0k0pJ46j49P7p6k2j15L2mJ0L6J2O8j8R7j78J30j17J88j61n9Q5N7J01
$$ 37 49 19 -1 -8 138 -11 66 -10 -32 -147 -115 -119 -109 -73 -61 7 -11 86 -92 38 -79 109 -52 -111 -26 31 132
5708A32j71J25m7k45L07l19L48r9J23m3k84M17j96q5oM6j32L00j10L2M6k52M0
$$ 132 -39 86 39 -206 101 -218 130 31 154 111 -173 244 48 -37 -43 3 -129 171 61 93 139 -113 -73
5731g3l5J14o6n9K37j49kj60K49l74M49l1r9J26L09p17M05J1j06j%K0lJ25j45
$$ -73 -108 6 -60 -119 118 -31 -33 -193 56 -318 131 100 1 127 436 -281 124 135 29 28 28 48 45 170 25
5756B5l04N06j85J97k29K56k03j31R4J05o9j15N4J29l6J17k8j55k07J91p9J79
$$ 25 -279 227 42 239 10 266 63 -68 26 131 62 -53 1 130 94 211 183 28 -179 12 -67 112
5778A12j60M8k2J38j23J12j33j98L41k01J36O6l1j23K52l99J47K17j95j18R1J32
$$ 112 -48 0 -22 116 -7 105 -28 -226 115 -86 50 116 85 -38 214 -185 -38 179 -16 -134 -43 89
5800H9k3j6q4J01pO3m9m9P4m0N8k35K97k37j0N8MnN6j62J02J10n5J39k4n9n6O8
$$ 89 66 50 -34 67 60 123 74 25 99 59 117 -118 179 -58 -68 -10 -6 -11 45 -117 -15 95 40 179 155 96 40 108
5828A08j43k26K80Pp2J2j09K35J7m9j03j7j2J6K10k03J34M5j35P9o9o5N3J71k06
$$ 108 -35 -261 19 26 -46 -34 -143 92 109 60 -43 -60 -72 -56 154 -49 85 130 -5 74 5 -60 -7 164 -42
5853d2p5R8q7J90k71K17j25J20K8j48K09k37Q6J65j00J27j56o9K72r4j63K45j75
$$ -42 -117 -19 -106 84 -187 30 -95 25 53 -95 114 -123 -37 128 28 155 -1 -70 202 108 -55 190 15
5876A5j93j7L00j02j27LK88j37k4n0%o3K37M3k91q8J92K07j34J02j35J4J7j23
$$ 15 -178 -195 105 3 -124 -121 167 30 6 -44 -44 -107 130 173 -118 -206 -14 193 59 161 26 40 57 -66
5900f6L73l84K7K02q6N7j56k3j20K39J24l81K12J08k30K1R6o2J25oJ33j36K8p3
$$ -66 307 -77 -50 152 66 123 -33 -56 -176 63 187 -194 18 126 -104 -83 13 -49 76 70 203 67 95 22
5924B2j39LL98l23L5n8J53o9j35K0NK11l38j0K04J09m3m0L6k15J36R8k01L80k53
$$ 22 -117 -114 284 -39 -4 -62 91 22 -113 -93 -88 123 -215 -225 -21 88 45 5 41 -174 -38 60 -141 239 -14
5949a4P6Pj63J03j40J23q3n2N9O9K1n8O1J26l4l26P7L10k9k26J7J71j23P2r1p8
$$ -14 62 69 -94 9 -131 -8 -91 -143 -84 -15 6 -52 9 135 101 -225 -148 162 133 -93 -76 95 -28 44 -47 -125
5975a25PK1J61%J1L7j55P7j59L8R0r0j40K62q9k8J97k62K36O2j53K47j61Q5k2
$$ -125 -118 -97 64 64 75 112 -43 34 -125 -87 3 -87 -227 35 -54 -82 115 -147 89 151 -2 245 84 169 147
6000A47j53J01j91J84k6o0nj9P2L7L3J09k74k23J23K25p1j37o4J55n7K09j13m0
$$ 147 -6 95 -96 88 62 2 -3 -22 50 87 120 229 -45 -268 -145 80 9 -128 -192 -37 -94 115 2 -38
6024c8Jn5o0j41J42J38J9j35l4J86J08j44j1k5N9O4j62J44j14p8J55q4K02p1j22
$$ -38 -37 -92 -152 -293 -151 -13 6 -129 -163 23 131 -13 -24 -49 10 74 -88 56 -58 -136 19 -65 137 66 -56
6049e6R7L4j44Q1j38O2j2L6J33k70J79o8j24K79j83J41ok11J28J70j78K57k79
$$ -56 41 75 -69 12 -126 -64 -76 -40 93 -177 2 -66 -190 89 -94 47 41 -170 -42 128 -50 207 -72
6072g2L8p9J33M8j49P8k0M9r1K77k88j1J71N3Q9k1k85J54rj1j63J27r4J94k06
$$ -72 -34 -113 20 68 -81 -3 -23 26 -65 212 -76 -87 84 137 226 205 -80 74 65 54 -109 18 -76 118 -88
6097h8J6M2j86L02j23m3P5J90M5j18k97L53j48J94m58L38J69l68j48J97J90j39
$$ -88 -72 -30 -216 86 -37 -80 -5 185 230 112 -185 168 20 214 -244 94 263 -105 -253 -56 134 -5
6119ej7j3J4j47J61M2K5j60j34L15j75p3J21J12Kn4n7K6J2n2P1j43J05K03k92
$$ -5 -22 -35 -21 -168 -7 35 60 -100 -234 81 -94 -167 -46 66 68 14 -43 -17 -5 -57 14 -129 -24 179 -113
6144a13L52k95J61k8J3j82K48l55M31k64p6N4j42K5J55J89k89K21l9J31k67Q9
$$ -113 239 -56 105 77 90 -92 156 -199 232 -32 -108 -54 -196 -171 -16 173 -116 105 66 197 -70 19
6166A9J88j48K3m42L84K21k38n6J57k06K46R2k03J2j24k0P2R2O2j68j22J99j34
$$ 19 207 59 82 -360 24 245 7 -49 108 -98 148 240 37 49 -75 -95 -23 69 131 -37 -159 40 -94
6189i4O0K50l39Q6k08J56Q9j47Q9j11K9Q8Rj68L48M4j93pN4k6k8n5o3R9r4K01
$$ -94 -34 216 -123 -37 -245 -89 0 -147 -58 -169 -140 -52 -43 -211 137 181 -12 -19 35 9 -19 -74 -137 -38 -132 69
6215F9k33R9J39l08L16j42L1k9l7K03R8k44J54j97N9R9m7j35J07J5k04K65N6j04
$$ 69 -164 -65 74 -234 82 -60 -29 -58 -95 108 206 -38 116 -81 -22 77 30 -105 2 17 -187 78 134 30
6239C0R0j0J1J25l01p5M1L12l40N6l22M03j42J86j50J07M2l20K66J5r0j15M4R6
$$ 30 120 110 121 246 -55 -130 -89 223 -117 -61 -383 20 -122 64 -86 21 63 -257 9 24 -66 -181 -137 -41
6263d1n0o2J00J8J3l3P8j04l6K01j37J56L5k47J06J21j4l86K88j15k30M37n5k04
$$ -41 -91 -153 -53 -35 -22 -55 23 -81 -117 84 -53 103 138 -109 -3 118 104 -282 6 -109 -339 98 43 -161
6287a61J98o4qM7N8O1j08j3kQ2M2j07L04jk01j65J35j43J80l52K32n4n1K34k26
$$ -161 37 -27 -35 12 70 131 23 10 8 90 132 25 329 328 127 -38 97 -46 134 -218 14 -40 -91 143 -83
6312h3J04j0J11J13j64k29M36l33n0Q7o6jJ29j63M9OO3M9j67K33p9j02l9K29l
$$ -83 21 11 122 235 71 -158 278 -55 -105 -18 -84 -85 44 -119 -70 -64 -1 48 -119 114 35 -67 -106 123 120
6337A20l48J81lP0J03j41Q2k38K20r7m5J28k30L23Oq7j4o0J69j96J1J55k51J23
$$ 120 -228 -47 -50 20 123 -18 64 -174 46 -51 -96 32 -198 125 131 44 30 -30 139 -57 -46 109 -142 -19
6361a9O5l0P5k25K21J26j53j40J52j35m8n7K06M1o8k81K54N0k49O7K16k9J3j42
$$ -19 46 16 91 -134 87 213 60 -80 72 -63 -111 -168 38 79 11 -270 -16 34 -215 -148 68 39 52 -90
6385i0m4J8K47l03k7K54L1Rk61K92l33K17J25k12K46N3K6n0k64K36j94J79m1J3
$$ -90 -134 -116 131 -172 -199 55 86 95 -166 126 -207 10 135 -77 169 222 248 198 -66 170 -24 155 114 127
6409A27J01k16o3Q7Oj12J3J43O4j30l2J47k66K29N9l51K25j55k2l7l8K61rj83
$$ 127 228 12 -51 36 42 -70 -57 86 150 20 -12 135 -131 98 157 -194 31 -124 -146 -183 -221 40 31 -152
6433a52K49j46L55m16K72k67J98nJo9j39J69k78J84J44k57K76k15J76K5k81L00
$$ -152 97 -49 306 -110 162 -105 93 88 89 20 -119 50 -228 -44 100 -157 119 -96 80 105 -176 124
6455A24jr9j66J46q1O6o2J97j39j76K33j28K0k3O1p7J93l10M34p7j35J21k93J05
$$ 124 123 24 -142 4 -77 -11 -73 124 -15 -191 42 -86 -66 -89 -28 -105 88 -222 212 135 0 121 -172 -67
6479f7O2j03J90n8N3J2j06N4n5K13q8j47J51m4J1j17J51p8k36K28J54p9J55l09
$$ -67 -5 -108 82 24 77 89 -17 37 -18 195 107 -40 111 67 78 -39 112 34 -202 26 180 101 256 -53
6503e3m4O2l4P3r4J10J79j29n9k81L01O7l21P9M2P4K72k09j84KK24j17q1J35j30
$$ -53 -97 -35 -69 4 -90 20 199 70 11 -270 31 98 -223 -144 -102 -28 244 35 -149 -147 77 -40 -121 14 -116
6528a16K14j70J17Nk7p4o7J17O7pq2o3n6K17j05P4j1Q6j31j95K27k70L07j16k2
$$ -116 98 -72 45 50 23 -51 -118 -1 66 59 -23 -86 -142 75 -30 44 33 119 -12 -207 20 -250 57 -59 -81
6553h1J8J06r0O7J34j15Q8j59n6K47j78R8M7k54J91o4j29J34J66j95k55K08n6
$$ -81 -63 43 -47 20 154 39 127 -32 -88 159 -19 79 126 -128 63 -1 -130 4 170 -25 -280 -72 -128
6576a28N3O4L2k06O3J40p2p3L66j53J89j45r9o6O3j87J00J4K49r8l7N6j40n7P6
$$ -128 -75 -11 21 -185 -122 18 -54 -127 239 86 275 130 31 -35 28 -159 -59 -45 204 106 69 125 -15 -72 4
6601DM8j11O1j55q0J03J09n9J62n6j92K57p0k53L34p8k84K21J1k3L3J18k07J33
$$ 4 52 -59 2 -153 -233 -130 -21 -80 82 26 -166 91 21 -232 102 24 -260 -39 -28 -51 -18 100 -107 26
6625B6M4K36j42k49J9J55k88K89Q6j88m2O5l73L36Q3j46j72M37l42L19j60k23
$$ 26 70 306 164 -85 -66 89 -199 90 176 -12 -54 11 -362 -26 57 -89 -261 176 -166 153 -7 -230
6647b30K77q2%l8k4K86j0k12K33p0j26J29q9Q8j20J22O2k41K29l25M4L96l84J84
$$ -230 47 -35 -35 -73 -97 189 179 -33 200 130 4 133 44 132 12 134 196 -45 184 -141 -97 299 -85 99
6671I9M4j43j03m4K02k27L30j39Q7j60J4oJ46j53k75J43R4Mm6P5J07O5o0j46J24
$$ 99 143 0 -103 -147 55 -172 158 19 106 -54 -40 -46 100 -53 -328 -185 -91 -87 -133 -58 49 114 54 -92 32
6696C2k24K57q9M3M8j37r4J7J3K57J04l12jl2J44J14l41K11o6L9J01OJ18l83p1
$$ 32 -192 65 -24 19 67 -70 -164 -147 -134 123 227 -85 -86 -118 26 140 -201 10 -56 -17 84 90 208 -175 -246
6721b46R0L19j04Q0k34J94O8j1k62j37L70k91K33j22l4J37J54m26J22J60n0OL3
$$ -246 -156 163 59 139 -95 99 167 156 -106 -243 127 -164 69 -53 -87 50 204 -222 -100 60 10 16 49
6744D9j16j88M23m24O6K03j03J18K42k33k18J61j16O1L0J21J62k68J65M8k32Q6
$$ 49 -67 -255 168 -256 -190 13 -90 28 270 37 -181 -20 -136 -75 -45 76 238 -30 135 183 -49 37
6766C7jn0r0K03k7k36K71p3o3pk73J95P6j09K57j46L5j44p5j47L70kJ09K1o7l24
$$ 37 36 -14 -104 99 72 -164 107 34 -29 -36 -309 -114 -38 -147 110 -36 -1 -145 -220 -367 3 1 110 131 64 -260
6792b60M13l35J16J99k28NJ51l6k2M6j24J10k85L39k57R7J38k5j6j26n3N8J08
$$ -260 153 -182 -66 133 -95 -90 61 25 3 49 -75 35 -250 89 -168 -71 67 42 26 -100 -153 -95 13
6815A3j26j63J29j6J7J9Q5J91k35KJ71l7j92J28j26J97J03j87L02n89M31r9j25
$$ 13 -113 -276 -147 -163 -146 -127 -42 149 -86 -84 87 50 -142 -14 -140 57 160 -27 275 -314 117 18 -107
6838a07J58j69K42j90j1j3N4oL9L3J39j83o4R7p9k7R8R6k10k63O92k40J25j38
$$ -107 51 -118 124 -66 -77 -90 -36 -42 -3 30 169 -14 -78 19 -60 -87 11 107 -103 -366 326 86 211 73
6862G3J1j42R1K4k19Q0M3j78K93Mk59J47j03K35k03P4J33j2j13m7M1L2K96l59
$$ 73 84 -58 33 57 -162 -82 -39 -217 76 80 -179 -32 -135 100 -103 -29 104 92 -21 -68 -27 5 301 -58
6886e8j4m3J24Ol1L9J0L3j64q9K47j53r1J46O8J30k41J03J53r2J41Oj29M1l08
$$ -58 -72 -115 9 15 -16 23 33 66 -98 -187 60 -93 -184 -38 30 160 -81 22 175 83 224 230 101 142 -166
6911a66Q4Q0k7k6M9N8N0r9P9l2p2o6N9q8j1K96p2k91K09j20K83J6k35O5L5Rl0
$$ -166 -82 -2 -29 -55 -6 52 102 3 82 50 -22 -88 -29 -117 -128 168 96 -195 14 -106 177 193 -42 23 58 67 37
6938C7l85L85M3m5K9j46J71j72J23j94K07o4J16M1j21j82J78K13k21K5r7O9j19
$$ 37 -348 37 80 35 64 -82 89 -83 40 -154 53 -11 105 146 25 -157 21 234 13 38 -59 10 -109
6961a09P1J11j29j9j55P5L38k27K22k65m3K11o4P7j21j17Q9k9R8J2j61M18k17
$$ -109 -38 73 -56 -75 -230 -155 183 -44 178 -87 -130 81 17 94 -27 -144 -55 -84 14 26 -135 283 66
6984F6j50n5L38l51K24j04J18K3n9K1j76L12j79J64j86KR7l05L21m9K2j73J55
$$ 66 -84 -139 199 -152 72 -32 86 109 50 71 -105 207 28 192 6 8 105 -200 121 72 94 -79 76
7007G6o2K0Q6k4p5p3PM3P8k58K01j85J11j43K51n9q8j0N4K25l07J23R6k13P5M4
$$ 76 14 34 120 96 21 -52 -45 -2 76 -182 19 -166 -55 -198 53 -6 -94 -104 -50 175 -132 -9 87 -126 -51 -7
7033gJ42k55Q3n4P6J12L0m1K64l29pj47L88j53j49L2JQ2k6j54N5k5J16o6N7Q5
$$ -7 135 -120 -37 -91 -15 97 127 86 350 21 14 -133 255 102 -47 -15 -14 68 42 -112 -57 -82 34 -32 25 110
7059A10p9n0J32r5rJ21k72J58j7O4l02K74Q4q2j44J84j13j58K01j43J40J47j61
$$ 110 31 -19 113 18 9 130 -142 16 -1 63 -239 35 119 37 -107 77 -36 -194 7 -136 4 151 -10
7082a0Jj01K44k50J20P8J4L6q3J00j99K15k9k26j3J49k40J04M44n34K02j45P4
$$ -10 -9 -110 134 -116 4 82 96 132 49 149 -50 165 136 -90 -103 46 -194 -90 354 -180 22 -123 -49
7105d9Nj70K21p9J49j52k2J62k93N5J33M0L4o3J03K30l60j45P2J87qO4k21J24
$$ -49 -44 -214 7 -72 77 -75 -97 65 -228 -173 -40 0 34 -29 74 304 -56 -201 -129 58 50 114 -107 17
7129A7Q9J7k30K40j86J46M4j80j45L5K44j75J40j18P3j91J82oj84K80j99J11l9
$$ 17 106 123 -107 133 -53 93 137 -43 -188 -153 91 -84 56 -62 11 -180 2 -4 -188 92 -107 4 -35
7152c5R1j35J07p5M0Q0l13J63K6O3n4J39j62M4k82K94N8j37L2r0L90k56K18j71
$$ -35 56 -79 28 -47 -7 73 -240 -77 -51 12 -42 97 -65 -21 -303 -9 49 -88 -56 -146 244 -12 206 35
7176C5p5J73J1j2j20q3M7Qj26J61J37k90M5r2J27j14N2K15r6k5nJ25K6j56m0m2
$$ 35 -40 133 144 132 12 -71 -24 -16 -142 19 156 -134 -89 -181 -54 -168 -116 99 3 -22 -27 98 124 -32 -72 -114
7202a14J36J14n5j9r6M9P0l6j20J46Q2j37p2k5R2Pk8J3L0k4K8k11L5K08l2p1m9
$$ -114 22 136 81 62 -34 15 85 49 -71 75 157 20 -52 -77 15 22 -6 7 37 13 41 -170 -135 73 41 -30 -79
7229g9K5J98n12L83o0R5k41J4K5K00J5p2Q8K7J58m22J46J44k27Q6P6o6Q8j48Q0
$$ -79 -54 144 -368 15 -45 50 -191 -177 -152 48 63 -9 79 106 264 -158 -12 132 -95 -9 67 1 89 -59 21
7254B1M8L0j1M0N1p7o4oQ9j50j11L50j60O0j61k1L35k29r6k1RM0J29k04k3J46
$$ 21 69 99 88 128 179 102 38 32 121 -29 -140 210 50 110 -51 -72 263 34 -62 -83 -74 -34 95 -109 -132 14
7280A4N1j05O8q2n3K09j33J01L0o8J01k42J46j20M6Rm0pM2j68K61N8m4k43J00
$$ 14 65 -40 28 -54 -107 102 -31 70 100 32 133 -109 37 -83 -37 -28 -68 -75 -33 -201 60 118 74 -169 -69
7305f9M0K21j32J8j81J55r9M3J58j46Q3j66J29K2J5k90J82q4q5L16j9l09K61M9
$$ -69 -29 192 60 78 -103 52 -47 -4 154 8 91 -75 54 76 91 -199 -17 -101 -186 130 111 -198 63 112
7329A12l52P2K82j40L03j97okj1j25J50p8L4Q8j3j68J19j0j38k3L13n9m04R7K71
$$ 112 -240 -168 114 -26 277 80 74 72 61 -64 86 8 42 130 117 -51 68 58 -80 -103 210 151 -253 -156 115
7354A15m5j63m5QRNJ86J38p8k77K25j02l9O2J50l08J80r2J27o2p1J79N7l75J19
$$ 115 70 -93 -138 -130 -121 -116 70 208 130 -147 78 -24 -63 -1 149 -159 21 -71 56 -6 -77 102 159 -216 -97
7379i7kJ58ok81J66J95j33j19K41K32n51K20q5M1L6N1N9o4k57K73K6k82L37k32
$$ -97 -99 59 53 -228 -62 133 0 -119 122 354 -197 23 -62 -21 15 66 125 61 -196 77 103 -179 158 -74
7403g4L48m65K31r3J25q9K3k33K10lJ0P9o6Pn0n7K23q6q0pM1J30p2L2J96j06l36
$$ -74 274 -191 40 -53 72 -17 6 -227 -17 -20 -10 69 3 10 -40 -97 126 40 -40 -47 -6 124 52 84 280 174 -162
7430a62N0L9L5K80k31mJ49j23p7O0K97k90N2r1J74q6j17j45K41q0r9K4K4l6m8
$$ -162 -112 -73 -38 242 11 7 156 33 -44 16 313 23 75 -16 158 72 -45 -190 51 -29 -128 -104 -80 -116 -164
7455a64p5M1n9nL01j0q1J7O8j10N9r4J99j59n8J52j19J35m8K10k8l16J42p4P1
$$ -164 -239 -198 -257 -262 39 29 -52 -35 33 -77 -18 -112 87 -72 -130 22 -97 38 -10 200 172 -144 -2 -76 -5
7480ej80K9J09j94K67j39O5N4Q4k51R6K35j26k05R8j49P5O0j73K60n2r0Q5k5J32
$$ -5 -185 -156 -47 -241 26 -113 -48 6 90 -161 -65 170 44 -161 -63 -212 -137 -77 -250 10 -42 -132 -47 -72 60
7505F0O3r0P5k15m3K62k80K41J49k10j02N1n3j8L16j95p2J11q1O9n4J9q5m5J25
$$ 60 123 33 108 -107 -150 112 -168 73 222 12 -90 -39 -92 -110 206 11 -61 50 -31 38 -16 3 -82 -127 -2
7530bJ1j37J99j07J99k81J1o2K66k82R1J35o6N4k16M1J7k8L1J21L4j16k55K17
$$ -2 9 -128 71 -36 163 -118 -107 -169 97 -185 -94 41 -25 29 -187 -146 -129 -157 -126 -5 29 -87 -342 -125
7554a25J13N2j79K70k55Q0n%O6m2K40j57m5j56J10k1R5j28J31J00j65J37m7M2
$$ -125 -12 40 -139 131 -124 -44 -49 -49 17 -25 215 58 13 -143 -33 -54 41 -87 44 144 -21 116 69 111
7578A11k8o0rp2J4J7Jp8o0R4R2m5J5J08J7l30K12mk47J49K5k9P2L2J77j25k39
$$ 111 83 23 14 -58 -44 -27 -26 -104 -164 -70 22 -23 -8 100 117 -213 -1 -5 -252 -103 -78 -107 -35 -3 174 49 -190
7605a90N4J88P8l05L32j18m3k2j23K58M0j77M6j03K19j46L6K21j86q8q5J37Q1
$$ -190 -136 52 130 -175 157 39 -4 -26 -149 109 149 -28 18 -85 134 -12 24 245 59 -29 -114 23 104
7628A04m5L9j16p2j14J21Q6Q1o8m5J32j87k67L50p6J22K6L4L6K8j65j38p2N12
$$ 104 59 98 -18 -90 -204 -83 3 84 16 -29 103 -84 -351 -1 -77 45 71 105 141 169 4 -134 -206 306
7652C06k26j13l7K11j45P7j37O7%M9j70O8R2r6J94k64R3j07J91J07j79Q8n6k7
$$ 306 80 -33 -70 141 -4 73 -64 3 3 52 -118 -50 42 -54 140 -124 -31 -138 53 160 -19 69 13 -14
7676a4O8o6j4n3M0k5J62j35o4J82k09K4J18j97L36l22j34L33m0k7q1L33k93J59
$$ -14 54 -12 -26 -79 -39 -64 98 -37 -101 81 -128 -104 14 -183 153 -169 -303 30 -10 -37 -118 215 -78 81
7700H1q1q3J53k9m0j0k7k52K89J76j42k2j54M8K00j8j25R6j69J35k1P9o9l3Lr6
$$ 81 0 -83 70 41 1 -9 -36 -288 1 177 35 13 -141 -93 107 89 -36 60 -109 26 5 84 15 -18 -15 -111
7726a11K17p3Q2k51K08O9k32p6P6M2j26M4J59q4l1K10j25j35J38k3J21o8l5J74
$$ -111 106 33 115 -136 72 141 -91 -167 -91 -49 -175 -131 28 -56 -87 123 -2 -137 1 -22 99 31 -4 170
7750A70j52M2q5j18P2J57l41J23K37l40J93K13k21J01j19L0j22L9L63j13j02J48
$$ 170 18 60 -25 -143 -71 86 -255 -132 105 -235 -42 171 -50 51 -68 -38 -160 -121 242 129 27 175
7772A75j62j25O8J15q6O3j40K09j04j37PJ66J81l55J45j57K16J4J02o5j07J09
$$ 175 13 -112 -44 71 -15 48 -92 117 13 -124 -117 49 230 -125 20 -137 79 93 195 130 23 132
7794A32m4j41N2K50m44m4J82J17o6l2o7k3K77m4l34K30M1Mk12J90l8p8P6J96o2
$$ 132 88 -53 -1 249 -195 -239 -57 60 -6 -38 -105 -128 149 105 -229 1 42 46 -166 24 -14 -92 -16 180 118
7819A18J4j73k08J01j07K23K61n06K97q4q2J67j30J36j11R0J8J77j57L4K2k0k7
$$ 118 132 -41 -249 -148 -255 -32 229 -277 20 -64 -146 21 -109 27 -84 6 24 201 44 78 100 80 53
7842E3pj04J88p1n0L6L02l49j41K27r0n0j03L4L08l12Q4PK84l77N3j15K78j7L6
$$ 53 46 -58 130 59 9 45 347 -2 -143 84 -6 -56 -159 -125 183 -129 -45 -38 246 -131 -78 -193 85 68 104
7867A04Q8k72Q7j98J11M9j5kO6m7J87q0L8j06n8m2p0J66J59r1l58J68K13q4o8
$$ 104 192 -80 7 -191 -80 -31 -46 -48 18 -29 158 78 116 10 -48 -90 -160 6 165 74 -284 -116 97 13 -55
7892e5J72m7r4J13k70N4M7m8J67J30l19L79l76J56O7q3q4O8J68j87jok63M28j41
$$ -55 117 70 -24 89 -181 -127 -80 -128 39 169 -150 229 -147 9 76 -7 -91 -23 145 -42 -43 -49 -312 116 -25
7917b5k86K63J43j87J17M2j64P2K35k44J26m6L94m31R9m9L02n45K65J05l13M40
$$ -25 -311 -48 95 -92 25 67 -97 -25 210 -34 92 46 440 9 108 59 361 -184 81 186 -127 313
7939C13j53m3j90m8J54l7k43K52j2J0K13p3j23j30j20L79kr8nj8r5j03L3K73k46
$$ 313 160 117 -73 -121 33 -4 -247 5 -7 3 216 143 20 -110 -230 149 147 49 44 26 -69 -172 -139 134 -112
7964a12J67k19J26o0k9J56j09L3p5K25n9pM4j40J7k0R0K3k07L36k62j4Q0J3j3
$$ -112 55 -164 -38 -98 -127 29 -80 -47 -122 103 44 37 81 -59 -42 -62 28 51 -156 180 -82 -96 -16 -3 -16
7989a6P6j72l6J37j94R2q2j05K63K4j9N9o3N2Q4j39k5N2jP9R1l1l40K22Q1j57
$$ -16 60 -112 -148 -11 -205 -113 -195 -300 -37 -13 -32 27 -36 16 100 -39 -64 -12 -13 66 157 126 -214 8 89 -68
8015f8l9J30N1K00k12J67m2qj62J37K5Ok17r5N0L9J83j97J12k49K63j28J54j21
$$ -68 -107 23 74 274 62 229 187 179 17 154 179 185 -32 -127 -77 -38 145 -52 60 -189 74 -54 100 -21
8039b1Q9n9q5J07j04K95k62Oj20J14J27k00J91O6j13l01M08l10K99j00J2j04K
$$ -21 68 9 -76 31 -73 222 -40 -34 -154 -40 87 -113 78 144 31 -270 138 -172 127 27 39 -65 -63
8062f3l4RO1J8K3J72k15j8kL7k35L52L4k15Q8K74k31J38k44J18j30j53K30j23
$$ -63 -97 -88 -27 -9 14 186 -29 -47 -49 -12 -247 105 139 -76 12 286 55 193 -51 67 -63 -216 14 -109
8086a09M9M8l13M32j66j06K56o2P7j82j13N0N07j93j49k3K35l41M4m0J80l8p4
$$ -109 -60 -12 -325 107 -59 -165 91 29 106 -76 -189 -139 368 175 26 3 238 -103 -59 -99 81 43 -31
8109c1M4%K25r2m8j20M2J11j4k51%L0J54P5ro6J0L0Q2k76J32j60J25l6J21j23
$$ -31 13 13 238 146 98 -22 20 131 117 -134 -134 -104 50 125 116 50 60 90 172 -104 28 -132 -7 -43 78 -45
8135d5J11K83m30J52j03k02L28K15l80N9P0R2l5k66K42r3P7P1j77J52n9p7J30
$$ -45 66 349 -81 71 -32 -234 94 309 -71 -12 58 150 115 -151 91 -2 75 146 -31 121 62 -15 115
8158A15m1j65r6J03L67j57j09j87JJ46K8K8j87P4J12K0k04J90J23r0j59o2K34
$$ 115 74 -91 -187 -84 283 126 17 -170 -169 -23 5 33 -154 -80 32 52 -152 38 161 71 -88 -150 84
8181H4n9q8m6j73K19O7P5k20Q1l3
$$ 84 25 -63 -109 -282 -63 4 79 -141 -60 -93
8191i3
$$ Imaginary data points
##PAGE= N=2
##DATA TABLE= (X++(I..I)), XYDATA
0@%%%%%%%%%%%%%JrJ6j6J6k4L2l2M0m8N6o4P2q8J04j20J36j55J79k04K29k58K93
$$ 0 0 0 0 0 0 0 0 0 0 0 0 0 0 1 -8 8 -8 8 -16 16 -16 24 -24 32 -32 40 -48 56 -64 72 -83 96 -108 121 -137 156
36A56l32L72m16M65n17N75o41P11p86Q71r63J060j167J287j419J561j719J895
$$ 156 -176 196 -220 245 -272 303 -338 373 -413 458 -505 555 -612 675 -744 817 -902 993
54I93k089K309k558K840l164L541l987M525n185O016p106Q604j0808J4407k1599
$$ 993 -1096 1213 -1345 1495 -1669 1872 -2115 2410 -2775 3241 -3865 4739 -6069 8338 -13261
69a3261O2021j41046j9588J99700m7455p7862J3583P3924n0245p734j6633k2337
$$ -13261 48760 -92286 -111874 87826 40371 -37491 -23908 50016 -229 -7963 -24596 -46933
81d6933R0871M5740j16281q2438J07919Q2673q3249l5825N6421j1816m7949L0340
$$ -46933 43938 89678 -26603 -109041 -1122 81551 -1698 -37523 18898 7082 -40867 -10527
93a0527K5183R404j1862l2858k6697M3392M6807n0673k583L4526n2819k2429P5701
$$ -10527 14656 24060 12198 -20660 -47357 -3965 42842 -7831 -10414 24112 -28707 -51136 24565
106B4565L0407p7212j7019N7371j8011k5770M1073k246k6249J9253P9m6306K3603
$$ 24565 54972 -22240 -39259 18112 101 -25669 15404 13158 -13091 6162 6241 -40065 -16462
119a6462Q5056n3610q8320P4243N5921p5697k8286P9464J0379o9663P371K5406
$$ -16462 68594 14984 -73336 907 56828 -18869 -47155 32309 42688 -26975 -19604 5802
131E802j1625K4123N863l8354k673L0175j0074k5419M5015K1179o6398j7008M7688
$$ 5802 -5823 18300 24163 -14191 -16864 13311 3237 -22182 22833 44012 -22386 -39394 8294
144H294J9265j9644q735O981j3749j389P882N95L4719n529p0798l041P5622J8310
$$ 8294 27559 7915 -820 6161 -7588 -8977 -1095 -500 34219 28690 -42108 -45149 30473 48783
158D8783o3861p888M0934k1106j6850K5221R029p76q321k7148j5124M9306M3394
$$ 48783 -15078 -22966 17968 -3138 -19988 5233 14262 13486 5165 -21983 -37107 12199 55593
171E5593o1062m2494N0712K1741l6987o136L8463n409l4162R284M534R66K5018
$$ 55593 -5469 -47963 2749 24490 -12497 -18633 19830 14421 -19741 -10457 -5923 -4957 20061
184B0061j0027l2459M846K9055o523k0050K1798K961k2533O360M918m272P318
$$ 20061 10034 -22425 -17579 11476 4953 -15097 6701 9662 -12871 -6511 -1593 -5865 1453
197A453J3387j0168k7054J1774J8579m510N562n382j5828K888J3595j100r203
$$ 1453 14840 4672 -22382 -10608 7971 3461 9023 3641 -12187 -9299 4296 3196 -6007
210f007K2322P06m3532L128L8939P919j7552j2985r13k731J5324J2826j6372J767
$$ -6007 16315 17021 -26511 -23383 15556 23475 5923 -7062 -7975 -10706 4618 17444 1072 2839
224B839M489k0852l767K8810K0855k8887k4595J6675O018K541R122n794j0688
$$ 2839 7328 -13524 -17291 11519 32374 3487 -21108 -4433 1585 4126 13248 7454 -3234
237c234l948M884j60Q200J5710k1720j8647J6679Q975l242j293M654p574j1857
$$ -3234 -7182 -2298 -2458 5742 21452 -268 -18915 -2236 6739 3497 2204 6858 -716 -12573
251a2573J1459M138j722P271q060r826J568J0371J646q291J0057k462j7574O769
$$ -12573 -1114 3024 1302 8573 513 -9313 -7745 2626 4272 -4019 6038 3576 -13998 -7229
265g229R929Q97j326j26n487j2712J2075J3231p193P38m799r659K010J1458R253
$$ -7229 2700 3597 2271 2145 -3342 -16054 -3979 9252 2059 2797 -2002 -11661 -9651 1807 11060
280A1060r022m038k278j1532J1644J7631j978j4378r465O896K302P230R490j2287
$$ 11060 2038 -2000 -4278 -15810 -4166 13465 11487 -2891 -12356 -5460 -3158 4072 13562 1275
294A275p496m3q88R066J0457K64j9256q577J5923M592Q49J645p387n332j587P841
$$ 1275 -6221 -6264 -7152 1914 12371 12635 -6621 -15198 725 5317 6166 7811 424 -4908 -6495 1346
310A346N936j081K138j2812o234J2622N554p58n375N27k325p130R996M352l618
$$ 1346 7282 6201 8339 -4473 -10707 1915 7469 6711 1336 1863 -462 -7592 2404 6756 3138
325C138J583o211m020K527O279M055o531Q90l020p342Q060N752P83m058n650p41
$$ 3138 4721 -1490 -5510 -2983 3296 7351 820 1710 -1310 -8652 -592 5160 5943 1885 -3765 -4506
341d506l323Q912Q775p258m644n674o9P232N988K796j0872n957L202p29R811N767
$$ -4506 -7829 1083 9858 2600 -2044 -7718 -7787 -555 5433 8229 -2643 -8600 -5398 -6127 3684 9451
357I451p300r306n321R436O765J867J56j1764l628M904M828O682k370m226q096
$$ 9451 2151 -7155 -12476 -3040 3725 5592 5748 -6016 -9644 -4740 88 6770 4400 174 -7922
372g922k164J2523L160j453k141p183k32J912P432L692o663j290m811P99Q379
$$ -7922 -10086 2437 5597 4144 2003 -5180 -5412 -3500 3932 7624 961 -329 -5140 -4341 4038
387D038L7P4l391k213N4k531Q010L340m922k276l905K286L026K139K831n726j532
$$ 4038 4075 4149 758 -1455 -1401 -3932 4078 7418 2496 220 -3685 -1399 1627 3766 6597 871 -661
404f61j814j589Q773K303k176n378n636L809K852N585J747q824l693j045N074
$$ -661 -2475 -4064 4709 7012 4836 -542 -6178 -2369 483 6068 7815 -1009 -4702 -5747 -673
419f73O831j413j555p805k280M999K256O803j140r999n005J803J1678K623o101
$$ -673 6158 4745 3190 -4615 -6895 -1896 360 7163 6023 -3976 -8981 -7178 4500 7123 1022
434A022l243m657K394L625J629M563m443n291l787J854J2202O50p191n298m53
$$ 1022 -2221 -6878 -4484 -859 770 5333 890 -4401 -8188 -6334 5868 6518 -673 -5971 -6424
449f424O701l09O15K473l571j337m191K646Q006j371j969m369j639L942R27L631
$$ -6424 277 -32 583 3056 -515 -1852 -6043 -3397 4609 3238 1269 -3100 -4739 -797 130 3761
465C761r82l559j26l212L251M252L71L13n842j353Q95J647P981n63p451n160K568
$$ 3761 2779 -780 -906 -4118 -867 3385 3756 4069 -1773 -3126 -2231 -584 7397 6834 -617 -5777 -3209
482c209Q362j692q04J567n272k365l54O122P344m672o808n851L848J0700k01m418
$$ -3209 5153 3461 2657 4224 -1048 -3413 -3767 2355 9699 5027 -1781 -7632 -3784 6916 6715 2297
498B297n048K43K601l185N853M975n379o608l896P451O889k476k487m771j022
$$ 2297 -2751 -2508 93 -3092 2761 7736 2357 -4251 -8147 -696 6193 3717 1230 -3541 -4563
513d563K271K714M654m283k756l98l076M751L153k07k031m129Q27q48K881O652
$$ -4563 -2292 422 5076 793 -1963 -2361 -5437 -686 2467 2260 229 -3900 -3073 -3921 -1040 5612
529E612l496o195k659N804M075o244K457M664m786m583r72P848M624l703m746
$$ 5612 2116 -4079 -6738 -934 3141 -3103 -646 4018 -768 -5351 -6323 1525 6149 2446 -2300
544b300n155N457O001k290q17j173J389k961n537R404P120n076q610k888Q169
$$ -2300 -7455 -1998 4003 1713 896 -277 1112 -1849 -7386 2018 9138 4062 -4548 -7436 733
559G33L256K2n19m632p30j009L075N929k636j134l673m254N316N278J524n009
$$ 733 3989 4011 3492 -1140 -1870 -2879 196 6125 3489 2355 -1318 -5572 -256 5022 6546 1537
575A537m268R15j146N847M449n169m244j829M617J445l679N181M17o269l353L475
$$ 1537 -2731 -1816 -2962 2885 7334 2165 -2079 -3908 709 2154 -1525 3656 4073 -2196 -5549 -2074
591b074P478j892l786j727k138M712Q25k265K241m26r70m626p91Q467K009m631
$$ -2074 5404 3512 -274 -2001 -4139 573 1398 -867 1374 948 -22 -4648 -5439 3028 5037 406
607D06n564R08N131k516J836K703l404k051l025L603N064j115j041m200j973K800
$$ 406 -5158 -4250 881 -1635 201 2904 -500 -2551 -5576 -1973 3091 1976 935 -3265 -5238 -2438
623b438L230L800l480k738j404k982P231L899l662k575j995J768n7J153N850k340
$$ -2438 792 4592 1112 -1626 -3030 -6012 1219 5118 1456 -1119 -3114 -1346 -1403 -250 5600 3260
639C260n293l839L972P740k396k148j955k814M137M09O06J720j074k785m247M030
$$ 3260 -2033 -5872 -1900 5840 3444 1296 -659 -3473 664 1073 1679 3399 2325 -460 -4707 -677
655f77O031q49l091m591J879L696k507K792L56k604j470j758L195J950N52m20
$$ -677 5354 4505 1414 -3177 -1298 2398 -109 2683 3039 435 -1035 -2793 402 2352 2904 2484
671B484m710L25O41K008L626l443j513j088j723L825J188K99j092k957q00q85
$$ 2484 -2226 -1901 -1260 748 4374 931 -582 -1670 -3393 432 1620 1919 827 -2130 -2930 -3815
687c815N008L371m223k640k746K649M670j733P47j511l234m0J065M750N70k671
$$ -3815 1193 4564 341 -2299 -5045 -2396 2274 541 1288 -223 -3457 -3497 -2432 2318 2888 217
703B17l134l198N579L099j283j04l487m77R46N53M173m89k746l117k6M577L61
$$ 217 -2917 -6115 -536 2563 1280 1176 -2311 -2788 -1842 -1289 2884 2395 -351 -3468 -3494 1083 1444
720A444R79j206l926J475J80J762L120k497j128k183M67K760N57J267k357k061
$$ 1444 2423 1217 -2709 -1234 -1054 708 3828 1331 203 -1980 -1513 1247 1804 3071 714 -1347
736a347Q96j291L913J557k500m25k794J167K430K05J215k180j513j140N59M321
$$ -1347 -451 -1742 2171 3728 1228 803 -1991 -824 1606 1811 3026 846 -667 -1807 -1248 3073
752C073p10m83j782l578K757K099J070M84l579j431q05K784K932j250n79l470
$$ 3073 2363 1880 98 -3480 -723 1376 2446 2930 -649 -2080 -2885 -101 2831 1581 1002 -2468
768b468j077K972J031K682j994m153L54K20L175J330j282j649k827J398J630J007
$$ -2468 -3545 -573 458 3140 1146 -3007 -2653 -2433 742 2072 790 -859 -3686 -2288 -658 349
784C49K503l742k069P83J14L736k38j680j020j773J760N68J903P58l132k27j224
$$ 349 2852 -890 -2959 -2176 -2062 1674 1436 -244 -1264 -3037 -1277 -709 1194 1952 -1180 -1407 -2631
801b631J489L407j405R1j409j959J820R59J789l79j855n00j841K830K169r72O55
$$ -2631 -1142 2265 860 951 -458 -2417 -597 362 2151 1772 -83 -583 -2424 406 2575 1603 2258
818B258l392o35J866O83K586j335j969j310n52L171R55R23j705l778J227O83J897
$$ 2258 -1134 -1769 97 780 3366 2031 62 -1248 -1800 1371 2326 3249 1544 -2234 -1007 -324 1573
835A573K316l302j350j002N66K828K67O32k973k290J890N20K998l57l346Q5j739
$$ 1573 3889 587 -763 -1765 -1199 1629 1896 2528 -445 -2735 -845 -325 2673 2316 -1030 -945 -2684
852b684K035K188n47J66k785j006J329R96K486j933j377j71j659K662J227l67
$$ -2684 -649 1539 992 1158 -1627 -2633 -1304 -308 2178 245 -1132 -1303 -2962 -300 927 560
868E60j05k583P6N47J556J557k040m8j507l97K465Q2J338j131k800Q41L50J952
$$ 560 455 -2128 -2052 -1505 51 1608 -432 -480 -1987 -2384 81 163 1501 370 -2430 -1589 -1239 713
886G13J375j866l69k419J478J511O16J564k942j175O88j50L455j55j629j090j914
$$ 713 2088 222 -147 -2566 -1088 423 1039 2603 -339 -1514 -826 -976 2479 2324 695 -395 -2309
903b309K463J308Q27k1l182K76r6J033K689j378l86k216j027K941R03Q48j487
$$ -2309 154 1462 2289 2268 -914 -638 -734 299 2988 1610 1224 -992 -2019 922 1825 2673 1186
920A186k553Q19j50J971P90j243k14k186%K189M78J369k597j201K90K96J975m99
$$ 1186 -1367 -548 -698 1273 2063 820 606 -1580 -1580 609 1087 2456 -141 -1342 -1052 -756 1219 720
938G20m81l06k162J149Q71O74J328k549o03o35P46K476p28o0j637j496K153N8
$$ 720 239 -67 -2229 -1080 -209 465 1793 -756 -1359 -1994 -1248 1228 500 440 -1197 -2693 -540 -482
956d82J427R4k252K49j352J298K092j69l52k576m20K306N61J422j840j206M42
$$ -482 945 1039 -1213 -964 -2316 -1018 1074 905 553 -2023 -2443 -137 424 1846 6 -1200 -758
973g58j300K788J056n70l81l044Q77J420J345Q48k457n94j22L87K263r8%j415
$$ -758 -2058 730 1786 1216 835 -2209 -1332 88 1433 2281 -176 -770 -892 -505 1758 1660 1660 245
991B45j877J671O26R87K10j760m05r47J402K412j422J80j796m59J500m08J732
$$ 245 -1632 39 665 1652 1862 102 -303 -1250 152 2564 1142 1322 -474 -933 567 159 1891
1008A891q26j057p5j501J743J093J24k00k920O10J162K81J071j063l75j010j150
$$ 1891 1065 8 -67 -1568 175 1268 1392 1192 -1728 -1118 44 325 1396 333 -42 -1052 -2202
1025b202K579k6R37j207k403J147R9J897N95k141j52p69L30J499J74J179k286
$$ -2202 377 351 1288 81 -2322 -1175 -1076 821 1416 -725 -877 -1646 -1316 183 357 1536 -750
1042g50j556J414P3J743j24j211l98j610K001J337n62L98k024J46J59O41K115
$$ -750 -2306 -892 -819 924 800 -411 -809 -2419 -418 919 357 755 -1269 -1123 -964 -323 1792
1059A792j552k91q46j006K378O16O51j173k099J329O0R16R10j243N08k061J08
$$ 1792 240 -51 -897 -1903 475 1091 1742 569 -1530 -201 -141 775 1685 442 950 -1111 -1003
1076a003J923J19R82j694j015N34rJ769P3j242K14j589Q46M35Q11J196k601m48
$$ -1003 920 1039 2021 327 -688 -154 -163 1606 1679 437 651 -938 -92 343 1154 2350 -251 -699
1094f99L68l0J872k74n73r35j587K172K0P17J34k111J32p23J347J902j279l36
$$ -699 -331 -361 1511 1237 664 -271 -1858 314 334 1051 1185 -926 -794 -1517 -170 1732 453 117
1112A17j416o20J991J93R08j473j201Q28j072K063L72o67Ok303P05J594J79Q95
$$ 117 -1299 -1919 72 265 1173 -300 -1501 -673 -1745 318 690 23 29 -2274 -1569 25 204 1099
1130A099k090k28L09l24J967o81J49m07j469J110M46R44N52k333L51j37N77R18
$$ 1099 -991 -1219 -910 -1234 733 52 201 -206 -1675 -565 -119 825 1377 -956 -605 -742 -165 753
1148G53j92M60j569o22J443l99J645l58j521L20q80J388J084o02J76j930J60J007
$$ 753 561 1021 -548 -1170 273 -126 1519 1161 -360 -40 -920 468 1552 950 1126 -804 -644 363
1166C63L00J599j901l46K9j071K345Q1l26l92j834O80N89R46M68j641L6q24K93
$$ 363 663 2262 361 15 44 -1027 1318 1399 1073 681 -1153 -473 116 1062 1530 -111 -75 -899 -606
1185f06J786p43M40j010j736J610k26J582l04j393k2p34J076Q72k53M56k122K
$$ -606 1180 437 877 -133 -1869 -259 -485 1097 793 -600 -622 -1356 -280 592 339 795 -1327 -1325
1203a325J013j66J510p04j087l96k41J297L17J00j87j577P68k50O70J182j362
$$ -1325 -312 -478 1032 328 -759 -1155 -1396 -99 218 318 131 -1446 -678 -928 -258 924 -438
1220d38R0o25m35J903j25K06q47p54L43N6J488R4j245N54j577P25J573l94P06
$$ -438 -348 -973 -1408 495 370 576 -271 -1025 -682 -626 862 956 -289 265 -1312 -587 986 592 1298
1239A298j582m30M86L15J303m97m01o21p34J585n1M43L89k129L78L51O4J533p41
$$ 1298 -284 -714 -228 87 1390 893 492 -129 -863 722 671 1114 1503 -626 -248 103 167 1700 959
1258I59o00r95M7J304k83J095j032j462R64m08R72O52j079P0j233N50R15P0N07
$$ 959 359 -636 -589 715 432 1527 495 -967 -3 -411 561 1213 134 204 -1029 -479 436 506 1013
1277A013j534k3J27o44J916n04o49K79j443R67N22N1M96j266q3l85N20J725j110
$$ 1013 -521 -544 -417 -1061 855 351 -298 -19 -1462 -495 27 78 574 -692 -775 -1160 -640 1085 -25
1296b5j04m66j197J355M98L06l1j361K98m83R63Q30l66k2j359L53Q19r0J171q79
$$ -25 -129 -595 -1792 -437 61 367 336 -1025 -727 -1210 -247 583 217 195 -1164 -811 8 -82 1089 210
1316B10j144L72k32J274K22j77m10j393J317K14L90R41j863m4K84m29J756m40
$$ 210 -934 -562 -794 480 702 525 115 -1278 39 253 643 1584 -279 -323 -39 -468 1288 848
1334H48k20m33q87P92J84Q72j38j060K84r12P25J202q80M82p56p60P69M08M95
$$ 848 628 195 -692 100 284 1156 1018 -42 242 -670 55 1257 377 859 103 -657 112 520 1015
1353A015p33l16k85n12J067L81m88M95j272R4K43K89R66j044l66l96J36R02p9
$$ 1015 282 -34 -319 -831 236 617 129 624 -648 -554 -311 -22 944 -100 -466 -862 -726 176 97
1372I7K85o44j111J174m12Q46M90j223m5l64K24Q60n2J13r54m48R06m70J552m66
$$ 97 382 -262 -1373 -199 -611 235 725 -498 -543 -907 -683 177 125 238 -716 -1164 -258 -728 824 358
1392C58r30K96q64R26J017n35q7p88l1J42M78J116j074J4n25l28J451kj33Q1r18
$$ 358 -572 -276 -1140 -214 803 268 181 -607 -638 -496 -18 1098 24 38 -487 -815 636 634 501 582 -336
1413c36K06J4P52K74p35J68p54K65R66m67Q00j000n47O68l37R32L06q27l23n68
$$ -336 -130 -116 636 910 175 343 -411 -146 820 353 1153 153 -394 274 -63 869 1175 348 25 -543
1433e43N89K83L11N71j560J43n7J17J246q25j12m38n54Q36k9M86j04j039L12k94
$$ -543 46 329 640 1211 -349 -206 -263 -146 1100 275 163 -275 -829 7 -22 464 360 -679 -367 -661
1453f61P05P34j106J41o80k74J246l92P58p04o89M06o26J328J3m32J14j106N37
$$ -661 44 778 -328 -187 -867 -1141 105 -287 471 -233 -922 -516 -1142 186 199 -233 -119 -1225 -688
1472f88O45J15L21q32p6Q2N5O38k10j23j77o21Q27p6M88K91j119K24j44K59R77
$$ -688 -43 72 393 -439 -515 -433 -378 260 50 -73 -250 -871 -44 -120 368 659 -460 -236 -380 -121 856
1493H56m84J60o68k29O27j18Q85k56j023O20p06R17K97p44M16r57L37R1K43J080
$$ 856 372 532 -136 -365 262 144 1029 773 -250 370 -336 581 878 134 550 -407 -70 21 264 1344
1513A344j185k04R7n04J316l47J5j68j026O55J4N86N1j028J63l18L52J060p48
$$ 1344 159 -45 52 -452 864 517 532 364 -662 -7 7 593 644 -384 -221 -539 -187 873 125
1532A25L08p62m41R02k60M01j8o60J54o44P98L55m13K32q26J0K70R3Q81o36k55
$$ 125 433 -329 -770 132 -128 273 255 -405 -251 -895 -97 258 -155 77 -749 -739 -469 -376 505 -131 -386
1553c86L0m84J030l73K87j42p57N80k00M08L25p01K68l96N2Q98l17K49k71o16
$$ -386 -356 -840 190 -183 104 -38 -795 -215 -415 -7 318 -383 -115 -511 -459 439 122 371 100 -516
1573e16K00O8Q20k42k67n6o10N95L88l56O71p57k23N98j00P28o47Q6k47k83O66
$$ -516 -316 -248 572 330 63 7 -603 -8 380 24 695 -62 -285 313 213 941 294 380 133 -150 516
1594E16p5L03k34q09R2L1M97P56p88j3n57k2O81k67M77k76n87J81j07O34O3n04
$$ 516 441 744 510 -299 -207 -176 321 1077 289 276 -281 -303 378 111 588 312 -275 -94 -201 433 496 -8
1616hk6n37K60O64l17K53l93m62L48l65R63l08l21m9m95O77J25L4M4n56K46j43
$$ -8 -34 -571 -311 353 36 289 -104 -566 -218 -583 380 72 -249 -298 -793 -116 9 43 87 -469 -223 -366
1638c66J63O59o63K33n81%L01K50K39k30n11L32l62O19L76o16M24p87K89N64k55
$$ -366 -203 456 -207 26 -555 -555 -254 -4 235 5 -506 -174 -536 83 459 -157 267 -520 -231 333 78
1659G8M89n99l59J99j31R67k04m56L15p72P68o6J76J72n36j44j73K24O91l19O6
$$ 78 567 -32 -391 -192 -323 644 440 -16 299 -473 295 229 405 577 41 -103 -276 -52 639 320 386
1680C86l79k40O06j80M19N1q11K78l47M10K38j78J55p89L86J87NM24m91l23Q6
$$ 386 7 -233 373 193 612 663 -148 130 -217 193 431 253 408 -381 5 192 197 621 130 -193 -107
1701a07k64N15K03k00q3o94J53L13J97K76p43K21k66l5Q98o17L38j89n76P20m55
$$ -107 -371 144 347 147 64 -630 -477 -164 33 309 -434 -213 -479 -514 384 -233 105 -84 -660 60 -395
1722c95O12o5k59P7p13M01M45j57L78p21j33M15j79O72l77j36Pl71N73J41j58
$$ -395 217 152 -107 -30 -743 -342 103 -54 324 -397 -530 -115 -294 378 1 -135 -128 -499 74 215 57
1743E7J00n60L74j10L34M49n69Mj82k41O81R8m9m1m82K19k94K78P13p80M58n57
$$ 57 157 -403 -29 -139 195 644 75 79 -103 -344 337 435 386 345 -137 82 -212 66 779 -1 457 -100
1765a00k1O95l66Q9k7m49L26j84N85l82q9P9o18M79M33k31K37q62J61Q3K14K61
$$ -100 -121 574 208 297 270 -179 147 -37 548 166 77 156 -462 17 450 219 456 -406 -245 -162 52 313
1787C13m08m3l12P0N12l01K89K31r23K22K15j41K54O6j60j74j13N45l47K50k18
$$ 313 -95 -138 -450 -380 132 -169 120 351 -572 -350 -135 -276 -22 44 -116 -290 -403 142 -205 45 -173
1808a73m36K17j71P09J9k11k48m1K06J26J46Q7o52J87l3L5P19m64J25o9n30M56
$$ -173 -609 -392 -563 146 165 -46 -294 -335 -129 -3 143 230 -422 -235 -268 -233 486 22 147 78 -452 4
1830DP6lJ71k68p0q7L88L51m62L4k60o7M56j27K97l23k28J82j44M81j46N1M3o69
$$ 4 80 77 248 -20 -90 -177 211 562 100 134 -126 -193 263 136 433 110 -118 64 -80 401 255 306 349 -320
1854c20K77J46k20Q30q99L6K49k30M97p2k0l83m58O44k53M07R1n11J73l82K43
$$ -320 -43 103 -117 713 -186 -150 99 -131 366 294 274 -109 -567 77 -176 231 322 -189 -16 -398 -155
1875a55L74j59p8k58N2O1K9L87k20l90N7k73N32N3l40M04l84k02K66Q2M27o06
$$ -155 219 60 -18 -276 -224 -163 -134 253 33 -357 -300 -573 -41 12 -328 76 -308 -510 -244 -162 265 -341
1897c41L24k33l56P88k32R4N4m98J06J05K04K95m19Q5m63M58J26j23M63m35j47
$$ -341 -17 -250 -606 182 -50 44 98 -400 -294 -189 15 310 -109 -24 -487 -29 97 -26 437 2 -145
1918a45L96j94L52j16l96J79l72M35K18K7j69l18K55k09K03K28k64lK6k67L41
$$ -145 251 57 409 293 -103 76 -296 139 357 384 215 -103 152 -57 146 374 110 107 133 -134 207
1939B07M7k69J24l47K49J97j87K14k99K20m97O1P08l90m5M9l06J02j61O03l36
$$ 207 254 -15 109 -238 11 208 21 235 -64 156 -341 -280 428 38 -7 42 -264 -162 -323 280 -56
1960e6j48J5k57M20Pj87M01l64l33L65j92M96l84J28q5p6K74l16K54mo38M53P2
$$ -56 -204 -189 -446 -26 -19 -206 195 -169 -502 -137 -329 167 -217 -89 -174 -250 24 -292 -38 -42 -680 -227 -155
1983a55j7N25n90O4l6n9L44k6J18l40K1J01m59O14J37k27o7j06P1L65j93K51l33
$$ -155 -172 353 -237 -173 -209 -268 76 50 168 -172 -151 -50 -509 105 242 15 -52 -158 -87 278 85 336 3
2006Cj32K50k39O41l04O8N0o06N93j94J8M60n87M7k11L45Oj01K64n52J36L69k65
$$ 3 -129 121 -118 523 219 287 337 -269 324 130 148 608 21 68 -143 202 208 107 371 -181 -45 324 59
2029E9K50p6o00K93L7M10k63j53Q9k94M84j54r0K63m10J55k35o1M45j30j62K5
$$ 59 309 233 -367 -74 -37 373 110 -43 46 -248 236 82 -8 255 -155 0 -235 -296 149 19 -143 -118
2051a18l46N15q7J40p7k95J39O3oJ58k78j45j2j84O55k42J55P8k81J2M9j06K00
$$ -118 -464 51 -36 104 27 -268 -129 -66 -72 86 -192 -337 -349 -533 122 -120 35 113 -168 -156 -107 -213 -13
2074a3m7J19k38J5L48J5J71j59j45l77J37M40k30K28J07m17p1J04L0K32m58K18
$$ -13 -60 59 -179 -164 184 199 370 211 66 -311 -174 266 36 264 371 -46 -117 -13 17 249 -209 9
2096IJ85j30L73j43j28K9m58L32k79N34J31o23M26n57L57J00j00J85m34OK74j66
$$ 9 194 64 437 294 166 195 -263 69 -210 324 455 -168 258 -299 58 158 58 243 -191 -185 89 -77
2118g7O09m94q4J27l26M11J82l69K83k38j03k21J62L38m51J92M7m49N62N0j81
$$ -77 532 38 -46 81 -245 166 348 -21 262 24 -79 -300 -138 200 -251 -59 -12 -461 101 151 -30
2139c0k16J91K9l96L24k7N3j88j38K79j27K97o5k30M1J60p5J78r1j10L0j61K62
$$ -30 -246 -55 -26 -422 -98 -125 -72 -260 -398 -119 -246 51 -14 -244 -203 -43 -118 60 -31 -141 -111 -272 -10
2162a0J16o5L2j49LP9o4M23m73l2p1J89L11j06L3kk74K90j95J91k4l06K38k24
$$ -10 106 41 73 -76 -73 6 -58 365 -108 -140 -211 -22 289 183 216 214 -60 230 35 226 202 -104 134 -90
2186i0J63J66k91M03k56p2M9l74L86J28j71kr7J64K2j91J88k27K19o7j69K89j87
$$ -90 73 239 -52 351 95 23 72 -302 84 212 41 39 -58 106 128 -63 125 -102 117 50 -119 170 -17
2209a7P4j20l47N84l87K12j07j02J82l11J74J28j15R7k30lL18k00J31J05m91M46
$$ -17 57 -63 -410 174 -213 -1 -108 -210 -28 -339 -165 -37 -152 -55 -285 -288 30 -170 -39 66 -425 21
2231B1l03L63J30m27l0o8J02J61O0J32k51r2K90j53J36J00K5j46m59N34k7r7J74
$$ 21 -282 81 211 -216 -246 -314 -212 -51 9 141 -110 -202 88 -65 71 171 196 50 -409 125 98 1 175
2254A75m31M21r2M5J70l59K85k98o7M62l63K28p1j63K16j06J78J20m53L76m42
$$ 175 -256 165 73 118 288 -71 214 -84 -151 311 -52 176 105 -58 158 52 230 350 -103 273 -169
2275a69K50J24Kl9k8k99K92j60L05r9K2k11l9L31n93M81j10l45L11k34J97n1J9
$$ -169 81 205 207 168 140 -159 133 -27 278 179 201 -10 -49 282 -311 170 60 -285 26 -208 -11 -62 -43
2298d3K10j87j51j11J88J16j75k29N14l18L40n4j77J6j22k2j4J21J45k71M01j26
$$ -43 167 -20 -171 -282 -94 22 -153 -382 132 -186 154 100 -77 -61 -183 -205 -219 -98 47 -224 177 51
2320E1k67N11l44P4k55j30L20j4J09P4j04k2M9J4J92l01K16l36j0L86l86K91K1
$$ 51 -216 295 -49 25 -230 -360 -40 -54 55 129 25 3 52 66 258 -43 173 -163 -173 213 -173 118 139
2343A39l10K27qnJ21o3K38l93L6k5K05R0k19n8K3j06L28r1J32k06k3J22n3k0J09
$$ 139 -171 56 48 43 164 101 339 -54 -18 -43 162 252 33 -25 -2 -108 220 129 261 55 32 154 101 81 190
2368A90k18J56k15k9K58k99Q2J9K66j98OK56j62n15K66L5K41l32J73j2k37J54
$$ 190 -28 128 -87 -116 142 -157 -75 -56 210 12 18 274 112 -403 -137 -102 139 -193 -20 -32 -269 -115
2390a15J80k77J64o9Q2j22l9J92j02j73J22J0P5P1j53K98k46J03o3n3P6o7J77
$$ -115 65 -212 -48 -117 -35 -157 -196 -4 -106 -279 -157 -147 -72 -1 -154 144 -102 1 -62 -115 -39 -106 71
2413G1P5j69J97l07R6P5k1q4R3N0M7j03O6k8J02k49p4M02j38Nm8l14L39k92J48
$$ 71 146 -23 174 -133 -37 38 17 -67 26 76 123 20 86 58 160 -89 -163 239 101 106 58 -256 83 -209 -61
2438f1K85m12K71N0j72J40j27P0p7k2J07J02rp1J41l2r8j47J35J8k16J3J10j20
$$ -61 224 -188 83 133 -39 101 -26 44 -33 -55 52 154 145 74 215 183 85 -62 73 91 -125 -112 -2 -122
2462a22K5M30m75R1R8j95R3Q6L4k18M7K14m43L17J38j59q4J14m3J92l78L64l31
$$ -122 -97 333 -142 -51 47 -148 -55 31 65 -153 -106 108 -335 -18 120 -39 -123 -9 -52 140 -238 126 -205
2485b05M8m6Q3K93l46Q3Q6k88J18K88j71K6o6o8L16l10K31k21K63k58q3O80k22
$$ -205 -157 -203 -120 173 -173 -90 -4 -292 -174 114 -57 -31 -97 -165 151 -159 72 -149 114 -144 -227 453 231
2508B31J3j79J32j30L9j08L08j21p3j08J37K6J5j22j9j42J18l15K66L64l06K32
$$ 231 244 65 197 67 106 -2 306 185 112 4 141 167 182 60 41 -101 17 -298 -32 332 26 258
2530B58j98j01O0J28L3k67j19L67k93M66l37j92J81p3K19j5J07k75j65J2J75J09
$$ 258 60 -41 19 147 180 -87 -206 161 -132 334 -3 -195 -14 -87 132 117 224 -51 -216 -204 -29 80
2552H0j2p6Kk60K2K26k02J06J06l28K95k4J14k11K6J64K1m2m3l6L52l23M3l3l31
$$ 80 68 -8 -6 -266 -244 -18 -220 -114 -8 -336 -41 -65 49 -162 -136 28 49 7 -36 -72 280 -43 0 -33 -364
2577c64K80K68o9k95L5K84p7m5mk09L45j67J0K65m51J79P8k57L55K6j32J30j35
$$ -364 -84 184 115 -180 -145 139 62 17 13 -196 149 -18 -8 257 -194 -15 63 -194 161 187 55 185 50
2600E0J61n67M50R3j20n4J51Np8m0M8j96K21Rl20L46k2P1k6j47j68R1O8P3k37
$$ 50 211 -356 94 187 67 13 164 169 91 51 99 -97 124 133 -187 159 137 208 182 35 -133 -42 26 99 -138
2625a38J26j56J38L74k00j7k06L4J46p6n1p8j01M21n19K20J13p0O3l68K14J11
$$ -138 -12 -168 -30 344 144 127 -79 -45 101 25 -26 -104 -205 216 -303 -83 30 -40 23 -345 -131 -20
2647b0Q4J5k51L7L14k58K23k57n1K44l36K74k47J35J26j65J26n9Q4J66k06q5J40
$$ -20 64 79 -172 -135 179 -79 144 -113 -164 80 -256 18 -229 -94 32 -133 -7 -66 18 184 -22 -107 33
2670C3j17K29j90M30l47n1j05n7J83Rj98L49rl86K48P3J70k33M3K3j52P3l2K8
$$ 33 -84 145 -45 385 38 -13 -118 -175 8 17 -181 168 159 -227 21 94 264 31 74 97 -55 18 -14 14
2694A4J04k08R2o1K04o6J2j28j7l6J73k6J3q5j8L34m91Q4L9p7J01J8j05l4O2o1
$$ 14 118 -90 2 -59 145 79 91 -37 -54 -90 83 57 70 -15 -33 301 -190 -106 -67 -144 -43 -25 -130 -164 -102 -163
2720a63K05j28M5k7L55l26p7n2L3J11j29M0J47j73k5J78J4M4j13j05PK11J4k17
$$ -163 42 -86 -41 -68 287 -39 -116 -168 -135 -24 -153 -113 34 -139 -164 14 28 72 -41 -146 -139 72 86 -131
2744a31n3K87k3j9k09K19p7k01L58j62J91j16l9J79l90K65Nj9L01l00K18j95J0
$$ -131 -184 103 80 61 -148 71 -6 -207 151 -11 180 64 25 204 -186 79 84 65 366 66 284 89 99
2767I9N5J5j20J93k87J75p5J57N0k37P2J50m1J04k81K11p7k44O6o3p2M82m02o3
$$ 99 154 169 49 242 -45 130 55 212 262 25 97 247 206 310 29 240 163 -81 -15 -78 -150 332 -70 -133
2791a33LL4J62k43L13k16q4J83j08Q4K08l81M51m92K77J14k81K11l76R0K19J32
$$ -133 -130 -96 66 -177 136 -80 -164 19 -89 -5 203 -178 273 -219 58 172 -109 102 -274 -184 35 167
2813A67j4M6k44q6J24r0j21M03k17k12M86l27N2l6J13J43j07k13J25j33M6j46
$$ 167 153 199 -45 -131 -7 -97 -218 185 -32 -244 242 -85 -33 -69 44 187 80 -133 -8 -141 -95 -241
2835b41K91j64m5K22K4j21rm2K30j34K6O0j66J89j14J78R0M0m3o7l90L09n8N1
$$ -241 50 -114 -159 63 87 -34 -43 -85 145 11 37 97 -69 120 6 184 274 314 271 204 -186 123 65 116
2859A16J04j18L6k74J81J83j47j12o1J47p4m1L17j36Pq6n1%M8o5R1m6J51p5j00
$$ 116 220 102 138 -136 45 228 81 -31 -92 55 -19 -60 257 121 128 42 -9 -9 39 -26 65 19 170 95 -5
2884ejj83L48l42J99o7O4J06l62J82QJ6L7l2k31M17l59J14K54j09m6N4J4j23K43
$$ -5 -6 -189 159 -183 16 -51 13 119 -243 -61 -53 -37 0 -32 -263 154 -205 -91 163 54 8 62 76 -47 196
2909A96o2r5O2j36j03O9N5K6M5p7m3N8K6J76k57j3p7QM0O2J96k22j4J87m8Rj24
$$ 196 134 39 101 -35 -138 -69 -14 12 57 -20 -63 -5 21 197 -60 -73 -150 -142 -102 -40 156 -66 -80 107 59 68 -56
2936e6N8J35j86J19K11m20M21j43k72K13r7J1N7J3j5j95oM12m05K36n2R9L7k85
$$ -56 2 137 -49 70 281 -139 282 139 -133 80 -17 -6 51 64 49 -146 -152 260 -145 91 39 138 175 -110
2960a10K58k35j69J27N8K56j47k0L0J47j68k1L8j07J33qk86J72J15k57L75j61
$$ -110 148 -87 -256 -129 -71 185 38 18 48 195 27 6 44 -63 70 62 -224 -52 63 -194 181 20
2982B0Q2P0l36L02N7m80L38l71J78L25j9k82P6J07j75P9Q4P1m4p2j80N66m27p1
$$ 20 102 172 -164 138 195 -285 53 -318 -140 185 166 -116 -40 67 -108 -29 55 126 82 10 -170 396 -31 -102
3006a02J29M9nr8J23K00l58MJ02r4K08k54M37k96R3K8j46M8K28j60L4l5Pj65N4
$$ -102 27 76 71 -27 96 296 -62 -58 44 -50 158 -96 341 45 138 166 20 68 296 136 170 135 142 -23 31
3031C1j6P9N3J9k36K50j22L0J11k28M8ll8R9qk9K7l5L11k91K7q5k01M54l47q9
$$ 31 15 94 147 166 -70 180 58 88 199 -29 19 16 -22 77 69 40 67 32 343 52 79 -6 -207 247 -100 -189
3057a89K28j35j24N7K20n5J86N3m49n2M33m6j30P7k89L46l56K10J25j11j57k56
$$ -189 39 -96 -220 -163 57 2 188 241 -208 -260 173 127 -3 74 -215 131 -225 -15 110 -1 -158 -414
3079d14N49o1o7L0q1O1m0J61j53k8J15k14K47J00l14K44l26L56j57j21K19j82
$$ -414 135 74 7 37 -44 17 -23 138 -15 -43 72 -142 105 205 -109 135 -191 165 8 -113 106 -76
3101g6l1K78q6P9j4j36K4N4m5M66m62p2j38J75J69l92K36J07r7o2j01J08L9J28
$$ -76 -107 171 85 164 150 14 38 92 47 513 51 -21 -159 16 185 -207 29 136 39 -23 -124 -16 23 151
3125A51Q8k65J51P7j26j17p8N1J39j98J27l1l5K31o2j39k26L57r9o5K06j13k36
$$ 151 239 -26 125 202 76 -41 -119 -68 71 -127 0 -31 -66 165 103 -36 -262 95 -4 -69 137 24 -212
3148b12J57q7O1j61K76P9j81J88l75L48J52l69J9J79k31K23k52J76q1J10j6pJ52
$$ -212 -55 -142 -81 -242 34 113 -68 120 -255 93 245 -124 -105 74 -157 66 -186 -10 -91 19 3 -4 148
3171A48k15L9J55o9q9J45k76K58k54O2J63o8j9Qk7J28l4j10J41n4J53m20K50j00
$$ 148 -67 -28 127 58 -31 114 -162 96 -158 -96 67 -1 -20 -12 -39 89 55 -55 86 32 185 -235 15 -85
3195h5J58l6M7j81J06K08l3r0K50n32k1L64l05K68P2j19j90J57j75MK76r8j76
$$ -85 73 37 84 -97 9 217 184 94 344 -188 -209 155 -150 118 190 71 -119 38 -137 -133 143 45 -131
3218a31J81p4j48K37k17qj1KK91k3j66K87l63J16m2j46L02l06K30q5k1P2M3j53
$$ -131 50 -24 -172 65 -152 -160 -171 -169 122 99 -67 220 -143 -27 -69 -215 87 -219 11 -74 -95 -23 20 -133
3242a33o8O0J12M6l1J35j90K57k99K09j30m1J04o3o2J46j97M00k23k07J96j84
$$ -133 -201 -141 -29 17 -14 121 -69 188 -111 98 -32 -73 31 -32 -94 52 -145 255 32 -175 21 -163
3264a63Q0O1j63M59k52p2K89j92N6po4J44j45J94l94O0K52j71K13k74L2P9n3L07
$$ -163 -83 -22 -185 274 22 -50 239 47 103 96 32 176 31 225 -169 -109 143 -28 185 -89 -57 22 -31 276
3288B76l16r1N04m47K81j92K94l47jK43k30q3K61j05N0r0L9J25k81PN7j70M12
$$ 276 -40 -131 373 -74 207 15 309 -38 -39 204 -26 -109 152 47 97 7 46 171 -110 -103 -46 -216 196
3311A96Q2p0l76k4L10j02p9N4j15P7P0q7J31j28Q3L2o5N0l59M08k27o6M41r7l14
$$ 196 278 208 -168 -192 118 16 -63 -9 -124 -47 23 -64 67 -61 22 54 -11 39 -320 88 -139 -205 236 139 -175
3336a75K22J31k45J61rk61K57j4j08J51q3Q2j90K82j73k6J27m1j33P2j6j50K89
$$ -175 47 178 -67 94 85 -176 81 67 -41 110 27 109 -81 201 28 2 129 88 -45 27 11 -139 150
3359A50q2j07K32l34J62n8J23J15l57J82j53K16J07l18O0J19M3J93l12j52M20
$$ 150 68 -39 193 -141 21 -37 86 201 -156 26 -127 89 196 -122 -62 57 100 293 -19 -171 249
3380B49l46K01k99J44j04J93Qm4M9o2Q5j14k6J10j4l49L42J31k13K39j09j54N3
$$ 249 -97 104 -195 -51 -155 38 46 2 51 -11 74 -40 -66 44 30 -319 23 154 -59 180 71 -83 -30
3403c0M6N0l09J74J61j74J29j25J60j53J04k09J4K15j04k0R1j04J02l8k18M19
$$ -30 16 66 -243 -69 92 -82 47 -78 82 -71 33 -176 -162 53 -51 -71 20 -84 18 -20 -238 181
3425A81k47J42j55Q5j6K6jQ6M5k14R4n5J5J3J63k05j21K22j44Q1K21j52Qj18K20
$$ 181 -66 76 -79 6 -10 16 15 101 146 -68 26 -29 -14 -1 162 -43 -164 58 -86 -5 216 64 72 -46 174
3450A74k3j18J35l57J95j46J32J04n9m2J43k63o1K03j09O6n7O6J08j32K28k51
$$ 174 151 33 168 -189 6 -140 -8 96 37 -5 138 -125 -186 17 -92 -26 -83 -17 91 -41 187 -64
3472f4j1l3j9J89j02r9J07j6k4O0m9K83l19N4j30J12k54L14K5j32J45q6j28K96
$$ -64 -75 -108 -127 62 -40 -139 -32 -48 -72 -12 -61 222 -97 -43 -173 -61 -315 -1 24 -108 37 -49 -177 119
3496A19j26j56J02j59R6n2M15m39L7M4M06k83K18j31j5p7K3j01J49l00L38RR3
$$ 119 -7 -163 -61 -220 -124 -176 239 -200 -163 -119 287 4 222 91 76 -1 22 -79 70 -230 108 117 210
3519B10j82J84k94J40p8j82K86J05r3q0R6l5j94K95k69R6k2m4L7J37l17J18K58
$$ 210 28 212 -82 58 -20 -202 84 189 96 16 112 77 -117 178 -91 5 -17 -61 -24 113 -204 -86 172
3542A72k12j85J54QK04r5pk17o2N14m05K68j30k27K65kJ4j60m7M8n9J75o7k3J11
$$ 172 -40 -225 -71 -63 141 46 39 -178 -240 274 -131 137 7 -220 45 43 57 -103 -150 -102 -161 14 -53 -76 35
3567C5J02j19k6k3J01o4k8J36j46k0j02N2Q2pM3o3J57O5j03j0n5j04K13j54oJ1
$$ 35 137 18 -8 -31 70 6 -22 114 -32 -52 -154 -102 -20 -27 16 -47 110 175 72 62 7 -97 116 -38 -44 -33
3593c3p3J44k18M9L24k30r6J21j88L15m00K80j16J00n5N5J95l43L95j11j38J6
$$ -33 -106 38 -180 -131 193 -37 -133 -12 -200 115 -285 -5 -121 -21 -76 -21 174 -169 226 115 -23 -7
3615gL6k25L73k73M8Rnn3O6J15N6k26J84j79k3J61j47K58k15L5J63k03K02j49
$$ -7 29 -196 177 -96 -48 -39 -44 -97 -31 84 140 -86 98 -81 -104 57 -90 168 -47 -12 151 -52 150 1
3639Al5nl14J33J26J1J33L0j04k24J52M5R0r5qp8mOK44k37K97j41j18K81k43j65
$$ 1 -34 -39 -353 -220 -94 -83 50 80 -24 -248 -96 -51 39 -56 -64 -142 -146 -140 104 -133 164 23 -95 186 -57 -222
3665b22K85l73M38j01j32j05P2J13KL7M7o7K6J07l40q6K25J33P0p6J5j82l5K98
$$ -222 63 -310 128 27 -105 -210 -138 -25 -23 14 61 -6 20 127 -213 -299 -74 59 129 53 68 -114 -149 149
3689A49j73Q0k22J53Nk93M55l27L20j28j82K37K1j53Q9J04m7J58j67m4Qnj24J04
$$ 149 -24 56 -166 -13 -8 -301 154 -173 147 19 -163 74 95 -58 31 135 88 246 79 35 43 38 -86 18
3713A8J92k31J31j72Q0J75j67k21K28R9j96MJ3J82Jm16L46j23J18r6J0p0N3L1
$$ 18 210 -21 110 -62 18 193 26 -195 33 132 -64 -60 -47 135 136 -280 66 -57 61 -35 -25 -95 -42 -11
3737a1q1J15j04J0J98j01q2J69j69m2J68j50J11Ll1Qj29J15j14K0o7J01L8m3K34
$$ -11 -92 23 -81 -71 127 26 -56 113 -56 -98 70 -80 31 34 3 11 -118 -3 -117 -97 -164 -63 -25 -68 166
3762A66j86j4N5k23K07k6l5M4l9L3K94j05J4j63m9J02l11K20J9R4j2j26J73m8
$$ 166 -20 -34 21 -202 5 -21 -56 -12 -51 -18 276 171 185 22 -27 75 -236 -16 3 97 85 -41 132 84
3786H4j14K78m69K45J17m7j8J6j84J95o1j09O6L6j9o8J8J79j42P0K5K52k67L42
$$ 84 -30 248 -221 24 141 94 76 92 -92 103 42 -67 -1 35 16 -52 -34 145 3 73 98 350 83 425
3810D25l70oR2j8Kj76k6M8K2j35L23j23Jj24J53Ok00K60n13K59r5O1k5K58j44
$$ 425 55 49 141 123 125 -51 -77 -29 -7 -142 181 58 59 -65 88 94 -106 154 -359 -100 -195 -134 -159 99 -45
3835d5Q3J64k40j1q1J29j32J27o0r2Q9M2J18Q5l06R5p0J83m8j59K19j87J68j26
$$ -45 38 202 -38 -49 -130 -1 -133 -6 -66 -158 -69 -27 91 176 -130 -35 -105 78 30 -129 90 -97 71 -55
3859e5K45o3k39m2M31k08r8J91k39K7o9K40j14J32m2J3j6k9l4O5q3q9K33o8j72
$$ -55 190 127 -112 -154 277 69 -29 162 -77 -50 -119 121 7 139 97 110 94 65 31 96 13 -76 157 89 -83
3884h3K3M0K24l22J91m03M44R6n44M45J2M0k31J47o4P8J24p6k13K44j09j78m0
$$ -83 -60 -20 204 -118 73 -330 114 210 -334 111 123 163 -68 79 15 93 217 141 -72 172 63 -115 -155
3907a55NJ06j28L44j36rJ37k0l83K40k5k47K50O2%q2p3K4N7J6K8K6p2J96j06o6
$$ -155 -150 -44 -172 172 36 27 164 144 -239 1 -24 -271 -21 41 41 -41 -114 -90 -33 -17 11 37 -35 161 55 -11
3933a1J07j29J09Q8Qk82K57k55J34J5qj29J37J7J97k27K11j75J00k48N6k9n3J28
$$ -11 96 -33 76 164 172 -110 147 -108 26 41 33 -96 41 58 255 28 239 64 164 -84 -28 -57 -110 18
3957A8K11k65J66J6l45J20l1K45j64N6N1j10j2k0K21j33j96K93o9j31j00J10K7
$$ 18 229 -36 130 146 -199 -79 -110 135 -29 27 78 -32 -44 -64 157 24 -172 121 52 -79 -179 -69 -42
3980d2k06L04K42m59L68j66l55M13r9M2M5J9k19J29o6K46l58K39j35o1J50n5k28
$$ -42 -248 56 298 -161 207 41 -314 99 0 42 87 106 -113 16 -50 196 -162 77 -58 -119 31 -24 -252
4003b52L28j14K66k96j42L89l23J24L2j87K28k76K56m0qp7k6L62j68J69k58r0
$$ -252 76 -38 228 -68 -210 179 -144 -20 12 -175 53 -223 33 -7 -15 -92 -118 244 76 245 -13 -103
4025a03K52r7m9J84l23P7J57k83K18J19k18l7R5J82J27k03k12P8K5j66J25J43
$$ -103 149 52 3 187 -136 -59 98 -185 33 152 -66 -103 -8 174 301 98 -114 -36 -11 -177 -52 91
4047I1j35j28L07j62o1J34k72J2K57k75J67J27j32L18r3j05k4O8O3l5j88K97l30
$$ 91 -44 -172 135 -27 -88 46 -226 -214 43 -232 -65 62 -70 248 155 50 26 94 157 122 -66 231 -99
4070i9j7J74K4%r9J27k90R3K02j66J14J2p7J5J5j46j5R9m4J91r4J55m27L75l9
$$ -99 -116 58 82 82 -17 110 -180 -87 115 -51 63 75 -2 13 28 -118 -133 -34 -78 113 19 174 -253 122 83
4095H3j28O3j11J66J2m3K25l38J81q7N4j49J73J37k65R6J53l28m2K33q1m4K74
$$ 83 -45 18 -93 73 85 42 267 -71 110 23 77 -72 101 238 -27 69 222 -106 -148 85 4 -40 234
4118B34n2l86p7M05M6k20j2K0J89j33m4J09k6p3j04K60n2J10k19L4j00J65Q4j42
$$ 234 182 -204 -281 124 170 -50 -62 -42 147 14 -30 79 53 -20 -124 136 84 194 -25 9 -91 74 158 16
4142A6J86o4j0j19K7k1J8Q9k51L00l8j09j12o0K07r9N9n2Oj54J45r6P2J06l19
$$ 16 202 138 128 9 36 15 33 122 -129 171 133 24 -88 -148 59 -40 19 -33 -27 -181 -36 -132 -60 46 -273
4167b73K65P3j15J39M6k05N0J08j04r5l5K54j4Q4m37J63k9K56P5k60k5l9Q8j17
$$ -273 -8 65 -50 89 135 -70 -20 88 -16 -111 -146 108 94 178 -259 -96 -125 131 206 -54 -79 -118 -30 -147
4191a47j2L63k23M6J26j55m7j01K21n7P1j01L4oR2j08RJ84k50K26Q3k61j41K30
$$ -147 -159 204 -19 27 153 -2 -49 -150 71 14 85 -16 18 12 104 -4 5 189 -61 165 248 -13 -154 76
4215G6J8Q2k04J56Q4Mr9j15Q8o2m7ko4J44p3k06L14K3J75k87Pj8j07K00j8J29
$$ 76 94 176 -28 128 212 216 117 2 90 28 -19 -21 -85 59 -14 -220 94 117 292 5 12 -6 -113 87 69 198
4241A98k22k1Pk62K18L02l78R4J3k40L68n2Pl13L18P6j53R8k19K65j03r4J1K25
$$ 198 -24 -45 -38 -300 -82 220 -158 -64 -51 -291 77 25 32 -281 37 113 -40 58 -161 104 1 -93 -82 143
4265A43k73J53O8k8l9k7r4J51ro1N3P9J35j49j24Q6M0k51J86J52l01Q1L46k85
$$ 143 -130 23 91 63 24 -3 -97 54 45 -16 37 116 251 102 -22 64 104 -147 39 191 -110 -29 317 32
4289C2K48j61m3K09r9j41J2j82J19j27J23l1K49k52M6j29J5L12j59l6K0k16K90
$$ 32 280 119 76 285 186 45 57 -125 -6 -133 -10 -41 208 -44 2 -127 -112 200 41 5 25 -191 99
4312I9p3q3j27K58j5l9j26J48k36K41j7r8K1nJ25m2q0j05J88O1o1j11K02%j74
$$ 99 26 -57 -184 74 59 20 -106 42 -194 47 30 -68 -47 -52 73 31 -49 -154 34 95 34 -77 125 125 -49
4337d9J89j55O8k24M0p7O3L54k75J62P1j31r7K95m71L70r2l7J07q0j03j7M7J87
$$ -49 140 -15 53 -171 -131 -208 -145 209 -66 96 167 36 -61 234 -237 133 41 4 111 31 -72 -89 -42 145
4361A45p5j30K64k16K3l1J36p2O7j79J48j27J2N3j00o2OK25j40O1O5J01l75J69
$$ 145 70 -60 204 -12 11 -20 116 44 111 -68 80 -47 -35 18 -82 -144 -138 87 -53 8 73 174 -201 -32
4385c2K34k43K97k70q5J29Q0k8m1N7M6p2n9p4J79o3j21M3r4J64Rr4m2j54J49P7
$$ -32 202 -41 256 -14 -99 30 110 82 41 98 144 72 13 -61 118 55 -66 -23 -117 47 56 -38 -80 -234 -85 -8
4411hr2M9J09K9l02L76k84O0J48k25J5o4K89l2j6k1j10K7P4Qj26J0R7J25j93l1
$$ -8 -100 -51 58 87 -215 161 -123 -63 85 -140 -125 -189 100 68 52 31 -79 -52 22 30 -96 -86 11 136 -57 -88
4437h8J77k1p8j59J11J77k67J28qO2j01K76j92j50J36m8o3L24j51K4j44R6L8j18
$$ -88 89 68 -10 -169 -58 119 -148 -20 -28 34 -67 209 17 -133 3 -45 -108 216 65 89 -55 41 79 -39
4461c9M06j64n3q4N9l34L58r5j42L00k27K68k18k7J90j50L7q2j32o0M00l7m44
$$ -39 367 203 150 66 125 -209 149 54 -88 212 -15 253 35 8 198 48 85 3 -129 -189 211 174 -270
4484b70K43K41l48J97n9o8J16j03n3K2j62M0L46p5k4n2nk1J0j16J67K56l61J54
$$ -270 -27 214 -134 63 4 -64 52 -51 -104 -82 -244 -204 142 67 43 -9 -14 -35 -25 -141 26 282 -79 75
4508G5k03M3K52l57K29r0m3R5O8l5j50K18l5n6L4J44O8j32p6N0l6ok4J00j14j16
$$ 75 -128 -85 167 -190 39 -51 -94 1 69 34 -116 102 67 11 45 189 257 125 49 99 63 57 33 133 19 -97
4534i7O8l9J95r8l0o2J86l56L33o1l0K8k2n8j40J70J59j06P8r1j91J59j31J5J37
$$ -97 -29 -68 127 29 -1 -63 123 -233 100 39 9 37 15 -43 -183 -13 146 40 118 27 -164 -5 -136 -121 16
4559A6q3R8J64j30m1J85j85l9j64Q6M3Q5k31J96j38K51O1l0k36J28l5j5j0J60
$$ 16 -67 31 195 65 24 209 24 -15 -179 -93 -50 35 -196 0 -138 113 174 144 -92 36 1 -14 -24 136
4583A36r3J12j81JJ87j14q1Q1J19j46N1j60Ql5K66j63L1j22R2J03j81LJ06l7j56
$$ 136 43 155 -26 -25 162 48 -33 48 167 21 72 -88 -80 -115 151 -12 19 -103 -11 92 -89 -86 20 -17 -173
4608a73K8L30k62J34r8k33L48l5p4J01K0L5r3j3k97K15Q9J20J10k95J48j24n4
$$ -173 -145 185 -77 57 -41 -274 74 39 -35 66 86 121 28 15 -282 -67 22 142 252 -43 105 -19 -73
4631g3N7l1j18J12j89L31l53K54j24m8J79j41J55L0P9l8K6p4N7r4m4M3j36J92
$$ -73 -16 -47 -165 -53 -242 89 -264 -10 -134 -182 -3 -144 11 41 120 82 108 34 91 -3 -47 -4 -140 52
4655E2n6j83K10Q3j31P1N3k22p3j7K61q8j66Q7K93j84J42k72O7JR9n2j34K6J53
$$ 52 -4 -187 23 106 -25 46 99 -123 -196 -213 48 -40 -206 -119 174 -10 132 -140 -73 -72 27 -25 -159 -133 20
4680B0p1j2N3k1L9J29l01K95l9j32M2Kj55j55J35J80K26k82L1J91L5k76M3n1K63
$$ 20 -51 -63 -10 -31 8 137 -164 131 92 -40 2 4 -151 -306 -171 9 235 -47 -16 175 210 -66 -23 -74 189
4705A89j03j79J40n3K4K34j46R7k5m03K97OP0j87L4M3Nr1J24j82K17j59J73k54
$$ 189 86 -93 47 -6 18 252 106 203 178 -225 72 78 148 -39 -5 38 43 -48 76 -106 111 -48 125 -129
4729a29J99J88k34J42j77l6K0j9J65j37%K05j08p9M0m6K09k29R7J5n3lp6k7q1
$$ -129 70 258 24 166 -11 -47 -27 -46 119 -18 -18 187 79 0 40 -6 203 -26 71 86 33 30 -46 -73 -154
4754a54N6M5K66k59j12K01j22J52PL9L3j60Q1N6k16J50m7P5n1j47J87Mj92K05
$$ -154 -98 -53 213 -46 -158 43 -79 73 80 119 152 -8 73 129 -87 63 16 91 40 -107 80 84 -108 97
4778I7o1L2m8Mk3j74J66j28K27J48r1o1j59J55n1Q2p5N7k21j09J65N9J87j92L0
$$ 97 36 68 20 24 1 -173 -7 -135 92 240 149 88 -71 84 33 115 40 97 -124 -233 -68 -9 178 -14 16
4803A6J41j88J43P0m4j27j3P0n8L8Q0O8k78O2JJ53j38N3k93N6J83jL7Mj19K6Q2
$$ 16 157 -31 112 182 138 11 -2 68 10 48 128 196 -82 -20 -19 134 -4 49 -244 -188 -5 -6 31 35 -84 -58 24
4830B4j07O8R5k07K3L0J66p5M2j12J12k58K07Q6o0j84L06q8L7K2k93K76r3K51
$$ 24 -83 -15 80 -127 -104 -74 92 17 59 -53 59 -199 8 94 34 -150 156 68 105 127 -166 110 17 268
4854B68m7j84j20K7Q9J11j99j26M60j1l44J69j2l78K94R2K62l84K91q1m6j4M3
$$ 268 221 37 -83 -56 33 144 -55 -181 279 268 -76 93 81 -297 -3 89 351 -33 258 177 131 117 160
4877A60k9l23K47j63J32qJ02j12J05j51k8J00j38M5K47j10l2Pp5J1J48o1J48o0
$$ 160 131 -192 55 -108 24 16 118 6 111 -40 -68 32 -106 -61 186 76 44 51 -24 -13 135 74 222 162
4901A62k34P8n1q3J3n9N7K52k81J73j17L0J06j0j01K19o1o7j07O4M4K3M1j27J01
$$ 162 -72 6 -45 -128 -115 -174 -117 135 -146 27 -90 -60 46 36 -65 154 93 26 -81 -17 27 50 91 -36 65
4926F5L7k21pP0J52o3j44L26l94J00j51J24R5J04j01j95M75j12j4j59L8N9Qj28
$$ 65 102 -119 -126 -56 96 33 -111 215 -179 -79 -230 -106 -11 93 -8 -203 272 160 146 -13 25 84 92 -36
4950c6m4L5K00k54J6K10k91L12n6J43k30m9r4R3k2J95j93PL15k16N4k19P9J1O5
$$ -36 -80 -45 155 -99 -83 127 -164 148 92 235 5 -44 -138 -45 -67 128 -65 -58 257 41 95 -124 -45 -34 31
4975C1k3o9O9J15j77J66j50J29M0K16m79k3J99Kj56J3M6J03Q3j78j38J95J04n1
$$ 31 8 -61 8 123 -54 112 -38 91 131 347 -132 -155 44 46 -110 -97 -51 52 135 -43 -181 14 118 67
4999F7k19r0K63j75m8K86j95J9k7M4K00j87M9j60J64M3q4O1j04M0O5J3J78q3q
$$ 67 -152 -242 21 -154 -202 84 -111 -92 -119 -75 125 -62 -13 -173 -9 34 -50 11 -93 -53 12 25 203 120 112
5024A12k04J99k51K35l2m0J98k9m75L05o9R2n1L6J40k27mN9o3J24J06j45J4l15
$$ 112 -92 107 -144 91 59 19 217 188 -287 18 -51 41 -10 26 166 -61 -65 -6 -69 55 161 16 30 -285
5048b85M03k56J41l40J34K46k49J69k58J80Q5k8R0J53k88K07j27j77J16P7j01
$$ -285 118 -138 3 -337 -203 43 -206 -37 -295 -115 -30 -58 32 185 -103 104 -23 -200 -84 -7 -108
5069a08J43r0K34k04Q6j63K19j24p4J07j02n3n1J41J07L1j88O5K46l07j96K15
$$ -108 35 -55 179 -25 61 -102 117 -7 -81 26 -76 -129 -180 -39 68 99 -89 -24 222 -85 -281 -66
5091f6N9j04K18p6j41J77n5NK75k74q8Q3J04j41J35p1n3L0J02j78K1Q4j8L27l21
$$ -66 -7 -111 107 31 -110 67 12 17 292 18 -70 13 117 -24 111 40 -13 17 119 -59 -38 46 28 355 34
5116C4j5P4P3p4k2k83J28M0o1j3p1K54RJ58k81J0m4P2J95q7Qk36J65O7k52L07
$$ 34 19 93 166 92 70 -213 -85 -45 -106 -119 -190 64 73 231 -50 -40 -84 -12 183 96 104 -132 33 100 -152 155
5142A55j84N8K8pM4K7k60J74q9J56j76P9j36K16j74J94NQm7L4j21K80p46K64J70
$$ 155 -29 29 57 50 94 121 -139 35 -54 102 -74 5 -131 85 -89 105 110 118 71 105 -16 264 -482 -218 -48
5167d8J28o6N1K6j57O2P5l9P9k82K42k14j8J64q4M3J68k56N0O9PR3o5L2L4Q7k05
$$ -48 80 14 65 91 -66 -4 71 32 111 -171 71 -143 -161 3 -81 -38 130 -126 -76 -7 0 93 28 60 94 181 -24
5194b4J3J2L1o0J07k56K07J08j96K4Q3%J52k65Q3r0q4J66P3L8p9m9o5j52m6L82
$$ -24 -11 1 32 -28 79 -177 30 138 -58 -34 49 49 201 -64 19 -71 -155 11 84 122 43 -6 -71 -223 -269 113
5220A13J36m15J34R6k01P7n5K40M6l55L73j77N1j2J12k90L7K51j96P3q6j44K41
$$ 113 249 -166 -32 64 -137 -60 -115 125 171 -184 189 12 63 51 163 -127 -90 161 -35 38 -48 -192 49
5243D9k8%j6j1K6j24K04j71JL2J8K08k42L0L00l71K63j56j02K14q7OKj95p9J65
$$ 49 21 21 5 -6 20 -104 100 -71 -70 -38 -20 188 -54 -24 276 -95 168 12 -90 124 37 43 45 -150 -229 -64
5269f4J83L8k3k42J72k20K47j06J41j07Q4j11P2k18Q6P8R4k62J34%J08M0l21R8
$$ -64 119 157 134 -108 64 -156 91 -15 126 19 103 -8 64 -154 -68 10 104 -158 -24 -24 84 124 -197 -99
5293i9J44O1j80k3o3M70k46m2o7M48m13J00j09q8K4J82k66Q0J36j98J48j1k01
$$ -99 45 106 -74 -97 -160 310 64 22 -45 403 -10 90 -19 -107 -83 99 -167 -87 49 -149 -1 -12 -213
5316b13L11L9j42j61J85p8j77L47j38L7o5Q2k04K36n5k48J84N8P8K00k26j50M8
$$ -213 98 137 -5 -166 19 -59 -236 111 -27 10 -55 27 -177 59 4 -244 -60 -2 76 276 50 -100 -52
5339e2J16J04k15j38K01j7j15K25j16J31o7L2J06k70J30J11j32K23k70j4j67K59
$$ -52 64 168 -47 -185 16 -1 -116 109 -7 124 57 89 195 -75 55 166 34 257 -13 -27 -194 65
5361F5j60J63n7k10L0J89Ro6M3o5K16j15L23m34q7K63j52K19j02j06K77k39M0
$$ 65 -95 68 11 -199 -169 20 29 -37 6 -59 157 42 365 -69 -156 107 -45 174 72 -34 243 4 44
5384D4j48O1J06l3k29OQ5J26J03j10j27J21Q0j66QL19j61j30o2K5J64j77o7j26
$$ 44 -104 -43 63 30 -199 -193 -108 18 121 11 -116 5 85 -81 -73 246 85 -45 -107 -82 82 -95 -162 -288
5408b88K33j50K98j62J50j40o8L20j00j97J67k13J94o5KK69l16J0J48K7k33K6
$$ -288 -55 -205 93 -69 81 -59 -127 193 93 -104 63 -150 44 -21 -19 250 -66 -56 92 119 -114 -88
5430h8J71o7m9j60K38q7k49L72J28k80j24L43R3l13j3K52j33J1j47kl8K37j50
$$ -88 83 16 -33 -193 45 -42 -291 81 209 -71 -195 148 241 -72 -85 167 34 45 -102 -104 -142 95 -55
5453e5p7J84n2L2L91k08k10L6j9k16L10l44K02m33L91k00l12L89m91R95p03L58
$$ -55 -132 52 0 32 423 215 5 41 22 -194 116 -228 -26 -459 -68 -268 -580 -191 -682 313 -390 -32
5475c2j93K92k36K01k20R6O1O5j40K28j60j4n4J35l3J61l93N4J35m8L9j04J73
$$ -32 -225 67 -169 32 -188 -92 -31 34 -106 122 -38 -52 -106 29 -4 157 -236 -182 -47 -95 -56 -160 13
5498A3JP6j9jR4J9k03K01m35P4O3Q1J60j43K1j9p9J92k4k30K46k54J54L6L1Q2
$$ 13 14 90 71 70 164 183 -20 181 -254 -180 -117 -36 124 -19 2 -17 -96 96 72 -158 88 -166 -12 24 55 137
5524A37j47np6J18nm0j23N9RL2J0R9n1N4n3n4l9J91l67J98L03j98l3k13M0J93
$$ 137 -10 -15 -91 27 22 -18 -141 -82 -73 -41 -31 68 17 71 18 -36 -75 116 -251 -53 250 52 19 -194 -154 39
5550C9L6lJ30k30l0n4k2K64k77J61k69K39Q2k5J61k24J59r9j03J55r7k6N7R3o3
$$ 39 75 72 202 -28 -58 -112 -134 130 -147 14 -255 -16 66 41 202 -22 137 38 -65 90 -7 -33 24 117 54
5575E4j94K12o4j31J14K2m3p9k9q8K96k29K9K32j17n0R8j78K49l39P8J30m3N4
$$ 54 -140 72 8 -123 -9 13 -30 -109 -138 -226 70 -159 -130 102 -15 -65 33 -145 104 -235 -157 -27 -70 -16
5599a6J17J02k92j98K69l4R1r7pj45J6K7K23J26k45J37p4j52J44j93M33k95J1
$$ -16 101 203 -89 -287 -18 -52 39 -58 -65 -210 -194 -167 56 182 -63 74 0 -152 -8 -201 232 -63 -52
5622e2K12j14J71l09L33k85J04J00k89J90M2j78L00m04L21k44K47j50o5O4M6j76
$$ -52 160 46 217 -92 241 -44 60 160 -129 61 103 -75 225 -179 142 -102 145 -5 -70 -6 40 -136
5644a36K39q4l1LJ32o7K11k31M6r2n7K35l24J67j47J64J9M2j34K44k91k6K18q8
$$ -136 103 19 -12 -9 123 56 267 36 82 -10 -67 168 -156 11 -136 28 47 89 -45 199 -92 -118 100 12
5668A2j18o4J58N6j94P9M3j25J97j8r0J59j65p2J00j2O2J27q2N1J7k61J21QRO8
$$ 12 -106 -170 -12 44 -150 -71 -28 -153 44 26 -64 95 -70 -142 -42 -54 8 135 53 104 121 -140 -19 -11 -2 66
5694F6j4j82J85K0k12R2k86L79p2O8J9Q6j9j41K39j32K5J04k95L34j93P6L8j32
$$ 66 52 -130 55 75 -137 -45 -331 48 -24 44 63 149 130 -11 228 96 121 225 -70 264 71 147 185 53
5718E3rJ03j71J52k05n3K05J81k16J48j57P4j27l6j63K63N8n4l2j8J54k05K10
$$ 53 44 147 -24 128 -77 -130 75 256 40 188 31 105 -22 -58 -221 42 100 46 14 -4 150 -55 155
5741A55k14L38n04K37k44P7J76j22k69K80J17K0j35l5K88j90j52J01J53K6l6q1
$$ 155 -59 279 -225 12 -232 -155 21 -101 -370 -90 27 47 -88 -123 165 -25 -177 -76 77 103 67 -14
5763a4P8L6j93J50r7l4K31r0j62K32k19l2K54j01j17J79m6j29J26P6K6k06J77
$$ -14 64 100 -93 57 -40 -74 157 67 -95 137 -82 -114 140 39 -78 101 55 -74 52 128 154 -52 125
5786A25P3l41L42k27p2J49N9Kl4r8j1M4j79Kj72K74M6Jr4L18k96J18k6J57r6n0
$$ 125 198 -143 199 -28 -100 49 108 110 76 -22 -33 11 -168 -166 -338 -64 -18 -17 -111 207 -89 29 3 160 64 14
5812A4J25j14l1J70k69J08q7N1Q0K5J9j72rj43K23q1K7J01K1mJ63k60j52K13Q
$$ 14 139 25 -6 164 -105 3 -84 -33 47 72 91 -81 -90 -233 -10 -91 -64 37 58 54 217 -43 -195 18 26
5837B6O2j17j12J85q1J4m4K2J35m5k02O8K17j59l5N0Q3j62K44k04R7j47O0l12
$$ 26 88 -29 -141 44 -37 -23 -67 -45 90 45 -157 -89 128 -31 -66 -16 67 -95 149 -55 42 -105 -45 -357
5861c57M08J4pk10J89j21J38j44J93p4k4m6k3J98rJ44l00j7N5O1k40L6J84O6k2
$$ -357 51 65 58 -152 37 -84 54 -90 103 29 5 -41 -64 134 125 269 -31 -48 7 68 -172 -136 48 114 92
5886I2n6j00J37r0o1J78m9M7J06k92J40J0r8n9n1L64k32j56L14k38J06o1R9j78
$$ 92 36 -64 73 -17 -78 100 51 98 204 -88 52 62 -36 -95 -146 218 -14 -170 144 -94 12 -49 50 -128
5910a28Q9K02j78r6q8O2J37M9m2J86q2j96k1J86M4l21K36j61J2J11k05J95K4m5
$$ -128 -39 163 -15 -111 -199 -137 0 49 7 193 111 -85 -106 80 124 -197 39 -122 -110 1 -204 -9 15 -30
5934c0k2Q0n9K40k62j09K41j85MJ39J0L1k93P4J57j36L34j78n2o3K47p3m8K6k66
$$ -30 -52 28 -31 209 -53 -162 79 -106 -102 37 47 78 -215 -141 16 -120 214 36 -16 -79 168 95 47 73 -193
5959a93L37Q5k68J2jN3p0l2J7J4J27j1n2J06m4j10N0k42K79j23J07n1K28l61J90
$$ -193 144 229 -39 -27 -28 25 -45 -77 -60 -46 81 70 18 124 80 -30 20 -222 57 -66 41 -10 218 -143 47
5984D7r9p1N1o7J4J36j21K45Q0l76J60jJ28j11P9R9j13j96J01j8J24j44J40j13
$$ 47 -52 -123 -72 -139 -125 11 -110 135 215 -161 -1 -2 126 15 94 193 80 -116 -15 -33 91 -53 87 -26
6008b6k5L4q7O9k56N15j00j2Kr8L7l9K5o8J56j01N4m0LlO6K22k43k70j8J44J8
$$ -26 -51 -17 -104 -35 -291 224 124 112 114 16 53 14 39 -29 127 26 80 40 43 40 106 328 85 -185 -203 -59 -41
6035d1K02k70L1R3j38J08N3P8Qk16R4Q6k41P4K91k70P2p2j7K18r3rP2q0K5l71
$$ -41 161 -109 -78 15 -123 -15 38 116 124 -92 2 88 -153 -79 212 -58 14 -58 -75 143 50 41 113 33 58 -313
6061c13N83m78L20l0r3K9K1j13J07j14p4L18m15K94j35M00n01J05PM05l14k5j62
$$ -313 270 -208 112 82 -11 18 39 -74 33 -81 -155 163 -252 42 -93 307 -194 -89 -82 323 9 -16 -178
6084a78K66mq6n3J58JJ20k26r5k6K37m8k0p9o2P8l6J94l9q1j4K13k73j13q6M76
$$ -178 88 84 -2 -55 103 104 224 -2 -97 -123 114 66 46 -33 -95 -17 -53 141 102 21 7 220 -53 -166 -252 224
6110B24k15j55kP7J25m6k06K08n9J13k37J65j96K64k12P8K35m04K77j61J53j71
$$ 224 9 -146 -148 -71 54 8 -198 10 -49 64 -173 -8 -204 60 -152 -74 161 -243 34 -127 26 -145
6132a45J47l3Q5p5p9K42m9n3J33q5ll2J79k68q8K26R0j53o0O9M4l3L3j05O0M2
$$ -145 2 -31 54 -21 -100 142 93 40 173 88 85 53 232 -36 -124 102 192 39 -21 48 92 59 92 -13 47 89
6158H9J1j74K28l27L42k56M4J08j08j32K46j28L6J7J80l43J4M6K74k15K2j3K06
$$ 89 100 -74 154 -173 169 -87 -43 65 -43 -175 71 -57 -21 -4 176 -167 -153 -107 167 -48 -26 -39 167
6181A67j83r1j40J79N4j43JJ33j60J97k28K54JrO7j77J64j49J46q3J38j61m3J80
$$ 167 -16 -107 -247 -68 -14 -157 -156 -23 -183 14 -214 40 41 32 99 -78 86 -63 83 0 138 -23 -66 114
6205A14j03O9j18J07Kj12k7j6J8r1J81j31K39j03j30K30k96m2J55q6K30k16J09
$$ 114 11 80 -38 69 71 -41 -68 -84 -66 -157 24 -107 132 29 -101 129 -167 -209 -54 -140 90 -126 -17
6228a7jr5L13l64K33K5k00o0P6M3n8K92j81j84J68k9J35j52J42m6j51n8J32P5
$$ -17 -18 -113 200 -164 69 94 -106 -166 -90 -47 -105 187 6 -178 -10 -39 96 -56 86 40 -111 -169 -37 38
6252C8J90k54l2K6l1J09q3j63K47j72K8M8PR4l68L77l51K34j59K45P0J4j45p4
$$ 38 228 -26 -58 -32 -63 46 -37 -200 47 -125 -97 -49 -42 52 -316 61 -290 -56 -215 30 100 114 -31 -105
6276a05M2k8MJ97j86o8m2J13J35k31K44k08Q9M9Nj3j9P7l7Q0K5k53rJ92n0j68
$$ -105 -63 -91 -87 110 -76 -144 -186 -73 62 -169 75 -133 -44 5 10 -3 -22 55 18 98 123 -130 -139 53 3 -165
$$ [...]
8191e9
##END NTUPLES=NMR FID
##END=
