##TITLE=1H_Pr 4687-06
 CDCl3, 8 sc, 
 8.06.2021
##JCAMPDX= 6.0         $$ Bruker NMR JCAMP-DX V2.0
##DATA TYPE= NMR FID
##DATA CLASS= NTUPLES
##ORIGIN= UXNMR, Bruker Analytische Messtechnik GmbH
##OWNER= root
$$ XWIN-NMR		Version 3.5
$$ Tue Jun  8 12:17:03 2021 Russian Standard Time (UT+4h)  she@DPX200
##.OBSERVE FREQUENCY= 200.131506
##.OBSERVE NUCLEUS= ^1H
##.DELAY= (6, 6)
##.ACQUISITION MODE= SIMULTANEOUS
##.ACQUISITION SCHEME= undefined
##.AVERAGES= 8
##.DIGITISER RES= 18
##SPECTROMETER/DATA SYSTEM= spect
##.PULSE SEQUENCE= zg30
##.SOLVENT NAME= CDCl3
##.SHIFT REFERENCE= (INTERNAL, CDCl3, 0, 15.7039)
##AUDIT TRAIL= $$ (NUMBER, WHEN, WHO, WHERE, WHAT)
$$ ##TITLE= Audit trail, XWIN-NMR		Version 3.5
$$ ##JCAMPDX= 5.01
$$ ##ORIGIN= Bruker BioSpin GmbH
$$ ##OWNER= she
$$ F:/spectra/data/she/nmr/H-F/1/audita.txt
$$ ##AUDIT TRAIL=  $$ (NUMBER, WHEN, WHO, WHERE, WHAT)
(   1,<2021-06-08 12:15:33.93 +0400>,<she>,<DPX200>,
      <created by zg, POWCHK disabled, PULCHK disabled
       configuration hash MD5:
       00 E9 B6 7A A2 85 ED C7 34 08 36 98 17 FE 4E 26
       data hash MD5: 16K
       82 F0 C0 CA 20 90 D0 6B D1 07 02 6A 16 09 84 1A>)
$$ ##END=
$$ 
$$ hash MD5
$$ 97 FF B8 B9 12 16 2B C4 E4 E0 07 FF 61 E2 C3 5B
##$RELAX= 
##$RELAX= 
##$RELAX= 
##$RELAX= 
##$RELAX= 
##$RELAX= 
$$ Bruker specific parameters
$$ --------------------------
##$DU= <F:/spectra>
##$EXPNO= 1
##$NAME= <H-F>
##$PROCNO= 1
##$TYPE= <nmr>
##$USER= <she>
##$AMP= (0..31)
100 100 100 100 100 100 100 100 100 100 100 100 100 100 100 100 100 100 
100 100 100 100 100 100 100 100 100 100 100 100 100 100 
##$AQSEQ= 0
##$AQ_mod= 1
##$AUNM= <au_zg>
##$AUTOPOS= <>
##$BF1= 200.13
##$BF2= 200.13
##$BF3= 200.13
##$BF4= 200.13
##$BF5= 200.13
##$BF6= 200.13
##$BF7= 200.13
##$BF8= 200.13
##$BYTORDA= 1
##$CFDGTYP= 0
##$CFRGTYP= 5
##$CHEMSTR= <none>
##$CNST= (0..31)
1 1 145 1 1 1 1 1 1 1 1 1 1 1 1 1 1 1 1 1 1 1 1 1 1 1 1 1 1 1 1 1 
##$CPDPRG= <>
##$CPDPRG1= <>
##$CPDPRG2= <>
##$CPDPRG3= <>
##$CPDPRG4= <mlev>
##$CPDPRG5= <mlev>
##$CPDPRG6= <mlev>
##$CPDPRG7= <mlev>
##$CPDPRG8= <mlev>
##$CPDPRGB= <>
##$CPDPRGT= <>
##$D= (0..31)
0 1.2 0 0 0 0 0 0 0 0.06 0 0.03 0 0 0 0 0.0002 0 0 0 0 0 0 0 0 0 0 0 0 
0 0 0 
##$DATE= 1623140133
##$DBL= (0..7)
120 120 120 120 120 120 120 120 
##$DBP= (0..7)
150 150 150 150 150 150 150 150 
##$DBP07= 0
##$DBPNAM0= <>
##$DBPNAM1= <>
##$DBPNAM2= <>
##$DBPNAM3= <>
##$DBPNAM4= <>
##$DBPNAM5= <>
##$DBPNAM6= <>
##$DBPNAM7= <>
##$DBPOAL= (0..7)
0.5 0.5 0.5 0.5 0.5 0.5 0.5 0.5 
##$DBPOFFS= (0..7)
0 0 0 0 0 0 0 0 
##$DE= 6
##$DECBNUC= <off>
##$DECIM= 32
##$DECNUC= <off>
##$DECSTAT= 4
##$DIGMOD= 1
##$DIGTYP= 9
##$DL= (0..7)
0 120 120 120 120 120 120 120 
##$DP= (0..7)
150 150 150 150 150 150 150 150 
##$DP07= 0
##$DPNAME0= <>
##$DPNAME1= <>
##$DPNAME2= <>
##$DPNAME3= <>
##$DPNAME4= <>
##$DPNAME5= <>
##$DPNAME6= <>
##$DPNAME7= <>
##$DPOAL= (0..7)
0.5 0.5 0.5 0.5 0.5 0.5 0.5 0.5 
##$DPOFFS= (0..7)
0 0 0 0 0 0 0 0 
##$DQDMODE= 0
##$DR= 18
##$DS= 0
##$DSLIST= <SSSSSSSSSSSSSSS>
$$ [...]
##$SUBNAM2= <"">
##$SUBNAM3= <"">
##$SUBNAM4= <"">
##$SUBNAM5= <"">
##$SUBNAM6= <"">
##$SUBNAM7= <"">
##$SUBNAM8= <"">
##$SUBNAM9= <"">
##$SW= 20.0188882624521
##$SWIBOX= (0..15)
0 0 2 0 0 0 0 0 0 0 0 0 0 0 0 0 
##$SW_h= 4006.41025641026
##$TD= 16384
##$TD0= 1
##$TE= 0
##$TE2= 300
##$TE3= 300
##$TEG= 300
##$TL= (0..7)
0 120 120 120 120 120 120 120 
##$TP= (0..7)
150 150 150 150 150 150 150 150 
##$TP07= 0
##$TPNAME0= <>
##$TPNAME1= <>
##$TPNAME2= <>
##$TPNAME3= <>
##$TPNAME4= <>
##$TPNAME5= <>
##$TPNAME6= <>
##$TPNAME7= <>
##$TPOAL= (0..7)
0.5 0.5 0.5 0.5 0.5 0.5 0.5 0.5 
##$TPOFFS= (0..7)
0 0 0 0 0 0 0 0 
##$TUNHIN= 0
##$TUNHOUT= 0
##$TUNXOUT= 0
##$USERA1= <user>
##$USERA2= <user>
##$USERA3= <user>
##$USERA4= <user>
##$USERA5= <user>
##$V9= 5
##$VALIST= <valist>
##$VCLIST= <CCCCCCCCCCCCCCC>
##$VD= 0
##$VDLIST= <DDDDDDDDDDDDDDD>
##$VPLIST= <PPPPPPPPPPPPPPP>
##$VTLIST= <TTTTTTTTTTTTTTT>
##$WBST= 1024
##$WBSW= 4
##$XGAIN= (0..3)
0 0 0 0 
##$XL= 0
##$YL= 0
##$YMAX_a= 160588
##$YMIN_a= -123927
##$ZGOPTNS= <>
##$ZL1= 120
##$ZL2= 120
##$ZL3= 120
##$ZL4= 120
##$ABSF1= 10
##$ABSF2= 0
##$ABSG= 5
##$ABSL= 3
##$ALPHA= 0
##$AQORDER= 0
##$ASSFAC= 0
##$ASSFACI= 0
##$ASSFACX= 0
##$ASSWID= 0
##$AUNMP= <proc_1d>
##$AZFE= 0.1
##$AZFW= 0.1
##$BCFW= 1
##$BC_mod= 2
##$BYTORDP= 1
##$COROFFS= 0
##$CY= 11.3945322036743
##$DATMOD= 1
##$DC= 2
##$DFILT= <>
##$DTYPP= 0
##$F1P= 15.9154993809931
##$F2P= -4.1035820241983
##$FCOR= 0.5
##$FTSIZE= 0
##$FT_mod= 4
##$GAMMA= 1
##$GB= 0.15
##$INTBC= 1
##$INTSCL= 1
##$ISEN= 128
##$LB= 0.24
##$LEV0= 0
##$LPBIN= 0
##$MAXI= 10000
##$MC2= 0
##$MEAN= 0
##$ME_mod= 0
##$MI= 1.114404
##$NCOEF= 0
##$NC_proc= 0
##$NLEV= 6
##$NOISF1= 3.799351
##$NOISF2= 2.8
##$NSP= 1
##$NTH_PI= 0
##$NZP= 0
##$OFFSET= 15.70392
##$PC= 1
##$PHC0= -11492
##$PHC1= 21.40101
##$PH_mod= 1
##$PKNL= yes
##$PPARMOD= 0
##$PSCAL= 0
##$PSIGN= 0
##$REVERSE= no
##$SF= 200.130013532006
##$SI= 16384
##$SIGF1= 3
##$SIGF2= 2
##$SINO= 400
##$SIOLD= 16384
##$SREGLST= <1H.CDCl3>
##$SSB= 0
##$STSI= 0
##$STSR= 0
##$SW_p= 3612.71676300578
##$SYMM= 0
##$S_DEV= 0
##$TDeff= 0
##$TDoff= 0
##$TI= <>
##$TILT= no
##$TM1= 0
##$TM2= 0
##$TOPLEV= 0
##$USERP1= <user>
##$USERP2= <user>
##$USERP3= <user>
##$USERP4= <user>
##$USERP5= <user>
##$WDW= 1
##$XDIM= 8192
##$YMAX_p= 0
##$YMIN_p= 0
$$ End of Bruker specific parameters
$$ ---------------------------------
##NTUPLES= NMR FID
##VAR_NAME=  TIME,          FID/REAL,        FID/IMAG
##SYMBOL=    X,             R,               I
##VAR_TYPE=  INDEPENDENT,   DEPENDENT,       DEPENDENT
##VAR_FORM=  AFFN,          ASDF,            ASDF
##VAR_DIM=   8192,          8192,            8192
##UNITS=     SECONDS,       ARBITRARY UNITS, ARBITRARY UNITS
##FACTOR=    0.0002496,     1,               1
##FIRST=     0,             0,               0
##LAST=      2.0444736,     0,               0
##MIN=       0,             -123927,         0
##MAX=       2.0444736,     160588,          0
$$ Real data points
##PAGE= N=1
##DATA TABLE= (X++(R..R)), XYDATA
0@%%%%%%%%%%%%%Qj6J6j6J6k4L2l2M0m8N6o6P4q8J04j20J36j54J78k04K29k58
35a37K91l28L68m09M55n09N66o27O95p69Q50r38J034j138J253j382J524j679J851
54I71k046K264k512K798l128L520l989M562n281O217p487R322j2216J7448k9815
69a9372J10606O9354k67036J6354J68287j4665j32069M8037Q4368n5480n2206
80d3822L9200j5215J5464O2598m7393j04309N4879J25537n0182j27655P4620R4879
92G8601r2773n5258R6517L9573p4348l3457M9036N301q462L9814k8864o4657M3344
105e633N3207l6408l2317L6093J4067n5892m815N4016l002j8079m184l2522L235
118c2234N5193R742o0950k1594O3911L030o7063L1746O4606m4295n8818L1850
$$ y = [0, 0, 0, 0, 0, 0, 0, 0, 0, 0, 0, 0, 0, 0, 8, -8, 8, -8, 8, -16, 16, -16, 24, -24, 32, -34, 40, -48, 56, -64, 72, -82, 96, -108, 121, -137, 154, -174, 194, -215, 240, -269, 297, -330, 365, -404, 446, -492, 542, -596, 657, -725, 799, -880, 971, -1075, 1189, -1323, 1475, -1653, 1867, -2122, 2440, -2841, 3376, -4111, 5211, -7005, 10443, -19372, 91234, 160588, -106448, -90094, 78193, 63528, -68541, -20504, 63864, 8384, -43822, -4622, -19837, -4373, 58225, 10832, -93477, -38598, 86939, 36757, -90898, -16278, 78601, -14172, -69430, 27087, 66660, -7688, -41145, 7891, 13192, 4730, 44544, 15680, -48977, -5633, 47574, 11166, -21151, 14942, 29009, -26883, -31698, 22318, 19316, 1237, -2947, -35469, -32234, 22959, 32701, -28249, -49843, 14068, 17098, -49965, -18219, 46387, 2092, -56726, -24876]
130b4876N3638j7871k4439J9644j7128j6895M6912O399l8539J1292K3144l0117
142h836k4403N7495L1838p3020k2381O1834l402l9492K5125L3612m2186m5147
154d8963M9900M0804m4875j6692K6573o744j8470J2269K5995q544k4733L872o27
167a0235N872L2699j1520l9665Q064L0340k443k1811J6909K2397l6896k2318L7518
180H911K2096j3380k3648n282J5579L110j14J775o105j43j1903p359K7486J0407
194B1430k3619j7455P497J7186n968l665J5379j5220k1002J5252J7845O29j0936
207b647o386J006n014J2790J4840j4129n701J552q545Q724J6650J462j8905j4573
221a8876J8392Q199r063Q734J51j7173m631J2114J5205o636j2644L815o997k245
$$ y = [-24876, 28762, 10891, -13548, 6096, -11032, -27927, 18985, 25384, -13155, -1863, 21281, -8836, -33239, 24256, 56094, -16926, -39307, 22527, 19125, -20367, 4758, 38370, -3816, -48963, 937, 41741, -3134, -19826, 6747, 3, -18467, -6198, 19797, 11253, -13480, -9608, -10235, -4363, 28336, 16816, -22849, -14785, 15555, 13112, -8699, 8210, 30607, -6289, -28607, 8911, 31007, 17627, -6021, -11303, 4276, 7386, 7272, 9047, 2942, 2799, -9104, -16463, 11023, 21430, -2189, -19644, -12147, 5039, -929, -4594, 10785, -4435, -25437, -10185, 7660, 8289, -2647, -9033, -8027, -13041, -251, 14589, 460, -5241, -3689, -12234, -3510, 13140, 14602, -4303, -18876, -484, 7715, -1348, 7386, 7537, -9636, -14267, -2153, 13052, 6416, -6228, -2413, -9410, -11655]
235a1655J9402M019j1661j2149k71J1476M180L300j338j4569K430P027l618J1578
249H151P520j4453j6774N498K7432R44k1768K692N247n582J578O542Q699p120
263H606j7425J381R342J2133K797k2479o848J4317L799m159q57P955n610k2025
277a9073J0154K3513m898j1930o348nN975M363O843n196j2084M122P8J391J3094
292I999j468j2711p358M683J4020j478l974J014j2006k001J4850M625m751q539
306e095r73K142m603J1785R369j6600r030M195O489O918j551k529p445n933J1792
321a069M560j927M039q436r439N974J2176P064j1801q745O873j558K047J0432
335A0190j883q094p445L075J1456l10L61l214j2823M074J0881J229o65n844m152
$$ y = [-11655, 7747, 11766, 105, -12044, -12315, -839, 3341, 6641, 5303, -9266, -6836, 191, -3427, 8151, 15671, 1218, -15556, -10058, 17374, 18318, -3450, -758, 4489, -1093, 485, 7027, 15726, 8606, -8819, -7438, 1904, 14037, 16834, -5645, -12493, 1824, 5623, 1464, 607, 8562, 2952, -19073, -8919, 14594, 9696, -2234, -8582, -8587, -2612, 1751, 8594, 3398, -8686, -4564, -4486, -3095, 9999, 8531, -4180, -11538, -6855, 7165, 5687, 1713, 2727, -9279, -11280, 3570, 8195, 3444, -5095, -6068, -3926, -8529, 3256, 12625, -3975, -13005, -8810, -2321, 4597, 3046, 517, -6928, -12861, -1069, 3491, 1564, 5603, -2833, -12272, -6298, 5878, 12942, 1141, -7604, -731, -2289, -242, 10190, 8307, 213, -7232, -4157, 7299, 6989, 7350, 4136, -8687, -4613, 6268, 7497, 6832, 988, -3164]
350c164j972K006J3683j120j1810q13j804K581Q376J854l102j0636l313J1725
364B491K549o1Q75q811l569L112O675O783o975o322j031k512J0438O354p629n432
380c065l558K694N160J713M034p622j0776N427N842L262K138p859m698j426M408
395d326J0876k978p299j441l383N148O162L34k95r135k589O655L650N732k694
410D417j1517L32N324N350K066n465m30l248m054R428N721j894n789r251M562
425d448R428J720j144p724k300L810r49N927L999o427n415l682O370J0289l376
440F078m970m168k450P396L667m97p16o635q68J586L713Q158n223r523L74K268
456a810N841K921l818k856o863J525R863P1k041l641n160K424J899M717L853r149
$$ y = [-3164, -5136, -3130, 10553, 9433, -2377, -3190, -4994, -2413, 5963, 7817, 4715, -5921, -9234, 2491, 5040, 4979, 5854, -2957, -6526, -3414, 3261, 10044, 3069, -3253, -4284, -6796, 3642, 9996, 2367, -3065, -6623, -3929, 1231, 2944, 6978, -644, -11420, -5993, -151, 3111, 5249, -2610, -7308, -8734, -4326, 6550, 3572, -3727, -5168, -8551, -3403, 2759, 3093, 2798, -6337, -8926, -2271, 1379, 7111, 4417, -7100, -6768, -1444, 3906, 5972, 507, 77, -3171, -7225, 2203, 7924, 6030, 241, -9010, -4448, 4980, 6700, 5556, -2168, -4468, -658, -1607, 4320, 8319, 1892, -3523, -7205, -835, 9454, 6078, 1108, -3060, -5510, 1886, 5553, 5056, 4340, -2295, -3163, -1577, 2136, 10294, 5071, -4452, -4078, -1810, 4031, 6952, 3134, 278, -6585, -5060, 4803, 4874, 2833, -808, -5968, -3544, -1645, 3072, 6925, -2224]
472b224n495K546L015P044n72o270m055j951Q105M721n279K14j957m131J446M290
488e53Q413k642j4485N4Q466N464J96p456n49J065k610M778K782K53o99r272j988
505h783R984P596j401j4011m153J3165L460o031j045M215Q41j0963q10J6854K564
520A1482j1094p807J182J1269L161m811l126l546M492J645n246N943O550p542
534B552j1609N79J8288N147j8034m974Q843L186l240j788O733j076j1350J523
548e220P083K992J431p036o671K115P105O491p183p454N684K28l531L572N504
563E110k5j1908l517J2038L041l485o05m044k411J698O832M064r265l836N586
578g27j927j23M757L124n342j0380M918J1253j967l629j870l090R55L628N685
$$ y = [-2224, -7719, -5173, -2158, 4886, 4314, -1956, -6011, -7962, 143, 4864, -415, -201, -2158, -6289, -4843, -553, 7860, 5218, -9267, -9213, -747, 4717, 4913, -2543, -3092, -2027, -4637, 141, 2923, 3176, 2477, -6795, -8783, 1201, 8797, 7396, -6615, -10768, 2397, 5857, -174, -1219, 2996, 3837, -7126, -7936, 8918, 11482, 388, -7419, -6237, 5032, 8193, 3382, 256, -3290, 1202, 2847, -2399, 3544, 10094, 2552, -9057, -8478, 9810, 14957, -3077, -8051, 792, 3978, 738, -1050, 5683, 4607, -6743, -5220, 1863, 4855, 6286, -750, -7421, -5306, 1799, 8290, 1107, -6347, -663, -435, -3966, -394, 5110, 5085, -6823, -10340, 1698, 4739, 1254, 649, -3395, -5806, -4108, 2724, 6788, -2477, -6313, -727, -2654, -2777, 1980, 5104, -238, -10618, -5700, 5553, 3586, -43, -1913, -5003, -4048, -420, 5265]
593E265j984q552L026K387l966M693O423k825j0581l578J3467N676q264k718N40
608i91L16N97Q68M789k320n402J086j665K819Q842k479j0648m363R593J0257r520
624A779o677P886L43p229r02J0387N973j3135q539Q655O231Q89l693m875P41R31
640a235K453R93k450L702j922j0180L530J1565K067j0771p940R483N567o661J429
655c70L273l563n136j16R306K026o867j398j653J27O042K038k597m906j488M442
671h40L95Q18L298m763m203J184L951M920l448l595M95k118K761M914k84k800
687F85n324P99O465l41P8J54m765q19J580M376L259n328k650J99q26N149L336
704F027l253m640k941O251L274m082J714O23m992j486L457O967j372q334k96K225
$$ y = [5265, 3281, -5271, -2245, 142, -3824, 869, 7292, 4467, -6114, -9692, 3775, 9451, 1187, -1531, -991, -675, -78, 790, 5579, 3259, -2143, -1057, -2722, 97, 8939, 6460, -4188, -8551, 1042, 11299, 1779, -4898, 2988, 3331, -3898, -4800, 5587, 11560, -1575, -10114, -1459, 4772, 5661, 1968, -2907, -2166, -1235, 1218, 2211, -239, 3463, 1541, -8639, -5109, 6456, 8523, -2248, -10188, -705, 4862, -1799, -370, 2903, -660, -5796, -5912, 3394, 5420, -1447, -2845, -4498, -4371, 1671, 3709, 1112, -3794, -5282, -840, -445, 373, 3671, -1092, -5295, -4111, -160, 4760, 1312, -2283, -1788, -3906, -1145, 3769, 3485, 685, -4639, -3840, 2625, 2284, 2362, 2516, -2249, -3068, -1488, 2888, 6147, 819, -1831, -1632, -2458, 2691, 6027, 2774, -1866, -4807, 1444, 4718, 636, 2350, 2973, -2019, -3505, -48, 6919, 5547, -2787, -3083, -858]
720h58K779K960l324k478L44p90J576N72K701J261q734l358Q560M874k663o588
736c166m88M136k244Q09L985j330k784m297Q74P426J336l249n003j690N312J829
752A456j822J751k517k470K24J511N338q91n112j082m96M201L977k626k966j571
768c095j87L699Q00J365j488m810M27K651K031L047l360l875q12K321N714j258
784C170l887O66j750j07L650J923j54m355l423M404K327J199l52n103M2J682J221
801A153K696j117j760k621k241N731L443k930k338k168M07K688Q75K109k911m336
817c320J743J068K323K157l593k379q51J085M627o36j866j314l331K403L486L93
833A995j031l550q22J708Q63L689l06n630q00Q87L185K314k089j348j951j138
$$ y = [-858, 1921, 4881, 1557, -921, -577, -1367, 209, 781, 3482, 4743, -3991, -7349, 1211, 6085, 3422, -3166, -3654, 482, -1762, -953, 3032, 1702, -1082, -5379, -4505, 2921, 4257, 1008, -3995, -5685, -373, 1456, -366, 1385, -1132, -3602, -3378, -1867, 3471, 2580, -2532, -3614, -4110, 91, 4068, 1442, -1524, -3095, -3282, 417, 1217, 2582, 1094, -3716, -3289, -638, 1393, 4440, 1080, -2795, -3607, -1286, 4428, 3170, -717, -51, -1801, -1908, 1742, 3665, 3511, -844, -4267, 137, 2464, 3663, 3311, -1792, -1750, -68, 1153, 3849, 2732, 972, -1649, -3890, 1841, 5284, 2354, 16, -2152, -1745, 943, 1818, 3927, 1016, -3320, -1577, -509, 1814, 3971, 378, -2001, -2852, -1767, 2860, 2224, 358, -956, -4287, -1884, 1602, 1995, 964, -2586, -3408, -1700, -837, 2852, 2546, -3084, -3884, -2997, 188, 2502, 413, -935, -2886, -4024]
849d024L903J716R7j033m674K25L654J932Q81l576j923J414j09K485K144k750
865C62k191j774K277M564j038j225j834k410L281J692O63L25m075q00J156K034
881A007L470k460l029J4m88K797K528j374j420l216J3M031P76L37j751l586J161
898a190J285K325J413l843j737k4R39L681n8k598j218j964K322K684n9j33l595
915a770k158L391J257J169m38l924l9L09J945L447k394k238j269n48L833J246
931A819j261j051k835Q47K299M98J710k244l155Q63J557K850M45l718o63l03J002
948a340L469p80j078j597k390K819K258R13o2m539o09K566J496K190k327k217
964a228M82q38K121K825j641j271k023l44L749R46N5k480l223K418K079R1Q20
$$ y = [-4024, -121, 1595, 1692, 659, -4015, -3790, -136, 1796, 2677, -899, -2822, -1408, -1517, 968, 3112, 362, -1829, -3603, -1326, 3238, 2200, 975, -859, -3269, 12, 1704, 2367, 2692, -1383, -2183, -1027, 1007, 4477, 2017, -1012, -998, -1486, 1311, 3839, 2465, 1045, -2171, -2158, 1873, 2649, 2986, 1235, -2351, -1190, 95, 2420, 3833, -10, -1747, -1771, -832, 2849, 2791, 193, -1025, -2989, -667, 2017, 1958, 1825, -1770, -3928, -537, 720, 1889, 1451, -2473, -2512, -2203, -258, 3189, 795, -1443, -2712, -3260, 573, 1819, 558, -493, -3328, -2481, -182, 316, 2026, -218, -3373, -2510, -953, 1897, 2342, -1376, -2039, -2342, -1340, 2129, 1349, 271, -1326, -3716, -897, 1361, 2274, 2212, -2327, -2936, -370, 1126, 3316, 989, -1228, -746, -1584, 537, 3362, 1721, 450, -1573, -1917, 1832, 2778, 2833, 353, -2870, -452, 1627, 1718, 2538]
981B538j687j964k37J54M390N34l499j208j125K383K392q66l18k036j655K471
997B67K24J364P58m051j343R27L059K317l316j937L07j77J924J401r35q09l177
1014c197Q16K741M09Q64j883l103J151J466K609Q3l734m56L36K48K994K4j493
1031a25j342k273K897K199j97k13k757q94J610J740K289k406l459K023N56M65
1047A13J637l14r99k746j00M880M41k071p77j973O13K312J910k65l678l93K324
1064I14j786J791K959j870l522j960M773L247l764q25O85j979R51J612J298q92
1080A632l235Q23L65N92L295j324m261o67K653K830j389k570K017j528k381K709
1096d39K463O20l677k708K819J204R66M1k475j226P05O56K624j065j187L54k720
$$ y = [2538, 851, -1113, -1350, -1196, 3194, 3728, 229, -979, -2104, 279, 2671, 1805, 1487, -549, -2204, 267, 491, 1855, 2613, -1438, -2781, -1854, 1205, 3522, 206, -1731, -1424, -1601, 323, 1724, 789, -20, -3197, -2381, 360, 769, 1633, -250, -3353, -2202, -736, 1873, 1956, -1778, -2234, -1898, -1650, 1344, 1368, -125, -1467, -3740, -843, 1356, 1159, 946, -1811, -2705, -1095, 645, 2934, 528, -2931, -908, -352, 113, 1750, 1436, 437, -2309, -2409, 2471, 2912, 841, 64, -1909, -1296, 1016, 2926, 2661, -1017, -1410, 914, -872, 919, 3878, 2008, -1514, -3474, 1299, 4546, 782, -43, 642, -1337, -386, 1226, 2524, 1632, -1603, -780, -415, 177, 3472, 2148, -2113, -2780, -127, 2703, 1314, -1256, 761, -767, -3148, -439, 2024, 2644, -1033, -3741, -922, 282, 1248, 1289, -1186, -2412, -1707, -1051, 1573, 508, -679, -325, -3045]
1113c045J154L432N25j439m215P70L724q25R7N78j901j072k72L780J530l838k80
1130a297P04j527K132K847q86l397j896L705J151j926K458n18l649Q6K837K228
1146C052j622k260J280j239o05M420K90l202k074Q78K989p82m04J803l139j747
1162b362K594J749O55j867j494Q5r87K960K034l079j071o35J195J354n07Q30q42
1179F12l196Q55K463J262k95l434k05J282K11J332R6j179p38j821K215K415j460
1196D15n29j497j329K542J869j14k019k003K018p5n57K813k23l073j252J720L020
1213A726q33j397N12k209J42L270Q0r36j474j56R85o60K512J309l876j313J688
1230f30J382J437j654k1q60j809K914J572j312m31j427k37J162R16J855j734k488
$$ y = [-3045, -1891, 1541, 2066, 627, -3588, -2818, 906, 81, 178, 756, -1145, -2217, -2489, 1291, 2821, -1017, -1297, -593, -2120, 12, 2859, 1973, -1424, -3320, 385, 1536, -390, 2068, 1550, -2099, -2013, 824, 3052, 1430, -830, 450, -789, -1394, 3026, 3316, 114, -1960, -1082, 1907, 1125, 721, 2524, -615, -2362, 232, 1981, 2636, 769, -725, -640, -1627, 1333, 3367, 288, -783, -1418, -223, 1131, 624, 1454, 612, -2584, -1729, 734, 1996, 1701, -1733, -1938, -656, -445, 887, 983, -196, -934, -2755, -540, 1875, 415, -114, -1611, -2940, -398, 1471, 1357, -662, -2665, -647, -722, -1279, 1534, 1311, -1762, -3014, -1294, 1726, 893, -504, 8, -2201, -2059, 1211, 1291, 355, -1119, -1275, -290, -950, 1562, 2871, -1005, -2318, -630, 752, 2189, 535, 514, -346, -2155, 759, 2331, 1019, 588, -839, -1076, 86, 1002, 2857, 1123, -1365]
1247a365J120J74J199J270j553r50r20M13K692l01p10o17k369J459J931n2L21
1264A742k213j167J116P17J849q05k364J02k05Q37J974k87j207j376p83K552J66
1281F48J30j36k789O8J708J069N38j939p91J16m67K408J077j960r41r00J009J815
1299F63m43M13j438j653J723J265P0M97k006p06M36J131K335j842j473O08j116
1316a536J419K014o82q29j917K23J869Q4J190j222k200O95J009J192N99j458p22
1333b72n50k06K964q6j573n52p36Q72J433K80J89k113j127J602K19J230j4k117
1351e57j71k17J305J494j620k42p51r88K193R90o26o03j566K22J093O15J081j797
1369a45j845J039J51J428J64j391m17j023P43K397o46l07r07j688J485J264N08
$$ y = [-1365, -245, -71, 1128, 2398, 845, -105, -1025, -612, 2080, 1779, 1069, 452, -1917, -458, 1473, 1421, 1742, -471, -1638, -522, 195, 2044, 1239, -1125, -1023, -1228, -391, 1583, 1296, 89, -1287, -2070, 482, 648, 778, 642, -2147, -2079, -371, 698, 1236, -703, -1494, -1378, -1845, 563, 1640, -320, -1261, -2161, -1152, 663, 220, 633, -805, -2458, -735, 530, 600, 1097, -909, -1615, -1179, -48, 2287, 445, -1028, -420, -1536, -117, 1897, 1215, 386, -1531, -1308, 561, 645, 1835, 613, -1587, -892, 117, 1309, 1908, 450, -272, -822, -1028, 1936, 1850, 277, -275, -1011, -139, 1294, 1574, 1763, -350, -1477, 125, 344, 1574, 1560, -557, -728, -945, 360, 1854, 234, -8, -759, -1747, 446, 1436, 810, 207, -1359, -1137, -44, 571, 1652, -145, -1990, -951, -800, 628, 792, -599, -1016, -2039, -1296, 1101, 455, 148, -759, -2447, -962, 302, 810]
1386H10n1k301O3P39R7J722k31j707n83O6J711Q13r08r8j723k4K279M68j33q97
1406A12j324P49L97Q49J248k123j095R17j32J637N93j310n19j448J399J690n66
1423A074J55j208j368J127J212R30p30j844J68m1O34J886j051j356Nm84J478O36
1441A223j64n61j769N22J781j80N84j482j100K47K63J620N82k040k95m97J26K199
1459A059n59p02n06j250J448N95L53L70k067m98J151O67Q74r06r89Po78J600J509
1478A478j528n47n87j74J712K83L20j094j831R73J222J74Q18j260j034L35M63
1495b77J534k21j124J46j197P99J540q0l92j228q36J836N77lP6j905L2R24K86
1514D87J152r76m68p48k52J970N88j278k03j053q7J836J59j31j125r76J062P9
$$ y = [810, 759, -1542, -1479, -740, -643, 1079, 848, -859, -1442, -1376, 335, 1148, 240, 142, -1581, -1605, 674, 1142, 1009, 112, -1212, -463, -66, 783, 2031, -92, -1187, -270, -402, 1235, 1828, 518, -1, -1449, -50, 1640, 1074, 1229, 21, -1347, -220, 992, 1922, 1192, -652, -484, -525, 109, 1995, 944, -412, -407, -891, 587, 1223, 1059, 498, -1271, -749, 1032, 852, 1436, -46, -1146, -899, -636, 984, 1566, -474, -769, -1266, -1140, 1059, 500, -202, -708, -1958, -510, 85, 438, 808, -1259, -1757, -606, 61, 935, 29, -960, -953, -1631, -31, 1478, -50, -597, -1184, -1358, 354, 637, 957, -137, -1968, -995, 227, 401, 1219, -41, -1075, -740, -277, 1257, 1036, -88, 58, -1139, -340, 1200, 1120, 728, -500, -1336, 500, 1077, 1074, 1150, -755, -723, 201, 487, 1639, 663, 195, -553, -805, 1165, 1753, 475, 272, -781, -868, 968, 1127, 996, -129, -1105, -43, 36]
1532C6N85J035j694p64L38K95J636p84p61l29j133J269J059j40l40j427j27Q55
1550c91R1J221m03j804J52L37R20O43r47m87m41o18J987K47k13m29j535P09J124
1569A63K30M95j115j500J067L05J051J50j356J4o24M90J670l9p71r50m78J254
1587E6N83L60p0j518n50J230M32R65j278l84O2n97J387J141j325p19l60L80J139
1606I34J16j28l75j535N44R02O18K72j662r7K37k61J907k41j248o62k36J292O52
1625A029o25L70j196j018J425R12P0p05j023L70j31J49J709j152j458J85M29J105
1643D45l08Pl6j819L64K071j66m98r04j75K27K94J001M88j800l31K70O00Q59k98
1663B91p7q16j081J624J110n41n15o02j06M90R3J529o88j389J49L6J163N05j010
$$ y = [36, 621, 1656, -38, -802, -464, -169, 1467, 683, -78, -407, -1540, -271, 788, 648, 308, -1119, -1246, -391, -300, 921, 518, -1286, -1134, -797, 123, 766, -181, -668, -1109, -1727, 260, 507, 294, -135, -1670, -961, 163, 393, 888, -227, -1727, -660, -355, 696, 846, -510, -496, -1120, -630, 1040, 1001, 230, -720, -1198, 56, 639, 999, 929, -589, -1139, 91, 523, 1488, 210, -174, -112, -709, 678, 1819, 494, -225, -585, -205, 934, 1050, 922, 547, -988, -444, 458, 1076, 1348, -314, -411, -174, -435, 1472, 1231, -17, -679, -915, 377, 1029, 404, 774, -422, -1440, -15, 897, 967, 262, -761, -391, -522, -373, 1336, 184, -1274, -1089, -660, 445, 137, 144, 108, -1711, -1347, 724, 558, 60, -844, -1019, -792, -498, 503, 991, -809, -1140, -870, -270, 589, 291, 214, -602, -1683, -59, 1051, 510, -5, -607, -713, -223, -130, 1399, 711, -678, -529, -493, 670, 1175, 165]
1682A65o2o67o2J691J47n22q17p25O69N63L32N78j221j044J022K81J186p88o25
1701A01j5q70N12J851o28p06r46L26O64k35J006o2k166J75R59L00L65o27j47n18
1721f61o11J958N17j485m30J01J71N20K01L82q11j488J312L81L39O2j067p0m12
1740a091O66J305p52q93J53k68O33Q03l13j8j405K14Q48R2L49k15r31J82J74P91
1760C24Q26j189m22l61K10J516k96j52n80o95N13R77M50l03j094l76O97n8J180
1779A167K76j632j66r0O55P62j86k15q59q27J806M74k66n81n00j12K00O10R93
1798A509j417q60P67j38N08M77m64m96q82O45J213q98K52m56q24O45M93P03k92
1817D85j189mK43JJ328p23q23k5j20P63L60k14k5j172j07J460j2j5N3j274J29
$$ y = [165, 103, -564, -626, 1065, 1212, 690, -127, -852, -183, 380, 712, 1290, 69, -975, 47, 328, 1514, 726, 101, 86, -784, -272, 1579, 951, 245, -701, -375, 289, 54, 1060, 998, -1168, -993, -34, 266, 631, 4, -143, -661, -1272, 686, 1203, -282, -712, -611, -440, 80, 281, 663, -148, -1636, -324, 57, 396, 458, -609, -679, -1091, -425, 880, 128, -765, -612, -880, -247, 556, 243, 225, -1180, -966, -118, -26, 323, 108, -823, -641, -467, 324, 1150, -39, -461, -822, -612, 904, 608, 456, -124, -819, -306, 671, 1121, 818, -276, -652, 45, -13, 1167, 1443, -189, -355, -445, 210, 972, 786, 571, -288, -1115, 691, 1165, 899, 318, -182, -294, -94, 516, 1509, 92, -768, -1, -139, 369, 846, 382, -114, -996, -351, 862, -36, 216, -240, -1064, -419, 74, 777, 485, -704, -708, -465, -464, 864, 141, -682, -707, -827, -64, 296, 82, 57, -1115, -1222, 238, 226, 211, 264, -1010, -881]
1838h81K84R35O85j306m84N1N9R36L22k18p68o52P88N00K57L55j160n46P90M28
1858C75L21o2n84l92KO15J187r86p47R8m82R81P06k28l10j180M69Q38j11O11l72
1879G49j256J05L30J170k39r32L02p70L19R55qk26n43n09M34N19j21N28j149n73
1899i15P90L83K59p4q78J48o38R69P92p96j40n90k30O61O02K76r27n55K76N07
1919h0p6P08r08n35J63K08R08j22m40j69n85L69J051j42j03p74m66R02j06Q06
1939F09J8j318J42L37L13O81o23m22j48l45J085M58k55k81n72J08O11r1N58p97
1959F8p17M56L39N60J97q50k74p0M1J111j27n99k74l57P34M57k78K43p13n56N44
1980f5K32Q45p42p64L98j95M40N69k55o29m03l0R36j40j8n7q78K23O14K24J70
$$ y = [-881, -597, 338, 1023, -283, -767, -716, -657, 279, 601, 383, -385, -1037, -249, 251, 508, 863, -297, -843, -53, 375, 696, 634, 50, -342, -340, 275, 1462, 476, -271, -173, -655, 326, 1032, 804, 494, -686, -217, 621, 510, 1121, 749, -507, -402, -72, 1098, 859, -73, 229, -541, -222, 733, 725, 499, -44, -553, -119, 400, 279, 807, -342, -915, -125, 258, 517, 443, -435, -287, -925, 44, 836, 40, -100, -690, -920, -259, 343, 619, -308, -863, -587, -80, -156, 552, -356, -891, -728, -520, 388, 266, -174, -343, -928, -559, 492, 350, 247, -527, -993, -91, -197, 609, 627, -691, -549, -212, 101, 782, 159, -263, -411, -756, 329, 787, 532, 251, -321, -213, 398, 307, 865, 68, -649, -193, 146, 706, 903, 53, -221, -291, -250, 861, 734, 135, -139, -496, 238, 695, 417, 660, -53, -609, -65, 167, 1012, 270, -494, -96, -291, 149, 718, 463, -166, -569, -599, 337, 197, 179, 122, -756, -533, 81, 305, 475]
2001D75o14m90J85Q2O30L5p71m8k47K94R56l76k44k19q77R25M29J69j60o15k44
2022g25N00J24N21k49k12m39k93J169K02n43n9m98J37Q33l89M19m31p18M81M99
2042C29J79K97p66m67k5L74R83m15l46j42p32N66P81Q0j22p82l06P89J41J59M0
2063F15r77J81r2M94N16k69o11l94K65P11J62k87o0r84L76L91M05k23m59m66L98
2084c08m9M85J92o87j57k17N89O07l74k28m63k20O34K05j04K18p09k76O42J7O73
2105D70m87p78N85l43P19L48m98l38l56J08Q51N1j49k99l58J37L91K81L88r26
2125b03j68J18N5Q83j31n87j62l17M74J042p75k45k03j2O31M9L8j56q71M33J95
2146H8K99M68m94n85k3J35N50K40l09k70l71k8O16LL04n24p70O37j61L40L08o60
$$ y = [475, -139, -629, -444, -362, 268, 303, -468, -516, -763, -469, 487, 111, -133, -352, -1229, -304, 125, 294, 134, -481, -725, -225, -101, 420, 171, -41, -480, -773, 396, 598, 55, -4, -502, -365, 468, 79, 498, 67, -651, -170, 329, 508, 805, 39, -428, -453, -79, 904, 489, 143, 1, -731, -165, 616, 696, 574, -208, -514, 275, 416, 575, 615, -362, -181, -273, 221, 737, 468, -143, -537, -272, 439, 601, 314, 254, -730, -354, 37, 442, 219, -240, -706, -308, -357, 128, 320, -367, -524, -741, -152, 455, 81, -147, -610, -830, -196, 9, -95, 123, -586, -862, -220, -203, 470, -17, -795, -210, -553, 166, 514, 16, -322, -678, -570, 281, 332, 183, -116, -474, -337, 54, 335, 723, -203, -371, -253, -198, 685, 554, -33, -195, -512, -38, 1004, 229, -16, -219, -231, 400, 449, 487, 331, -540, -107, 88, 387, 855, 361, -224, -247, -112, 438, 678, 369, 99, -272, -300, 316, 319, 623, 99, -671, -34, -195, 145, 453, -207]
2168b07j98mL15N63j99o96M0j30L86M99j75qj062K06O22l0J72j74o18K65j9L65
2190h7O74j046k46R4J57P23J61j88m18o19N81J31J75J76o34J53j38k3R90k34q12
2211d30P0pL76N81l34o6l78r9O85k67J60J20p86J73J93O65L69p19l40J08j01N91
2233E64j17j32j57o17M76N89l43K19l81m47K71L43N3L19q78k24K88P5Q08m10m94
2254a95l1m29Q34L24k88m1m86k56N65J73N9l05l95L94j69L44o9j84k4l44K4O65
2276A66O5m66J56p37O35RJ03N26p95m58P27QM7L89q06J10o0M04M01l77k40oj81
2299c80N49J36ll00p36O23K96k20Q90o95m04j98M42N27p9l28L3l75k81R46J18
2320E61J30r27m0O58k36J3N95p97l92N35j47M40j18l34L5j87J12O44l65No35m9
$$ y = [-207, -405, -409, -94, 469, 270, -426, -386, -516, -130, 369, 194, 186, -876, -670, -48, -78, 94, -80, -698, -433, -452, -87, 587, -459, -705, -611, -454, 269, 430, 242, -176, -795, -214, -83, 92, 268, -366, -213, -351, -374, 616, 382, -430, -360, -367, 9, 590, 256, 190, -188, -287, 398, 131, 291, 411, -375, -202, -9, 656, 1025, 306, -34, 74, -27, 564, 447, 315, 158, -459, 17, 606, 263, 482, 101, -346, -75, 268, 321, 640, -238, -462, -174, -99, 709, 299, -195, -226, -655, 179, 503, 215, 174, -312, -568, -3, 170, 229, -76, -471, -77, -246, 98, 29, -155, -179, -523, -499, 166, 231, -235, -79, -816, -181, -172, -69, 457, -338, -796, -69, -61, -14, 375, -431, -321, -381, 23, 424, 47, -193, -199, -380, 169, 305, 302, 2, -734, -111, 185, -35, 855, 160, -244, -442, 0, 527, 448, 120, 153, -222, -503, 443, 561, 691, -236, -276, 382, 146, 159, 754, -43, -435, 100, -47, 393, 275, -59, -24, -211, -99, 545, 180, 185, -450, -499]
2342d99N97l89P73m45o94L29K09K37N9m42J82l03L3M00mk05j9j56L27J21k68K00
2364D3l28k60L55J89J35p9n62M65j65j94N60p8m57O2j90P01k34o4L71p78K05M53
2386A50j74M73n43j60J51j23L57L75n10j66j19K80L99n2J28l34m81L72L14j42
2406A95J18n52J34K88P0L56l52m75L6L7L42M44m42M6j74k34M68j63Q3j79n15L93
2428g6K85l36L76l64Kk04O1M91p1n62L21k32j23N87M9j99l94Q1L07n6L2M06o20
2451b39k79L59K85R8o7p57L58k04M28L20n25K71l80j39N15j49L28n89k93P55k41
2472a45N8K55k30l62J51J98K75k46Q1L9m52K48O92m51J41n01L70J2k71O17m30
2493D9lp4K70N3L22m17jl22J29L34j87jL3k91j05N13l3q7m59L9L90k15K33K80
$$ y = [-499, 98, -291, 482, 37, -657, -328, -119, 118, 177, -265, -83, -386, -353, 47, 43, -162, -181, -337, -10, 111, -157, 43, -285, -545, -190, -1, 134, 55, -507, -42, -207, -401, 159, 81, -376, -314, -504, 197, -37, -101, 270, -508, -303, 150, -24, 449, -94, -254, -103, -226, 131, 506, -4, -170, -289, -9, 390, 338, 466, 132, -349, 23, 337, 195, 313, -239, -105, 183, 253, 609, 257, -218, -182, -145, 197, 641, 199, 245, 71, -163, 305, 142, 225, 46, -469, -76, 209, -127, 249, -115, -113, -317, -256, 235, 164, -398, -77, -309, -432, 155, 204, 5, -389, -308, -1, -57, -25, 381, -239, -518, -159, 126, 224, 157, -600, -242, -446, -18, 302, -223, 48, -332, -471, 44, -105, 223, -366, -659, 96, -145, -87, 168, -62, -424, -273, -75, 200, -46, 35, 74, -378, -130, 562, 111, 252, -249, 121, 133, -138, 479, 49, 46, -28, 242, 295, 617, 200, 199, -123, 6, 340, 153, 152, 185, -106, -211, 302, 269, 182, -277, -238, 152, -63, 170, 450]
2517D50l75l64J9M89J47r3M1k14n31L47L74j38Km27j91L87K8J70k26r3n6L3N34
2540C13j12l66r1k16M3O31k61K63m48m5%j7K10K79o20K35j33M21K17m28j55J29
2562a51j03L06K44l50J12l06j23M11j36J73J1m81L99j95M50K12m17j21j15l9N94
2583C75J28m39q8p0K60J38r2K48m48n5J87K7J53K27m30j32m3K03J35j06k95K70
2605A53k21K05K40K6l48k28k14N02J90l17K27l96J81j69L20n2j14n4l35K40J29
2626c5J40j60K2k04Q7j8J58J54m59J00K15k19qJ45n1P2k74L03J77M0oo22J76N49
2650B82j65J69k76j61K8j33N14j12j89r6J68J3J74p4l17J92j99K31K30j43K32
2671C68m62k79N60m2L42j9m74j94J50K31K33n3k60j51k13N89l8m9N0m08o3P3L59
$$ y = [450, 75, -289, -270, 219, 366, 273, 314, 100, -431, -84, 290, 152, 154, -273, -464, -77, -49, 121, -105, -198, -254, -221, 313, 201, -165, -256, -472, -429, 202, -59, 204, -244, -289, -289, -306, -96, 183, -437, -202, -335, 86, 303, -125, -280, -151, -254, 52, 296, -54, 58, -248, -371, 40, -96, 77, 88, -393, 6, -189, 261, 473, 56, -65, -180, -219, 375, 503, 64, -24, -94, 166, 304, 212, 460, 12, -43, 144, 171, 324, 551, 121, -11, -54, 149, 284, 178, -117, 153, -68, 137, 377, 403, 55, -173, -387, 115, 305, -12, 215, -181, 0, -169, 151, 99, -15, -69, -404, -164, -35, 105, -55, -33, -237, -150, -168, -10, 144, -315, -215, 0, -219, -227, -82, -133, -61, -335, -32, 145, 185, 179, -443, -267, 282, 117, 286, 10, -151, -123, -256, 258, 146, -43, -139, 29, 42, 216, 142, -175, 17, -182, 49, 279, 136, 368, -94, -373, 187, 145, 487, 468, -6, -200, -50, 181, 414, 361, 101, -50, -263, 326, 288, 239, 289, -119, -182, -109, 250]
2694B50K42j67m20K88m55L97J36l59M7k47R6M75l21M35n27r7NM39J3r0m70K7J64
2717a39O8J02L8m70j77M56L12K7j69k38K9m5J68k3K61K2o13K41K27r9L20k64k39
2740b05n6K67J2J60k11R9k80j95N07j23M0j45k56M17j6J35J42l23P2j69J60Q4
2762A16o1j93J68k97L03L16j27k13j66P2L40j30j47R1j28j52N41l3j51j55j44
2783a50K1j7M87k47r4j28k3J45N04n78O25m96j24J81l12N60k96k26QK00k21L61
2805A80j59j45j1m12M39K34k50K90l88m0J73RM22l92m67L43R3J64m3J6j14j35
2827a93K1L46l52J36Q3n26M91l7J35M9k25J9j91M09o4j8l8o5j71L00J30k75J77
2850A41j20o4K85n9K04k26l80m1R2L28K00o62K31pR9K29j23j1j77j85L93R4j89
$$ y = [250, 492, 325, -95, 193, -262, 135, 271, -88, -41, -288, -192, 283, -38, 397, -130, -227, -222, 217, 230, 140, -330, -303, -139, -71, 31, 69, -401, -578, -122, 190, 217, 48, -190, -161, -206, -38, -61, 200, 222, -391, -150, 77, -22, 298, 34, -205, -261, 6, 18, 178, -33, 66, -214, -409, 98, -25, 15, -130, -386, 31, 15, 150, 292, -31, 41, -128, 32, 116, 55, -138, 30, -267, 36, 352, 225, 12, -154, -82, 258, 128, -19, 72, -56, -208, 333, 300, 149, -6, -150, -129, -146, 341, 94, 0, -128, -151, -6, 498, -80, 545, 49, -75, 106, -206, 354, 58, -168, -160, 40, -181, 180, 21, -124, -135, -547, -108, 126, -124, 166, -222, -262, -89, -80, 342, -50, -517, -174, -81, 83, 40, 56, -58, -193, -172, 174, -178, -42, 41, -485, 6, -31, 104, 153, -72, -53, -244, 165, 101, 83, 45, -20, -191, 109, 239, -36, 141, 21, -43, 242, 183, 387, 161, -219, -260, -168, 160, 360, -302, -71, -78, 21, 250, 127, 116, -61, -246, 147, 241, 52]
2873E2Q8k81j00N06m75L71P6m65M4NM52k47R5j34n4L1r5K26M5m0j72k20L43l22
2897b71K29lj14O9M5K24k46l4Q6Q9l95P09k98j78j66J71K2J77k2M27o59j37K82
2920Gj51L99r2j83m7m8N7K28k27L14l00q5J57L09j31k01j26j51L21J51k3m51K90
2943A7L7k37M85k51Qp7K07k22L59j14j4m02R9K35P8j57L61o44K74N9M2K48k57
2966A34j20J2N0M7o1k84O0m8p7K55N3R6J37l61L2O6K40j65j60R3j69J77P2J08
2990A87l07J79k68p9M09k64L90m22j89K25j04J40L45l55o1K06l49M06L3j33k77
3011b88K05J88K70k03k95k55L88J2jK99k11l95J34L06J59k36k70J38p2J58L34
3032C65k12k94L36qr4R9qk32j28rK92J61k30J23o0k82Q9k1L89Nk2k61Q8o2K21
$$ y = [52, 140, -141, -241, 265, -210, 161, 237, -228, -184, -179, 273, 26, 121, -13, -67, -36, -131, 95, 140, 100, -72, -292, 51, -271, -42, -45, -159, -90, -45, 179, -67, -101, -15, 74, -321, 388, 90, -88, -254, -83, -61, 116, 94, 521, -138, -275, 7, -144, 255, 163, -20, -67, -115, -58, 170, -57, 257, -43, -128, 29, 338, 207, 6, -120, -271, 50, 201, 178, -273, 17, 54, -183, 302, 51, 59, -18, 189, -33, 326, 212, 198, -204, -105, 130, 208, 51, 412, -232, 42, 101, 143, 391, 134, 14, 26, 76, 123, 62, -222, -162, -210, -287, -32, 21, 117, 254, -107, -75, -9, 231, 66, -94, -1, -170, 7, 79, 187, -120, 59, -209, -288, 121, -143, 247, -175, -364, -139, -243, -103, 242, -113, -174, 32, -317, 89, 122, -11, -288, -83, 105, 375, 172, -123, -378, 10, 22, 21, 320, 109, -286, -152, 154, 313, 77, -193, -55, -127, 31, 365, 153, -141, 195, 187, 93, 192, 184, -48, -176, -185, 107, 268, 38, 161, 101, -181, -92, -113, 276, 281, 259, -2, 86, 24, 245]
3057B45j17m26K89q9J09K61j7n16K00k81K49J56L7j4r1q1K90K48n22J7m9n2K24
3080G0o3O3M9m86K20o5K23L0q6J3jj00K08j20N9N0p8m0J03j29O4k78J43P4q4L13
3106A52j09J60k91j24L95Q0J2k64j22O9J14P4o2N3l39J17L54l33K50O6k87Lk4
3129e6L85k22K19m81J57JN13n35K29r6j50J16j96K59O7k94k97L04J38N1J42m42
3151a88K8Q7J72J06k83K90n37M23j86J10l6J24j83J05J17k89K09k45L1r1J75K08
3173A47j6k76L0K9J65j41M9j50J5K58m35M60L1k36r2M6j3J44J25m57K78J5k74
3196b98O52q3j76j93j60J09L07m39M17r3j27R4J72j82J42j94J31Rl25O56k52j00
3218F7jr3RN4k18N10m38J04L13m81K01J55k59J00q8L6P7j60K85l73J89j97L78
$$ y = [245, 128, -298, -9, -98, 11, 272, 255, -261, -61, -342, -93, 63, 100, 86, -5, -86, 204, 452, -70, -53, -102, -154, 70, 7, 70, 119, -367, -147, -212, 11, 41, -45, -32, -33, -133, 75, -45, 14, 64, -14, -54, 49, -80, -16, -294, -151, -77, -161, 152, 43, 203, -88, -212, 183, 263, 275, 11, -111, -42, 72, 146, 84, 137, -202, -85, 269, -64, 186, 252, -35, -32, -56, 329, 107, 326, -155, 2, 3, 516, -19, 210, 114, -36, 80, -116, 143, 210, -84, -381, -77, 61, 112, 254, -188, -160, -73, 99, 205, -78, 212, -325, 98, -88, 22, -14, 110, -73, 32, 149, -140, 69, -176, -145, -236, -61, 147, 131, -145, -115, -86, 79, -62, -13, -163, -148, 110, -325, 135, 166, -70, -162, -116, -129, 15, 140, -317, -39, -24, -298, 354, 271, 95, -98, -258, -149, 158, -281, 136, 43, -84, 10, 182, 0, 142, -52, 79, 88, -237, 419, 167, 67, 66, -27, -18, 36, -182, 328, -110, -6, 307, -174, 27, 182, -77, 23, -65, -29, 48, -112, 173, -200, -11, -208, 170]
3241A70j91J32n5k45J96O6o0K55j87k02L5K31P2k80J07j65K55L4k43J07q9l98
3263d55L86J32o4j33n0O3J72k0N7M6l5O2k86Q7K2J1m9j12K22j27J97q2K4k41K1
3288a52L35j68O8R1k39l8K0Q7RJ92j54j59K40q2J30k26k10J85K23j45j5M89m96
3311a5J21p6J45j68q0R1O2K36j52l66J16L87k80j44M87m19L35j03l97K6r1N41
3333B56l95J93l5l44L19R7m7O1j11k60M22p2k33K70l12j4O5J21J5j44Q5k51L49
3356C5Qrk56K27O1J70j22k0k48J95p2j54J48K48o0j60j03N4J13Q3j32k48L0J38
3380g4K10p6j66J82j27O4K0p0Q6j3k33J85P9Q0J68n10J57p4RL2K50j71J30k69
3404a31M41l02J02j23M6j09J9K70k14J65l44J98M1o4j58J06j09K2j13J59L86k72
$$ y = [170, -21, 111, 56, -189, 7, 73, 13, 268, 81, -121, -86, 145, 217, -63, 44, -121, 134, 168, -75, 32, -57, -455, -69, 63, -1, -134, -184, -121, 51, 31, 88, 134, 99, 161, -125, -38, -16, -5, -54, -166, 56, -71, 126, 44, 68, -173, -152, 183, 15, 83, 174, -65, -103, -83, 4, 13, 205, 51, -108, 132, 50, 180, -46, -256, -71, 152, 7, -8, 481, -15, 106, 30, 175, 7, -73, 18, 80, 316, 164, -202, -86, 301, 21, -123, 364, -55, 280, 177, -220, -194, -285, 256, -139, 54, 19, -325, -6, 91, 44, 105, -6, -266, 156, 84, -149, 121, -191, -205, -140, -19, -4, -148, -63, -314, 35, 43, 34, -222, 5, 66, 236, 114, 94, -154, 41, -31, -185, -37, 211, 151, -9, -112, -58, 55, 138, 6, -242, -212, -74, 136, 60, -106, 76, -51, 13, 33, -37, 49, 36, -197, -12, 67, 147, 315, -195, -38, -112, -103, -71, 179, 8, 138, -131, 310, 8, 110, -13, 33, -76, -57, 213, -1, 164, -180, 18, 59, -5, -163, -57, -166, -144, -257, -98, 288, 16]
3426A6J32j09k95K97j66K78k93M9J7MO6RJ10k67J03N2N3k02L71l22l4J32J21n7
3450F5J68k80kj51J23j0K9R5J0k11O0J09k37R0J59L1k13K89q6j37J37l41L09j09
3474a03K27J14j40k26J60KJ9j11J54J32j77J21j67J16J13p0K9k4%P8k00p6mj46
3498a79L88j03j6j14j93J58M08l32k14R5j66N39j8k62K97k68j02l7J39R0m7k11
3520a48J72j15J58l10K98O1k40J08Kk09M64n81J67P1O8J26q2r0R8k4r0J10j54
3543a40K04k8KJ92m36L60k10k88M08l12L97j2j72L8N1m6Q3p0O9j22qJ94l94M65
3567B25k00J5pK46r8m0J03l12k24M69j26K59r6j45o4J32j03J6r5j81M7m5K68Q1
3591A25J55q1n6J21q0l01o0j5J66O9j21L5oJ74K0k47J05K7N7j16p8J14m7k8L3
$$ y = [16, 148, 39, -256, 41, -125, 153, -140, -91, -74, -70, -4, 5, 115, -152, -49, 3, 56, -146, 225, -97, -131, 1, 122, 65, 233, -47, -49, -200, -77, -87, -58, 37, 47, -164, -104, 5, -232, -142, 17, 48, -165, 124, 38, -99, 38, -303, 6, -103, 124, 238, 98, -128, 32, 34, 53, -58, 96, 228, 51, 172, 5, 121, 234, 164, 193, 169, 169, 247, 47, -29, -33, -179, 209, 106, 90, -24, -217, -59, 349, 17, -197, -102, -268, 271, 253, -9, 288, 20, -82, -119, 20, 110, 63, -148, 24, -91, 67, -243, 55, 116, -124, -16, -14, -223, 241, -340, -173, -102, -34, 92, 10, -80, 18, -6, -96, 14, -140, 64, 36, 38, 230, -206, 154, -56, -344, 64, -248, 149, 137, -35, 3, 54, 8, 91, 21, 90, -32, -40, 154, -240, 225, 25, 40, 33, 279, 181, 141, 244, -68, -292, 177, 51, 310, 214, 69, 5, 137, 34, 50, -45, -226, -179, -224, 44, 125, 280, 199, 143, 264, 184, -117, -177, -192, -26, 43, -78, -43, -49, 125, 145, -102, 3, 30, 87, -29, -107, 7, -40, -68, -35]
3616c5N7r5P4j20J73k8J5l04R9L9K47k1j29p9L7j5nj8K62k62J24j46J80k3J64
3641A91j68M9k06j23M56k71K62m38K65j80J59K36o2l07J08m3J97l9J54j88J7N8
3663A27k99M15l20K46m1k86J74Q7J18k95K84j29J1l46O83m13j57J29J41k35M47
3684C41o49J68M56l70K37k45Q7k58M41m6j13J09j34l1n5l03L57K03j65k20j0J79
3706b1J28k7k4J25m54K03J19o7L9j7L8q2j00M8K88l12J92q4m8K40k53O3j12M2
3730g6J60P5k1n3k60J47J05j75K24M5q8j43P1J69r4k17J61P7J01l5J68l31P9j55
3754f6J67j20O6j9j27J02J58K1P1l0k59j37l7L5L23j42J43k55j26M05j92JJ52
3777A34j13k89M78k68K21m11L19k81L20K6j48M2j02K14j62j2k1j1K60k72J17k5
$$ y = [-35, 22, -73, 1, -119, 54, 26, 41, -263, -164, -125, 122, 101, -28, -107, -70, -85, -90, -108, 154, -108, 16, -130, 50, 27, 191, 23, 72, -134, -257, 199, -72, 190, -248, 17, -163, -4, 232, 170, -137, -29, -72, 125, 86, 240, 52, 69, 127, -172, 243, -77, 169, 128, -158, 16, 103, 221, -74, 210, 81, 92, -254, 429, 16, -141, -12, 129, -106, 341, -308, -140, 316, -54, 183, -62, 25, -233, 208, 162, 49, 158, 24, -7, -62, -365, -8, 195, 30, -190, -200, -21, 107, 80, 56, 181, -273, -70, 49, -18, 21, 4, 42, -40, -140, -92, 196, -116, 76, -8, -56, 184, -69, -6, -118, -76, 84, 159, 138, 85, -175, -28, 77, -98, 126, 171, 83, -60, 11, 180, 86, -131, 30, 107, 208, 173, 341, 10, 89, -66, 101, -19, 47, 28, -99, 3, 161, 182, 253, 223, -36, -173, -210, -175, 148, 6, 149, -106, -232, 173, -19, -18, 134, 21, -268, 210, -58, 163, -248, 71, -210, 110, 136, -12, 30, -72, 142, -20, -32, -53, -64, 196, -76, 41, 16]
3799A6J77l37K48j90k11L23J37j8l96K94j70K70k08J23L8M1l12K34L30k18p8J12
3821B05l73J54J3L4j15J93k83j07L02N0l14J04J83J11J3k37K79j64k89J99J85
3842A43J2k26J06p9m7R6P5k7l2k21L78L4j13k3j84J02J27j09j58L13k31P6k57
3865b45L21j09J08j15J15n0M6R4N3k20K04k56J18J77j38j10j45R2L36l03M0QK
3888B3k15M1K5K18J20j52q7O6j33K44o7k96K19m7j8n6K18j43LJ51k51J24L3j77
3912a57K48k71J39mK32k53L4j66j03J17K67k9k22J05M3J0J00j86o4L90qk61J04
3935F5r6J44l87K32J73k98K47O5k33O2k94K91J02r9r6M54k71n0L31m44J7M5K09
3958A69l65J66mQ1K5L5r0L9j16L7R5L6j26k25L42j94j38K82Q0q0j9O6k52O1L08
$$ y = [16, 193, -144, 104, -86, -297, 26, 163, 145, -251, 43, -127, 143, -65, 58, 96, 137, -175, 59, 389, 171, 93, 205, -168, -14, -1, 33, -82, 111, -172, -279, 23, 73, -241, -137, 46, 157, 170, -67, 212, 48, -241, -42, 143, 155, -71, 35, -44, -91, 5, 80, 53, 21, -200, 178, 212, 99, 76, -108, -6, 121, 12, -146, 167, -64, 12, -245, 76, -33, 75, -40, 75, 25, 71, 165, 218, -2, 202, -54, 64, 241, 103, -7, -152, -60, 276, -27, 13, 21, 23, -192, -151, -126, 92, 212, 60, -27, 39, -94, 150, 83, -213, 6, -41, -59, -115, 103, -40, -37, 114, -137, -13, 20, -157, 91, -180, -41, -45, 187, -66, -32, -198, -301, -184, 83, 54, -168, -63, -20, -10, 90, -96, -160, 230, 222, -39, 65, -31, 113, -274, -42, 131, -167, 80, 145, -88, -26, -320, -29, 73, -26, -122, 332, 61, 11, 342, -102, -85, -40, 169, -196, -30, -34, 47, 72, 107, 17, 56, -60, -23, 72, 108, -18, -243, 99, -95, -233, 49, 129, 49, 30, 96, -156, -95, 213]
3983B13n1l59lL22j04j91J18L48n37J41J33J65k22O0Pj35j25N10j3j42j44p9J93
4006A05j40k63K55P2m4J34l45M66j54K5O5j31j43j3K25J43j16p3j01OJ17o7j34
4029a11J81Q5j10j55J74k02J12R7k3R4m94L39K10n19N43l34J88J69n93M39j47
4050e7ML8j20L58m34O8K13j18j8J22k04K36k5k15Q7J13k27mJ28j29M42j59Qj38
4074c1M9J19j21oL6r3r7L91k68j4J24k30j7K12O6Pk66r1L14J45l60k5J87J54j88
4099cJ0J17P3k66L7j33qL17k96M82l61m7K16O8l31O2J24l59L22J91l48K56k49
4122a26K5P0j42N8K49j92J21O0k35K61K4m4J8k50J94O6k54rL5J50O3q3L8k79J50
4147c2N0N1j63K04P2k87J56k37J85j06R2Pk39L87j65M11k16l03J3K02j42K54k78
$$ y = [213, 162, -197, -200, 122, 18, -173, -55, 293, -244, -103, 30, 195, -27, 33, 40, -95, -220, 290, 277, 135, -9, -88, 105, -35, -298, -43, 29, -15, 119, -226, 240, 86, 111, 176, 45, -98, -111, 114, 257, 141, 68, -33, -27, 90, 23, -111, 70, 155, 45, -110, 64, -138, -26, 71, 48, 142, -352, -13, 197, -322, 221, -113, 75, 244, -349, 90, -57, -53, -15, -135, 223, -211, -143, 70, -48, -66, 56, -148, 88, 63, -152, -65, 48, -179, -183, -55, -184, 258, 99, 107, -31, 18, 137, 16, 10, 46, -47, -144, 247, -21, -35, 89, -141, -158, 54, 120, 127, -139, -230, 84, 229, -131, -156, 31, 185, -3, 7, 124, 197, -69, -32, -165, -173, 144, -152, 330, -31, -78, 138, 206, -125, -63, 61, -298, 24, 215, -133, 123, -126, -101, -31, -173, -115, 134, -58, 63, 123, -112, 149, 173, 129, 147, -103, 91, 157, -97, -106, -71, 79, 142, 59, 97, -182, -32, 18, 69, -94, 110, 182, -105, 51, -186, -1, -107, -15, -8, -247, 140, -25, 386, 170, -133, -120, 82, -60, 194, -84]
4170h4P1K1o1J03N5l0J02k98RM40l59k03L16k62lR0P7m1j09M02kl65J55k4J4K44
4196B58l13l6rM0j19K80n7K21l2M7l01j21J88l17M39%j51J66k23K13k11J3J03
4219G8l0m4J7J45m46K30j3L42k51k46L17l6q3l32K82L33l11k3q2K68o6j19j31
4242b01R3L8K5J43M3j94q9O5K1K6K43k16j36j4K29q7K40j55j6j14o3K36j76J41
4266H2j49L9K0j78J22J24j07K91j06j43R8o7j17K13j19l9R7J7j95K68k03L0j07
4289a29m6K21J93l69J34n1K7q4J9n0L9J83j22J85j24j12J62j7l7l0J47l08L38
4312A69l00J01j30j15K20n5L06l26J29K41k55q7j46J52n5J36K83l32J67L0j50
4333a7J47J31k27L3k17K4J4L23j78J11k05K3J60k28q0N0j41J84M2l2K31j5j21
$$ y = [-84, -13, 8, -53, 50, 105, 75, 177, -121, -112, 328, -31, -234, 82, -180, -183, -93, -16, -57, -166, 236, 234, -131, 24, 0, 14, 258, -55, -91, -100, -60, -179, 101, 44, 265, 233, 280, -21, -142, 46, -271, 168, 168, 17, 183, -40, 173, -38, -25, 78, 48, 4, 21, 166, -280, -50, -63, 279, 28, -218, 99, 63, -20, -352, -70, 263, -48, -71, -153, 115, 49, -70, -201, -108, -70, -45, 98, 141, -53, -142, -77, -56, -30, 213, -3, -139, -153, 76, -11, 229, 74, 58, -56, -119, 117, -59, 82, -67, -28, -8, -186, -64, 60, -47, 244, 138, -5, 93, 26, -91, 122, 3, -36, 61, 78, -117, 151, -52, -22, -129, -175, 46, 239, -130, 4, -47, -20, -104, -85, -135, -96, 87, -35, 150, 26, -86, 76, 59, 22, -8, 139, -169, 169, -131, -30, -160, -275, -55, -110, 196, -130, -1, 240, -15, -102, -248, -96, -151, -15, 268, -64, 103, 133, -17, 130, 261, 34, 67, -150, -126, -112, 211, 33, 144, -61, -38, 122, -106, -186, -136, -277, -93, -51, -83, 148, 133, 12]
4356A2n9k40J89J09m4k03N2j20N72l36p0K04o1J17k09K07k25J30L5MKJ7l72J7
4380b72M00j89N4P0m0J82k18j1K6ln6p7K04k32K02p4J04p1m8J44p4k6r9R8J05
4405I9j21l5K12k77K35l5k9J40j33j40n5k0o5J49K11l03J05J87l60L14o3l48K82
4428e0q9K44j92M7J39N8k27J07j49J05J33j54M2p4J91j54K04j79Q5j27K62m94
4450b72K76Q2j52P7M6l00J71M7Ro0M7k2J14J47k01o8J18o8J58j1J82m31J8J47
4474E4O0k3l93M42k55K60k77J63k58L83k93j04N2J63k1j96r6K51K19j21j68K93
4496A35j67k70J72R6n2r1K50j90K54k57L86l53J23lk74L70k88K97j04j02J57P9
4518A68N4l37J16O6m8q4K31K12m29l1J57j33p5L68j81k74Q4J31p3P6k29J00J37
$$ y = [12, -47, -287, -98, 11, -33, -236, -184, -304, 268, -68, -138, 66, 5, 122, -87, 120, -105, 25, 60, 64, 66, 83, -289, -272, 128, -61, -7, 63, 23, 205, -13, -24, 2, -1, -57, -134, 70, -162, 40, -34, 70, -1, -49, 95, 21, -5, -104, -6, 99, -22, -57, 155, -122, 113, 78, 49, 189, 56, -84, -139, -159, -224, -75, 136, -167, -62, 125, -235, 79, 16, -332, -50, -139, 105, -87, -40, 99, 157, -70, 37, -112, -7, 126, -28, 14, -60, 131, -23, 181, 2, 87, -40, 222, -272, 4, 86, -66, 11, 57, -243, -72, -25, -16, -76, -29, -51, 63, 210, 9, -59, 59, -9, 149, 138, 320, -111, -93, 54, 114, 91, -302, 140, -115, 145, -132, 31, -227, 156, -137, -241, -189, -26, -47, -243, -339, -88, 131, 10, -158, 135, -32, -302, -130, -34, -86, -177, 73, -117, 137, -120, 266, -87, 36, 33, -241, 129, -159, 138, 34, -68, 89, 168, 222, -115, 1, 67, 19, -65, 166, 378, -51, -82, 75, -58, -133, 235, 54, -220, -136, -5, -78, -2, -231, -131, 6]
4541FK69j16j61k09K24q7J49K4j60L5Q1j88k65O18j43JQ6j14j16J97J07k30M8
4564E6J28k18J21j44J72p0L1M1j03o1j73L27l36L52m65K13K14J32K0l84J66M4
4586F3o6j20O8on0J83rR8k18K0Q9o6K35r6m76K35R2l7M9L1j82J67k5j21Q8J43
4612H9n28M65LK52L5k62q9jJ34k11K13J6j09j28j5J38J00j25j14J23j41J17J61
4635A23O7m39K34N7Or5K58ml47K70k15R5Lo2J21K63l05q7Q0J22j67j63L75k11
4659b1J48m70L04r6K7r1M6J92k44K76L6j52L35m55jP8M5L72m50Q6O6o0k39M88
4683B20j23k87K14q1Q7j87J01K60k55K47l31M2R9N1K08J50l64m65M06j82J39J94
4705A43j72l6J6MJ76k57M5j10P0J01j75O1p3J08J26J15P1k03J10l32M31j42k94
$$ y = [6, 275, 159, -2, -211, 13, -74, 75, 99, -61, -26, 55, -133, -398, 220, 77, 78, 164, 50, -66, 131, 238, 8, 56, 184, -34, 87, -57, 115, 45, 76, 117, 14, -47, -220, 107, -229, 123, -342, -129, 85, 217, 237, -147, 19, 63, -3, -123, -55, -61, -111, 72, 63, 161, -57, -37, 52, -14, 221, 125, -351, -116, -24, -61, -12, 19, -163, 4, -21, -142, -54, 89, -439, 26, 29, 281, 316, 54, -35, -36, 98, -113, 100, 116, 7, -121, -136, 2, 102, -23, -137, -14, -155, -38, 123, 190, -249, -15, 42, 48, -47, 211, 207, -140, 130, -85, 10, 13, -49, 72, 335, 30, -57, 23, 145, -22, -185, 190, -21, 127, -343, -39, -135, -108, -199, -153, 39, -205, 71, 107, -45, 290, -165, -166, -88, -43, 329, -121, -35, 31, -29, -268, 220, 97, -190, 24, -57, 30, -157, -56, 204, -51, 196, -135, -93, 6, 57, 265, 415, 51, -414, -8, -190, -51, 143, -29, -65, -49, -45, 131, -126, -81, -191, -121, -20, -195, -134, -207, -99, 27, 142, 213, 10, 120, -212, 219, 77, -217]
4728b17J59j28q1L65k76K46J00k46j64J07O1o3J96k8j68K19O7l18R1Jm0K51k19
4751h5J88k46K12n9M6k97L2M9L37k03N8L9j74K51q1J51l69J94k47L36k66J72j68
4774a30L16k6p9J03j86J09j60J44o1L40m01J05j44K10Om03L76r1k66J11j04J22
4796a09J1Q3r8J05n7J2J27m9m9j22l7R6j8L8N2L3j38Q0j47J04J08k70J20J50J18
4821A43Mj07lL0j66Lp8K76l2L2L1k8k37l5K37n81M14k19L68m2O1l02K33N0j75
4846a23N9L79m49k73N19l57K25J17k86L8J10j11L09M8k13K60l11K5M7Oo0L3K16
4869B08k72K73k72J56p3r9J2J23On8j52J63K26m90L70p4K7j31J01r8J21k16L73
4892B24k13N6J6k72K81k43L5j7j32K73J85p1m57K48P6k7k1J78p9j98L63l83L32
$$ y = [-217, -58, -186, -267, 98, -178, 68, 168, -78, -242, -135, -74, -137, 59, 31, -137, 82, 149, -169, -78, -77, -117, 134, -85, 103, -143, 69, 10, 56, -241, -209, -160, 177, -26, 32, 71, -103, 148, 67, 218, -151, 43, -204, 132, -134, 38, -130, 186, 160, 81, 184, -2, 107, -53, 91, 30, 370, -31, 74, -70, 140, 146, -257, 119, 28, -238, -127, -231, -109, -98, -15, -113, -8, -65, -53, 74, 25, -24, -146, -183, -87, -105, -67, -15, 18, -120, -40, -187, -83, 25, -245, -125, 25, 143, 147, 40, 37, 67, -99, -96, -174, 102, 70, 102, 133, 105, -132, -167, 70, -511, -97, -316, 52, 10, 71, -231, 2, 52, -123, -64, 315, -134, -407, 112, -245, -20, 97, -189, -151, -41, -152, 157, 205, -8, 252, -59, -34, 13, 19, -41, -8, 208, -64, 209, -63, 93, 20, -79, -67, 56, 62, 4, -148, 15, 241, -249, 121, 47, 74, -57, 44, -54, 67, -149, 224, 11, 67, 83, -189, 92, -151, -116, -133, -265, 8, 193, 122, -335, -87, -11, -38, -59, 119, 40, -158, 205, -178, 154]
4915A54j6k54r9J76J95l30K26%j3J05k75K74k75J57n1J74R2l60J41j37J2K37j11
4938B2j37N4J57J04q6k99k8J87J95j40j36L51k17O7J6M8k84N6j7J65k94L00J3
4961I7k64O9K6Lj1J16O2k08r0J98k44J02J62N9l1J08k42J41k27N17m32p1L77k31
4985a4M6l38L19l9P4j35J15j49o7Q1K43r9J50k68Q0r5J33o3J4j14J88j78K32j00
5009A6l4J37Qr3j59J46j43J62J27Jk14J10J49l3j78ll6L1NJ98k13J68l74L85l10
5034a47o7L38J12m01J26J63K47l65K9J81l43K85k24l7K9J6J12P1o9J56m51O8J87
5057A6j73l2L0K05j14J66k33j56M25j34r0K4k1J38n1j36J3j07J75J19R1j92M5
5080HK9OQ0J61k14PL7j26M4Pj42Q2J73j2P4l0j40j1o5J04o6k08K94k15Q7K58m15
$$ y = [154, 138, -116, -215, -39, 156, -174, 52, 52, 39, 144, -131, 143, -132, 25, -26, 148, 240, -120, 21, -116, -104, 133, 22, -115, -61, 96, 200, 114, -185, -213, -26, 169, 29, -107, 244, 27, 94, 110, 158, -126, -70, -87, 78, -216, 84, 97, -167, -98, -72, -69, -80, 36, 98, -110, -200, -2, -246, -144, 18, 77, 46, 154, -88, 53, -174, 343, -89, -160, 217, -14, 32, -306, 13, -26, 48, -87, 28, -121, -188, -107, 136, 37, 187, -81, -1, -96, 37, -26, -12, -126, 62, -116, 116, 16, -18, 119, 127, 34, -125, 21, -122, 40, 167, 168, -46, 64, 213, 180, 2, -1, -37, -6, -1, 197, -16, 152, -222, 163, -147, -214, 124, 236, -165, -39, 124, 371, 6, 35, 216, -127, 158, -66, -103, -74, -58, 54, 125, 56, 212, -239, -171, 16, -157, -189, -159, 46, -68, 98, -135, -291, 134, 0, -90, -66, -87, 51, 0, -136, -123, -230, -55, 64, 155, -37, 8, 37, 43, 123, 284, 70, 77, 114, -12, 32, 39, -103, -21, 152, 140, 214, 184, 44, 33, -32, 72, 6, -202, 92, -123, -36, 222, -193]
5107a93L06j22k26M12l58K96K1k27J45o3J46l06JK76n9R4k05K57j88N2q3j93L44
5130A27o0K5j45P3J09m64K89L3J05l4o6j86R3J09j95K99j07J71j12K21l52J79
5152A12k64J92J27p7m8J23j26k06l6K01k38K79p7R5j06K0P2l50J44K92k67K25
5174H7l95L82j69j04J83nl8o6J81q3p1K65j70l0J89k39J75n4M7O3L3l29o9K29
5198A2j69J4K53m3pK11J03k59M2k62M91j78j82J25k47K17l07K10l18L02j16Q8
5220b0p8J63J65P0k96j67j38K35J30lO0q0j26K01K19n73J18J57K9k48J03K00J58
5243B79m12PJ37j30K34j13J69j75o8J07Nj95J11j84J40N6N6P9m31N41k00K46k94
5266c5j96K57j8N0N5l16K19L7J58n4k63Q0J2K58j98n3L2j21J89j01l2K20j78m4
$$ y = [-193, 113, -9, -235, 177, -181, 115, 136, -91, 54, -9, 137, -169, -168, 108, 49, 143, -62, 195, 7, 59, -24, -217, 127, 67, 92, -53, 20, 129, -335, -46, -13, 92, 58, -8, -194, -101, 8, -187, 112, 5, 176, 64, 285, -67, 112, -152, 40, 167, 90, 42, 165, 39, -167, -203, -2, -240, 39, -38, 57, -49, -29, 43, -307, -163, 129, -138, 87, -308, 74, -95, -199, -16, -21, -59, -125, 56, -27, -98, 167, -3, -33, 156, -83, 92, 38, 85, 148, 181, -148, -217, 12, -157, -143, 110, 67, 60, 271, 374, 115, 157, -105, 386, 208, 26, 151, -96, 121, -186, 24, -294, 8, -108, -20, -98, 65, 230, 300, 4, -163, -301, -66, 64, 61, 121, 41, -85, 116, 335, -238, -120, 37, 66, -182, -79, 121, 279, -133, -126, 11, -119, 115, 2, 171, -4, -72, 35, 40, -155, -44, -228, -88, -32, 24, 103, -328, 213, 13, 259, -35, -231, 26, 8, 58, 113, -203, 16, 53, 211, 157, -106, -26, -14, 244, 46, -7, 25, -96, 93, -8, -40, 180, 2, -42]
5290d2J38q9k82Q4L30k39L05j14m1K9R3k16j5Q6j24J67j2m9q4kQ3j18K73j01l08
5315b48L71p9k03L31n48K84J9Q5q9J7l2P6j4%j28j83L56KQ1k29J82J7K21k70q0
5340f1J86o5k3p2N7J09l50J7J40Q0k4k0Q1OJ1l53L32p7j50J71j62m0J66J65j36
5365a2j33r5KK14J56l10J83K96k12j32J93K9j66l4j2q1K63j92J49Ol18J28J79
5388A01o9J0l9J11j34On7O2k1Q3j67j25J51p2K97j30J93r2j68LK08k58K14j23
5412a6mj20J36n0J1O6r5j32J56l9K2O1j69K31m1k47K79k18L08l29K6J05n0J18
5436Ip9Q3j02R9j43J40O8j35J70k68J84k15M9L54j77j90N6RJ61k8j33J93m49M02
5460E8r8l1K39N9l13J38j26N4k43M02K33k81k29L19j93M1K17j62j42K06l49K86
$$ y = [-42, 96, 7, -275, -191, 139, -100, 205, 91, 50, 79, 172, -44, -59, 27, -97, 70, 58, 9, -75, -77, 6, -112, 161, 60, -248, 123, 44, -159, 172, -376, -92, -73, 12, -77, -60, -92, -16, -30, -30, -158, -341, 15, 17, 98, -131, 51, 68, 289, 19, -61, 125, 60, 37, -35, 22, 131, -219, -202, -62, 18, -6, -26, 55, 61, 72, -281, 51, -26, -176, -5, -167, -207, -41, 124, -12, -145, -240, -238, -24, 132, -178, 5, 301, 89, -43, 150, 179, 13, -21, -33, -114, 149, -43, 106, 112, -206, -78, 101, 32, 42, 3, 114, -20, -14, -71, -9, -30, 53, -114, -239, -88, -160, 137, 7, 200, 108, -60, -57, 151, -107, 107, -16, -20, -140, -4, -54, -43, 23, -72, -204, -48, -87, -65, -4, -173, 58, 17, -230, 49, -169, 139, -190, -164, -59, -109, 9, -70, 13, -89, 10, -133, 7, 75, -60, 110, -158, 26, -189, -140, 214, 37, -153, -97, -88, 73, 45, -88, 105, -344, 58, -40, -71, 168, 227, -86, 52, -74, -20, -263, 139, 372, 91, -138, 181, -12, 29, 246, 84, -58, 148, -201, 85]
5482H5o9M1j35j54K17p6J6J80j40K03j72RJ41l54J65M1Q7k80k2R9k25L51p3K16
5506A51L9k94J47m4J24l1k12J21O2j10OK31j24j58K33j54R1l0p4J29n9k15K40
5529F9j38J01J52l79J10K66m45L27j14K28j03j30k56K05R7j36J49M9K1j07l7j56
5551b27L55k19n4L80n0p2j60j24R1JM4M7J16k0j45Q0M0k25mR7K39L8k72J65j68
5576d7O1j41j68n6L23j32L48l88L00k21j50J88K41j64J48j38P7J24j56j52J39
5597C6Rj38n7N0J69j57K42l05J41J47q8J66k49j1m7K39m0j93j23K20N6o2J09l2
5621H2l23L27Q7N5l84J00K45j47J52j04j45P3j1kJ32n8j95%Q8k60K19j25K22j57
5645a29L62m18K40m6K2k9M35j80l41j27K53j72j0r0n1K51l4K12j10J44j85j3J08
$$ y = [85, 16, 57, -78, -232, -15, -91, -75, 105, -35, 168, -4, 5, 146, -208, -43, -2, 85, -195, -217, -118, -343, 8, -65, 151, 190, -104, 43, -1, 123, 92, -120, 1, 63, -47, -41, 190, 66, -92, 141, -13, 78, 48, -26, 103, 44, -171, 69, -69, 32, 184, -195, -85, 181, -264, 63, -51, 177, 74, -56, -312, -107, -10, -146, 3, 52, 73, -34, -71, -227, 128, -91, -145, 235, 185, 113, -47, -171, -80, -79, -35, 12, 128, 108, -37, 43, 83, -142, -146, -49, 190, 228, -44, 121, -47, 14, -127, -295, -351, -28, -160, 188, -200, 100, -121, -271, -83, 158, -6, 142, 4, 81, 205, 49, -103, 36, 45, -93, -150, -100, 69, -88, 154, -151, -10, 137, 49, 215, -34, -45, -92, 147, 107, -86, -209, 11, 67, 5, 114, 82, -241, 86, 173, 228, -156, -56, 189, 42, 194, 90, -55, 18, 7, 5, 137, 79, -116, -116, -28, -288, -69, -194, 28, -129, 233, -185, 55, 9, 31, 2, 437, 257, -84, -211, 42, -130, -140, -230, -281, -30, -64, 148, 38, 182, -3, -16, 92]
5668I2j61K0R6m37K94K32j66p6J51j55k5K74o1P0k17k2j73K42k85J22L26R1j26
5691A06l00K71k23J8L1L91k01n2J73l09K00p3O4j07k2J58l5Q3j37j25o7K28L6
5714A08k86J40j1k8P4L7J9j39N7l0k18K95o2J5J03j50K5J40R8o14N23J10k56J56
5738A06j54J54o3nQ5n7J62k04o2K75k1k75J92j44l3J90j92L6L4k26J69o7J25M8
5762G3m7J27P7l84P7J1R9j82O0P4o5L0o7J3K12j36J61k28L55j94k73N2m1L38l31
5787a89j31N92k66n5J05k17K10j72J04l7m9j04m2K91k30J35J69J05l64k1oJ05
5809f7K93k24J57l63M70k04M8j15J63j08L0op4j66P8R7K53n48K92l1m3R3Q7k3
5833H9m8j61J01J99j30j73K02n23L23K78j36J44l05O3J7K00n6j50K05j83k7K18
$$ y = [92, -69, -49, 47, -390, -96, 136, -30, -106, 45, -110, -135, 139, 78, 148, -69, -91, -264, -22, -307, -185, 141, 232, 106, -194, 77, -146, -128, -97, 294, 93, 41, 214, -95, 105, 32, 96, -11, -33, 125, 90, 173, 36, -89, -156, 72, 108, -178, -38, -49, -77, -3, 34, 53, -86, -29, -59, -277, 18, -44, -29, 74, -76, -51, 89, 187, -427, 96, 206, -50, 106, -48, 106, 43, 38, 123, 66, 228, 24, -38, 237, 216, -59, 133, -11, -44, 146, -46, -10, 24, -202, -33, -100, 25, 73, 26, 153, 230, -154, -77, -66, 33, -149, -89, -15, -80, -50, -117, -104, 108, -28, 133, -95, 260, 66, -207, -155, -196, 142, -189, -320, 272, 6, -49, 56, -161, 49, -123, -19, -56, -105, -209, -251, 40, -190, -55, 114, 219, -145, -166, -172, -67, 226, 2, 159, -204, 266, 62, 110, -5, 158, 50, 80, 74, 0, -166, -88, 9, 262, -286, 6, -25, -68, 25, 112, 89, 41, -120, -19, 180, 50, -123, 79, -444, -121, 157, 21, 165, -140, -77, -60, 140, 84, -66, 139, -44, -71, 147]
5855A47l13N8M03l80L1k3n9M2j0K8r4J22p0j19K26J17r5j28l5L27o4J51M2n57
5879b53J99j11K35k4J00l91L56k44j22K77j52J24J00k43j26K69N9k78J43R6J00
5900A14k17m0M4J13m26O49j91j62O0j5L6L0J8K96l04l0R3j20J47j86J11Mj72k8
5924a76L58q8M8r7m6k08K48j97J26j0r7J23n7K55j16m2O1J9j22n0l6K1J22n5j66
5949a82M88m7J10l99J2PJ12l4j73J23N7k84L3J07o7K37L9j68K96j91k29M2L3K19
5973A41l7j73K11m22J41J12K55l14j2L61k84j89K91M9k9j02o2K23l12O8J7K06
5995A39k94K01o2R8l41J27J85k29J28K90n12J49%K27k15M2NJ25Qj74K01k34K16
6018H0o2N6o0K09j56j56p7l9L25j56K39l32J99j95J53k09M28j9k15j43J65L0k42
$$ y = [147, -166, -108, 295, -85, -54, -77, -136, -94, -104, -76, -170, -48, -118, -237, -11, 106, 11, -117, -152, 175, 111, 262, 304, -253, -54, -165, 70, 46, 146, -245, 111, -133, -255, 22, -130, -6, 94, -149, -275, -6, 53, -225, -82, 14, 114, -103, -143, -99, 14, -412, 237, 46, -116, -56, -71, -35, -5, 13, 309, 5, -25, 68, -52, 95, -91, 20, 24, -148, -176, 182, 94, 142, 45, -1, -209, 39, -158, -32, -42, -139, -16, -73, 182, 66, 24, 85, 104, -18, -68, -104, -83, 39, -16, -182, 306, 259, 369, -30, -18, -11, 101, 67, -106, 17, 74, -210, -177, -70, -137, 100, 139, -29, 267, 76, -153, -111, -78, 141, 104, -69, 142, -280, -139, -27, 228, -86, -98, 263, -21, -210, 81, 130, 101, -1, -63, 160, -152, -84, -67, 139, -155, 46, -16, 82, -259, -132, 53, -176, -48, 242, -270, -121, -121, 106, -109, -67, -62, 63, 71, -103, 98, -136, 80, 18, 74, 14, 223, 67, -89, -166, -205, 120, -36, 203, -129, 70, -125, 28, -181, 247, 228, 13, -130, 35, 65, -177]
6041a77L36m34L84n2n3p9k4j14K24n9k28J94o1K38p4j04R7M5J34k99K13o5L8j79
6065i9NK12L9p0j94J14M6J93l02o5o5K66m5j88J03K21j43j67K42O4l42J5J11J80
6089A31R1j92j25J27l6K5J81j92K2k86J41J90j36J59m4M0j76K55k54P8J77l4j20
6112B2M3J09o7m2J38j83p5J72j08j32NN5j63J08K72M2k27J18k24k06L05k1j09
6135a68J32J66Pj10j09K82q0k62K01N6r5p2P3kq1Q9R5l02M2Q5j14K88qk78K3p6
6161b18J36l0K37l50K16J30j84j8l4J27Q3j04p3J67k65R7J35R3k40p8J42k54K99
6184A4o8j7J69k0N9j47m7J95Q7l10Q8K9j53J84l9k11L46j12j36J13j58P0N6j37
6208a45K34j74P0K08q6j92R8L88m12O5j46P5J19j15J0q2O9k5K47j30j44r9K42
$$ y = [-177, 159, -275, 109, 57, 4, -75, -99, -213, 11, -48, -276, -82, -143, 95, 21, -83, 14, 59, 193, -106, 107, 42, 80, -99, -94, 118, 157, 87, -107, 7, 53, 246, -56, -121, -186, 80, 35, -153, -50, 171, 28, -139, 103, 167, -175, -160, -49, 131, 222, 30, -95, 32, -4, 21, 202, 10, 32, -254, -113, 77, -59, 100, 56, 96, -80, 175, -79, -1, 176, 142, 22, 65, 174, 107, 65, 203, 20, -55, 117, 9, -123, -118, -63, -226, -118, 154, 196, -31, 87, -137, -343, -38, -59, -168, -36, 130, 137, 27, -82, 200, 120, -142, 59, 115, 20, -52, 21, 19, -62, 27, 122, -180, -138, -53, -167, 121, 113, -165, -142, -218, -82, -112, 125, -225, -9, 121, -63, -81, -115, 12, 95, -9, -82, 85, -180, -83, 52, 145, -95, -173, -31, -285, 14, -54, -71, 98, 78, 137, -10, -57, 138, 225, -85, 3, 32, -121, 63, 24, -187, 159, 47, -89, 24, -134, -64, -8, -145, 89, -85, -15, 193, 107, -85, 13, 401, -11, 54, -92, -17, 102, -13, -3, -85, -16, -41, 206, 76, -68, -167, 75]
6231G5lL2k86L16nk8j27m0J25M4o1j1k40K87Rj11k1O0L9k6l2k44L57j36r5P4k58
6258c06M42j98j40J78O0j83N3J78m2l01N00j61o5J98k58K42j27r0j92J82j22K94
6280A42j51p0K16M7Mm0j10O1J94k99J63k00L2kj89J76j15M69k96r1K4j32Q9K83
6304B05l05J13J50j49K80k82K0k1K6o1l6p5J33J3m5k5J38N3J16rk75Q6k45J08
6328h7n8L84l85K77l0k67r5N31l30o2n8K14L84m57j00J28N5j47K14l26Q6K42O8
6351A81k30j00K59j58k51L91K24l00p4oQ6J9j7J32n2j44m7J76n6P3k43J57J00
6374A20k93P9R8Q7j98J22K7J35l6j14j1j23q3J98oj03K51j09o2K56m23RO0J08
6398a1k12M11k12j09J71L0K4k45M6J95n6j11j96J77l9N6k79M78j92l3J21K34l57
$$ y = [75, 72, 104, -182, 134, 129, 101, -26, -66, 59, 103, 42, 31, -209, 78, 87, -24, -45, 15, 54, 28, -4, -248, 109, -27, -122, -48, -306, 136, -62, -202, -24, 36, -147, -94, 84, 42, -259, 241, 80, 15, 213, -45, 197, 70, -20, -212, -30, -152, 142, -9, -79, 137, 184, 188, 148, 38, 99, 293, -6, 157, -43, -11, -13, -202, -26, -141, 328, 32, -59, -35, -167, -78, 205, -100, 13, 163, 14, 294, 12, 32, 11, 37, -24, -60, -135, -2, 11, -34, -59, 79, 132, 248, 239, -36, 50, -195, -87, -145, 239, -146, 131, 101, -166, -261, 270, -60, -122, -180, 34, 418, -39, -139, -11, 44, -103, 111, -215, -129, 113, 181, -49, -149, 110, -48, -299, 92, 316, 16, -58, -64, 22, 41, 24, 156, 104, -40, -87, 89, 33, 106, -137, 20, 120, -173, -94, 4, 91, -107, 15, 42, 177, 141, 27, 16, -107, -190, 8, 2, -101, 150, 41, -21, 235, -188, -179, -119, -11, -223, 188, -24, -133, 38, 68, 92, -153, -107, 88, 32, -79, -275, -98, -137, -81, -360, 118, -74, -107, 14, 248, -109]
6421a09R9k0L31n36M96j88J37r7k26L1o2J36j10J72j19qJ84J8k33L01j08j78Q1
6444hK04n83L96J38j74K05l55M2K17l14J87Q9l80M79k10J04k61L99j88j62K37
6465F2p2K0O1o5l2n6n9J71l14M33mQ9k07k02M10k40j05j8P9m7l1J57N2l15K65
6490C2k52L52p1k7k41M2K02n8j8j7J79j60O8j89J41p6Q5j61R8J22N1M7j35k09
6514a95J11o4J36j41J41J88m5k43j87J89j45q8K89n2M1K02M7o6k27J81N5j22k23
6537b18K77J09j40j71J96j33L75k16l90K75QM0J03r6p6j61L76q4PO3j8l54K4L16
6561A12j49O4K3l2J26k70J68j85K75k73L58j09Oj79o0L11j39k33K72j77N0m3J14
6584C0j89PR2O9mk25K01J28j99J16j00r2p8J1J23J56Kj92J19j47j06K03j06j4
$$ y = [-109, -10, -30, 301, -235, 261, 73, 210, 113, -113, -82, -144, -8, -118, 54, -65, -73, 111, 129, -104, 197, 89, -89, -8, 196, -387, 9, 147, -27, 178, -177, -135, 82, -232, -45, 44, -336, 143, -67, 37, -224, 175, -13, -175, 62, -10, 10, 71, 6, -26, -82, -141, 30, -284, 149, 145, 234, 27, -175, 235, -5, -110, -128, -49, -96, -127, 30, 82, -233, 32, -220, 132, 61, 34, -207, -165, 37, -21, -39, -56, 123, -37, 31, -158, -17, -93, -8, -169, -71, 51, 102, 149, 14, -195, -84, -148, -12, -153, -12, 176, 131, -112, -299, -110, -255, -343, -54, -106, -65, 137, 184, 118, -109, 72, 127, 5, -218, 59, 168, 28, -143, 53, -80, 295, 79, -311, -36, -28, 12, 115, 19, -57, -218, 158, 74, 81, 144, 126, -228, -204, 112, -37, 27, 50, 18, 144, -126, 42, -143, 132, -141, 217, 108, 114, -65, -125, 186, 47, -186, 86, -91, -41, -84, 30, -159, -152, -60, 9, 5, -220, -19, 109, -90, 26, -74, -166, -244, -233, -110, 46, 48, -144, -25, -172, -278, -75, -181, -195]
6608a95J24OK1j6j16K6J15r5Q2j01K3J36J15l43O69m99N5j9l1J9l6O7P3j1k4k13
6634a68J48K4j92L51m3k42J03j23M2L17k36O6k0P3j65K66j47r1J51j19J01J8l9
6657G5L7k06L73n11M21l4n38N94j94m9K61o3q8l1N8N5j75r7N7J32J7k80K89l2
6681G1J9j75o4Q9l06K66l3R4nr3j74K12J11K5P9j91J50l43M28k65KK23n7l26K51
6706a2Q1l09K83p8JK5P1l3l0L0j63Oq9K46K8M8k9n8j08J61n1O1J02P5l32J46j81
6733a09j8QK12q1L36l32J36j39o6J45k38J14p6J63k15Q6R4%Pj85L95j49J30j33
6757H5p7p8N3K7J26j88n0J39J46l58J63K12l35K18J5j98L7r6k35K81O6O0j51J03
6781c5J93k11k1JK7Oq4J19j01J91Mk56R2M6Q3J91k65r8k78O38k04j80K19r1N4
$$ y = [-195, -71, -65, -44, -60, -176, -150, -35, -130, -48, -149, -126, 10, 125, -218, 451, -48, 7, -12, -43, -24, -60, 7, 80, 69, 45, -168, -20, 4, -188, 163, 120, -122, -19, -142, -100, 217, -19, 47, 27, 100, -65, 201, 54, -37, 114, -5, 96, 114, 75, 112, -94, 279, -232, 189, 155, -383, 211, 17, -32, 229, 166, 78, 47, 105, 160, -15, -112, -55, 77, 94, -186, 103, 71, 90, -85, -149, -60, -366, -100, -133, -39, -44, -137, -311, -99, 12, 37, 116, -75, 75, -268, 160, -105, -103, 120, 63, -263, -12, 69, -240, 43, -35, -34, -9, 62, 29, -1, 29, -134, -128, -217, 29, 57, 105, 76, 18, -90, 71, 20, 81, 183, 258, -74, 72, -109, -127, -119, 93, 12, 348, 16, 152, 13, -53, 92, -146, -32, -108, 55, -160, -74, 20, 20, 27, -158, 237, 88, 218, 85, 8, -70, -17, 10, 136, -52, -102, 37, 183, -175, -12, 200, -135, 83, 98, -100, -63, -159, -394, -113, -47, 13, -138, -35, 158, -53, -74, -73, -46, -40, -124, -5, -106, 85, 89, -167, -75, -29, 54, 245, -20, -118, -396, 242, 38, -142, 77, -14, 40]
6806D0o8j24K28n9l4K45j36J04l21M7M05j51j50J86Q7n4m69p2M31j91J43K8k52
6829a37J69j43R4N7J07J15j01j64j42PL43k17J92l52J48q8Q3m4J4L09k94J80o7
6852F9o6K10j01k9j20l4j21L22k2j25J43k49m6L4pM5p3M8N8J37n2j81Q3n7q3J34
6878h3M4MK92l32N2M4r5M9L00j22k25K29k07L46k17l0NJ2M4J39l02P2j90J10O1
6903@Q2nj52K1K43Q3j24q9O8j5j50J14j6J29j62j03m4J52j92L75l70J78k31K28
6927B0R9o5k26m8K04o3Q2o1J81j4j6Q1j10j73N6K15rJ6J4Q6j09l01J33n3J0j29
6953a80J75R9j51j70N3J61k06P5L36k59K44o4j8k07o1mK96m3j31k20L22J26n22
6976c49O14k74p1K46j63J06J57n42K63P1k05L5j7J22R2P2q4o0J35k01k5K25k44
$$ y = [40, -28, -152, 76, 17, -17, 228, 92, 196, -125, -78, 327, 176, 26, 212, 299, 245, -224, -296, 135, -56, 87, 115, -137, 32, -111, -17, 40, 147, 262, 161, -3, -145, -138, 205, -12, 180, -172, -24, -112, -29, -73, -59, 250, -44, 136, 69, 3, 213, 112, 83, -37, -71, -192, 130, 108, -17, 126, -123, -169, -135, -142, -97, -170, -122, -64, 73, 21, -160, -77, -134, -217, -83, -39, -35, 257, -75, -23, 21, -74, -25, 275, 153, -72, 157, -50, 296, 79, 49, 54, 66, 110, 249, -53, 19, -171, -61, 0, 82, 77, -75, -54, 189, 272, 148, 59, 127, 112, -38, 76, 60, 189, 27, -76, -120, 32, -160, 215, -155, 23, -208, 20, 119, 54, -172, -220, -16, -79, 3, -58, 123, 109, 93, 174, 64, -109, -53, 162, 153, 169, 183, 269, 160, -141, -8, -61, -51, -180, -5, 94, -57, -227, -174, -13, -219, -144, 192, -67, 177, 113, 95, -112, -173, -177, 119, 76, -55, -275, 47, 173, -349, 265, -9, -80, 166, 3, 109, 266, -276, -13, 58, -147, -112, -129, -7, 85, 157, 73, 13, 148, -53, -78, 147, -97]
6999i7K63P5k52J70j25k63K52l4J1k41K31j2M4JO6J10m88K50j07K16m45N28Q3
7022B36m93K53p0J98j48M1J66j89j21O6n1L1J34r9J81j75J82l19J49J20ol50L27
7045F3j00OK4p7j38K79j47N1J09j59J27k04j43L04R3k27J70j55L51j99nJ4Q8k03
7069g8o7K27j26k34L39o2J00l94M67N0kj38q9N4j56R6j01K55j59L83m84J91k7
7092D5j53K94N0r7k70J51q4J99Q4l69K95k46M72l71J07K1m58K99P5k6R6l8l20
7115b44J39K69l8k04j36J75K64k14m8pL4j34J07p3N2J18j84M7R2q5J08j13Q6L1
7139D2j72j03N17m21K12N8k2kj7j01Q1K0J13n24K46J73o6K37k49mO1n7n0K51k98
7164g5K04L9k6k3j82k05K48L9k09M1J25KL09j79j2j48K46k99k1J98k24L98k87
$$ y = [-97, 166, 241, -11, 159, 34, -229, 23, -11, 0, -241, -10, -22, 22, 23, 89, 199, -289, -39, -146, 70, -375, 153, 236, -257, -4, -74, 124, -24, 17, 183, -6, -127, -61, -112, -81, 53, -46, 135, -40, 142, -177, -28, 92, 86, -264, 63, -37, -31, -7, -84, -222, 57, -90, -39, 70, -89, 38, -166, -309, -5, 88, -139, 31, -124, 227, 28, 23, 37, 125, -78, -145, 82, -44, -278, 61, -1, 99, -295, 172, 222, 220, 82, -7, 47, -109, -13, -114, 141, -18, 365, -119, 72, 45, -108, 186, 236, 139, -131, 20, -64, 135, 219, -150, 145, -101, 371, 0, 107, 128, -330, -31, 44, 18, 114, 76, -244, -105, 164, 126, -78, -214, -39, 225, 11, -37, -44, -10, -144, -37, -110, -58, 60, -124, -77, 15, -70, 38, -75, 11, 42, -130, -233, 284, -137, 75, 133, 111, 109, 92, -9, 72, 92, 205, -319, -73, 100, 34, 271, 22, 18, 79, 22, -28, 223, -75, 129, 168, 142, 119, -63, -268, -20, 19, -190, -149, -24, -22, 287, 108, 96, -52, 194, -105, -126, 72, -152, 246, -41]
7187d1K31k49K12j17q9N2O6L9j78K19k91J76J1o4O6j43r0N3L0j4R4K8n3K2N6q7
7213f1R7k15K28J75j23q9J55k25O5k3j72J32J31k14M46n05L03p5k22j3R9J43N4
7236I1j12J15j08j57l1K23j00L38j42j42J59J33j17j26J21j01j58O1K84k75p3
7257a17M4P0l01L39j82J11K13m39K30l1K6m9K66m9n5J04j70K20l07N6J69l05J0
7280a47K97k76P4o1J61j13O4k26L8L58r5P8J5j02J01o3m3J5%j84P1m3PM5J19j8
7306G2k38J20Ll36J90pl2L25%nL6l03J31R4J03l55K70j76O9O4Q4j51K13l37P7
7331h9O6r2J02m8j6L88l29j19Q8o0L66k50k41K63k89J87K60j2k22k1J78j91L9
7354d2K6l0J53N4j39n0J53R9j48rP6J5k51L03j15J24j33j29k01M32k94J8J85k25
$$ y = [-41, 190, -59, 153, 36, -53, -1, 65, 104, -74, 145, -146, 30, 41, -23, 43, -100, -190, -137, -107, -121, -27, 1, -52, -30, 26, -61, 36, -179, 49, 224, 101, 12, 167, -58, 7, -16, -188, -56, 75, -139, 307, -198, 105, 30, -192, -205, -106, 37, 91, -21, 94, -14, -171, -202, 21, -79, 259, 117, -25, 134, 267, 150, 24, 145, 44, -114, -53, 231, -44, -117, -73, -3, -304, 35, -147, -36, 177, -262, -32, -63, -37, -86, 180, 131, 76, 180, 10, 230, -77, -21, 148, -157, -147, 150, -126, -52, -113, 48, -65, -1, -227, -189, 169, 74, 152, 167, 65, 166, 103, 60, 75, 75, -109, -38, -81, -74, -29, 90, 72, -166, -46, -43, -379, -189, -196, -228, 97, 97, 92, 128, -175, -44, 50, 153, -202, 68, -108, -39, 25, 109, -42, 171, -166, -89, -23, -115, -13, -61, -77, 311, -18, -137, -49, -109, 257, 7, -234, 29, -260, -73, 187, 175, -47, -68, 110, -81, -42, -16, -46, 107, 161, 22, -28, 125, 224, 76, 67, 143, 158, -93, 210, 95, 219, 86, -43, -244, 188, -106, -88, 97, -128]
7378a28j7J85k14J81L9k58K82j28j12J55q7p1L49k13Ll7j14N3nm20Q80m69J56
7401A0j48K6k6J9K01J10j86j5oJ30j54k07K60p1M36m83k1K52j51oK52N1k71K88
7425B90k49j64K50J44k74o8J15L2k50p5L82j54K2j03J89k90J12J91j58K76l21
7446a03K93r1j72K24J04j08K02k92r1Q1k12K18j43r1J04L95j36k53O2J5r0k0R
7469i5J43L0j69J30l7l8N1j69M3p9L44k03o0o0J2K30k25L49j28Kn4K8J4r0n9J63
7495G3j16Nk28O2J12K06rj67j9J7LJ65j0j85K74J6k47J15j3M2j28K5J22j95J86
7520A06R4j51q0J1j15o4K76r7J01J38n2j64m56K39J63l5J11k73L49r3J62K3p3
7543A20k09J95n6r9NJ68k62J98l54L01QoO0j19O5j31K25J16j36m30J78k5J49J67
$$ y = [-128, -145, 40, -174, 7, 46, -212, 70, -58, -170, -15, -102, -173, 176, -37, -34, -71, -185, -132, -137, -557, 323, -146, 10, -138, -112, -138, -119, 82, 192, 6, -9, -15, 115, -39, -246, 14, -57, 379, -104, -125, 127, -24, -30, 222, 273, 2, 290, 41, -123, 127, 271, -3, -71, 44, 76, -174, -249, 133, -21, 1, -102, 87, -203, -91, 100, -58, 218, -103, 190, 99, -73, 151, 255, 147, 349, 57, -34, 47, -165, 53, -90, -181, -77, 318, 182, -71, -9, 6, -84, -104, -95, 48, 78, -91, 39, 2, -36, 15, -154, -111, -190, 154, -49, -109, -169, -157, 73, -152, 197, 69, 71, 17, 45, 59, -31, -90, 73, -43, -38, -266, -204, -92, 114, 105, -62, -81, -64, -61, 104, 94, -91, 183, 199, -48, 67, 54, 96, -32, -7, 115, -80, 106, 200, 49, -31, -20, -135, -199, 77, -20, 81, 219, 167, 3, -453, -214, -51, -86, 25, -248, 101, 8, 170, 193, 120, -89, 106, 50, -49, -44, 124, -138, 60, -294, 7, 15, 9, 69, -50, 15, -116, 109, 225, 89, -341, -163, -188, -39, 128]
7567A28P4r9l70L96j11n9j60K80j89n4LP6R3J24j79L23l95K5M02o15L16K41o32
7590c82M43j94J20N8j31O4J07N0l40K35k74K53k24L40k62L53j06l79K55r6M1J59
7612I0k47L72j89j44K04r8J97n1J64k49j7r4POK02l60J26j15J3K64j61J50J8j2
7636G6o2L2J08j74oJ26n8j46J3N2J67j47L6J09l9J25j7l15K12j09R5j27M2L0J40
7661A63qj37J64j78n4L8L20j40Q0l31P7j76J51j41K86l5j86k32M03j18j39r1M07
7684A23L0j96l0k41M09j10k99J97K60k22L00l68K5L10Mj52R1j81M26k06l22L59
7706B07l04k3L59k40J4M2l06J04J07l20M23l9P1r6K6k44KK77k36k4Q9L59m3l15
7730a10K02J5l60J80K34j26j35J34RR7kKj31K7k08O3Q2J83r8P7P4k51K6K7j4j3
$$ y = [128, 202, 103, -267, 129, 18, -41, -201, 79, -110, -164, -161, -85, 8, 132, -47, 276, -119, -94, 308, -307, 9, 250, -382, 61, -133, -13, 45, -86, -22, 85, 135, -205, 30, -244, 9, -215, 125, -137, 216, 110, -269, -14, -110, -69, 90, -157, 215, 26, -118, 86, -12, 185, 134, 298, 49, 32, -62, -55, -49, 153, -207, -81, -196, -183, 81, -80, 70, 88, 76, 14, 46, 154, -20, -26, 100, 42, -104, -91, -39, 128, -19, 17, 126, 87, 212, 195, -120, 92, -17, 78, -49, -7, 23, 163, 155, 18, 182, 4, -50, -12, 308, 168, 248, -83, -6, -182, -31, -172, 114, 79, -107, -339, 64, -54, -193, -284, 123, 153, -43, -73, -314, 95, -15, -314, -117, 143, -79, 221, -147, -122, 188, 192, 40, 131, -50, 376, 170, -152, 207, -97, -120, 239, -1, 13, 55, -251, -147, -40, -360, 63, 24, 95, -1, 25, -219, -217, 60, -176, -200, -111, 248, 205, -110, 92, 107, -253, -73, 161, 35, -100, 34, 43, 140, 138, 140, 9, 36, -172, -109, -27, 156, 58, 135, 209, -42, -16, 11, -3, -16]
7756a6j2P7j77K16K8j6k63J12k7J86j49k20L37j6j31r0J41m4J19o1j53J47jl41
7780c54L48k62P0L22O6j24k05J71k2J41q8k8J02k68L0K11n3j21n6L46o9j56j76
7803a75Q2r5K45m2O8N6k42J08K4k18N6J10J21j08r2J15k47J50j10M17j75o6j02
7826a20K05j04P4j92M6nj13O2K83n1k26K68m04K49K22j35k13K54l22J40J69k57
7848a70N51k42k23K42r8K59k28o4M0l35J57K72m7j79j95J84J24R1j3j91m6J29
7870A8j12K46l29P9J04K6L0k71Q0J78J01j28k08M7l8J85J98j10j04J31j61J66
7892A28q2k07J07N1P7Q9p4j93Q2J38N9j19j18L3k47K77n1N6R1j70J62j06k7o5
7916a09J16j95K06j55J38K6j72Q3O7nJ34l60K38L0P6k53L0J04M2O9k39K35k12
$$ y = [-16, -28, 49, -128, 88, 116, 100, -163, -51, -78, 108, -41, -261, 76, 60, -71, -161, -20, -64, 55, -6, -159, -12, -13, -354, -6, -268, -198, 124, 190, 66, -139, 32, 10, 151, 63, 35, 137, -131, -101, 110, 57, -64, -120, 226, 157, 1, -175, -93, -188, 57, 15, 83, 139, -103, 5, 29, -189, -133, -23, 98, -10, -102, 13, -234, -84, -194, 223, 48, -18, -120, 85, -19, 55, -137, -91, -96, -209, -147, 136, 85, -141, 127, -277, -28, 194, 59, -154, 100, -222, -82, 87, -170, 381, 139, -84, 158, 60, 319, 91, 27, 67, -268, -111, 161, 114, -65, -260, -76, 48, 139, 126, -65, -111, 18, -94, 152, -177, -98, 6, 32, 62, -209, -129, 49, 150, 22, -186, -139, -177, 8, 206, 96, -8, 123, -38, 128, 46, -161, -54, -3, 74, 163, 89, -104, -22, 116, 175, 56, -62, -29, -276, 1, -50, 6, 97, -73, 89, -17, -44, -109, 7, -188, 18, -137, 1, 27, -145, -62, 5, 0, 134, -226, 12, 42, 118, -135, -105, -1, 41, 110, -129, 106, -106]
7939a06K50J23m43J54J03j73M0N6J12k56P5j5j94K20n6j22K27%j8J04m04M41k61
7962a43J71q2K3Q5j15K1q4k06L40J03j47Q9j85q0L06r7K90q5k93J46J58K6j84
7985E7R0O5j75l5j81R9M8j24M21j92j8Pj44L25k09p4O6J4m5J08j99K38p6r5J13
8010H4p6K0j25L31Oj46j34k01K30q0J50P6m00K90J26k7k73o0K96P1k20r5l0J42
8034d5mj37K71P8k17M8j48L26k95L4P7J21p2j3j16J83l05K77j28J57kk21R7qr3
8059a35J46R1j49n5l9K69k02L14l66j24L49r4L2k35K31j00l3J53P6Q5m3k11l9
8082g9N5K06k62J78k23J04MMJ65j63j49K83k72k3K77l2k58N0P1r2K57j42J93j57
8106eJ5j50K01j51L4J43o0k35J07K33k23N2L00j33J1k05P1O3J46j40J66k25K04
$$ y = [-106, 144, 267, -176, -22, 81, -92, -52, 4, 116, -140, -65, -80, -274, -54, -110, -232, -5, -5, -23, 81, -323, 118, -143, 28, -54, -31, 54, -61, -40, -124, -330, 10, 113, -34, 55, -130, -210, 96, -1, 289, 204, -89, 57, 215, 241, 57, 147, 212, 37, 2, -179, -80, -32, -156, 265, 73, 55, 62, -82, 243, 34, -40, 26, 40, -5, 103, -96, 142, 66, -29, 84, 8, 28, -97, 234, 240, 94, -40, -241, -11, -91, 59, 135, -265, 25, 151, 124, -149, -209, 87, 158, -62, -157, -187, -45, -49, -186, 85, 163, -54, -6, -154, 172, -123, -89, -12, 109, 37, 24, -92, 91, -214, 63, -65, 92, 90, -131, -34, -42, -135, 11, 102, -47, -102, -141, 128, -74, 240, -126, -250, 99, 5, 37, -198, 33, -67, -100, 53, 129, 214, 171, -40, -79, -24, 182, -80, 98, -125, -21, -17, -13, 152, -11, -160, 123, -149, -172, 105, 73, -185, -135, -64, -156, 101, -41, 152, -5, 10, -140, 61, -90, -56, 87, 27, -208, -101, 132, -91, -39, 261, 128, 139, -66, 5, 68, 214, 74, 240, 15, 219]
8129B19r7kn22M25j51m1n0O0J21j18R8J7L46m74K66k14k25M12J51k85M13l74k81
8152c06L31j66K10J49k85j6P5k5p4L36k79J00J24j94m4J84j16j72K14j93J37k5
8174c5l2J23j52j2J03p0J07J0j09J74k64J37O6m5p8J52j04
$$ y = [219, 122, 120, -402, 23, -128, -169, -219, -159, -38, -156, -58, -41, 305, -169, 97, -117, -342, 70, 221, -64, 349, -25, -306, 25, -141, 69, 218, -67, -83, -8, -33, -107, 229, -50, 50, 174, -20, -64, 120, 4, -168, 46, -147, -10, -35, -67, 56, -96, -108, -5, -75, 32, 42, -67, 107, -157, -20, 46, 1, -77, 75, -29]
8191b9
$$ Imaginary data points
##PAGE= N=2
##DATA TABLE= (X++(I..I)), XYDATA
0@%%%%%%%%%%%%%%qJ6j6J6j6K4l2L8m6N0n8P2q8J00j11J31j52J69j93K23k50K81
36A50l19L56l96M42m96N52o10O80p55Q33r21J016j120J236j361J498j650J821
54I56k009K219k459K731l043L408l840M359m997N804o864Q329j0504J4096k1433
69a3247O6477j43596l3561K32945k4868j39033K3733J11914o0321o7569M7399
80B73K1198j7929M1311l9394q5144N0325J17390n4047j30570N7599J14700q7512
92a1800p2936R6739M5092q7393l6956O3005K4540k9300J9137j0918n5299M0944
104a5145O3778l9681m1196L4183K3605m4797q111O0252j40m0046M63q796M893
117a0738M6737J437n9904j9124O1199J5766o7490J3922O5698m2875o2213L9496
$$ y = [0, 0, 0, 0, 0, 0, 0, 0, 0, 0, 0, 0, 0, 0, 0, -8, 8, -8, 8, -8, 16, -16, 22, -24, 26, -32, 40, -48, 52, -59, 72, -80, 89, -104, 119, -131, 150, -169, 187, -209, 233, -263, 289, -321, 359, -396, 437, -484, 532, -588, 648, -713, 785, -865, 956, -1053, 1166, -1293, 1438, -1605, 1803, -2037, 2322, -2675, 3129, -3735, 4594, -5910, 8186, -13247, 53230, -90366, -123927, 109018, 84150, -54883, -31150, 80764, 20443, -47126, 273, 21471, 3542, 44853, 5459, -79685, -29360, 88030, 33983, -96587, -38988, 75712, -11800, -84736, 12003, 57095, -30298, -67254, -4249, 20291, -9009, 10128, -790, -56089, -15145, 48633, 8952, -32244, 1939, 25544, -19253, -27364, 32888, 32748, -7298, -6835, -15631, -10738, 35999, 37436, -22468, -41592, 19607, 35373, -32117, -18195, 47503, 4628, -57585, -18089]
129a8089N7581k3639m2412J8141L966j8947L7413J2636m5643K970L0848j8652
141c827k0410M4404L0287o7564k9375P2472J0194m9512J5690L3401l3844l9216
153c7300M6912M5797n0073l0773L5285K267k0867J0627K0175j1538k9177N713
165a2952J3999j57J7655j0266m0172J0758L5384l693k5004P266K2151k7579k2230
178c4840M1232K2208k6160k2444J884K1759O394p274N13n734j579r82l652K1680
192A3005Q742k8541j3952J4673J8714m889j3259J0090o748k0449J8242J9448q181
205F895j5075o209O775J994O515J1177j5076j2084R269j076O070J4010n268j7572
219i655q585J9919J4544j4023R11L984j4719P9J5650J0687q621j6858N261L510
$$ y = [-18089, 39492, 15853, -26559, -8418, -4452, -23399, 14014, 26650, -18993, -16023, 14825, -3827, -24237, 20167, 50454, -17110, -46485, 25987, 36181, -13331, 2359, 35760, 1916, -37300, 9612, 55409, 5336, -25437, 9848, 12115, -8752, 1875, 22050, 10512, -18665, -12952, 1047, 890, 18545, 8279, -31893, -21135, 14249, 10556, -14448, -7182, 14969, -12610, -34840, 6392, 28600, 2440, -20004, -18120, 3639, 10033, 2759, 3272, -2462, -4041, -5023, -8675, 13005, 21747, -6794, -20746, -6073, 12641, 7752, -5507, 4583, -2165, -22614, -4372, 15076, 6895, -8180, -14389, -7614, -5620, 895, 12072, -3004, -15088, -5819, -6895, -825, 13185, 7917, -9655, -18240, 1679, 16223, 2200, 3111, 7095, -7624, -7545, 8105, 18792, 10171, -6687, -1426, 2084]
233B084l112J5715J725j7838q114M537J3066L273n694l074j1350J123J2994l489
247A846K570N088j5473j1735J0567K3355p20k7098P50J3627m173O18O164K460
261G846o654j4691N562J5561M741k729j9450o028K0524N307q402k727L372k141
275I1j5661Q580K4524r345j8770j420M648Q204K716n84m750j1727N210P686j666
290b264P502j970j4660j831R138J2344k137j0328J490m291j043J5931L213j0246
304H48o496L69P253j024M969P887j6605r619J1475P959K439m352o641k544k583
319f665J0943O542q347o44m393p269R281J0964M58j2051j0256J0628L885j491
333A585P183l770r866k446N870J1335j795o545j454p951M859J3396k231n948m352
$$ y = [2084, -1028, 14687, 16412, -1426, -9540, -5003, 8063, 11336, 5642, 2568, -8782, -7659, 5335, 1846, 4416, 9504, -5969, -17704, -7137, 16218, 15498, -11600, -10850, 2777, -1396, -778, 5386, 7846, 1192, -13499, -7937, 7624, 12365, 9636, -9814, -15842, 4682, 9989, 1587, -1140, 2232, 91, -15570, -6990, 17534, 8189, -10581, -12001, -7353, 851, 3567, 2983, -1767, -13494, -8284, -598, -2264, 5238, 3268, -11392, -13223, -4085, 8259, 6122, -4206, -2716, -7007, -8050, 7881, 11094, 848, -5648, -5279, 1974, 950, 5919, 13806, -2799, -12418, -943, 7016, 9455, 5103, -1538, -4082, -6665, 4278, 10820, 2473, 1829, -2564, -9833, -552, 10412, 10870, -1181, -11437, -809, 3076, 1585, 8768, 4998, -4868, -7314, -1444, 9891, 8096, 1551, 97, -7854, -2995, 10401, 8170, 2222, -2130]
348b130l151L501K978Q180j495j4826l28N279J884O021j206p009o533j146J2785
363B804L402o690j251n503j962P090N353K454p807p665L792J880O748N744j0518
378b129o286K228M100O480r62r00m800q508P773R356j278j552p423l868M566M906
394A703O993l854j0602O07J807M153N989l046l701n233j760R477L943r14l052
409B510j0114K218R535L009j272o777j388J882k130P774N267o803o094m141N643
424h81J0705j897n471n507j513O438R66J503K587p956m961J705N802Q392o195
439C717q732l5K95O910L874m783l013l966M9N495K152L716m987j0445L345O653
455B45L112J148o518k842j424K221R527m36p270j940j926L811M383O66J403q172
$$ y = [-2130, -5281, -1780, 1198, 9378, 7883, -6943, -7271, -1992, -108, 5913, 4707, -2302, -8835, -9981, 2804, 6206, -484, -1735, -7238, -9200, -2110, 3243, 5697, -2110, -9775, -5983, -4103, 2645, 8389, -2129, -8415, -6187, -2087, 4393, 3431, 2531, -2269, -10777, -3004, 6352, 5074, 3522, -3901, -7769, -3203, 1703, 8696, 4842, -5760, -5153, -3346, 807, 6796, 3750, 49, -5184, -6944, 2533, 6476, 5562, 2510, -7604, -5386, 4149, 7158, 5886, -891, -2279, -397, -2527, 5247, 10514, 3711, -2383, -6524, -881, 9824, 7927, 2456, -3051, -4564, 1874, 2840, 4343, 6930, -1026, -5987, -4282, 1520, 9912, 3717, -5015, -5050, -4755, 2155, 6029, 1246, -1767, -5733, -5684, -189, 1963, 5679, 692, -9753, -6408, 245, 3357, 4505, -2013, -4855, -6279, -4058, 5469, 5033, -2237, -4177, -6103, -2292, 2091, 2757, 4160, -4012]
471d012n470P102M317K812j721q142j691K430O685M695p825k708J686k778L371
486a249M715K893l413j2429J949J2496K947l647p349j061N025q46K820L368l729
501B490j543n449j85J0826M545n794j1506k242J4846M061r725k112L898N06o718
516d102p79J4541J244j5388n055O274J0514J247q967l167j1L331M114n239K100
531F57N778q266q761M832J5420K498j8952n827J3505M086m564k798L814N64r898
546g912J926J0041K75k722n978m633N774O838K728p389q476O740M243m335L131
561B51L573k639q775k090J3298M010q419j730j219m37L960M341J964r066m191
576g169Q431P37k126L697O85n294o314N067J1916l867p813Rk17K181L872K160
$$ y = [-4012, -9482, -2380, 1937, 4749, 3028, -5114, -6805, -4375, 2310, 7005, -820, -3528, -1842, -4620, -1249, 3466, 6359, 2946, -9483, -7534, 4962, 7909, 4262, -3087, -4148, 877, 31, 2851, 6219, 2490, 947, -4502, -4687, 6139, 10684, 4890, -6616, -8858, 5988, 10049, 324, -1788, 2110, 2616, -4102, -4881, 9660, 10904, -4484, -9539, -3265, 7249, 8496, -471, -3638, -3649, -318, 3796, -1443, 657, 6435, -1831, -10592, -5760, 9660, 12158, -6794, -12621, 884, 4970, 406, -2392, 1422, 1986, -7912, -5986, 4055, 4330, 1608, -4370, -9003, -3229, 3609, 6337, -1052, -9528, -2788, 1455, -2880, 251, 3824, 1185, -7590, -9680, 3618, 7628, -791, -2521, -3740, -4177, -217, 4124, 6088, -2978, -7169, 1262, 1999, -127, 3570, 4255, -1039, -7353, -2286, 9630, 5763, -2050, -2041, -2258, -77, 3795, 5955]
592E955k796q171K340O352l446J866M769n015p778o31J2471N543j1853m575M318
607f51J250J318R8J544j354o247J883K442R14N858l715j0487n71J0175Q098r430
623A125r656Q502L583p642L51Q388L214j2537q025J2078P519l734m879m120K244
638c589L118J218Q86l303Q00N56p316L400J1605j496j1304n497J0028P985p921
653h30j901M684l263l636J817P560J443r108j348K480R41N011O87m961l287j19
669c830N218K105k167J752m034l769L495M368K443l918n246K464P68J524M664
684E837k592m336k573J843P017o14l461j22l107l7L899K322R67n520l714L462
700g29J140K987J941n193m019k39N785M287o007j105J979l839p7M313M125k281
$$ y = [5955, 3159, -5012, -2672, 3680, 234, 2100, 6869, 1854, -5924, -6555, 5916, 11459, -394, -4969, -651, 599, 1917, 2015, 3559, 2205, -4042, -2159, 283, 1197, 7055, 3340, -7147, -7718, 2457, 10555, 1125, -8531, -29, 3554, -4088, -3737, 4651, 7865, -4672, -12697, -619, 6900, 3166, -1713, -5833, -3589, -471, 747, 1633, -1670, -870, -314, -7630, -4230, 7375, 5879, -5425, -10922, -894, 7091, -830, -2731, 1953, -1310, -4946, -3129, 4431, 5874, -3234, -4582, -2102, -1161, 3850, 4537, -424, -3711, -3830, 1388, 3493, 1326, 3078, -956, -4725, -1230, 3138, 5581, 1663, -3583, -1119, -351, 1173, 5837, 3245, -1091, -3664, -1821, 5196, 4582, 1121, 999, -2108, -2145, 1754, 4076, 5043, -477, -4191, -729, 411, 3398, 5339, 146, -3873, -4112, 1673, 5960, -47, -1152, 827, -3012, -3089, 1224, 5349, 3068]
716C068r090P03N950J423P93l568l515K004Q02J071J466k29L13o505k055R384
732B015L920m885o358J62O030k30j798L293j556l875j115J532O941J42o005k961
748d748M70N701K268l710J10j205k260K530K106K864j504o101J56K742L099K798
764E316m268l581N52J336L371P84j743r13l796J314M611J40M25k768m015J571
780a664L266L487j561n600J050J029o05L685M00k127l241k165M841L278j810j242
796A021m193O03L615O99O66j711k841k03o05M504L375n083k985J07J198L612p7
813A702m04k310m018K644L429j02J127l858k366J677J776L123q41l672k77r72
829c342K127M299j762k075k095l53L199J144J087p70n471J57L648K322J131l152
$$ y = [3068, -6022, -5319, 631, 2054, 2847, -721, -4236, -2232, -1430, -359, 1107, 878, 1191, -5314, -7369, 2015, 5935, 1050, -5308, -5146, 884, 654, -1144, 2149, 593, -3282, -4397, -2865, 4076, 4218, -1787, -4748, -4278, 1423, 3691, -19, 91, -1114, -3374, -844, 1262, 4126, 2622, -3479, -3323, -581, 2518, 5316, 1048, -2533, -1981, -645, 2726, 3510, 1767, 854, -2942, -1628, 2983, 3123, 3548, 780, -3235, -1664, 1602, 5089, 3528, -2072, -1022, 7, -598, 3087, 3487, 1360, -1881, -4046, 795, 4073, 2263, 1021, -3172, -2569, 1046, 1745, 2411, 700, -2141, -2344, -2949, 1555, 4930, -153, -3138, -3031, -1833, 1779, 1702, 1298, -1012, -5030, -2386, 1043, 941, 2068, -1790, -4156, -2479, -703, 2420, 1579, -2093, -2370, -3342, -1215, 3084, 1322, -753, -2848, -3201, -2, 1142, 2229, 1459, -4012, -3855, -207, 2115, 3246, 94]
845I4k177M44m42L928J903k487j401k894R22M830Q62j175l409j837L266Q53J072
862B352J237l476k018L39K392M007k421l027m78j098L611K205j330q94l103n66
878b268L122J540J333k357m657J478J689J672K055l020k092j068M52M570N2j918
894E83j276l014J908K937M42L60l678k093K565J034K102k02l991p10M45K127K835
911B374j762j639j843j003M038J882r82r62l431L50K364R86K237k271l353N87
927b428Q07L295J183l031r49r90Q81L316p4q32j379k887K080K763J014j83m236
944a650n46K071R42K254r30k591o42o24K577K818j376j281k792n87M105R46j83
961B511j584l012J436R36J029K298k601k291j78J83L710N00k197j828j887K416
$$ y = [94, -2083, -1639, -2081, 1847, 3750, 1263, -138, -3032, -2110, 2720, 3582, 2407, -1002, -2839, 427, 1280, 2352, 3589, 113, -1905, -1566, 826, 4833, 2412, -615, -1093, -2191, 1420, 3625, 2295, 1401, -1702, -2268, 854, 2394, 3727, 1370, -3287, -1809, -120, 1552, 3607, 587, -1505, -2573, -2121, 2449, 2501, 583, -693, -3707, -1799, 1138, 1580, 1940, -1738, -3831, -1266, -232, 1870, 1668, -2323, -3033, -2588, -461, 2374, 612, -1027, -2870, -3873, 165, 2047, 1065, 103, -3328, -2978, -614, 372, 2609, 338, -3015, -2428, -1621, 1674, 2857, -174, -1123, -2113, -1232, 2084, 2010, 1178, -201, -3088, -1008, 1755, 2769, 2586, -1650, -2196, -125, 817, 3071, 2141, -450, -1092, -1716, 861, 3679, 2303, 1022, -1770, -2357, 1748, 2694, 2511, 927, -2085, -649, 287, 1316, 3614, 1013, -1278, -1456, -1273, 2437, 2937, 740, -1088, -2975, -559]
977e59L059j276m33r96k282J343P74K840m9m730q39J674J704K283j615k131r95
994b228q79L232J153j031M29l427r63L022K350M73l081k646K172Q16J238J178
1010A808k099j011j109Q76L393m06j304q31k401J918K629P70n81l742n68K758
1026A00N21J657m07k922j22m76K095K930j949j493j189p14K948J723l9j905l631
1043b873K618K314j147J075o68j342j811O80M313K99l756o49l26J169K515Q1j042
1060A450l110o18L405n50k32K618k476l378K21M060L222n019k430K724j044Q57
1076c00J717l67j059k723P77K345j13J634j410m244P91L217K224j837l169J635
1092h82K67k207K899K296j678k706k179L624K549j024n46k203p58J930J032J278
$$ y = [-559, 2500, 1224, 791, -205, -2487, -1144, -370, 2470, 2421, -2309, -3148, -1474, 230, 2513, 898, -1233, -2228, -3107, 125, 1278, 247, 676, -2751, -3714, -692, 1658, 2131, -950, -3596, -1424, -608, 630, 1808, -291, -1302, -2411, -1535, 1858, 1452, 148, -683, -3084, -1166, 1463, 2233, 1652, -2090, -2658, 100, 621, 2278, 1871, -1051, -1173, -1649, 446, 3376, 1427, -66, -1255, -1969, 979, 2702, 2663, 758, -2873, -255, 2059, 912, 1987, 1319, -23, -1834, -1154, 3159, 3458, -298, -947, -1273, -104, 2411, 2492, 1450, -1660, -2278, 1127, 577, 345, 2963, 487, -2891, -2670, 1390, 4612, -407, -2837, -113, -1157, -300, 1417, 1050, -9, -2732, -1955, 390, 277, 1911, 501, -3743, -2952, 265, 2489, 652, -2517, -882, -615, -2822, 77, 2373, 695, -2011, -4190, -566, 1983, 959, 413, -1790, -2548, -618, 414, 1692]
1108A692q47k448P96o12O71L326n60k372k558J433M237q14k260P73j202r23J798
1125A30K041J130l946j332K210l81J117K339j786k823r55L443K205l065M50P25
1141A502l597Q37L414P38j784l161J759P08j361L364L75m379r23J980K745q49
1157A368k027J453j728j876L376J575r05k080j617J562K39J450J695l685j596
1172b796J579Q41J224o79l41m41k359J328K993J36j294k674j6K844k7J00M1j958
1190a499k46J09J682K297k144j375k58q15L025J742j510k143j345K396J193j241
1206a32J703Q4l601N2K205K544j077k757Q51l42k19L005p9k139j032Q9J783j05
1224H33N37J268l755j270L202J009J21j219j051P8r72K287K155k909j120Qk80
$$ y = [1692, 845, -1603, -807, -1419, -748, 2578, 2018, -354, -2912, -1479, 2758, 1944, -316, 457, -745, -1668, 130, 2171, 3301, -645, -1977, 233, -148, 969, 3308, 1522, -1301, -2256, 1187, 3392, 327, 777, 1502, -2095, -1258, 2156, 2894, 1110, -2051, -292, 416, -945, 2419, 2794, -1585, -2508, -528, 2217, 1368, -659, 794, -934, -2810, 566, 2141, 1236, -844, -2461, -899, -660, 790, 2485, -1200, -2796, -1217, -376, 848, 169, -172, -613, -2972, -1644, 1349, 1485, 191, -2483, -2499, 345, 318, 418, 459, -1499, -1745, -1636, 46, 2343, 199, -1176, -1434, -2249, 776, 2518, 1008, -1135, -2480, -84, 1109, -132, 1571, 1655, -1946, -1894, 311, 2855, 1778, -979, -128, -470, -689, 2316, 2237, 98, -934, -845, 938, 833, 1370, 2638, -1117, -2387, 815, 1824, 1945, 726, -325, -247, -1219, 1068, 3223, 314, -806, -798, -1078]
1241a078J981O45K22j844k564K026J361L2Q77k065j447P89O29K043n95j886l1
1258i05j431J803J936p71r42j156p61J781Q52O41m38l130P93J198M22J619j239
1275B72j890l85L16K555M34j651j4j602L65K386K76l09j401j092J175K44J431
1292A110J124k853r26Q53Q54J551n58j003o47j572K562J670j279p3j417j054J685
1309B7J313J061j360k296Q94M94O53J627j279j551p43M06K288lo98o09k028J101
1327g03J871J77M7j867p09Q10J18K023k99k511k58L83P80J301m00o64j456p89
1345b146K580N35m40j0k034l69J244P72J431j830j596O25m22J755J103j468p25
1362i95p26M76K037j07l24j302j547J877J179j99O50j689o80Q9Q29K197j044j489
$$ y = [-1078, 903, 1548, 1770, -74, -2638, -612, 749, 781, 1658, -407, -1854, -1065, -436, 1607, 1012, -874, -905, -2336, -533, 1403, 632, -310, -1466, -2227, -446, 406, 1047, 609, -2521, -1728, -530, -108, 1511, 272, -1618, -2003, -1687, 868, 1302, -349, -363, -1965, -1600, 786, 1062, 753, -648, -1740, -565, -321, 1110, 2234, -619, -1545, -692, 162, 1713, 1155, 152, -495, -2067, 495, 2165, 886, 813, -604, -1658, 27, 1340, 2401, 1041, -1255, -361, 133, 786, 2413, 1134, -417, -1160, -754, 1534, 1531, 833, 224, -1804, -703, 1168, 1345, 1392, -475, -1184, -374, -256, 1767, 1468, -1043, -1301, -918, -138, 1163, 763, 99, -1357, -2146, 434, 969, 529, 519, -1515, -1884, -640, 132, 1563, -267, -1863, -1238, -1660, 95, 1198, -270, -995, -1721, -1245, 792, 685, 361, -941, -2488, -611, 568, 369, 1019, -670, -1350, -1261, -432, 1765, 721, -768]
1380g68k45n86J716J139k96n19j757K61K017q0N75j62k749P11P74J184Q82j678
1398D19m00l80l70K325M97j634n90q84Q58J355K7N96j893j563J807K49Q64K90
1416A573j860m45k53R06K127j417o87n93r10J707J246m35o44j723J29J557L6J241
1434A555j432j932O85M07J254O55j687n34o03L74K206j67r41o23j046O49J349
1451A69L94J77j700m97P36J00J665m31j489n21J46J227J255j176Mr27q73K124
1469C83L93R7n75j654N19Q02Q03R97j699j230N77M43J105L27q20o46j415J298
1487b95K146q22P7r18j440J382O78P04j89j931L56K28k10K388r56j320k96n01
1505i19J725L24j46m75j656K08J704J9K84q15j210K11K04J216Q59k047m77k5J48
$$ y = [-768, -1013, -1599, 117, 1256, 960, 441, -1316, -1055, 962, 882, 1457, 1295, -1454, -743, 31, 1215, 2097, 419, 19, -361, -731, 1594, 2091, 457, -133, -1017, -159, 1196, 1223, 1819, -74, -1637, 170, 419, 1283, 1573, -287, -732, -985, -79, 2048, 631, -56, -649, -1559, 148, 1394, 959, 315, -1408, -1279, 278, 314, 1555, 123, -1809, -1124, -717, 537, 1192, -495, -1029, -1632, -1258, 948, 781, -160, -783, -1829, -1180, 169, 563, 740, -960, -1457, -721, -621, 1044, 613, -876, -1397, -1251, -24, 1231, 55, 59, -868, -1741, 383, 776, 873, 298, -1356, -837, -35, 768, 1765, 66, -1164, -587, -144, 961, 1288, 468, -178, -1593, -295, 1851, 1029, 1106, 188, -1252, 130, 808, 1512, 1323, -608, -252, -24, -234, 2154, 1198, -122, -418, -919, 806, 1130, 984, 509, -1147, -939, 765, 784, 1068, 253, -957, -746, -542, 674, 1533, -514, -991, -1016, -868]
1524h68J675r0o12o14j228J268N89J46L87j391j083R55P94J034p38j533M24l63
1542a248J157J226q78r61m43l73J496K68N26p12j885N42J368M48M38j311o58L77
1560f23j8J450M00j292m81l36O58J398n31l9p56j000J211P83J58j32j525K71K48
1579a56M13J603o46j518m00j7J756N02j070l3r72k46J487K35J35r41j165J003
1597c0L4O39R36j466j043N9Q09R75l91m17r1j415R61J232k26k18j154l25R33K53
1617E5N47L44j942j78K10J539J30j139R6l41p39J428J014o24q35j004N45R99n29
1636d24J527j018j494N24Q02P69j64r64J62q40P9K172k45q80p99k30J094L17K19
1655F07Q09k023n24J219M25M16m07q84J70m50J329J058j283l47o21K89J005l8
$$ y = [-868, 807, 717, 105, -509, -1737, -469, 120, 266, 653, -738, -1821, -866, -72, 962, 224, -1309, -885, -1248, -91, 1135, 257, -704, -1147, -1520, -24, 244, 770, 58, -1827, -1285, 83, 531, 969, -342, -1000, -623, -641, 809, 1209, -83, -564, -900, -242, 1156, 625, 586, -170, -1170, 41, 824, 982, 850, -675, -404, -156, 257, 1860, 1214, -304, -704, -721, 1035, 1537, 467, 434, -538, -784, 703, 938, 1073, 132, -1033, -30, 4, 643, 1579, 113, -930, -871, -62, 913, 522, 105, 14, -1401, -440, 792, 566, 348, -806, -1131, -198, 55, 602, 946, -996, -1174, -964, 575, 705, -434, -338, -679, -1418, 10, 1024, 400, -435, -1439, -894, 105, -424, 1103, 85, -1409, -885, -83, 686, 522, -442, -280, -1120, -1041, 1131, 886, 6, -793, -1023, 71, 388, 607, 1416, -607, -1131, 88, 513, 929, 522, -362, -192, -642, 687, 1745, 462, 115, -506, -217, 788, 750]
1673G50N02m72j643O84Q59K49J30j043l89J65j40J460M0j145j65o31R24R57o24
1692D68J73r72q56J132O01L61n35r18K56l41O86J023q34j226k34M08J301k61j61
1711G1J24j648K30J565J28n53o33k84M94l65J181O40j815o77R17K26Q78j73L0
1730C36j000r14J536Q22n08p4p07j13M0P80J108r71j283N40J67N83P59o29n63
1749i1o72K09J452n4m05J5j186M35Q10M47K16j403m48N48J84J148k70q88o8n82
1769f03N30J143j70o73r64L03P73J33L14j8j474k00R06N74J85p32p1k46p10J280
1789B80Q59j610q7l78J77J040m9L49r33j260J329N35j44N09j176m50k2O04J406
1808I79r14p08L43q56L98J329j84l85j127L14Q40k62O30O1j448M06N63N1P41p93
$$ y = [750, 1252, 780, -863, -179, 680, 929, 1059, 16, -373, -208, -348, 1112, 1152, 7, -158, -789, 135, 1092, 468, 641, -331, -1187, -55, 546, 907, 372, -546, -290, -631, 55, 1078, 244, -982, -1216, -808, 493, 232, 71, 195, -1453, -1223, 342, 470, -83, -716, -1000, -506, -871, 310, 950, -865, -1542, -625, -399, 479, 306, 336, -664, -1578, -42, 780, 272, 198, -509, -622, -582, 198, 1306, 335, -948, -408, -241, 342, 1101, 472, -91, -763, -554, 898, 844, 439, 454, -732, -297, 513, 960, 1176, -227, -675, -127, 57, 1205, 935, 47, -21, -603, -73, 1070, 900, 227, -737, -434, 339, 472, 786, 768, -706, -906, 0, 574, 759, 27, -44, -290, -1000, 280, 1139, -471, -558, -936, -759, 281, 232, 581, -352, -1612, -283, 252, 108, 617, -559, -1009, -1031, -427, 979, 65, -643, -300, -1156, -758, 571, 387, 2, -1125, -811, 29, -233, 397, 458, -990, -584, -21, 30, 771, -22]
1828b2k24m17j8J339J05p78J87j014L25R80J83N10j458m86Q64k83Q17M11r99m67
1848d45j65P31R85m27l94k40o21N13P78o0j65q87k5O63K59M91o33j012M70l2O64
1869D48L63m75m37p36M10J288l82n41R0j125M43Q69N19l09j074O0K47K9O23J65
1889D75r47l00r6P35M24r2j83j159o2J337K19m15k17o91L56J30M31O98j006k23
1909e86M0j30J001K66n17m15o89M76J019q3J39o88l07L57K16L88K95j020l93K99
1929c32J78R58l45l44j01l54Q57K41l99l55o68M50N77m1P94n17q54K6J91N77L53
1950H92p52k08k66q0R97l8j31m72p73P17L40J25J09p95m39P34L74jp4o23L7m40
1972g67P63M68m91j39m78k12N68O06J1m08q41K78L38J60P65j000k96Q%J001J39
$$ y = [-22, -246, -663, -681, 658, 763, -15, 172, -842, -517, 463, 646, 1156, -302, -788, 76, -207, 610, 1021, 22, -445, -610, 121, 1106, 679, 285, 45, -576, -63, 715, 655, 490, -397, -422, 241, 500, 991, 358, -654, -184, -216, 448, 811, 336, -101, -837, -427, 861, 479, -62, 28, -1097, -654, 215, 734, 425, -649, -589, -342, -313, 310, 475, -472, -772, -868, -133, 291, 199, 16, -1143, -1205, 132, 351, -64, -281, -972, -616, -486, -55, 643, -363, -586, -546, -676, 325, 591, 74, -341, -1030, -554, 465, 382, 521, -167, -474, -117, 99, 487, 782, -238, -631, -332, -154, 804, 459, 115, 14, -340, 517, 758, 359, 4, -664, -214, 363, 322, 1116, 599, -255, -229, -38, 539, 892, 140, -68, -334, -414, 583, 545, 414, -58, -831, -114, 226, 351, 460, -335, -774, -40, 334, 333, 259, -364, -327, -767, -4, 464, -27, -166, -644, -856, -288, 318, 329, -79, -920, -642, -304, -144, 621, -379, -675, -667, -667, 334, 473]
1993D73q28N8n63J84Q15K86m33o53j34Q01N1J51J65r35K02l7O13N33o22k77j02
2014b52k69P55M07k01j12p47m6Q61J31K66m07o44Q1L01K65N40r85n3o3J8R44k91
2036D99k29k34o86P61N35p0N9q61j83K38Q37K19l97r66J04R6L84M18l55j31m85
2057d47k87O60K65K64n44p50L74L78J79J38o28l29N15j61M18N07q26L7k22k2Q52
2078C71m58o1n91j72Q04J55K1K47r30K10J37K19N06m20m95J59l31P13O96n73j96
2099A1n47J99R27n23M98o14o04O74j9M02J56o54k09j24L76P50j69l54l51k01N03
2120A27M54q8J97q81n30Q27K98J05q6l67l43M30J10N23p07r9k2m69O89J83j39
2141B12j27o81M79K67j17K44n15k20K34J00L36K80q39j53J43k7P94j33l56m25
$$ y = [473, -355, -297, -860, -676, 139, 425, -8, -661, -795, 6, 57, 208, 373, -562, -360, -397, 216, 749, 127, -150, -252, -521, 234, 641, 440, 328, -419, -465, 396, 527, 793, 386, -258, -177, 124, 389, 929, -56, -109, -172, -154, 790, 499, 270, 36, -650, 111, 646, 576, 635, -226, -409, -171, 666, 885, 488, -478, -374, -278, 106, 524, 169, 38, -447, -734, -74, 191, 455, -89, -839, -465, -87, 92, 230, -398, -727, -212, -373, 45, 552, -274, -237, -459, -481, 371, -87, -148, -739, -911, -107, 48, 69, 316, -614, -404, -267, -48, 458, 38, -457, -298, -629, 84, 780, 207, 11, -536, -337, 590, 67, 565, -49, -653, 21, 2, 404, 560, -94, -303, -427, -51, 699, 530, 176, -175, -376, 127, 581, 493, 690, -191, -721, 106, 404, 509, 423, 56, -287, 143, 253, 776, 69, -30, -52, -521, 168, 351, 212, 85, -596, -117, 150, 33, 277, -238, -458, -224, -124, 212, 492, -347, -500, -357, -384, 410, 277, -79, -504]
2161e04m09O88N77l59k35k97n7M06J22N81l86p76K76l03O32N24n75M7p10K87J012
2182E41q1l46j95o80M15M13K47M5n70j48O9K55O26J4k67k69k24J23P39m78n8k43
2204g2k55J33N88K67l68m53K71K38k81M57j01n42Qj39P46J2j41j73q05J35O68
2225A93J40J98l90p58O06R5L45m5l64l84o7J32J037p33l74L76m83N56K25j00m9
2246A56p75J45J65J51N21R2j141J07K80K14O04j012J9n0N7N66J79k07l9o45K30
2267c83N08n4L30n89k3j08j02Q46j07m59M0m19L31N32k86J65m93l88J016K55l84
2288B28Q9l73j90M48o8O19o14n70M10k53M01M32m24p2k27R4M82m2j21P4m99P5
2310a01K81L06Q7p60K68j06J49K49k4n25Q4m84P03J67r2k7p27R1O19rM7L3r20
$$ y = [-504, -913, -225, 352, -7, -242, -539, -596, -190, -68, 513, 127, -649, -373, -676, -44, 480, -95, -48, -758, -471, 541, 460, 114, -81, -761, -346, 67, 314, 359, -211, -359, -290, -35, 591, 605, 338, 69, -155, -32, 707, 229, 171, -72, -327, -194, 394, 661, 293, -160, 111, 349, 68, 525, 424, -118, -110, -249, 497, 509, 368, 195, -610, -475, 193, 333, 531, 141, -617, -11, 84, 429, 384, 20, -364, -431, -299, 738, 5, -369, 7, -476, 80, 305, 205, 156, -619, -474, -309, -158, 363, 455, -686, -579, -299, -85, 519, -493, -474, -524, -467, 99, 278, 71, 32, -613, -383, 125, 71, 401, -188, -211, -319, -421, 425, 318, -141, -101, -520, -189, 343, 57, 222, -271, -659, 357, 612, 228, 317, -56, -246, 202, 134, 753, 139, -431, -21, -274, 127, 559, 135, 63, -164, -70, 412, 370, 249, 323, -176, -101, 180, 486, 573, -187, 81, -25, 124, 373, 349, -176, -92, -576, 127, 294, 202, 175, -552, -461, 158, 149, 196, 229, -691]
2333f91N66j88K79L95n15j36j48K13K75J33o08M23m26K48R1K67l6m70O2K69j3
2354a0J91o0k09k7k70J67N51j23n08J82l37N58M68l86k62j83J4M81l53M95j06
2375B73n54J50J00L93P4K4l68j08%N65l31p1q3l89N22J69k44L91o44j14K83K76
2397C14K65k38m11k2j66M32J72k14k37k26q7N33R3R6l57m74L99M6J23L96m78q
2419d9l04Q2K95M0m6j39l54M68K84k37J18j94o89N78m0L65k30m82J75J28Q7M92
2441C48l33l33j88n2N38J04j05N1n06O9P46j37J38l46k17J50j15L15L35n30q1
2462a49j62K71M64k52j28R8n83L79J07L60j5m44j76K48l4L71J14n43N0j18J94
2483E2L15jj64j46k35K47K19N4k81j87J22J84L4J84l34l26J84j49K58J42k60K05
$$ y = [-691, -125, -313, -34, 361, -154, -290, -438, -225, 50, 183, -425, -2, -428, -180, -89, 178, 142, -328, -266, 3, -10, 181, 121, -88, -115, -385, -218, 333, 210, -298, -116, -453, 105, 573, 187, -75, -258, -244, 237, -116, 379, 273, -281, -131, -31, 362, 436, 460, 92, -16, -16, 549, 218, 147, 64, -325, 197, 366, 122, 513, -131, -245, 38, 314, 579, 341, -70, -92, -258, 174, 346, 132, -105, -331, -418, 115, 208, 304, -53, -527, -128, -82, 41, 437, -41, -49, -353, -271, 24, 64, 18, -121, -475, -7, 277, 40, 158, -36, -725, -147, -187, 178, -52, -534, -359, -231, -144, 348, 15, -318, -506, -558, -20, 84, -21, 30, -476, -407, 339, 202, 340, -6, -223, -73, -188, 127, 462, -68, -149, -311, -40, 424, 172, 44, 142, -441, -62, 45, 405, 390, -54, -230, 18, -16, 355, 469, -74, -24, -142, 52, 367, 366, 202, 56, -179, 68, 287, 341, 60, -127, -5, 179, 213, 397, 63, -263, -79, -228, 30, 172, -88, 117]
2505A17l51JO79m67K6l99j41R13n59L05J76o99M4K0K21M02l10j40P2p5j4M75n68
2528b72J29k75K45L48m6M7j21m74L82L0J68N4l11L6j63J21L94J13m88J89n05Q2
2550c17P43l20R7k44j96K8L04J41p2m43K37N6L66J0k04j49l3l12P80j11l27j32
2572i8N8P6K58j10J40P2n38J88k18O28l54k8J49o38M12N36l07pl44k20L05P8J01
2595A39L1l20K6o9J68K10l99m3J90m50O77K65m90oj85O9L49k12q2k40K0P0J56
2618a26L53l4m44q7R0j86P94k48k5k83j69Q7O31m49o9q2k19L30L75J43j46l79
2640a43K40p2q3N02m43k18J54o4J22K28j16K56o36K15L87j64N8j64k96M66k08
2661B1K57L08o25M25n94L39P0J29k12N1j73J16K01k25K60n23J90K66k88J99q9
$$ y = [117, -234, -233, 446, -21, 5, -394, -535, 378, -181, 124, 300, -399, -355, -335, -114, 288, -22, -162, -90, -165, -179, 296, -272, -143, -418, -173, 175, 129, 176, 55, -419, -37, -7, 161, 215, -96, -60, -223, -102, 292, 405, -83, 106, -399, -317, 426, 106, 203, -41, -237, -209, 95, 236, 164, -279, -42, 14, 380, 390, 186, 37, 4, -308, 472, 361, 34, -98, -40, 36, 294, 184, 324, 396, -142, 46, -172, 456, 102, 74, 223, -415, -3, 533, 226, 219, -125, -345, -40, 38, 139, 170, -150, -124, -193, -25, 185, -214, -257, -67, -517, 160, 425, -65, -71, -256, -187, 162, -50, -132, -372, -352, -282, -126, 227, 193, -251, -338, -248, -434, 360, 112, 87, -196, -365, -278, 353, -96, -165, -247, -466, -136, 239, 382, 236, -143, 97, 25, -58, 444, 1, -217, -63, -127, -5, 223, 107, 363, -273, -58, 329, 165, 223, 59, -237, 229, 21, 278, 586, -39, 386, -208, 131, 201, 330, 118, 169, -4, 112, 313, 88, 348, -175, 15, 281, -7, 192, 103]
2682A03m26j10K63K34L84o76J19j97J7O61l92J98m12l4Q3K48k21K84k61l15k9
2703d79K44M56j33m12J30k71N50R8m00M70m45k26N19j31K37j39l97K43k38N25
2723B01J01k36j30j3J89P0L7n6l73m0L42K41k58L32k17m17J77r1K98K11l13p6
2745b1K55n7j4p1qk7r6J16K59k22J25l50KL43L6p4j59l25L51q2r7N07l83k13K07
2770Bp4L04R7k92p2k2j03L47k38J05j10j07j90N1N09l4m70M7q3M5J53J01j50M38
2794B54k97J55j67j09K45l12J21J59m5K13j85l11K71r1M9J04J71j87m96L94L73
2815C09l01K24m36J70j8J81j19p2l18K82N6L5J92m5n5n7l05N51k26R8k32j59M42
2838A97j08N2j43J94j87J50n4k75L06k6k00j5K00j4K65m39k51J38J96J88J2j28
$$ y = [103, -323, -433, -170, 64, 448, -228, -109, -306, -289, 372, -20, 178, -234, -268, -185, 63, -158, 126, -135, -450, -479, -235, 221, 88, -324, -194, -465, 85, 183, -217, 253, -192, -418, 101, -30, 207, 68, -329, -86, -324, 201, 302, 66, -64, -77, 112, 182, 219, 163, -210, -250, 92, 333, 75, 407, 190, -227, -50, -141, 157, 368, 55, -21, 234, 177, 163, 92, 84, 57, -39, 77, 336, 114, 239, -111, -109, 234, 270, 196, 37, -288, 63, -19, -116, 391, 8, -205, 2, -72, 232, 329, 37, -35, -57, -160, 187, -51, 54, -56, -163, -353, -302, 207, 173, -297, -250, -333, -288, -135, -34, -184, 254, -43, 112, -55, -164, 81, -231, -110, 49, 4, 217, 32, -279, -8, -99, -50, 54, 225, 38, -458, -64, 309, 8, 232, -204, -34, -52, 129, 10, -62, -380, -98, -42, -7, 185, 140, 85, 28, -277, 274, 48, 146, -86, -245, 197, 89, 141, -2, 192, 5, 155, 101, -174, 132, 106, -94, -109, 91, 77, 342, -97, -348, -210, -14, 174, 186, 58]
2860E8j73k51K56L56J44n59n9L8J62j68K78j62q8j59J04J48K42m03r6J41O5J37
2882A1J09J38j06l84Nj31L15Q8r6l43K96QM6M2Q9j46q2J33K4J82J22l16p5%k00
2907b71O40r8m37K28k22L7N7N7K1o7m1O5L46r6Nk71j76M54l27J26J75k31R3J20
2931A87N4J19k49l34J09K84j40L7J27L0l12J70j86K97K27n47J86j44L13j99J48
2952A77j31k44k17L41L31J39k47q0j15R2k64K74k4l36M70j46NJ13l73J7J16l70
2974d72M77k64J52Q2n10P34j17Q5J63m47p3PK64J62j01j7k06j5N22p8l85l8K17
2997A42m28K96j20J80J64j41j6lL9j17j8j39K98j31K3J72k37k87L42j20L18o8
3019A49j61j62K65r1J92M3l05p2J12J57k16J73j79O1J72j30m3J24L4J59m31J1
$$ y = [58, -115, -366, -110, 246, 390, -169, -228, -190, -28, -196, 82, -80, -168, -327, -223, -75, 167, -236, -332, -191, -126, 11, 120, 258, 152, -232, -227, -358, -43, 45, -51, -394, -98, -90, -44, -2, 87, -59, -141, -8, 16, 198, 320, 4, -71, -71, -271, 369, 271, -166, 62, -160, -123, -66, -9, 12, -55, -96, -31, 315, 219, 224, -47, -223, 231, -96, 30, 205, -26, 67, 187, 241, 360, 111, -223, -114, 170, 30, 67, 194, 224, -88, 82, -104, 193, 420, -127, 59, -85, 228, 29, 177, 46, -198, -415, -74, 257, 396, 149, 69, -46, 46, -218, 56, 32, -304, 166, 20, 25, 138, -235, -218, -102, -472, 5, -259, -107, -25, -535, 199, 82, 167, 330, -117, -190, -183, 81, 243, 142, 125, -81, -96, 426, 348, -37, -75, 142, -286, 10, -110, 70, 234, 93, 77, 74, 113, -4, -22, -161, 137, 6, 29, 201, -36, -323, 19, -101, 217, 149, -12, -174, 91, 0, 192, 235, -70, -142, -30, 127, -89, 84, -95, -34, 138, 8, -35, 89, 123, 282, -149, -138]
3041a38M25Qj17j47m5J15r9o3L50m59j2K37j28Q2J03k5k69kL6L52n27K93p6l12
3065d18L45l19L48L26k34l52N04p9k7j87k2J94l57J8K97L9Rm38K39K28j74O0Q0
3088H0j90J88j10K90Lm54J24q2j40N70j27J56l15j1o4J68j27J37O4l62L34j1K5
3111A46K79o45N3j96O12o0m02K59k09j93M16Q9L9k39j58K66K5J1j72J85j06j61
3133a61M07l64J47j78R7k71K11R4R3k59J27P6P1jj33K09l91P5J63j67kP7j88J30
3157a38o5K92j17j76K89k39P6K26k21n7j10P1m0K03R8K1p1j91P3p8R1J93j88J9
3181c9n7j6M3J13M9j63j45J64Q8j5l1l79L02j35J65K13Q0k82k7k7R5J82l1l3k05
3206i1k55N38l8q5n6N6n8p8L47j93j06J52j65n8L99l73p5q6N1R9J60J60m24j45
$$ y = [-138, 287, 295, 178, 31, -14, 101, 2, -61, 289, -170, -182, 55, -73, 9, 112, 87, -182, -184, -148, 204, -323, -30, -106, -418, -73, -392, -44, 282, 48, -304, 200, 121, 94, -93, -115, 79, -278, -260, 37, 76, 85, -353, -114, 114, -60, 0, 80, -110, 78, -32, 258, 261, -193, -69, -151, -291, 279, 152, 308, -7, -18, -82, 86, -41, 96, 160, -202, 132, 121, 146, 425, -220, -167, -363, 249, 189, -213, 46, -163, -356, 60, 149, 188, -51, -209, 57, 82, 93, -79, 106, 0, -161, 246, -118, 29, -149, -52, -323, -112, -18, 75, -184, -57, 19, 90, 89, -44, 165, -226, -151, 12, -155, -157, -80, -268, -138, -203, 89, -28, -204, 85, -154, -78, 148, -73, -130, -240, -169, -209, -6, 92, 113, 42, -149, -76, -154, -63, 130, -58, -39, -96, -112, -69, 44, 93, -70, -215, -51, 37, 22, -9, -388, -86, -221, -56, 157, 237, -45, -72, -99, -4, 178, 147, 114, -91, -346, 192, 154, 69, 13, 69, 11, -67, 280, 87, -19, 133, -32, -90, 309, -64, -139, -225, -174, -75, 85, 245, -179, -324]
3230c24Q6K64NJ95j57M1j20Q7o7k1n5k07R9n1R9j36J48j47j18K53O2J73l3j59
3254h3l4J25r3P9j16J19J69n01L45J69o9j05n7k2K77m4l5J5k14J46j32Q3m8L0
3278Dj58P8Q8NK11k57J04j67P6K39j06j02m3j3K86l11K64j33k78J18K13j08K78
$$ y = [-324, -238, 26, 31, 226, 69, 110, -10, 77, 10, -11, -66, -273, -174, -225, -126, -262, -114, -261, -379, -126, -64, 109, 76, -83, -117, 8, -85, -6, -122, -3, 166, -335, 10, 179, 110, 5, -52, -74, 203, 159, 124, 139, -75, 71, -61, 22, -26, 4, -154, -76, 12, 17, 228, -29, 75, -92, -16, 223, 117, 15, -28, -41, 245, -66, 198, 65, -213, -95, 118, 10, 288]
$$ [...]
8191h3
##END NTUPLES=NMR FID
##END=
