##TITLE=1H_Pr 4687-03-2
 CDCl3,8 sc, 
 11.03.2021
##JCAMPDX= 6.0         $$ Bruker NMR JCAMP-DX V2.0
##DATA TYPE= NMR FID
##DATA CLASS= NTUPLES
##ORIGIN= UXNMR, Bruker Analytische Messtechnik GmbH
##OWNER= root
$$ XWIN-NMR		Version 3.5
$$ Thu Mar 11 11:12:07 2021 Russian Standard Time (UT+4h)  she@DPX200
##.OBSERVE FREQUENCY= 200.131506
##.OBSERVE NUCLEUS= ^1H
##.DELAY= (6, 6)
##.ACQUISITION MODE= SIMULTANEOUS
##.ACQUISITION SCHEME= undefined
##.AVERAGES= 8
##.DIGITISER RES= 18
##SPECTROMETER/DATA SYSTEM= spect
##.PULSE SEQUENCE= zg30
##.SOLVENT NAME= CDCl3
##.SHIFT REFERENCE= (INTERNAL, CDCl3, 0, 15.7039)
##AUDIT TRAIL= $$ (NUMBER, WHEN, WHO, WHERE, WHAT)
$$ ##TITLE= Audit trail, XWIN-NMR		Version 3.5
$$ ##JCAMPDX= 5.01
$$ ##ORIGIN= Bruker BioSpin GmbH
$$ ##OWNER= she
$$ F:/spectra/data/she/nmr/H-F/1/audita.txt
$$ ##AUDIT TRAIL=  $$ (NUMBER, WHEN, WHO, WHERE, WHAT)
(   1,<2021-03-11 11:10:40.26 +0400>,<she>,<DPX200>,
      <created by zg, POWCHK disabled, PULCHK disabled
       configuration hash MD5:
       00 E9 B6 7A A2 85 ED C7 34 08 36 98 17 FE 4E 26
       data hash MD5: 16K
       C3 58 3B 55 D1 79 BD 48 93 43 0D C7 40 84 73 F4>)
$$ ##END=
$$ 
$$ hash MD5
$$ C9 48 19 3B 3A BB 76 42 87 4A 8C 23 C5 AB 08 DB
##$RELAX= 
##$RELAX= 
##$RELAX= 
##$RELAX= 
##$RELAX= 
##$RELAX= 
$$ Bruker specific parameters
$$ --------------------------
##$DU= <F:/spectra>
##$EXPNO= 1
##$NAME= <H-F>
##$PROCNO= 1
##$TYPE= <nmr>
##$USER= <she>
##$AMP= (0..31)
100 100 100 100 100 100 100 100 100 100 100 100 100 100 100 100 100 100 
100 100 100 100 100 100 100 100 100 100 100 100 100 100 
##$AQSEQ= 0
##$AQ_mod= 1
##$AUNM= <au_zg>
##$AUTOPOS= <>
##$BF1= 200.13
##$BF2= 200.13
##$BF3= 200.13
##$BF4= 200.13
##$BF5= 200.13
##$BF6= 200.13
##$BF7= 200.13
##$BF8= 200.13
##$BYTORDA= 1
##$CFDGTYP= 0
##$CFRGTYP= 5
##$CHEMSTR= <none>
##$CNST= (0..31)
1 1 145 1 1 1 1 1 1 1 1 1 1 1 1 1 1 1 1 1 1 1 1 1 1 1 1 1 1 1 1 1 
##$CPDPRG= <>
##$CPDPRG1= <>
##$CPDPRG2= <>
##$CPDPRG3= <>
##$CPDPRG4= <mlev>
##$CPDPRG5= <mlev>
##$CPDPRG6= <mlev>
##$CPDPRG7= <mlev>
##$CPDPRG8= <mlev>
##$CPDPRGB= <>
##$CPDPRGT= <>
##$D= (0..31)
0 1.2 0 0 0 0 0 0 0 0.06 0 0.03 0 0 0 0 0.0002 0 0 0 0 0 0 0 0 0 0 0 0 
0 0 0 
##$DATE= 1615446639
##$DBL= (0..7)
120 120 120 120 120 120 120 120 
##$DBP= (0..7)
150 150 150 150 150 150 150 150 
##$DBP07= 0
##$DBPNAM0= <>
##$DBPNAM1= <>
##$DBPNAM2= <>
##$DBPNAM3= <>
##$DBPNAM4= <>
##$DBPNAM5= <>
##$DBPNAM6= <>
##$DBPNAM7= <>
##$DBPOAL= (0..7)
0.5 0.5 0.5 0.5 0.5 0.5 0.5 0.5 
##$DBPOFFS= (0..7)
0 0 0 0 0 0 0 0 
##$DE= 6
##$DECBNUC= <off>
##$DECIM= 32
##$DECNUC= <off>
##$DECSTAT= 4
##$DIGMOD= 1
##$DIGTYP= 9
##$DL= (0..7)
0 120 120 120 120 120 120 120 
##$DP= (0..7)
150 150 150 150 150 150 150 150 
##$DP07= 0
##$DPNAME0= <>
##$DPNAME1= <>
##$DPNAME2= <>
##$DPNAME3= <>
##$DPNAME4= <>
##$DPNAME5= <>
##$DPNAME6= <>
##$DPNAME7= <>
##$DPOAL= (0..7)
0.5 0.5 0.5 0.5 0.5 0.5 0.5 0.5 
##$DPOFFS= (0..7)
0 0 0 0 0 0 0 0 
##$DQDMODE= 0
##$DR= 18
##$DS= 0
##$DSLIST= <SSSSSSSSSSSSSSS>
$$ [...]
##$SUBNAM2= <"">
##$SUBNAM3= <"">
##$SUBNAM4= <"">
##$SUBNAM5= <"">
##$SUBNAM6= <"">
##$SUBNAM7= <"">
##$SUBNAM8= <"">
##$SUBNAM9= <"">
##$SW= 16.9725357007746
##$SWIBOX= (0..15)
0 0 2 0 0 0 0 0 0 0 0 0 0 0 0 0 
##$SW_h= 3396.73913043478
##$TD= 16384
##$TD0= 1
##$TE= 0
##$TE2= 300
##$TE3= 300
##$TEG= 300
##$TL= (0..7)
0 120 120 120 120 120 120 120 
##$TP= (0..7)
150 150 150 150 150 150 150 150 
##$TP07= 0
##$TPNAME0= <>
##$TPNAME1= <>
##$TPNAME2= <>
##$TPNAME3= <>
##$TPNAME4= <>
##$TPNAME5= <>
##$TPNAME6= <>
##$TPNAME7= <>
##$TPOAL= (0..7)
0.5 0.5 0.5 0.5 0.5 0.5 0.5 0.5 
##$TPOFFS= (0..7)
0 0 0 0 0 0 0 0 
##$TUNHIN= 0
##$TUNHOUT= 0
##$TUNXOUT= 0
##$USERA1= <user>
##$USERA2= <user>
##$USERA3= <user>
##$USERA4= <user>
##$USERA5= <user>
##$V9= 5
##$VALIST= <valist>
##$VCLIST= <CCCCCCCCCCCCCCC>
##$VD= 0
##$VDLIST= <DDDDDDDDDDDDDDD>
##$VPLIST= <PPPPPPPPPPPPPPP>
##$VTLIST= <TTTTTTTTTTTTTTT>
##$WBST= 1024
##$WBSW= 4
##$XGAIN= (0..3)
0 0 0 0 
##$XL= 0
##$YL= 0
##$YMAX_a= 289809
##$YMIN_a= -258757
##$ZGOPTNS= <>
##$ZL1= 120
##$ZL2= 120
##$ZL3= 120
##$ZL4= 120
##$ABSF1= 10
##$ABSF2= 0
##$ABSG= 5
##$ABSL= 3
##$ALPHA= 0
##$AQORDER= 0
##$ASSFAC= 0
##$ASSFACI= 0
##$ASSFACX= 0
##$ASSWID= 0
##$AUNMP= <proc_1d>
##$AZFE= 0.1
##$AZFW= 0.1
##$BCFW= 1
##$BC_mod= 2
##$BYTORDP= 1
##$COROFFS= 0
##$CY= 11.3945322036743
##$DATMOD= 1
##$DC= 2
##$DFILT= <>
##$DTYPP= 0
##$F1P= 15.9154993809931
##$F2P= -4.1035820241983
##$FCOR= 0.5
##$FTSIZE= 0
##$FT_mod= 4
##$GAMMA= 1
##$GB= 0.15
##$INTBC= 1
##$INTSCL= 1
##$ISEN= 128
##$LB= 0.24
##$LEV0= 0
##$LPBIN= 0
##$MAXI= 10000
##$MC2= 0
##$MEAN= 0
##$ME_mod= 0
##$MI= 1.114404
##$NCOEF= 0
##$NC_proc= 0
##$NLEV= 6
##$NOISF1= 3.799351
##$NOISF2= 2.8
##$NSP= 1
##$NTH_PI= 0
##$NZP= 0
##$OFFSET= 15.70392
##$PC= 1
##$PHC0= -11122.67
##$PHC1= 16.20094
##$PH_mod= 1
##$PKNL= yes
##$PPARMOD= 0
##$PSCAL= 0
##$PSIGN= 0
##$REVERSE= no
##$SF= 200.130013532006
##$SI= 16384
##$SIGF1= 3
##$SIGF2= 2
##$SINO= 400
##$SIOLD= 16384
##$SREGLST= <1H.CDCl3>
##$SSB= 0
##$STSI= 0
##$STSR= 0
##$SW_p= 3612.71676300578
##$SYMM= 0
##$S_DEV= 0
##$TDeff= 0
##$TDoff= 0
##$TI= <>
##$TILT= no
##$TM1= 0
##$TM2= 0
##$TOPLEV= 0
##$USERP1= <user>
##$USERP2= <user>
##$USERP3= <user>
##$USERP4= <user>
##$USERP5= <user>
##$WDW= 1
##$XDIM= 8192
##$YMAX_p= 0
##$YMIN_p= 0
$$ End of Bruker specific parameters
$$ ---------------------------------
##NTUPLES= NMR FID
##VAR_NAME=  TIME,          FID/REAL,        FID/IMAG
##SYMBOL=    X,             R,               I
##VAR_TYPE=  INDEPENDENT,   DEPENDENT,       DEPENDENT
##VAR_FORM=  AFFN,          ASDF,            ASDF
##VAR_DIM=   8192,          8192,            8192
##UNITS=     SECONDS,       ARBITRARY UNITS, ARBITRARY UNITS
##FACTOR=    0.0002944,     1,               1
##FIRST=     0,             0,               0
##LAST=      2.4114304,     0,               0
##MIN=       0,             -258757,         0
##MAX=       2.4114304,     289809,          0
$$ Real data points
##PAGE= N=1
##DATA TABLE= (X++(R..R)), XYDATA
$$ plain form
0 0 0 0 0 0 0 0 0 0 0 0 -5 8 -8 8 -8 16 -16 24 -24 32 -40 48 -56 64 -72 86 -97 112 -131 150 -172 195 -221
33 -221 247 -279 316 -354 394 -442 490 -546 605 -671 743 -819 905 -998 1098 -1210 1332
50 1332 -1467 1616 -1783 1970 -2178 2415 -2686 2999 -3366 3802 -4331 4988 -5830 6945 -8501
65 -8501 10822 -14626 21908 -40591 183050 289809 -258757 13250 146523 -101708 -22194
76 -22194 91092 15837 -4396 -41298 59875 92217 -86118 -99877 99263 77738 -76776
87 -76776 -2805 68142 -79842 -38332 84012 -8542 -29258 18425 -1245 67736 -14980 -101641
99 -101641 61375 21758 -60192 82261 6519 -74250 21853 -28065 3643 60577 -55332
110 -55332 5193 57057 -63980 -18506 39347 -44757 -14160 55528 -4809 -30462 7936 -34719
$$ packed form
0@%%%%%%%%%%nJ3j6J6j6K4l2M0m8N6p2Q8j04J20j36J58j83K09k43K81l22L67m16
33b21M68n26N95o70P48q36R32j036J151j276J414j562J724j903K096k308K542
50A332k799L083l399L753m148M593n101N685o365P168q133R319j0818J2775j5446
65h501J9323k5448L6534o2499K23641J06759n48566K72007J33273k48231P9514
76b2194J13286p5255k0233l6902J01173L2342j78335j3759J99140k1525j54514
87g6776P3971P0947j47984M1510J22344r2554k0716M7683j9670O8981q2716q6661
99a01641J63016l9617q1950J42453p5742q0769R6103m9918L1708N6934j15909
110e5332O0525N1864j21037M5474N7853q4104L0597O9688o0337k5653L8398m2655
$$ plain form
122 -34719 -26836 72166 -434 -62205 47231 -5997 -55232 60356 -12810 -73887 55829 20802
134 20802 -23060 34538 -45199 -36950 55320 348 -6895 18043 -27980 8831 23949 -33124
146 -33124 -3142 17006 -5395 28480 28808 -45051 -37027 42650 19640 -16239 23121 -1217 -27130
159 -27130 20824 6894 -12680 9463 -5805 17050 24826 -29716 -5342 18343 -18195 11783
171 11783 20024 -21489 12558 10626 -31827 9406 16941 -25243 8409 28359 -18202 -14333 10752
184 10752 -10648 -14953 12181 15702 2997 -14674 -24064 6361 10659 -12072 9110 6768 -25253
197 -25253 1847 17413 -17991 -14915 4118 8725 13486 -10057 -22906 5773 5711 -9737 14203
210 14203 2725 -26104 10404 24503 -16366 -19508 4000 8881 11626 2568 -5170 -4222 -11290 6370
$$ packed form
122c4719P883R9002p2600o1771J09436n3228m9235J15588p3166o1077J29716l5027
134B0802m3862N7598p9737Q249R2270n4972p243K4938m6023L6811J5118n7073
146c3124K9982K0148k2401L3875L28p3859Q024P9677k3010l5879L9360k4338k5913
159b7130M7954j3930j9574K2143j5268K2855P776n4542K4374K3685l6538K9978
171A1783Q241m1513L4047j932m2453M1233P535m2184L3652J9950m6561L869K5085
184A0752k1400m305K7134L521j2705j7671r390L0425M298k2731K1182k342l2021
197b5253K7100J5566l5404L076J9033M607M761k3543j2849K8679o2j5448K3940
210A4203j1478k8829L6508J4099m0869l142K3508M881K745r058p738R48p068J7660
$$ plain form
224 6370 21333 -6874 -10990 18481 4485 -14154 3208 3687 -3015 11860 12779 -7892 -5911 2126
238 2126 -569 6768 6095 -1856 4422 628 -7339 6668 2199 -4390 5540 -2888 1089 11197 -6566
253 -6566 -8655 2389 -5556 5496 15020 -7739 -12416 322 3083 -1044 -2829 -1894 -147 3418
267 3418 1301 -8908 -11438 -2767 7843 13189 -6273 -18797 -569 3063 1912 4669 -9463 -7882
281 -7882 7988 2867 -969 -6135 -12797 7620 12238 -4520 -4493 -1884 -1870 3677 3290 -3453 -3555 3946
297 3946 9336 -44 -6530 -3378 782 8079 4852 867 914 -5213 -355 6662 -758 3187 7266 -4207
313 -4207 504 2426 -2107 4063 1248 -1692 4919 3368 -963 -2009 -3509 3290 5425 1510 -1411
328 -1411 -5322 281 5625 1441 -4768 -7805 1723 10688 577 -6495 -6079 -7129 6365 8911 -4784
$$ packed form
224F370J4963k8207m116K9471j3996j8639J7362M79o702J4875R19k0671J981Q037
238B126k695P337o73p951O278l794p967J4007m469o589R930q428L977J0108j7763
253f566k089J1044p945J1052R524k2759m677J2738K761m127j785R35J747L565
267C418k117j0209k530Q671J0610N346j9462j2524J8228L632j151K757j4132J581
281g882J5870n121l836n166o662K0417M618j6758K7K609J4N547l87o743j02P501
297C946N390r380o486L152M160P297l227l985M7o127M858P017p420L945M079j1473
313d207M711J922m533O170k815k940O611j551m331j046j500O799K135l915k921
328a411l911N603N344m184o209l037R528Q965j0111p072M16j050J3494K546j3695
$$ plain form
343 -4784 -6436 -4909 1207 5820 -4957 -7792 1075 2618 3956 -2515 -10980 -2994 3544 5660 1168
358 1168 -8033 -5094 2058 3489 1827 -5742 -5357 4997 2682 1036 -662 -5809 1019 2899 582
373 582 3655 -1303 -1538 4314 -1577 -1200 2710 1035 4393 -245 -1891 5081 -886 -3752 4983 4677
389 4677 2208 168 -1957 622 -1440 4534 8664 -4865 -6147 3992 5279 2155 -4779 -3585 5202
404 5202 875 805 3708 -8191 -4945 7531 4269 -3954 -7033 -267 6956 -1020 -5477 -1862 -4545
419 -4545 2049 6644 -1501 -7305 -7787 2097 7601 -3107 -5478 430 -2270 -204 1487 -3429 -1749
434 -1749 -716 2242 1747 -4783 -1541 1403 -1616 2094 1555 -3852 967 1089 -1231 1362 1159 -173
450 -173 -1960 96 5977 2373 -4389 -532 755 1457 6116 2440 -2994 -4390 1036 8776 3307 -6389
$$ packed form
343d784j652J527O116M613j0777k835Q867J543J338o471q465P986O538K116m492
358A168r201K939P152J431j662p569L85J0354k315j646j698n147O828J880k317
373E82L073m958k35N852n891L77L910j675L358m638j646O972n967k866Q735l06
389D677k469k040k125K579k062N974M130j3529j282J0139J287l124o934J194Q787
404E202m327p0K903j1899L246J2476l262q223l079O766P223p976m457L615k683
419d545O594M595q145n804m82R884N504j0708k371N908k700K066J691m916J680
434a749J033K958m95o530L242K944l019L710n39n407M819J22k320K593k03j332
450a73j787K056N881l604o762L857J287P02M659l676n434j396N426P740n469r696
$$ plain form
466 -6389 -1390 5082 3519 1072 -2190 -1870 -610 5336 8947 -5037 -11617 3770 9201 260 -2460
481 -2460 -4110 -2777 4737 5169 -826 -7585 -5699 5471 7915 -3155 -7534 -2035 2219 1389 249
496 249 -1406 -7588 -823 9232 -1923 -9505 -293 -44 0 5476 -2886 -7641 -1359 1710 3198 214
512 214 -4463 -2826 1560 1495 76 -305 -1217 -3972 1346 8211 -2834 -6433 3725 975 -198 5039
528 5039 -1132 -4740 1378 4703 4642 -2461 -5856 2177 6355 5053 -1929 -5632 505 2713 4805 6986
544 6986 -7216 -8186 8248 5986 -363 -2349 -5376 2768 7974 -609 -3544 -2602 -1637 4673 5987
559 5987 -2562 -10460 -526 11550 -1027 -6725 494 -3654 370 8045 -2625 -7164 -2307 -29
573 -29 6077 327 -7614 -1414 2133 707 -1090 -2163 -952 -2327 224 4738 -4234 -5090 2260 600
$$ packed form
466f389M999O472j563k447l262L20J260N946L611j3984o580J5387N431q941k720
481b460j650J333P514M32n995o759J886J1170K444j1070m379N499M254q30j140
496B49j655o182O765J0055j1155p582R212K49M4N476q362m755O282L069J488k984
512B14m677J637M386o5j419l81r12k755N318O865j1045l599J0158k750j173N237
528E039o171l608O118L325o1p103l395Q033M178j302o982l703O137K208K092K181
544F986j4202r70J6434k262o349j986l027Q144N206q583k935R42R65O310J314
559E987q549p898R934J2076j2577n698P219m148M024P675j0670m539M857K278
573b9O106n750p941O200L547j426j797j073J211j375K551M514q972q56P350j660
$$ plain form
589 600 1370 115 -3029 379 -456 -926 4467 89 -4214 377 1813 3193 203 -2027 824 -1468
605 -1468 1884 5930 -2785 -3190 2949 718 3496 1276 -4755 1225 4211 2127 324 -3236 -763
620 -763 3397 3162 2042 -4449 -3286 4269 2735 1923 -1502 -5389 2153 4677 -1087 -998 -1967 -1429 3391
637 3391 502 -1192 -2189 -2677 3754 1876 -4412 -1685 791 89 336 -1470 -1096 -1910 -1359 3526 -1142
654 -1142 -3947 517 -258 -1354 24 -116 298 -1964 -2136 1468 -574 -792 1029 -2281 -187 1551
670 1551 -299 92 -1316 -1398 2503 1572 -910 -1207 -820 2550 2429 -873 -826 -844 1644 4060 324 -2441
688 -2441 -925 1516 4337 1157 -2504 -435 794 2989 2073 -2192 -783 1544 1913 1669 -1640 -2323
704 -2323 1691 2359 1441 -1265 -2337 718 1207 1150 139 -2592 -1097 1569 -49 -454 -901 -1096 -241
$$ packed form
589F00P70j255l144L408q35m70N393m378m303M591J436J380k990k230K851k292
605a468L352M046q715m05O139k231K778k220o031N980K986k084j803l560K473
620g63M160k35j120o491J163P555j534q12l425l887P542K524n764Q9r69N38M820
637C391k889j694r97m88O431j878o288K727K476p02K47j806L74q14N51M885m668
654a142k805M464p75j096J378j40M14k262j72L604k042k18J821l310K094J738
670A551j850L91j408q2L901r31k482k97L87L370j21l302M7j8K488K416l736k765
688b441J516K441K821l180l661K069J229K195r16m265J409K327L69k44l309o83
704b323M014O68r18k706j072L055M89n7j011k731J495K666j618m05m47j95Q55
$$ plain form
721 -241 -671 101 -183 -1560 -357 -63 -1456 8 -37 -1377 -1045 -905 580 -192 -1580 -834 -210 525
739 525 960 -1804 -2177 291 1358 1653 -1179 -2874 -71 1834 2010 -97 -2956 -411 2199 2091 324
756 324 -1871 -1441 2516 2416 636 -1371 -1309 2343 2835 479 -1179 -1081 1554 3378 646 -1136 -1105 139
774 139 2992 1150 -1077 -928 -41 1987 1480 -802 -348 85 261 1134 -656 -1122 -130 -357 256 -539
792 -539 -1018 -297 -663 -389 491 -524 -995 -808 -1148 447 72 -758 -1237 -1770 -203 1346 -286 -1437
810 -1437 -1694 -700 1609 557 -1460 -1347 -774 1466 1148 -844 -1783 -290 1592 1773 -1032 -2275 84
827 84 1629 2273 -279 -1946 -497 1756 2289 665 -1658 -997 1393 1980 1019 -1158 -900 1765 1727 612
845 612 -329 -420 736 1329 877 -118 -908 420 1443 548 -330 -387 384 735 -499 662 671 -1064 -443 412
$$ packed form
721b41m30P72k84j377J203K94j393J464m5j340L32J40J485p72j388P46O24P35
739E25M35k764l73K468J067K95k832j695K803J905J76k107k859K545K610j08j767
756C24k195M30L957j00j780k007O2L652M92k356j658R8K635J824k732j782L1J244
774A39K853j842k227J49Q87K028n07k282M54M33J76Q73j790m66R92k27O13p95
792e39m79P21l66K74Q80j015m71J87l40J595l75q30m79n33J567J549j632j151
810a437k57R94K309j052k017J13N73K240l18j992r39J493J882J81k805j243K359
827H4J545O44k552j667J449K253N33j624k323O61K390N87r61k177K58K665l8j115
845F12r41r1J156N93m52r95p90J328J023q95q78n7P71L51j234J161Rj735O21Q55
$$ plain form
865 412 -182 -289 -502 -342 -839 -818 1012 106 -1707 -1508 -357 1201 -127 -2292 -897 247 -403 768
883 768 -1165 -2409 -579 1231 1277 -1332 -2552 -108 1822 628 -398 -2287 -572 1229 340 1045
899 1045 -1389 -2548 1701 2116 -838 -927 -384 1116 1893 -607 142 -380 -429 2019 1094 -350 -823 -238
917 -238 2512 905 -1470 1070 380 -736 1882 740 -217 8 -1264 1676 1452 -655 766 -529
933 -529 -507 1678 182 432 -776 -2063 2275 1270 -1710 -497 -1271 195 2457 -1217 -1867 -999 -1158
950 -1158 2675 665 -3012 -1566 -436 2067 1471 -3311 -1717 102 149 2141 -1637 -2796 186 259
966 259 2393 79 -4489 236 2302 -47 763 -2230 -1838 2402 846 964 -564 -2666 1596 2931
982 2931 -55 -582 -1628 506 2395 -635 1357 -417 -2122 2835 1553 -837 823 -894 658
$$ packed form
865D12n94j07k13J60m97K1J830r06j813J99J151J558j328k165J395J144o50J171
883G68j933j244J830J810M6k609j220K444J930j194j026j889J715J801q89P05
899A045k434j159M249M15k954q9N43J500P77k500P49n22m9K448r25j444m73N85
917b38K750j607k375K540o90j116K618j142r57K25j272K940k24k107J421j295
933e29K2K185j496K50j208j287M338j005k980J213p74J466K262l674o50Q68j59
950a158L833k010l677J446J130K503n96m782J594J819M7J992l778j159K982P3
966B59K134k314m568M725K066k349Q10k993L92M240j556J18j528k102M262J335
982B931k986n27j046K134J889l030J992j774j705M957j282k390J660j717J552
$$ plain form
997 658 2470 -968 636 123 -1649 2477 1206 -661 -361 -1627 1359 2057 -685 288 -1278 -1650 3454
1014 3454 864 -1761 -174 -1594 1124 2247 -1803 -1506 -600 82 2332 -1001 -2608 -803 -26 2257
1030 2257 157 -3594 -431 -167 738 2127 -3180 -2717 1834 565 917 -602 -3448 590 1534 366
1046 366 143 -2567 -791 2598 293 99 -1587 -1307 2398 763 -137 296 -1618 1020 2450 -562
1062 -562 -163 -70 -626 1969 308 -259 745 -1018 726 1496 -666 620 36 -538 1755 294 -131
1079 -131 603 -948 829 1545 -787 59 -382 -589 1522 215 -1083 -448 -662 1406 1087 -1536 -753
1096 -753 -923 304 1457 -1104 -1335 -148 -579 1290 66 -2572 -363 241 166 444 -1666 -1392 825
1113 825 278 -61 -692 -1571 542 978 29 -266 -1220 -136 1061 -277 -310 -233 -497 1262 30 -425 388
$$ packed form
997F58J812l438J604n13j772M126j271j867L00j266K986O98k742R73j566l72N104
1014C454k590k625J587j420K718J123m050K97R06O82K250l333j607J805P77K283
1030B257k100l751L163K64R05J389n307M63M551j269L52j519k846M038R44j168
1046C66k23k710J776L389k305j94j686K80L705j635r00M33j914K638J430l012
1062e62L99R3n56K595j661n67J004j763J744P70k162J286n84n74K293j461m25
1079a31P34j551J777P16k332Q46m41k07K111j307j298O35k14K068l19k623P83
1096g53j70J227J153k561k31J187m31J869j224k638K209O04p5K78k110K74K217
1113H25n47l39o31q79K113M36r49k95r54J084J197j338l3P7k64J759j232m55Q13
$$ plain form
1132 388 -492 286 646 -556 666 658 -556 765 313 101 1156 -388 -126 742 446 834 150 -838 490
1151 490 901 336 258 -964 -147 1100 565 158 -694 -444 938 614 -377 -571 -976 757 1028 -868 -718
1170 -718 -752 -220 1226 -788 -1637 -206 2 687 447 -1596 -870 -96 -58 490 -1076 -1214 -198 231 126
1189 126 -301 -913 -165 197 -229 21 -758 10 286 -300 220 67 -626 387 -168 12 676 -254 223 393
1209 393 -259 975 311 -336 183 557 371 635 -347 -412 441 660 1109 -548 -641 319 1142 901 -200 -733
1229 -733 307 1102 749 -66 -1101 -162 1359 611 -109 -1086 -674 943 784 -417 -925 -736 490 918
1247 918 -118 -1026 -680 210 602 -75 -839 -548 -6 363 -6 -993 -772 -441 401 54 -879 -478 -72 -11
1267 -11 295 -338 -595 -26 -140 -313 397 -55 -243 402 -308 290 518 261 -71 -185 174 557 379 -120
$$ packed form
1132C88q80P78L60j202J222qj214J321m52k12J055j544K62Q68k96L88o84r88J328
1151D90M11n65p8j222Q17J247n35m07q52K50J382l24r91j94m05J733K71j896J50
1170g18l4N32J446k014q49J431K08O85k40k043P26P74L8N48j566j38J016M29j05
1189A26m27o12P48L62m26K50p79P68K76n86N20j53o93J013n55J80O64r30M77J70
1209C93o52J234o64o47N19L74j86K64r82o5Q53K19M49j657r3R60Q23k41j101n33
1229g33J040P95l53q15j035R39J521p48p20r77M12J617j59j201n08J89J226M28
1247I18j036r08L46Q90L92o77p64K91N42L69l69r87K21L31Q42l47r33M01M06O1
1267a1L06o33k57N69j14j73P10m52j88O45p10N98K28k57l32j14L59L83j78m99
$$ plain form
1287 -120 -223 198 1139 436 -298 -191 494 1047 825 -394 -601 469 1010 1028 -314 -947 65 989 808
1306 808 -244 -837 188 942 542 110 -797 -297 851 474 -191 -367 -667 352 464 -276 -598 -460 44
1325 44 461 -393 -538 -358 -104 191 -384 -549 -185 -190 -168 -116 -338 -69 -15 -362 -125 185 -111 -75 -484 -338
1347 -338 335 -91 -229 -177 -830 307 642 -307 -364 -568 -5 980 440 -662 -177 -22 1125 724 -622
1366 -622 -596 150 678 1128 -652 -698 437 430 1067 367 -1031 446 918 296 185 -604 -259 1100 334 86
1386 86 -360 -774 677 420 -210 -129 -743 388 820 -589 132 -25 -558 550 43 -507 343 -693 -282
1405 -282 275 -371 268 -286 -674 465 -146 -136 154 -1325 -5 467 -238 332 -814 -1055 1371 544 -527
1424 -527 -19 -1277 605 1365 -568 -408 -796 14 1893 -97 -1116 -287 -112 1542 1051 -1441 -165
$$ packed form
1287a20j03M21R41p03p34J07O85N53k22j219k07J070N41J8j342o33J012R24j81
1306H08j052n93J025P54m00m32r07N00J148l77o65j76l00J019J12p40l22J38N04
1325D4M17q54j45J80K54K95n75j65L64nK2N2k22K69N4l47K37L10k96L6m09J46
1347c38O73m26j38N2o53J137L35r49n7k04N63R85n40j102M85J55J147m01j346
1366f22K6P46N28M50j780m6J135pO37p00j398J477M72o22j11p89L45J359p66k48
1386H6m46m14J451k57o30Q1o14J131M32j409P21j57n33J108n07n50Q50j036M11
1405b82N57o46O39n54l88J139o11J0K90j479J320M72p05N70j146k41K426q27j071
1424e27N08j258J882P60j933J60l88Q10J879j990j019Q29J75J654m91k492J276
$$ plain form
1441 -165 262 919 1785 -849 -961 733 638 1317 37 -1529 655 755 650 724 -1558 -47 1376 307
1459 307 416 -556 -972 1466 434 -286 220 -1260 287 1333 -768 105 -426 -744 1059 45 -254
1476 -254 292 -1308 116 364 -780 282 -876 -850 767 -308 -131 38 -1489 420 663 -642 131
1493 131 -1053 -790 1568 -441 -763 -187 -1005 1022 726 -1114 -127 -685 516 1826 -1004 -586 89
1510 89 -29 1436 329 -1285 153 168 674 936 -1245 -369 741 589 1152 -927 -953 864 618 478
1528 478 420 -1419 445 1095 -86 487 -662 -295 1251 185 -416 70 -758 680 584 -676 52 -522
1546 -522 -217 524 -683 2 296 -533 146 -29 -799 532 -643 -197 451 -741 -57 123 -1219 243
1564 243 42 -335 422 -1029 -390 616 -147 -82 -253 -668 667 326 -417 -217 -519 313 1166 -418 -380
$$ packed form
1441a65M27O57Q66k634j12J694r5O79j280j566K184J00j05P4k282J511J423j069
1459C07J09r72m16K438j032p20N06j480J547J046k101Q73n31l18J803j014k99
1476b54N46j600J424K48j144J062j158K6J617j075J77J69j527J909K43j305P73
1493A31j184K63K358k009l22N76q18K027k96j840R87n58J201J310k830M18O75
1510H9j18J465j107j614J438J5N06K62k181Q76J110j52N63k079k6J817k46j40
1528D78n8j839J864O50j181N73j149L67J546j066o01M86q28J438r6j260P28n74
1546e22L05P41j207O85K94q29O79j75p70J331j175M46O48j192O84J80j342J462
1564B43k01l77P57j451O39J006p63O5j71m15J335l41p43K00l02Q32Q53j584L8
$$ plain form
1583 -380 -119 58 836 -143 -719 70 -119 730 245 -1042 95 431 318 675 -457 -177 572 208 257
1602 257 246 -310 428 393 -229 -13 -360 -34 459 -81 -105 153 51 162 -24 -329 205 172 -140 -187 -318 213
1624 213 365 -440 -198 -144 72 350 -435 -593 -96 -47 387 -307 -622 -160 279 177 -129 -910 -319 440 206
1645 206 -410 -760 -350 375 576 -23 -638 -426 446 629 -100 -253 -444 190 618 -2 -271 -261 123 511
1665 511 89 -458 -170 382 478 240 -106 -113 550 291 316 -138 -296 340 438 66 26 31 -35 289 98 130 328
1688 328 212 8 -3 -43 167 -61 -427 -400 -43 245 186 -544 -549 -140 112 169 -216 -636 -153 326 -66 -278
1710 -278 -982 -218 499 407 -211 -638 -226 303 147 -386 -609 -261 231 397 -77 -835 -185 340 530 4
1730 4 -409 -147 307 423 35 -375 -264 270 382 187 -179 161 310 257 110 -38 -122 253 343 49 -5 73
$$ packed form
1583c80K61J77P78r79n76P89j89Q49m85j287J137L36j13L57j132K80P49l64M9
1602B57j1n56P38l5o22K16l47L26M93n40k4K58j02J11j86l05N34l3l12m7j31N31
1624B13J52q05K42N4K16K78p85j58M97M9M34o94l15M62M39j02l06p81N91P59k34
1645B06o16l50M10P25K01n99o15K12Q72J83p29j53j91O34M28o20k69J0L84L88
1665E11m22n47K88N52R6k38l46pO63k59K5m54j58O36R8l72m0No6L24j91L2J98
1688C28j16k04j1m0K10k28l66K7L57K88n9p30nM09K52N7l85m20M83M79l92k12
1710b78p04P64P17r2o18m27M12N29j56n33k23L48M92J66m74p58O50N25J90n26
1730Dm13K62M54J16l88m10J11N34J12j95l66L40J49n3j47j48q4L75R0k94n4P8
$$ plain form
1752 73 290 387 -202 253 259 249 125 -120 305 326 94 -144 -336 216 570 10 -221 -229 48 568 145 -490 -248
1775 -248 -29 350 267 -403 -714 -65 344 97 -369 -721 40 242 -23 -148 -620 -87 202 205 -332 -512 -353
1796 -353 302 365 -219 -483 -515 559 163 -255 -281 -240 171 260 -158 -444 -127 144 431 24 -391 58 -111
1817 -111 199 114 -168 371 16 -59 32 117 147 268 -266 175 385 295 322 14 -469 200 253 318 -79 -165 106
1840 106 493 183 -222 -484 -10 614 67 -290 -464 -193 405 281 -397 -382 -147 557 518 -338 -620 -536 35
1861 35 432 -472 -869 -225 224 193 -206 -400 -419 85 241 -52 -361 -290 112 104 -269 91 -216 2 413 -79
1883 -79 49 202 -287 170 -5 111 190 -208 45 351 -105 500 -79 -44 358 339 362 163 -360 62 446 285
1905 285 88 -358 -168 705 514 208 -243 -339 437 878 -224 -219 -499 -17 653 199 -399 -301 -18 691 7
$$ packed form
1752G3K17R7n89M55Oj0j24k45M25K1k32k38j92N52L54n60k31qK77N20m23o35K42
1775b48K19L79q3o70l11O49M09k47m66l52P61K02k65j25m72N33K89Ln37j80J59
1796c53O55O3n84k64l2J074l96m18k6M1M11Q9m18k86L17K71K87m07m15M49j69
1817a11L10q5k82N39l55p5R1Q5L0J21n34M41K10r0K7l08m83O69N3O5l97q6K71
1840A06L87l10m05k62M74O24n47l57j74K71N98j24o78J5K35P04l9q56k82Q4N71
1861C5L97r04l97O44M49l1l99j94j9N04J56k93l09P1M02ql73L60l07K18M11m92
1883g9J28J53m89M57j75J16P9l98K53L06m56O05n79L5M02j9K3j99n23M22L84j61
1905B85j97m46J90Q73j91l06m51r6P76M41j102Nk80M82O70m54n98R8K83P09o84
$$ plain form
1926 7 -645 -739 -171 530 553 -657 -595 1 229 549 -640 -637 -129 171 192 34 -671 2 93 123 -219 -536 -429
1949 -429 300 166 92 -84 -440 245 218 -108 -105 -118 -47 307 -67 -143 14 -188 145 152 -102 183 -115 -45 407
1972 407 123 75 -16 -192 -30 395 172 180 -301 -47 572 45 197 -151 -389 664 376 -410 -286 -84 402
1993 402 673 28 -219 -28 21 451 -123 -420 -176 -101 442 261 -681 -347 151 -195 231 -591 -224 387 81
2014 81 -2 -120 -584 161 507 -258 147 -230 17 642 -197 -122 111 -303 336 -28 -198 213 -80 124 79
2035 79 -274 -99 156 -32 -303 -175 44 359 8 -78 -122 -91 295 245 -217 156 195 513 73 -248 -64 377
2057 377 249 129 -334 -108 414 276 151 43 -404 240 174 -119 -134 -295 230 378 -49 -217 -287 -186 271
2078 271 -234 -501 -178 53 89 -97 -500 -220 171 37 44 -240 -255 280 57 -84 -124 -349 40 -23 -348 101
$$ packed form
1926Go52r4N68P01K3j210O2N96K28L20j189LN08L00K1j58p05O73R1L0l42l17J07
1949d29P29j34p4j76l56O85k7l26Lj3P1L54l74p6J57k02L33Pk54K85k98P0M52
1972D07k84m8r1j76J62M25k23Qm81K54O19n27J52l48k38J053k88p86J24K02M86
1993D02K71o45k47J91M9M30n74k97K44P5N43j81r42L34M98l46M26q22L67O11l06
2014H1q3j18m64P45L46p65M05l77K47O25q39P5K33m14O39l64j70M11k93K04m5
2035G9l53J75K55j88k71J28K19L15l51q6m4L1L86n0m62L73L9L18m40l21J84M41
2057C77j28j20m63K26N22j38j25j08m47O44o6k93j5j61N25J48m27j68p0J01M57
2078B71n05k67L23K31L6j86m03K80L91j34Pk84j5N35k23j41m0k25L89o3l25M49
$$ plain form
2100 101 -234 -47 -45 -158 -103 138 -2 -87 -212 -220 250 15 -159 -206 -503 275 392 -96 -258 57 421 591
2122 591 26 -211 -21 387 424 42 -44 68 251 263 73 -244 -196 181 200 47 -93 -316 300 269 110 -205
2144 -205 -99 -92 288 -39 -271 -104 -185 309 85 -238 -256 396 115 -73 -163 -166 31 47 29 -235 -203 10 -190
2167 -190 -126 -173 -78 60 -90 -74 -150 335 23 -17 -265 -36 93 -6 -84 -434 78 148 104 15 -218 85 109 305
2191 305 -125 -373 -152 478 11 60 8 -224 425 286 199 -80 -258 273 276 110 -263 276 271 506 9 -340
2213 -340 -74 328 191 96 -181 -111 224 132 277 -149 163 244 106 -36 -471 -95 -63 76 -163 -210 -259 -87
2235 -87 210 -308 -118 -33 19 -169 -365 23 -160 -198 -199 35 -23 107 -90 40 -424 253 111 123 -188 -263 -235
2258 -235 287 157 -76 -221 -121 201 354 -199 -146 -110 98 314 -10 -195 50 230 178 295 -208 267 276 475
$$ packed form
2100A01l35J87Kj13N5K41j40q5j25qM70k35j74m7k97P78J17m88j62L15L64J70
2122E91n65k37J90M08L7l82q6J12J83J2j90l17M8L77J9j53j40k23O16l1j59l15
2144b05J06PL80l27k32J67q1M94k24l23j8O52k81j88r0lJ97J6j8k64L2K13k00
2167a90O4m7R5J38j50J6p6M85l12m0k48K29J29r9p8l50N12P0m4q9k33L03K4J96
2191C05m30k48K21O30m67M9n2k32O49j39q7k79j78N31Lj66l73N39nK35m97l49
2213c40K66M02j37r5k77P0L35r2J45m26L12Q1j38j42m35L76L2J39k39m7m9J72
2235h7K97n18J90Q5N2j88j96L88j83l8jK34n8J30j97J30m64O77j42J2l11p5K8
2258b35N22j30k33j45J00L22J53n53N3L6K08K16l24j85K45J80n2J17n03M75RJ99
$$ plain form
2280 475 -167 -40 267 368 242 -44 -120 77 178 291 190 -40 -209 210 152 -242 -55 -219 190 78 -268
2301 -268 -38 383 -159 -48 -106 -181 284 -150 -253 35 -218 38 -135 -292 -193 -99 4 141 -208 -192 202 -37
2323 -37 101 81 -396 -84 241 -21 32 -601 -105 324 36 -190 -60 -387 419 122 -199 -114 -157 -5 498 -191
2345 -191 -20 -42 131 585 -127 -421 -6 276 216 263 -543 209 86 107 274 -336 -105 498 5 375 -133
2366 -133 -242 245 321 -185 230 -290 -31 270 -69 343 124 -341 382 -36 -159 -4 -434 -25 -134 -272
2386 -272 15 -45 -465 170 29 -183 183 -554 -317 270 -41 166 -312 -426 237 232 48 -1 -263 204 332
2407 332 -342 -108 -290 -152 858 67 -295 33 6 347 400 -334 23 40 251 717 -288 -148 168 -204
2427 -204 359 -29 -351 26 275 131 190 -288 -106 437 -125 140 37 -205 314 236 -171 165 -138 65 166
$$ packed form
2280D75o42J27L07J01j26k86p6J97J01J13j01k30j69M19n8l94J87j64M09j12l46
2301b68K30M21n42J11n8p5M65m34j03K88k53K56j73j57R9R4J03J37l49J6L94k39
2323c7J38k0m77L12L25k62N3o33M96M29k88k26J30l27Q06k97l21Q5m3J52N03o89
2345a91J71k2J73M54p12k94M15K82o0M7q06P52j23K1J67o10K31O03m93L70n08
2366a33j09M87P6n06M15n20K59L01l39M12k19m65P23m18j23J55m30M09j09j38
2386b72K87o0m20O35j41k12L66p37K37N87l11K07m78j14O63nj84m9k62M67J28
2407C32o74K34j82J38J010p91l62L28k7L41N3p34L57J7K11M66j005J40L16l72
2427b04N63l88l22L77K49j44N9m78J82N43n62K65j03k42N19p8m07L36l03K03J01
$$ plain form
2448 166 -422 144 148 1 162 -104 69 249 -325 -107 174 -325 104 46 -525 392 -137 -123 135 -532 -171
2469 -171 169 -148 84 -276 -373 547 -118 -192 137 -281 136 176 -206 0 -319 -237 311 36 -124 353 -116
2490 -116 401 98 -354 -80 99 149 432 -277 -20 510 -188 254 -251 -119 159 -25 77 166 -223 23 329
2511 329 -164 265 -57 -196 441 2 37 270 -8 157 -36 -42 238 -37 -175 182 -110 -224 105 -461 -247
2532 -247 -100 -219 197 -202 -404 102 16 61 47 -412 -245 78 86 350 -336 -313 91 39 59 -82 -498 -7 185
2555 185 -110 -111 -130 -69 309 -144 -271 36 -265 163 251 -34 71 76 -30 75 -40 -22 -18 43 173 -10 106 273
2579 273 103 117 286 155 93 348 27 187 178 146 108 9 -17 412 -50 -159 53 -39 333 62 -155 -47 -16
2602 -16 150 213 -134 -168 239 82 -35 -28 -223 -168 42 41 52 -168 -116 171 -200 -48 -165 -105 266 -39 -72 -237
$$ packed form
2448A66n88N66Mj47J61k66J73J80n74K18K81m99M29n8n71R17n29J4K58o67L61
2469a71L40l17K32l60r7R20o65p4L29m18M17M0l82K06l19Q2N48k75j60M77m69
2490a16N17l03m52K74J79N0K83p09K57N30o98M42n05J32K78j84J02Q9l89K46L06
2511C29m93M29l22j39O37m39L5K33k78J65j93oK80k75j38L57k92j14L29n66K14
2532b47J47j19M16l99k02N06q6M5j4m59J67L23QK64o86K3M04n2K0j41m16M91J92
2555A85k95jj9O1L78m53j27L07l01M28Q8k85J05Nj06J05j15J8MO1J30j83J16J67
2579B73j70J4J69j31o2K55l21J60rl2l8r9k6M29m62j09K12r2L72k71k17J08L1
2602a6J66O3l47l4M07j57j17Pj95N5K10jJ1k20N2K87l71J52j17O0L71l05l3j65
$$ plain form
2626 -237 -328 -43 -41 21 -254 -362 -116 163 36 -239 -143 -20 10 -168 -17 97 96 34 -145 53 53 124 149 -153
2650 -153 96 4 95 -4 132 142 211 40 403 -28 -147 302 -12 -110 102 -134 264 34 90 181 29 74 225
2673 225 23 -145 61 170 16 -232 -254 50 226 37 24 -229 -148 -130 -58 -148 -430 -77 22 191 164 -462 -240
2696 -240 24 -19 -167 -164 1 115 -173 -111 -266 7 20 202 111 -276 -180 -41 44 -41 71 -27 80 76 25 -173
2720 -173 174 17 -105 198 5 154 139 -181 82 -26 295 68 24 126 233 -26 195 71 27 13 50 -30
2742 -30 -70 -104 328 460 -138 15 -54 -45 65 38 -134 -178 64 293 285 -119 -441 72 -178 179 -247 -80 11 -58
2766 -58 82 127 -146 -225 6 -12 -51 -55 -51 -82 3 -47 -76 -239 251 -164 -28 70 -39 -290 31 -136 216 70 -159
2791 -159 -6 91 -242 105 156 21 -75 102 325 -35 -260 93 193 31 -25 -158 1 -51 51 83 162 -188
$$ packed form
2626b37r1K85KO2k75j08K46K79j27k75R6J23L0j78J51J14jo2j79J98%P1K5l02
2650a53K49r2R1r9J36J0O9j71L63m31j19M49l14r8K12k36L98k30N6R1j52M5J51
2673B25k02j68K06J09j54k48k2L04J76j89j3k53Q1J8P2r0k82L53R9J69k7o26K22
2696b40K64m3j48LJ65J14k88O2j55K73J3J82r1l87R6J39Q5q5J12r8J07mn1j98
2720a73L47j57j22L03j93J49j5l20K63j08L21k27m4J02J07k59K21j24m4j4L7q0
2742c0m0l4M32J32n98J53o9RJ10k7j72m4K42K29qm04l22N13k50L57m26J67R1o9
2766e8J40M5k73p9K31j8l9mMl1Q5n0k9j63M90m15J36R8j09k51L21j67L52j46k29
2791a59J53R7l33L47N1j35r6J77K23l60k25L53J00j62n6j33J59n2J02L2P9l50
$$ plain form
2813 -188 123 111 22 -107 -135 41 158 58 27 161 247 106 33 -184 90 -63 236 197 -168 -219 -271 -114 267
2836 267 47 -280 67 134 205 60 -240 -137 -105 9 33 -131 -72 145 -120 -13 140 -373 114 169 1 151
2858 151 -190 -336 29 -192 -72 40 -232 96 -45 -28 210 -43 -154 94 21 151 95 -388 198 413 155
2879 155 300 -99 -27 29 -164 241 -28 -271 198 160 -248 18 34 99 154 55 209 -59 -117 234 96 -193 -13
2902 -13 -62 300 29 -279 -92 -19 14 363 -273 -368 190 -131 214 -63 -279 105 186 -231 18 -148 -117 75
2924 75 31 148 -181 -433 17 108 -224 8 -81 -179 226 145 61 8 -92 133 2 -159 43 -136 -88 196 -208
2947 -208 -18 143 -111 206 -93 114 -59 -49 -61 431 32 43 -88 133 166 15 -207 284 -60 202 108 -375
2969 -375 232 146 27 67 -10 -48 -70 -121 99 171 -171 -24 -86 -66 298 -161 -249 145 1 -123 251 -394 144
$$ packed form
2813a88L11j2q9j29k8J76J17j00l1J34Q6j41p3k17K74j53K99l9l65n1n2J57L81
2836B67k20l27L47O7P1j45l00J03L2J14K4j64N9K17k65J07J53n13M87N5j68J50
2858A51l41j46L65k21J20J12k72L28j41J7K38k53j11K48p3J30n6m83N86K15k58
2879A55J45l99P2N6j93M05k69k43M69l8m08K66J6O5N5r9J54k68n8L51j38k89J80
2902a3m9L62k71l08J87P3L3L49o36r5N58l21L45k77k16L84Q1m17K49j66L1J92
2924G5m4J17l29k52M50R1l32K32q9r8M05q1q4n3j00K25j31j61K02j79M8K84m04
2947b08J90J61k54L17k99K07j73J0j2M92l99J1j31K21L3j51k22M91l44K62r4m83
2969c75O07q6j19M0p7l8k2n1K20P2l42J47o2K0L64m59q8L94j44j24L74o45N38
$$ plain form
2992 144 -305 -218 84 -74 -232 -29 -198 -171 -115 -231 -31 -286 -258 154 139 64 -71 112 -40 222 230 193 16
3015 16 -81 57 -56 9 54 235 368 -125 -132 69 -300 124 97 -124 142 340 16 151 -13 34 115 -102 -27
3038 -27 66 8 330 -107 163 10 321 49 -104 -36 159 128 -90 232 214 -353 213 -56 -34 129 -59 -4 -22
3061 -22 -113 -134 -128 95 -67 17 0 35 35 -58 -96 -157 -208 -1 6 -176 -238 -117 81 -13 -217 -156 -260 29 -210 23
3087 23 144 -129 312 229 -236 -20 76 9 252 199 21 -193 71 144 7 -191 185 133 24 88 -100 -3 201
3110 201 19 191 -27 141 275 147 28 7 -230 54 20 -33 -194 81 -7 83 242 88 169 21 34 12 5
3133 5 187 -163 -11 28 -9 -3 29 -51 -169 -63 -104 -37 -243 -270 -18 142 17 40 -397 -57 102 22 -14 -197 -120
3158 -120 23 -123 -126 -133 -73 -56 51 -27 -317 17 11 15 -124 109 53 61 -154 176 -349 -102 -123 13 -83 -50 2 241
$$ packed form
2992A44m49Q7L02j58j58K03j69K7N6j16K00k55K8M12j5p5j35J83j52K62Ql7j77
3015A6r7J38j13O5M5J81J33m93pK01l69M24k7k21K66J98l24J35j64M7Q1k17P5
3038b7R3n8L22m37K70j53L11k72j53O8J95l1k18L22j8n67N66k69K2J63j88N5j8
3061b2r1k1OK23j62Q4j7L5%r3l8o1n1K07Pj82o2J21J98r4k04O1j04K89k39K33
3087B3J21k73M41q3m65K16R6o7K43n3j78k14K64P3j37j98L76n2j09O4j88R7K04
3110B01j82J72k18J68J34j28j19k1k37K84l4n3j61K75q8R0J59j54Q1j48J3k2p
3133EJ82l50J52L9l7OL2q0j18J06m1O7k06k7K52J60j25K3m37L40J59q0l6j83P7
3158a20J43j46lpO0J7J07p8k90L34oMj39K33n6Qk15L30n25K47k1J36r6L3N2K39
$$ plain form
3184 241 19 77 -120 236 54 -74 -101 156 292 -65 -8 104 26 14 224 -51 -104 72 6 -45 -123 -41 29 -120
3208 -120 -178 18 -227 180 -134 -28 19 180 60 63 164 -127 -67 80 -84 258 -148 -15 267 140 16 102
3230 102 -78 -48 128 -185 276 36 -37 253 81 -252 -210 -128 63 109 -223 -201 -90 -75 6 -17 28 72 -69 -15
3254 -15 202 -160 -106 391 -160 -4 -29 179 214 36 -62 -28 3 237 52 32 92 13 -116 -100 75 61 17 325
3278 325 -75 -139 22 217 -98 -197 -78 -53 -3 62 -15 -105 181 -104 48 -187 -30 -58 94 -107 -174 -96 14
3301 14 107 57 7 -318 -180 -26 -90 -44 -141 142 -64 0 -177 -101 -249 205 85 -45 -129 -123 251 100 40 -134
3325 -134 -29 -35 57 -112 -119 214 58 40 171 140 -34 225 -73 282 79 -4 130 -133 46 70 -196 129 294
3348 294 7 85 49 -97 155 76 39 166 -250 -91 2 54 117 15 -14 65 -115 190 113 -91 38 55 44 -29
$$ packed form
3184B41k22N8j97L56j82j28k7K57J36l57N7J12p8j2K10k75n3J76o6n1p8Q2P0j49
3208a20n8J96k45M07l14J06M7J61j20LJ01k91O0J47j64L42m06J33K82j27j24Q6
3230A02j80L0J76l13M61k40p3K90j72l33M2Q2J91M6l32K2J11J5Q1k3M5M4j41N4
3254a5K17l62N4M97n51J56k5K08L5j78r8L4L1K34j85k0O0p9j29J6J75j4m4L08
3278C25m00o4J61J95l15r9J19K5N0O5p7r0K86k85J52k35J57k8J52k01o7P8J10
3301A4R3n0n0l25J38J54o4M6r7K83k06O4j77P6j48M54j20j30q4OL74j51o0j74
3325a34J05oR2j69pL33j56j8J31l1j74K59k98L55k03q3J34k63J79K4k66L25J65
3348B94k87P8l6j46K52p9l7J27m16J59R3N2O3j02k9P9j80L05p7k04J29J7j1p3
$$ plain form
3372 -29 -32 -174 36 -205 -147 81 -217 -15 -135 10 -144 -104 44 -85 92 -188 4 -62 295 -3 -239 111
3394 111 149 -3 -92 -24 -183 159 36 35 -148 -54 -75 148 164 29 -20 193 -107 -91 -114 -168 -190 48 -23 -128 172
3419 172 18 123 93 17 34 158 222 172 -147 -48 -81 -59 223 147 105 225 110 72 195 -84 35 5 9 116 -98
3444 -98 113 -53 -34 -14 73 101 147 23 -83 -104 -273 -96 -121 30 -44 177 -124 -134 165 134 -68 325 -313 30
3468 30 -150 -30 229 -15 70 20 24 178 378 23 262 8 -68 51 194 106 -7 -79 169 37 -114 -71 -26
3491 -26 132 414 45 91 -222 -150 39 84 4 -61 -128 248 134 -85 -75 -63 -176 79 24 -278 74 -95 -99 -37
3515 -37 30 21 55 111 0 -12 -142 167 -33 -148 0 -277 78 -99 5 -209 -28 35 105 140 -31 149 -54
3538 -54 65 -7 -105 92 -243 -126 159 -11 -124 -111 -161 37 97 -108 -31 71 -161 -119 189 -156 -53 -143 92
$$ packed form
3372b9lj42K10k41N8K28k98K02j20J45j54M0J48j29J77k80J92o6L57k98k36L50
3394A11L8j52q9O8j59L42j23jj83R4k1K23J6j35m9K13l00J6k3n4k2K38p1j05L00
3419A72j54J05l0p6J7J24O4n0l19R9l3K2K82p6m2J20j15l8J23k79J19l0MJ07k14
3444i8K11j66J9K0Q7K8M6j24j06k1j69J77k5J51p4K21l01j0K99l1k02L93o38L43
3468C0j80J20K59k44Q5n0MJ54K00l55K39k54p6J19J43q8j13p2K48j32j51M3M5
3491b6J58K82l69M6l13P2J89M5q0o5o7L76j14k19J0J2j13K55n5l02L52j69mO2
3515c7O7rL4N6j11j2j30L09k00j15J48k77L55j77J04k14J81O3P0L5j71J80k03
3538e4J19p2r8J97l35J17K85j70j13J3n0J98O0k05P7J02k32M2L08l45J03r0K35
$$ plain form
3561 92 -74 -22 173 -73 -19 172 -15 -116 -258 -147 149 92 -111 101 -118 241 -73 -42 -169 32 -285 -39
3583 -39 139 -156 301 -45 -56 -9 -177 -86 56 -91 -81 -20 -118 138 -76 19 -85 12 60 -65 -195 172 177 -233
3607 -233 149 -135 -149 -210 -38 148 -248 -253 -8 93 -35 -101 -59 43 170 247 -120 -6 -104 102 -18 -62 91
3630 91 -45 -95 -109 -12 -75 -24 -28 6 27 92 -66 -28 -128 -206 290 42 126 80 0 198 313 -87 91 1 -88 229
3656 229 115 -50 -15 95 25 -12 -117 115 -141 19 131 -192 -11 -100 140 -65 82 125 77 -8 -368 124
3678 124 -190 24 -37 128 56 -17 -165 124 -78 -295 6 79 -150 -228 7 -162 -158 56 -154 215 17 -15 -48
3701 -48 -126 -68 43 131 148 -46 -147 206 -79 198 177 -38 5 -140 28 18 -87 -29 -59 -254 145 -170 -9
3724 -9 105 39 -149 73 155 214 -13 -197 34 -76 30 19 148 -180 122 -49 -149 200 189 104 -71 -4 16
$$ packed form
3561I2j66N2J95k46N4J91j87j01j42J11K96n7k03K12k19L59l14L1j27K01l17K46
3583c9J78k95M57l46j1M7j68R1J42j47J0O1r8K56k14R5j04R7M8j25j30L67Nm10
3607b33L82k84j4o1J72J86l96nK45J01j28o6M2J02J27P7l67J14r8K06j20m4J53
3630I1j36n0j4R7o3N1mL4K1O5j58L8j00p8M96k48Q4m6q0J98J15m00J78r0q9L17
3656B29j14j65L5J10p0l7j05K32k56J60J12l23J81q9K40k05J47M3m8q5l60M92
3678A24l14K14o1J65p2p3j48K89k02k17L01P3k29p8K35j69MK14k10L69j98l2l3
3701d8p8N8J11Q8J7j94j01L53k85K77k1k15M3j45J68j0j05N8l0j95L99l15J61
3724iJ14o6j88K22Q2N9k27j84K31j10J06j1J29l28L02j71j00L49j1q5j75O7K0
$$ plain form
3747 16 -153 -332 63 -254 38 23 -213 -38 -63 -54 -74 -98 -42 42 -354 20 -54 -77 -47 -121 -122 -141 37 103 -3 -101
3773 -101 191 32 -148 -93 -16 274 54 -226 75 29 -364 230 118 -9 -45 -71 28 -118 -155 -162 224 163 -8
3796 -8 48 173 251 146 -178 -17 -10 1 198 -159 -75 205 153 33 -84 -29 35 -142 19 49 -228 77 47 -28 -8
3821 -8 -62 -161 137 -30 -89 90 -9 -3 -91 7 40 -7 7 89 -198 80 -105 76 -54 -61 169 -47 71 -35 -15 -126
3847 -126 -59 86 -30 -132 4 29 31 -90 -196 -4 260 46 -25 -194 99 -74 156 -17 -340 36 116 198
3869 198 84 68 73 225 33 -22 -3 -291 50 0 -213 -100 133 -128 238 -53 -31 58 89 7 -12 -81 134 2
3893 2 -94 -14 139 101 240 -110 122 -44 51 184 -205 -150 -301 21 69 -47 -223 204 -89 -209 78 -76 36
3916 36 11 -154 88 -147 -18 -42 -15 66 309 -110 -1 210 193 134 218 -154 146 -280 -26 -70 -61 132 123 37 122
$$ packed form
3747A6j69j79L95l17K92j5k36J75k5Rk0k4N6Q4l96L74p4k3L0p4jj9J78O6j06r8
3773a01K92j59j80N5P7K90k20k80L01m6l93N94j12j27l6k6R9j46l7pL86o1j71
3796hN6J25P8j05l24J61PJ1J97l57Q4K80n2j20j17N5O4j77J61L0k77L05l0p5K0
3821hn4r9K98j67n9J79r9Oq8R8L3m7J4Q2k87K78j85J81j30pK30k16J18j06K0j11
3847a26O7J45j16j02J36K5Kj21j06J92K64k14p1j69K93j73K30j73l23L76Q0Q2
3869A98j14j6NJ52j92n5J9k88L41n0k13J13K33k61L66k91K2Q9L1q2j9o9K15j32
3893Br6Q0J53l8J39l50K32j66R5J33l89N5j51L22M8j16j76M27k93j20K87j54J12
3916C6k5j65K42k35J29k4K7Q1K43m19J09K11j7n9Q4l72L00m26K54m4RJ93rq6Q5
$$ plain form
3941 122 352 -1 13 91 -144 52 -88 39 85 -61 -54 -29 28 60 79 93 45 -69 17 -14 -76 -93 70 -262 7
3966 7 19 37 211 -95 228 -155 1 -20 -129 -1 -224 -111 0 33 -149 -157 219 -54 70 -88 -22 140 27
3989 27 -45 255 -312 -60 -114 -222 168 -169 -225 87 95 12 -66 -49 -3 99 59 -145 113 53 17 -10 156 75 153
4014 153 25 300 157 170 -33 163 13 -57 351 -21 64 128 149 -64 -19 154 166 -69 -282 46 149 -167
4036 -167 186 181 -101 -36 -120 -172 141 276 -14 7 -40 -102 -202 82 -73 -54 122 -105 -227 -526 108 -183 91
4059 91 -55 -183 -93 -220 -10 76 56 -308 -265 46 -100 192 -212 73 148 -162 -6 142 96 242 91 -125
4081 -125 -191 49 71 -238 82 4 15 71 87 211 481 64 81 47 -107 -99 71 67 -139 94 194 -108 133 -16
4105 -16 126 -20 75 -48 231 46 309 125 44 -72 -107 -98 71 28 -57 -133 175 -93 -36 42 -116 17 165 139
$$ packed form
3941A22K30l53J4P8k35J96j40J27M6j46PK5N7L2J9J4m8j14Q6l1o2j7J63l32K69
3966GJ2J8J74l06L23l83J56k1j09J28k23J13J11L3j82qL76k73J24j58O6J62j13
3989B7p2L00n67K52n4j08L90l37n6L12Qq3p8J7M6J02m0k04K58o0l6k7J66q1P8
4014A53j28K75j43J3k03J96j50p0M08l72Q5O4K1k13M5J73J2k35k13L28J03l16
4036a67L53nk82O5q4n2L13J35k90K1m7o2j00K84j55J9J76k27j22k99O34k91K74
4059I1j46j28R0j27K10Q6k0l64M3L11j46K92m04K85P5l10J56J48m6J46j51k16
4081a25o6K40K2l09L20p8J1N6J6J24K70m17J7l4j54QJ70mk06K33J00l02K41j49
4105a6J42j46R5j23K79j85K63j84q1j16l5RJ69m3q5p6L08k68N7P8j58J33J48k6
$$ plain form
4129 139 -160 -166 51 126 -29 212 169 -102 -197 -23 57 78 -4 33 130 105 -91 101 -55 58 -236 46 57 174
4153 174 190 33 32 181 -280 89 -12 -151 -99 -38 -55 -253 91 45 110 -80 -78 118 79 -84 211 51 58 134 -200
4178 -200 30 124 -40 34 147 -130 -93 -186 -83 -56 127 22 -74 -63 -141 110 -194 -75 125 220 -69 -195 112
4201 112 -160 157 -178 -227 -107 -49 29 -112 11 80 -87 64 283 -60 -255 -154 -38 -140 230 -74 -103 314
4223 314 -72 75 90 -154 -163 -1 190 131 -101 130 173 119 -2 116 128 -280 54 131 -65 -120 -78 42 102 155
4247 155 27 -64 -90 57 -37 47 -24 81 154 90 -51 111 -81 39 17 -262 -14 17 -77 165 5 0 56 -47
4271 -47 40 48 92 73 142 259 -41 -330 -87 -101 -3 90 1 -156 -155 -167 156 120 -289 64 208 -86 -171 -146 -170 -35
4297 -35 -173 -4 134 -55 -47 -144 4 -6 76 4 -120 81 122 -171 -85 134 81 -78 49 24 -202 -69 81 33
$$ packed form
4129A39k99oK17P5j55K41m3k71r5J74Q0K1q2L7R7k5j96J92j56J13k94K82J1J17
4153A74J6j57jJ49m61L69j01j39N2O1j7j98L44m6O5j90KJ96l9j63K95j60PP6l34
4178b00K30R4j64P4J13k77L7r3J03K7J83j05r6J1p8K51l04J19K00R5k89j26L07
4201A12k72L17l35m9J20N8P8j41J23O9j67J51K19l43j95J01J16j02L70l04k9M17
4223C14l86J47J5k44rJ62J91n9k32K31M3n4j21J18J2m08L34P7j96n5M2J20O0N3
4247A55j28r1k6J47r4Q4p1J05P3o4j41J62j92J20k2k79K48L1r4K42j60nN6j03
4271d7Q7QM4j9O9J17l00k89K43j4R8R3q9j57Jj2L23l6m09L53J44k94q5K5k4J35
4297c5j38J69J38j89Qr7J48j0Q2p2j24K01M1k93Q6K19n3j59J27k5k26J33J50m8
$$ plain form
4321 33 75 -226 -33 148 -188 -13 -5 -255 -44 -117 -121 -185 -21 5 225 150 37 182 -121 -86 -47 134 172 66
4345 66 246 -49 -37 -3 -137 -81 -104 181 -80 32 -175 32 -92 -79 14 -164 -62 -67 -395 216 -48 -114 -52 59
4369 59 -27 -133 -153 68 -49 -39 -85 160 -78 -75 285 -148 -36 15 -195 254 -156 -88 -74 -164 -112 -135 179 75
4393 75 -95 65 68 -11 -108 133 18 49 123 29 3 -121 100 -32 283 47 -77 -84 -123 -82 -103 -202 -110 -61 -109 -167
4419 -167 91 -229 -159 -52 -41 33 161 -45 -143 -169 166 48 -310 -137 -266 -89 -21 -36 -92 138 -278 -136 -57
4442 -57 -76 -12 -105 -187 -48 -187 -71 189 -65 75 89 -61 182 80 -19 26 74 130 124 -22 143 -61 98 -130
4466 -130 66 -165 117 -6 136 252 -134 -112 26 -107 -16 26 -89 -222 -32 -157 290 -166 37 164 22
4487 22 21 -3 -10 -156 257 141 -59 -121 29 31 159 143 -123 -399 352 238 -204 196 -63 67 60 -30 -18 6 -176
$$ packed form
4321C3M2l01J93J81l36J75Qk50K11p3mo4J64K6K20p5j13J45l03L5L9J81L8j06
4345F6J80k95J2L4j34N6k3K85k61J12k07K07j24J3R3j78J02nl28O11k64o6O2J11
4369E9q6j06k0K21j17J0m6K45k38LL60m33J12N1k10M49m10O8J4r0N2k3L14j04
4393G5j70J60Lp9r7K41j15L1P4r4k6j24K21j32L15k36j24pl9M1k1r9R2M9m8n8
4419a67K58l20P0J07J1P4J28k06r8k6L35j18l58J73j29J77O8j5n6K30m16J42P9
4442e7j9O4r3q2J39j39J16K60k54J40J4j50K43j02r9M5M8N6oj46J65k04J59k28
4466a30J96k31K82j23J42J16l86K2J38j33R1M2j15j33J90j25M47m56K03J27j42
4487B2jk4pj46M13j16k00o2J50KJ28j6k66k76P51j14m42M00k59J30pr0J2K4j82
$$ plain form
4512 -176 73 125 -117 -95 -70 44 202 172 -29 -22 131 51 -67 54 -16 -172 -87 99 151 62 -123 -122 -15 8 -126
4537 -126 7 -145 144 214 -3 -149 -63 -94 -23 279 -133 72 28 200 -166 -103 122 93 -95 133 -242 82
4559 82 107 8 -9 9 169 -39 -14 23 -6 19 -88 115 -122 -28 -129 216 142 -198 -47 -76 -25 33 29 26 -35 -1 79
4586 79 15 -72 43 291 5 -117 112 102 27 -243 130 144 67 80 -253 -59 -63 -117 -139 230 -23 24 -92 -90 -303
4611 -303 -7 -348 -117 75 -67 101 -48 -217 -77 17 187 110 -3 90 -21 -82 -24 -181 39 -73 -222 1
4633 1 247 -238 -71 -222 161 -82 -34 104 159 124 -115 -137 -114 238 -52 -71 42 -183 -123 80 144 -96 279
4656 279 -227 -45 -247 -58 -66 44 -205 -60 140 -43 -19 89 174 26 -157 -28 62 136 348 93 92 203 25
4679 25 -209 -84 -50 96 -31 161 77 -27 81 270 55 -130 270 -31 -137 -136 -14 23 58 165 -101 -268
$$ packed form
4512a76K49N2k42K2K5J14J58l0k01PJ53q0j18J21p0j56Q5J86N2q9j85JJ07K3j34
4537a26J33j52K89P0k17j46Q6l1P1L02m12K05m4J72l66O3K25k9j88K28l75L24
4559H2K5r9j7J8J60k08K5L7k9K5j07K03k37R4j01L45p4l40J51k9N1N8mlo1L4Q0
4586G9o4q7J15K48k86j22K29j0p5k70L73J4p7J3l33J94mn4k2L69k53M7j16Kk13
4611c03K96l41K31J92j42J68j49j69J40R4J70p7j13R3j11o1N8j57K20j12j49K23
4633AK46m85J67j51L83k43M8J38N5l5k39k2K3L52k90j9J13k25O0K03O4k40L75
4656B79n06J82k02J89qJ10k49J45K00j83K4J08Q5j48j83J29R0P4K12k55jJ11j78
4679B5k34J25L4J46j27J92q4j04J08J89k15j85M00l01j06JJ22L7L5J07k66j67
$$ plain form
4701 -268 48 142 43 89 39 29 -5 -79 94 92 226 123 135 43 -105 -21 -118 -11 197 -128 -108 170 -11 121 90
4726 90 -46 -80 -34 -178 -23 -6 -174 2 -119 -235 -287 -9 -96 37 -220 -235 -58 -75 -118 -96 62 -128 156
4749 156 -252 -268 -169 105 198 53 -77 -44 -25 -121 -129 -40 110 -40 93 -15 41 -217 -150 32 78 -99 46 74
4773 74 -19 54 28 -320 -54 -34 -2 119 -88 57 41 -21 -297 61 121 -126 -13 41 94 -139 -64 41 162 144
4797 144 -107 95 -144 233 -5 -160 -20 -108 -35 -292 98 -18 -30 24 -39 -122 95 -25 -211 -121 -5 16 -101
4820 -101 -71 13 -117 43 43 -34 -3 117 -17 53 13 285 141 25 -185 236 170 58 42 95 28 41 -63 -259
4844 -259 156 132 101 163 77 62 -26 113 27 125 -75 -4 -13 69 120 140 98 -57 -66 299 56 -102 -163 -236 91 -235
4870 -235 49 -32 -59 -41 5 -203 206 -85 -182 -135 104 60 -158 139 53 170 -82 91 -45 55 124 155 248 58
$$ packed form
4701b68L16R4r9M6n0j0l4p4J73kJ34j03J2r2j48Q4r7J07K08l25K0K78j81J32l1
4726I0j36l4M6j44J55J7j68J76j21j16n2K78q7J33k57j5J77j7m3K2J58j90K84
4749A56m08j6R9K74R3j45j30L3J9r6qQ9J50j50J33j08N6k58O7J82M6j77J45K8
4773G4r3P3k6l48K66K0L2J21k07J45j6o2k76L58O0k47J13N4N3k33P5J05J21j8
4797A44k51K02k39L77k38j55J40q8P3k57L90j16j2N4o3q3K17j20j86R0J16K1j17
4820a01L0Q4j30J60%p7L1J20j34P0m0K72j44j16k10M21o6j12j6N3o7J3j04j96
4844b59M15k4l1O2q6j5q8J39q6R8k00P1rQ2N1K0m2j55rL65k43j58o1p3L27l26
4870b35K84q1k7J8M6k08M09k91r7M7K39m4k18K97q6J17k52J73j36J00O9L1R3j90
$$ plain form
4894 58 139 135 -80 114 160 -304 -20 33 -40 16 -113 2 20 92 180 132 96 -179 -93 -12 -9 99 14 179 -130 138
4920 138 138 17 47 -53 119 5 145 -67 199 -157 -154 -14 -173 -3 -31 -148 -41 -105 -107 172 -3 169 32
4943 32 72 7 230 -30 8 -142 75 -28 -155 -115 -102 1 268 -29 155 -20 -122 -99 -242 -123 14 40 -144
4966 -144 -104 102 98 40 11 -27 86 -48 -105 76 -125 126 9 68 -155 87 -2 42 -61 -76 -22 -140 -7 -49
4990 -49 348 -234 23 154 95 16 6 -4 98 58 -355 -102 31 106 134 -332 -188 -39 -232 87 210 19 -52
5013 -52 -56 25 -157 -184 0 -191 -5 -193 -80 -18 -35 -8 28 -374 -92 -92 218 171 -1 -57 -46 116 -76 -147 35
5038 35 -6 -35 -65 31 -127 53 25 38 82 231 100 86 110 -86 -11 -8 -106 11 -128 208 48 -170 -27 6 160
5063 160 -251 -17 7 39 -55 -84 232 -12 -292 67 -41 77 -72 253 -65 35 154 -107 49 -68 -46 -8
$$ packed form
4894E8Q1mk15J94M6m64K84N3p3N6j29J15J8P2Q8m8l6k75Q6Q1LJ08q5J65l09K68
4920A38%j21L0j00J72j14J40k12K66l56LJ40j59J70k8j17J07o4kK79j75J72j37
4943C2M0o5K23k60L8j50K17j03j27M0J3J03K67k97J84j75j02K3j43J19J37K6j84
4966a44M0K06mn8k9l8J13j34n7J81k01K51j17N9k23K42q9M4j03j5N4j18J33m2
4990d9L97n82K57J31n9p9j0j0J02m0m13K53J33P5K8m66J44J49j93L19J23j91p1
5013e2mQ1j82k7J84j91J86j88J13O2j7K7L6m02K82%L10m7j72n6J1J62j92p1J82
5038C5m1k9l0R6j58J80k8J3M4J49j31j4K4j96P5Lr8J17j39L36j60k18J43L3J54
5063A60m11K34K4L2r4k9L16k44k80L59j08J18j49L25l18J00J19k61J56j17K2L8
$$ plain form
5085 -8 -47 -36 165 49 30 193 -144 -27 183 -26 25 -74 67 -3 104 -67 147 -90 129 102 76 -120 100
5108 100 28 10 300 -19 -14 -141 32 85 32 86 -72 -176 55 -38 -85 -80 50 23 -2 40 -112 5 -225 144 296
5133 296 53 -51 -94 112 -152 -25 -60 63 -99 90 -205 -52 16 90 1 -118 -63 70 -195 119 96 56 62
5156 62 42 26 -111 88 46 -48 33 -2 -202 124 74 -2 141 -3 -58 -118 314 -94 108 -64 -119 -47 -153 -236 12
5181 12 -72 -56 -14 28 84 61 116 234 141 -82 78 103 -9 -148 -152 -103 19 76 240 -172 -170 166 5 -310 53
5206 53 -75 116 -84 -102 118 -85 122 132 20 -164 -60 -138 131 -123 282 100 -101 22 136 15 -2 99
5228 99 -114 178 33 -34 -121 80 160 288 28 7 163 -163 237 -38 -129 -178 -125 12 102 242 99 -19 128
5251 128 106 -147 -41 191 -67 85 -43 -275 -137 -21 -225 35 76 128 24 65 186 172 -20 25 44 -92
$$ packed form
5085hl9J1K01j16j9J63l37J17K10k09N1r9J41p0J07j71K14k37K19k7k6j96K20
5108A00p2j8K90l19Nj27J73N3n3N4j58j04K31r3m7NJ30k7k5M2j52J17k30L69J52
5133B96k43j04m3K06k64J27l5J23j62J89k95J53O8P4q9j19N5J33k65L14k3m0O
5156F2k0j6j37J99m2r4Q1l5k00L26n0p6J43j44n5o0M32m08K02j72n5P2j06q3K48
5181A2q4J6M2M2N6k3N5J18r3k23J60K5j12j39mM9J22N7J64m12KL36j61l15L63
5206E3j28J91k00j8K20k03K07J0j12j84J04p8K69k54M05j82k01J23J14j21j7J01
5228I9k13K92j45o7q7K01Q0J28k60k1J56l26M00k75r1m9N3J37R0J40j43j18J47
5251A28k2k53J06K32k58J52j28k32J38J16k04K60M1N2j04M1J21j4j92M5J9j36
$$ plain form
5273 -92 -84 -28 59 60 102 -229 41 107 122 -136 95 35 -142 -101 -140 60 177 37 -17 65 -80 -50 -155 13 24 93
5299 93 -171 84 121 -97 -146 -252 31 215 -224 166 -2 12 273 50 84 -134 -43 -81 46 17 11 -92 197
5322 197 -4 -60 15 -109 4 271 58 -47 36 -250 35 -77 -57 -203 58 -88 -207 -49 -10 -76 -106 -255
5344 -255 26 -52 129 -58 189 41 -57 -59 -75 -45 -156 90 -44 -142 258 -173 -19 -54 19 -95 -70 273 -144
5367 -144 -38 83 19 -205 1 71 157 55 -125 31 30 86 -103 145 131 85 -270 -70 -47 16 43 -42 -39 -108 -79
5392 -79 132 158 -116 209 56 14 -15 82 279 -47 -80 -113 -257 70 24 -75 -118 -128 -182 -20 -64 26 -103 95 18
5417 18 -265 -38 -217 -108 -136 -158 187 -35 -3 133 89 269 112 -115 -172 -82 144 213 -80 32 31 134 20
5440 20 -104 -144 103 -166 -332 -96 -18 5 43 108 60 216 75 12 -88 148 95 -221 58 -88 -67 -215 47
$$ packed form
5273i2QN6Q7JM2l31K70O6J5k58K31o0j77M1l9K00J17j40n4Q2j45L0j05J68J1O9
5299I3k64K55L7k18m9j06K83J84m39L90j68J4K61k23L4k18R1l8J27k9oj03K89
5322A97k01n6P5j24J13K67k13j05Q3k86K85j12K0j46K61j46j19J58L9o6l0j49
5344b55K81p8J81j87K47j48r8kj6L0j11K46j34r8M00m31J54l5P3j14K5L43m17
5367a44J06J21o4k24K06P0Q6j02j80J56jN6j89K48j4m6l55K00K3O3K7q5Lo9K9
5392g9K11K6k74L25j53m2k9R7J97l26l3l3j44L27m6r9m3j0n4J62m4R0j29J98p7
5417A8k83K27j79J09k8k2L45k22L2J36m4J80j57k27n7R0K26O9k93J12jJ03j14
5440B0j24m0K47k69j66K36P8K3L8O5m8J56j41o3j00K36n3l16K79j46K1j48K62
$$ plain form
5463 47 -135 15 48 -223 -97 -67 -43 -3 8 -10 61 -35 -9 -126 -55 52 -27 -247 158 -7 93 -134 146 -95
5487 -95 195 -70 266 4 -150 75 50 -145 -103 135 -21 -14 190 -62 116 -206 108 -121 71 -96 -229 -145
5509 -145 -48 -298 173 93 52 97 -188 -104 33 -162 162 -10 -215 -6 92 -45 149 208 129 -89 64 -149 61
5532 61 79 -5 -72 -169 -38 176 20 66 -67 -69 -102 -55 179 34 81 15 -56 88 -213 -18 61 171 15 51 -24
5557 -24 -32 -90 -312 17 67 193 144 120 -22 -89 123 -58 -185 -274 -4 -19 -24 114 -43 121 -7 106 1 -54
5581 -54 -17 -285 -33 55 29 -115 -41 -170 -108 141 13 -36 -153 -71 -253 -296 -80 -155 66 17 -162 175 -324 102
5605 102 -105 -11 146 95 -51 31 133 90 -199 -168 12 -57 -56 -122 -154 -142 42 -12 -92 51 -125 -2 -88 3 -22
5630 -22 -106 194 -199 -7 142 -92 -37 100 89 336 -147 109 183 -41 -25 20 -35 212 223 -131 2 -67 -153 120
$$ packed form
5463D7j82J50L3k71J26L0K4M0J1j8P1r6K6j17P1J07p9k20M05j65J00k27K80k41
5487i5K90k65L36k62j54K25k5j95M2K38j56PK04k52J78l22L14k29J92j67j33Q4
5509a45R7k50M71q0m1M5k85Q4J37j95L24j72k05K09R8j37J94N9p9k18J53k13K10
5532F1J8q4o7r7J31K14j56M6j33kl3M7K34j45M7o6p1J44l01J95P9J10j56L6p5
5557b4qn8k22L29N0J26m9k4j42o7K12j81j27q9K70j5nJ38j57J64j28J13j05n5
5581e4L7k68K52Q8k6j44P4j29O2K49j28m9j17Q2j82m3K16p5K21m9j79L37m99M26
5605A02k07R4J57n1j46Q2J02m3k89L1J80o9Jo6l2J2J84n4q0J43j76J23q6R1k5
5630b2q4L00l93J92J49k34N5J37j1K47m83K56P4k24J6M5n5K47J1l54J33o9q6K73
$$ plain form
5654 120 -174 -45 -87 22 80 43 -109 -54 3 -101 150 -165 -153 -178 -96 -100 -269 -64 -115 -48 190 -135 -80 38
5678 38 -119 58 52 -204 37 70 -118 -117 338 -109 -48 -54 169 -109 -88 107 -44 -61 77 201 4 -18 -8 -33 103
5703 103 -273 -164 100 -127 111 296 11 -78 5 -54 -65 109 34 -155 -14 -215 29 -167 81 -30 -113 126
5725 126 384 43 16 -45 -2 158 -285 8 116 226 -93 -273 265 -71 125 7 -99 91 -16 -144 -99
5746 -99 132 159 239 46 -30 10 55 -46 -120 241 -121 -37 -17 278 -31 113 367 204 86 9 38 -17 14 -74 -120
5771 -120 15 154 -5 87 -28 16 144 76 200 -5 -148 -61 100 -230 -60 159 133 159 -25 10 -167 218
5793 218 -92 13 32 91 -203 54 -120 69 273 69 -16 26 87 -87 -84 -31 36 73 -7 184 51 -39 -154 45
5817 45 -5 -233 -114 -48 -111 55 176 59 -93 181 -17 -25 98 -29 44 104 -114 106 -31 -134 -188 237 37
$$ packed form
5654A20k94J29m2J09N8l7j52N5N7j04K51l15J2k5Q2mj69K05n1O7K38l25N5J18
5678C8j57J77ok56K41L3j88JM55m47O1oK23k78K1J95j51j7J38J24j97k2J0k5J36
5703A03l76J09K64k27K38J85k85q9Q3n9j1J74p5j89J41k01K44j96K48j11q3K39
5725A26K58l41k7o1M3J60m43K93J08J10l19j80N38l36J96j18j06J90j07j28M5
5746i9K31K7Q0j93p6M0M5j01p4L61l62Q4K0K95l09J44K54j63j18p7K9n5L1q8m6
5771a20J35J39j59R2j15M4J28o8J24k05j43Q7J61l30J70K19k6K6j84L5j77L85
5793B18l10J05J9N9k94K57j74J89K04k04q5M2O1j74LN3O7L7q0J91j33r0j15J99
5817D5n0k28J19O6o3J66J21j17j52K74j98qJ23j27P3O0k18K20j37j03n4M25k00
$$ plain form
5840 37 77 102 -59 193 -51 -91 83 96 -79 72 203 87 -50 25 -13 -33 286 -105 -64 36 -207 98 71
5863 71 -150 -377 -57 91 -82 -200 107 -298 105 78 42 48 -17 46 -64 222 -126 78 -217 89 -78 30
5885 30 -82 -17 -53 -78 -64 -98 126 0 65 144 -16 65 104 137 -62 62 -163 -185 -341 -52 -30 -79 -101 51 45 140
5911 140 -321 -326 -54 112 163 22 153 123 -5 204 9 96 -27 -247 -87 103 171 39 -202 132 108 -62
5933 -62 105 91 30 -14 227 0 -98 -68 -98 -95 61 98 -163 -42 165 -44 -163 -98 35 -147 -46 92 -26 -97
5957 -97 17 -138 -54 50 -33 130 -103 28 184 177 -135 99 -103 -40 2 -23 -167 31 -307 76 -54 36 -28
5980 -28 35 -35 -91 57 -63 141 71 -191 -175 135 42 1 -173 104 -115 -170 -69 57 152 116 -132 110 5 88
6004 88 204 3 158 15 45 -47 -4 122 -58 -97 -97 -113 -175 -92 97 87 -59 -226 96 219 56 -178 172 75
$$ packed form
5840C7M0K5j61K52k44m0J74J3j75J51J31j16j37P5l8k0L19l91M1J00k43L05k7
5863G1k21k27L20J48j73j18L07m05M03k7l6Oo5O3j10K86l48K04k95L06j67J08
5885C0j12O5l6k5J4l4K24j26O5P9j60Q1L9L3j99J24k25k2j56K89K2m9k2J52oR5
5911A40m61nK72J66N1j41J31l0j28K09j95Q7j23k20J60J90O8j32k41L34k4j70
5933f2J67j4o1m4K41k27r8L0l0LJ56L7k61J21K07k09j19O5J33j82J01J38j18p1
5957i7J14j55Q4J04q3J63k33J31J56pl12K34k02O3M2k5j44J98l38L83j30R0o4
5980b8O3p0n6J48j20K04p0k62J6L10r3m1j74K77k19n5J01J26R5l6k48K42j05Q3
6004H8J16k01J55j43L0r2M3J26j80l9%j6o2Q3J89j0j46j67L22J23j63k34L50r7
$$ plain form
6028 75 -164 115 -20 95 133 -23 -175 -3 5 15 136 -37 -112 101 46 -53 -45 234 67 -44 -70 -290 39 154
6052 154 95 122 6 22 92 -180 145 97 -27 -96 118 -115 -116 173 33 156 148 -70 38 15 -63 -5 0 65 -135
6077 -135 -27 -86 -25 -26 -88 50 -2 198 -146 -72 115 32 -170 121 288 88 -2 -7 65 -174 -33 27 -154 104
6101 104 -47 23 65 -174 27 -262 -29 51 20 -95 -66 48 -232 7 22 122 170 112 -40 -10 -88 -147 30 75
6125 75 70 -62 -117 -57 -301 -37 61 -57 67 5 -182 56 27 -137 -48 12 -100 -19 16 -184 -22 -51 -299 110
6149 110 -23 19 209 31 88 -88 42 136 -146 -33 93 -152 166 221 50 181 -25 -141 62 -136 -141 -121
6171 -121 -59 149 233 9 -299 87 135 -96 -23 -14 -152 -254 55 -12 123 -89 47 145 -116 54 -22 51 92 173
6195 173 -175 121 174 64 234 -65 26 -27 18 65 129 89 144 -65 -141 221 -262 74 -35 24 -91 -173 7 -87
$$ packed form
6028G5k39K79j35J15L8j56j52J72QJ0J21j73p5K13n5r9QK79j67j11k6k20L29J15
6052A54n9K7j16J6P0k72L25m8j24o9K14k33jK89j40J23qk18J08k3p8N8NO5k00
6077a35J08n9O1jo2J38n2K00l44P4J87q3k02K91J67k00r0nP2k39J41O0j81K58
6101A04j51P0M2k39K01k89K33Q0l1j15K9J14k80K39J5J00M8n8j52L0p8n9J77M5
6125G5nj32n5O0k44K64R8j18J24o2j87K38k9j64Q9O0j12Q1L5k00J62k9k48M09
6149A10j33M2J90j78N7j76J30R4k82J13J26k45L18N5j71J31k06j16K03j98nK0
6171a21O2K08Q4k24l08L86M8k31P3Rj38j02L09o7J35k12J36R8k61J70p6P3M1Q1
6195A73l48K96N3j10J70k99R1n3M5M7O4m0N5k09p6L62m83L36j09N9j15q2J80r4
$$ plain form
6219 -87 -88 -53 226 51 -90 18 104 -164 36 174 56 -89 -88 -177 -40 2 -118 26 -123 149 13 -143 269
6242 269 -231 -57 -135 -8 100 50 -126 -95 99 37 119 13 -4 -134 -1 -208 -237 21 31 -80 -37 -101 -99 -251
6266 -251 -40 261 129 13 -25 -235 62 210 23 109 -25 -76 76 86 78 -21 191 -47 85 -31 -160 20
6288 20 18 130 -166 204 168 -62 15 -102 118 3 58 75 -65 129 114 51 -175 52 -3 16 119 162 145 90 48
6313 48 -105 -147 99 -79 205 77 -25 -27 -55 42 62 287 -106 -78 42 162 -228 74 -84 -110 77 -88 -105
6336 -105 47 -28 115 -34 -159 -41 -10 -178 -184 3 14 -208 -112 -190 225 -57 76 73 -197 48 19 35 14 2
6360 2 71 40 -22 -1 -191 23 -92 -65 -107 -265 195 226 33 -143 -23 -4 -123 -79 -102 201 157 -12 117 177 -150
6385 -150 73 103 -158 62 71 159 -126 -212 101 201 264 156 -138 24 226 -13 113 -95 -31 55 301 1 241
$$ packed form
6219h7jL5K79j75j41J08Q6k68K00J38j18j45Jq9J37M2j20J44j49K72j36j56M12
6242B69n00J74p8J27J08n0j76L1J94o2Q2j06j7j30J33k07k9K58J0j11M3o4Kj52
6266b51K11L01j32j16l8k10K97J48j87Q6j34n1J52J0qr9K12k38J32j16j29J80
6288B0kJ12k96L70l6k30P7j17K20j15N5J7j40J94j5o3k26K27n5J9J03M3j7n5m2
6313D8j53m2K46j78K84j28j02kk8R7K0K25l93K8J20J20l90L02j58k6J87j65j7
6336a05J52p5J43j49j25J18L1j68oJ87J1k22R6p8M15k82J33lk70K45k9J6k1j2
6360BO9l1o2K1j90K14j15K7m2j58M60L1j93j76J20J9j19M4k3L03m4j69J29O0l27
6385a50K23L0k61K20RQ8k85q6L13J00O3j08k94J62K02k39J26k08O4Q6K46l00K40
$$ plain form
6408 241 -2 64 55 -318 197 62 19 31 -226 -97 211 48 -11 36 -14 -196 -283 -45 -28 -304 -164 -173 45 -83
6432 -83 121 -30 48 253 -35 -132 263 -31 123 25 -71 -113 -179 -162 42 -145 16 190 -112 124 35 19 -168
6455 -168 243 87 14 72 -179 70 286 -71 -111 -107 -79 163 49 144 -84 58 -29 -88 39 -163 -84 23 -52 137
6479 137 -126 -76 30 85 -67 297 -45 45 -29 163 22 -20 0 229 29 -188 55 106 45 44 -29 89 -108 -154
6503 -154 -178 88 92 -2 -27 210 -336 -86 -126 -71 111 -133 87 -240 149 -126 67 -39 -62 -96 -268 84 -230
6526 -230 -23 67 -200 -44 166 345 224 -79 14 167 171 38 40 180 199 -78 -159 -14 -109 -27 86 290 328 17
6550 17 -6 -16 -31 20 102 138 -74 -105 146 157 226 -124 178 -170 9 43 46 -23 152 88 29 251 39 111 120 102 -234
6577 -234 132 -40 94 186 90 -129 227 -23 14 -219 -207 -7 -8 54 -15 -34 -66 129 -31 6 71 57 100 126 28
$$ packed form
6408B41k43O6rl73N15j35m3J2k57J29L08j63n9M7n0j82q7K38J7k76J40rK18j28
6432h3K04j51P8K05k88r7L95k94J54r8r6m2o6J7K04j87J61J74l02K36q9j6j87
6455a68M11j56p3N8k51K49K16l57m0MK8K42j14R5k28J42q7n9J27k02P9J07p5J89
6479A37k63N0J06N5j52L64l42R0p4J92j41m2K0K29k00k17K43N1o1jp3J18j97m6
6503a54k4K66Mr4k5K37n46K50m0N5J82k44K20l27L89k75J93j06k3l4j72L52l14
6526b30K07R0k67J56K10J79j21l03R3J53Mj33KJ40J9k77q1J45r5Q2J13K04L8l11
6550A7k3j0j5N1Q2L6k12l1K51J1O9l50L02l48J79L4Lo9J75o4n9K22k12P2Rj8l36
6577b34L66j72J34R2r6k19L56k50L7k33J2K00jO2o9j9l2J95j60L7O5j4M3K6r8
$$ plain form
6602 28 52 3 -163 -5 -153 56 118 118 -129 103 43 51 5 44 0 20 2 -169 -97 -156 144 -104 165 59 -35 137
6628 137 -19 158 95 -16 50 -5 100 70 13 -279 43 -107 -107 115 137 293 102 -102 -109 -19 252 27 36 -23 19
6653 19 38 94 -61 89 -82 -106 37 104 -221 12 11 61 -1 -102 10 26 -233 -74 -94 58 42 132 126 -22 280
6678 280 55 217 -87 144 -48 -7 -118 83 -32 57 135 127 -42 -81 -195 10 136 29 -198 21 36 -4 -61
6701 -61 45 -37 149 9 116 290 56 -146 -85 -168 -79 -47 221 -54 84 -34 41 -15 11 -17 -108 -111 -162 24 -2
6726 -2 120 -23 172 30 133 -61 69 -131 -132 120 11 -14 -14 29 -143 153 139 -169 38 47 -79 -143 183 -119
6750 -119 -7 -17 123 83 -148 -95 124 -3 59 8 -242 -20 26 -150 -56 -126 -121 52 -228 -30 -81 82 -31 -223
6774 -223 -51 -74 -23 39 -21 -126 95 -165 98 -144 -22 33 -26 112 -95 32 49 79 34 -115 -32 -88 41 -173
$$ packed form
6602B8K4m9j66J58j48K09O2%k47K32o0Qm6L9m4K0j8j71P2n9L00k48K69j06r4J72
6628A37j56J77o3j11O6n5J05l0n7k92L22j50%K22K2J56j91k04pR0K71k25Rn9M2
6653A9J9N6j55J50j71k4J43O7l25K33jN0o2j01J12J6k59J59k0J52j6R0oj48L02
6678B80k25J62l04K31j92M1j11K01j15Q9P8qj69l9j14K05J26j07k27K19J5m0n7
6701f1J06q2J86j40J07J74k34k02O1q3Q9L2K68k75J38j18P5n6K6k8r1ln1J86k6
6726bJ22j43J95j42J03j94J30k00jK52j09k5%M3j72K96j4l08K07Rj26o4L26l02
6750a19J12j0J40m0k31N3K19j27O2n1k50K22M6j76R4p0NJ73k80J98n1J63j13j92
6774b23J72k3N1O2o0j05K21k60K63k42J22N5n9J38k07J27J7L0m5j49Q3n6J29k14
$$ plain form
6798 -173 -10 43 67 104 28 82 -149 -51 -153 168 59 214 196 -242 -92 87 60 7 2 250 44 79 -142 -50
6822 -50 -49 -138 79 30 -88 58 173 -3 33 320 -49 -155 12 28 -9 123 31 71 40 -396 -40 11 -305 -78
6846 -78 206 -20 278 -11 -107 -336 -73 -298 66 -87 -110 -216 190 118 -254 -33 91 49 -75 -81 -280 -292 101
6869 101 54 -223 53 -199 -233 -87 61 43 75 -76 -108 42 -30 167 -139 164 -32 303 34 255 73 -114
6891 -114 -189 -163 -97 -394 -67 -19 -72 39 -35 -147 -24 -9 -19 -165 228 2 -260 -3 199 31 -256 31 23
6914 23 -189 45 -232 17 -80 -10 275 163 55 85 -57 -145 66 -152 214 25 -343 52 211 -167 107 44
6936 44 -99 95 -23 -198 196 -5 91 38 -24 84 -94 -313 -53 -158 -76 -42 80 3 -53 -85 -19 -31 -129 123
6960 123 -38 83 100 -105 -98 159 -71 76 -229 104 47 -49 98 -38 49 -250 110 -24 14 -49 -72 120 -35
$$ packed form
6798a73J63N3K4L7p6N4k31R8j02L21j09J55j8m38J50J79k7n3nK48k06L5k21R2
6822e0Jq9K17m9j18J46J15j76L6K87l69j06J67J6l7J32r2M0l1m36L56N1l16K27
6846g8K84k26K98k89r6k29K63k25L64j53k3j06M06p2l72K21J24m2j24oj99j2L93
6869A01m7k77K76k52l4J46J48j8L2j51l2J50p2J97l06L03j96L35k69K21j82j87
6891a14p5K6O6k97L27M8n3J11p4j12J23J5j0j46L93k26k62K57K02j68k87K87q
6914B3k12K34k77K49r7P0K85j12j08L0j42q8K11k18L66j89l68L95J59l78K74o3
6936D4j43J94j18j75L94k01R6n3o2J08j78k19K60j05Q2L4J22p7n6l2O6j2r8K52
6960A23j61J21J7k05PK57k30J47l05L33n7r6J47j36Q7k99L60j34L8o3k3J92j55
$$ plain form
6983 -35 19 82 -122 61 -117 35 5 -15 -15 -102 63 -76 100 -204 -9 -97 24 -102 -77 -162 38 214 -37 -105
7007 -105 235 34 -52 -1 -11 -99 -300 88 4 132 -107 -27 -114 180 -83 -319 -72 -167 -84 -99 -45 55 -119 -2
7031 -2 83 189 95 -54 21 2 74 -71 71 3 73 -85 237 59 150 -67 -71 22 -262 6 -45 13 54 203 17
7056 17 -72 -137 -147 -97 -25 -53 60 -100 -63 141 82 95 -117 -29 194 -262 -69 89 -37 8 -15 148 162 103 38
7081 38 81 -57 34 151 -137 98 132 -17 273 28 -54 38 42 -80 86 402 -98 -288 83 -215 40 -94 99
7104 99 10 -94 -11 -54 -115 -142 49 -149 4 -164 -171 -232 61 278 80 -154 -184 -45 210 83 -52 145 0
7127 0 -261 -8 120 -95 -60 107 -7 -45 -47 -266 198 104 -61 -127 11 -21 41 -72 145 -88 181 -9 -73 -54
7151 -54 -19 -24 -197 -151 22 145 -13 110 31 166 174 3 -41 106 112 -190 154 -70 -26 164 38 -19 -38 49 266
$$ packed form
6983c5N4O3k04J83j78J52l0k0%q7J65j39J76l04J95q8J21j26K5q5K00J76k51o8
7007a05L40k01q6N1j0q8k01L88q4J28k39Q0q7K94k63k36K47r5Q3j5N4J00j74J17
7031bQ5J06r4j49P5j9P2j45J42o8P0j58L22j78R1k17mR3k84K68n1N8M1J49j86
7056A7q9o5j0N0P2k8J13j60L7K04n9J3k12Q8K23m56J93J58j26M5k3J63J4n9o5
7081C8M3j38R1J17k88K35L4j49K90k45q2R2Mj22J66L16n00j90L71k98K55j34J93
7104I9q9j04Q3m3o1k7J91j98J53j68po1K93K17j98k34l0J39K55j27j35J97j45
7127@k61K53J28k15L5J67j14l8kk19M64r4j65o6J38l2O2j13K17k33K69j90o4J9
7151e4L5nj73M6J73J23j58J23p9J35Qj71m4J47Ol02L44k24M4J90j26n7j9Q7K17
$$ plain form
7176 266 -18 -13 -15 -58 -11 80 160 110 -24 -10 119 -145 -23 107 251 -80 135 99 -59 141 108 -57 -12 96
7200 96 1 28 -101 -35 -22 145 112 28 30 -28 -135 -247 -102 106 -90 -114 104 181 178 -143 -144 273 -172 160 -145
7225 -145 16 105 162 213 175 38 95 176 -136 -441 159 3 -68 -99 163 21 80 275 -107 136 116 -105 -51 38
7249 38 136 102 117 60 67 287 -93 7 33 -140 93 -34 -175 -169 -43 -82 -8 -34 -92 -33 -109 3 -100 110 -100
7274 -100 153 226 -127 -121 41 -18 277 -219 -146 -24 40 -228 112 -135 -30 51 146 96 -122 -191 104 188 -154 175
7298 175 -69 99 -59 88 73 12 90 64 -1 93 23 104 -43 -32 223 -9 30 141 67 -217 -93 188 12 1
7322 1 141 -118 -22 -304 112 -56 39 178 61 7 -17 -14 283 3 147 -59 18 -155 294 177 124 -21 216
7345 216 111 75 47 -50 -273 149 -144 -209 -185 -71 -82 -132 3 -43 -19 -108 179 -74 57 201 26 -73 60 -44
$$ packed form
7176B66k84Nkm3M7R1Q0n0j34J4J29k64J22J30J44l31K15l6j58K00l3j65M5J08
7200I6r5K7j29O6J3J67l3q4Kn8j07j12J45K08j96k4K18P7ll21jM17m45L32l05
7225a45J61Q9N7N1l8j37N7Q1l12l05O00j56p1l1K62j42N9J95l82K43k0k21N4Q9
7249C8R8l4J5n7PK20l80J00K6j73K33j27j41OJ26l9P4k6n8N9p6J12j03K10k10
7274a00K53P3l53OJ62n9K95m96P3J22O4k68L40k47J05Q1R5n0k18o9K95Q4l42L29
7298A75k44J68j58J47j5o1P8k6o5R4p0Q1j47J1K55k32L9J11p4k84J24K81j76j1
7322AJ40k59R6k82M16j68R5J39j17n4k4LK97k80J44k06P7j73M49j17n3j45K37
7345B16j05l6k8r7k23M22k93o5K4J14j1n0J35m6K4q9K87k53J31J44j75r9J33j04
$$ plain form
7369 -44 -21 -17 -25 54 -51 -158 18 136 40 -41 13 -124 -148 285 -164 -41 160 -49 72 29 3 -55 -9 46 -83
7394 -83 -201 67 46 -25 62 100 50 7 -10 263 -126 67 15 197 15 -102 33 49 19 -74 120 93 24 37 -100
7419 -100 -128 27 118 55 113 -85 213 -117 118 203 -184 127 -72 81 138 -8 -42 -97 -168 60 40 105 -129 30
7443 30 103 322 52 -99 -57 -101 -268 -23 128 -77 -43 129 97 -78 -141 82 12 -16 148 -53 -333 -63 90
7466 90 17 114 -182 15 354 1 -101 109 -67 291 21 -22 -28 160 -32 60 -46 64 -150 -147 19 98 94 133
7490 133 54 67 232 -178 127 58 204 216 -43 -235 43 97 83 56 -8 -148 -60 15 29 -45 79 17 -74 -82 -7 93
7516 93 107 -126 116 127 25 -27 80 48 226 117 109 130 -63 -184 -57 59 -7 -201 186 56 150 -107 27
7539 27 40 133 27 -96 119 0 -3 113 150 -147 11 -168 136 69 -88 8 -152 -72 -49 55 -111 148 37
$$ packed form
7369d4K3MqP9j05j07J76J18r6q1N4j37k4M33m49J23K01k09J21m3k6n8M6N5j29
7394h3j18K68k1p1Q7L8n0m3j7K73l89J93n2J82j82j17J35J6l0r3J94k7o9J3j37
7419a00k8J55R1o3N8j98K98l30K35Q5l87L11j99J53N7j46l4n5p1K28k0O5k34J59
7443C0P3K19k70j51M2m4j67K45J51k05L4J72l2j75o3K23p0k8J64k01k80K70J53
7466I0p3R7k96J97L39l53j02K10j76L58k70m3oJ88j92R2j06J10k14LJ66P9mL9
7490A33p9J3J65m10L05o9J46J2k59j92K78N4j4k7o4j40Q8P5J4p4J24o2r1qP5J00
7516I3J4k33K42J1j02n2J07l2J78j09qK1j93j21J27J16o6j94L87j30R4k57J34
7539B7J3R3j06j23K15j19lJ16L7k97J58j79L04o7j57R6j60Q0K3J04j66K59j11
$$ plain form
7562 37 93 16 22 32 -45 -85 -115 -139 77 -28 -8 28 151 160 201 -1 -193 -147 -63 -159 72 -117 -52 -112 161 108 134
7589 134 -125 140 -151 206 -87 94 23 -167 -69 140 -25 -18 12 140 -7 120 237 -91 1 258 70 19
7611 19 -156 -15 -131 -13 204 -121 147 155 -259 -59 -49 -44 208 -185 -25 -201 192 -60 -118 129 -248 -70
7633 -70 -31 94 119 35 173 76 131 -175 238 124 58 9 86 27 54 -94 -24 -52 -151 93 78 113 120 28 -81 22
7659 22 37 0 -57 -41 141 30 -6 -88 68 -23 -138 -74 -50 86 69 -180 -54 -74 121 59 31 -182 -96 -220 -153
7684 -153 211 -73 39 18 84 -44 -113 68 -152 -91 -68 165 133 304 6 59 190 -65 87 215 65 -223
7706 -223 51 128 -29 -14 -27 20 -228 -47 93 -209 124 -117 -66 30 68 -13 -18 282 -279 -126 -224 -128 70 -43
7730 -43 -28 -108 -82 18 162 -70 -125 3 81 92 -31 14 -226 268 -4 167 -6 95 -168 -161 -90 251 -84 128
$$ packed form
7562C7N6p7OJ0p7m0l0k4K16j05K0L6J23RM1k02j92M6Q4r6K31j89O5o0K73n3K6
7589A34k59K65k91L57k93J81p1j90R8K09j65PL0J28j47J27J17l28R2K57j88n1
7611A9j75J41j16J18K17l25K68Qm14K00J0NK52l93J60j76L93k52n8K47l77J78
7633g0L9J25K5q4J38r7N5l06M13j14o6m9P7n9K7j48P0k8r9K44j5L5Pr2j09J03
7659B2J5l7n7J6J82j11l6q2J56r1j15O4K4J36j7k49J26k0J95o2k8k13Q6j24O7
7684a53L64k84J12k1O6j28o9J81k20O1K3K33l2J71k98N3J31k55J52J28j50k88
7706b23K74P7j57J5j3M7k48J81J40l02L33k41N1R6L8q1nL00n61J53r8R6J98j13
7730d3J5q0K6J00J44k32n5J28P8J1j23M5k40M94k72J71j73J01k63PP1L41l35K12
$$ plain form
7754 128 -124 -143 107 -231 96 -140 125 31 -10 -58 -406 61 -91 -80 36 -18 -120 423 -77 54 2 -27 -128
7777 -128 -121 33 -101 -132 -108 17 38 39 -278 -150 344 -62 -113 -174 66 265 -70 -26 50 24 -69 -268 -25 -239
7801 -239 127 2 56 -53 120 -80 34 48 104 36 -24 -123 32 91 -120 -79 63 -29 84 145 24 46 6 -18
7825 -18 -156 246 -67 -40 -56 65 -50 -72 -113 134 14 -28 27 -39 -176 -123 171 12 -153 11 -278 1 -98
7848 -98 -126 89 -24 -87 1 -111 115 59 -247 77 -99 -35 -5 141 -50 24 50 -86 -173 -114 100 31 -7 3 230
7873 230 229 -233 9 62 -47 81 201 50 78 34 -69 239 161 153 -162 -154 -69 -212 -45 -199 -14 94 29 -74
7897 -74 -78 88 -105 192 61 -11 169 225 -1 2 -194 -226 108 -179 -81 170 -175 220 -347 -144 134 -35 -238
7920 -238 139 11 -65 -175 -57 287 -12 -65 -4 16 -8 4 -71 106 123 -123 169 -29 -44 -129 -176 184 198 108
$$ packed form
7754A28k52j9K50l38L27k36K65r4m1m8l48M67j52J1J16n4j02N43n00J31n2k9j01
7777a28PJ54j34l1K4J25K1Jl17J28M94m06n1o1K40J99l35M4P6k6r3j99K43k14
7801b39L66j25N4j09J73k00J14J4N6o8o0r9J55N9k11M1J42r2J13O1j21K2m0k4
7825a8j38M02l13K7j6J21j15k2m1K47j20m2N5o6j37N3K94j59j65J64k89K79r9
7848i8k8K15j13o3Q8j12K26n6l06L24j76O4L0J46j91P4K6j36q7N9K14o9l8J0K27
7873B30jm62K42N3j09J28J20j51K8m4j03L08p8ql15QQ5j43J67j54J85J08o5j03
7897g4mJ66j93K97j31p2J80N6k26Lj96l2L34k87R8K51l45L95n67K03K78j69k03
7920b38L77j28p6j10J18L44k99n3O1K0k4J2p5J77J7k46K92j98j5q5m7L60J4r0
$$ plain form
7944 108 96 6 131 96 -64 -8 -64 34 157 11 -143 -40 3 91 -104 -61 -227 -84 -121 22 94 128 -190 40
7968 40 -102 -156 90 40 -41 -59 109 -83 -79 119 116 -158 -44 -60 -19 -24 222 80 36 172 54 32 143 -162 -188
7993 -188 -41 3 -21 -59 2 322 -46 113 -56 51 234 176 0 172 2 76 139 160 24 226 97 -333 -80
8016 -80 -256 179 187 79 159 21 -269 -37 -10 1 -210 -6 -51 102 153 -1 -100 6 3 -48 165 -85 329 26
8040 26 -220 -74 50 19 -100 -88 -55 173 39 -13 109 173 -103 91 -87 57 -178 -9 51 268 138 -136
8062 -136 79 -7 -136 -2 151 -237 -75 88 93 -143 13 -45 44 -208 306 -15 9 54 -85 -82 -40 131 -157
8085 -157 -100 -19 47 -228 -29 -96 -52 -96 119 -117 -126 -205 186 219 49 -98 243 -71 198 290 -271 45 -63 70
8109 70 134 47 -16 97 60 5 152 -4 -176 -202 -200 362 381 -56 6 -175 -36 -44 -155 50 185 -106 -62 -13 -4 -101
$$ packed form
7944A08j2r0J25l5j60N6n6R8J23j46j54J03M3Q8j95M3j66J43l7J43P2L4l18K30
7968D0j42n4K46n0q1j8J68j92MJ98lk74J14j6M1nK46j42m4J36j18k2J11l05k6
7993a88J47M4k4l8O1L20l68J59j69J07J83n8j76J72j70P4O3K1j36K02j29m30K53
8016h0j76M35Qj08Q0j38k90K32K7J1k11K04m5J53N1j54r9J06ln1K13k50M14l03
8040B6k46J46J24l1j19J2L3K28j34n2J22O4k76J94j78J44k35J69O0K17j30k74
8062a36K15q6j29J34J53l88J62J63Nk36J56n8Q9k52N14l21K4M5j39LM2J71k88
8085a57N7Q1O6k75J99o7M4m4K15k36rp9L91L3j70j47L41l14K69R2n61L16j08J33
8109G0O4q7o3J13l7n5J47j56j72k6KN62J9m37O2j81J39qj11K05J35k91M4M9Rr7
$$ plain form
8135 -101 26 201 40 -152 90 -31 114 47 -114 130 213 139 -90 -4 48 29 -231 -101 -51 166 116 55 -274
8158 -274 -353 23 163 158 -65 -40 -110 -43 450 -12 -200 87 -34 -72 -236 113 93 115 -141 120 230 -64 268
8181 268 175 6 -160 -231 -79 -21 -71 -99 341 -25
$$ packed form
8135a01J27J75j61j92K42j21J45o7j61K44Q3p4k29Q6N2j9k60J30N0K17n0o1l29
8158b74p9L76J40nk23K5p0O7M93m62j88K87j21l8j64L49k0K2k56K61J10k94L32
8181B68r3j69j66p1J52N8n0k8M40l66
8191b5
$$ Imaginary data points
##PAGE= N=2
##DATA TABLE= (X++(I..I)), XYDATA
$$ plain form
0 0 0 0 0 0 0 0 0 0 0 0 0 8 -8 8 -15 16 -16 24 -32 33 -40 50 -63 72 -87 100 -117 136 -155 178 -205 234 -266
33 -266 302 -341 385 -432 486 -543 606 -675 750 -832 922 -1023 1130 -1248 1376 -1517 1669
50 1669 -1840 2027 -2232 2462 -2719 3005 -3334 3704 -4133 4637 -5233 5957 -6851 7999 -9519
65 -9519 11650 -14868 20337 -32102 114772 -201490 -141189 246157 -84157 -58634 101309
76 101309 9843 -52568 -28669 10698 68043 -83399 -94779 98581 103251 -84333 -39663 72301
88 72301 -42914 -61951 89268 7732 -63490 19572 6144 17125 1338 -98220 42544 74798
100 74798 -68954 35563 32498 -101681 8421 18165 -21723 54830 -34935 -36579 63156 -43748
112 -43748 -41493 58562 -14929 -25243 55480 468 -50644 2533 -2499 -19843 58588 21182
$$ packed form
0@%%%%%%%%%%%Qj6J6k3L1l2M0n6O5p3R0j13J35j59J87k17K53k91L33l83M39n00
33b66N68o43P26q17R18j029J149j281J425j582J754j945K153k378K624k893L186
50A669l509L867m259M694n181N724o339P038p837Q770r870J1190j2808J4850j7518
65i519K1169k6518L5205n2439J46874l16262O0301L87346l30314K5523J59943
76A01309r1466o2411K3899L9367N7345j51442j1380J93360M670j87584M4670J11964
88G2301j15215j9037J51219q1536p1222Q3062j3428J0981j5787r9558J40764L2254
100G4798j43752J04517l065j34179J10102R744l9888P6553q9765j644R9735j06904
112d3748K255J00055p3491j0314Q0723n5012n1112N3177n032j7344P8431l7406
$$ plain form
124 21182 -73177 27340 34384 -58356 39780 27780 -73863 43790 53857 -48453 12269
135 12269 -11893 -41469 63244 23234 -30638 17783 -12599 -6245 32254 -23011 -11569 32027
147 32027 -77 6885 16719 -39397 -34234 48392 34155 -29119 3493 7486 -30501 12158 18043
160 18043 -21001 4609 3401 163 17294 -27956 -19517 26204 -8762 -4467 22178 -21476 -7511
173 -7511 15922 -28735 -2762 25570 -20183 -5166 27184 -17908 -25105 12819 -905 -13143
185 -13143 13218 14899 -7952 -17389 -16941 8469 20072 -9278 -408 10542 -19413 -3519 23040
198 23040 -11210 -15195 14504 12387 6100 -8707 -19958 8749 17936 -6303 6382 9826 -20325
211 -20325 5700 28088 -13735 -21042 13427 16298 6741 -715 -9933 -2892 -1585 6871 20038 -4451
$$ packed form
124B1182r4359J00517P044r2740R8136j2000j01643J17653J0067j02310O0722
135A2269k4162k9576J04713m0010n3872M8421l0382O354L8499n5265J1442M3596
147C2027l2104O962R834n6116N163Q2626j4237o3274L2612L993l7987M2659N885
160A8043l9044K5610j208l238J7131m5250Q439M5721l4966M295K6645m3654J3965
173g511K3433m4657K5973K8332m5753J5017L2350m5092p197L7924j3724j2238
185a3143K6361J681k2851r437M48K5410J1603k9350Q870J0950k9955J5894K6559
198B3040l4250l985K9699k117o287j4807j1251K8707R187k4239J2685L444l0151
211b0325K6025K2388m1823p307L4469K871r557p456r218P041J307Q456J3167k4489
$$ plain form
225 -4451 -15887 13902 7998 -17548 641 10483 -2348 5267 8323 -11501 -11082 5037 2245 2783
239 2783 4228 -5727 -2576 400 -8381 1578 4493 -7891 1157 -1 -4765 6356 -6642 -13286
253 -13286 4383 830 173 10204 -9538 -16549 2979 5832 -1091 -3480 -1130 617 1728 -816
267 -816 -7878 -7281 4086 10558 8193 -6987 -18134 2962 12295 1220 2530 -4936 -6114 10694
281 10694 5987 -4708 -2587 -5452 8485 15951 -5363 -7292 2409 2169 4667 4247 -2302 -1378 5163
296 5163 7631 -1245 -7991 -156 4762 7647 4138 -3838 -1684 -3518 -1029 7693 558 -1981 4811
311 4811 -4832 -4272 3947 -2707 901 1402 -3987 1381 1804 -4708 -3950 -2530 1753 4487 -2544 -4522
327 -4522 -4722 -734 4372 -1263 -6239 -5645 1967 8926 -2069 -11147 -4384 -1454 6016 8864 -6996
$$ packed form
225d451j1436K9789n904k5546J8189R842j2831P615L056j9824M19J6119k792N38
239B783J445r955L151K976q781R959K915j2384R048j158m764J1121j2998o644
253a3286J7669l553o57J0031j9742p011J9528K853o923k389K350J747J111k544
267h16p062N97J1367O472k365j5180j1147K1096R333j1075J310p466j178J6808
281A0694m707j0695K121k865J3937P466k1314j929R701k40K498m20o549R24O541
296E163K468q876o746P835M918K885l509p976K154j834K489Q722p135k539O792
311D811r643N60Q219o654L608N01n389N368M23o512P58J420M283K734p031j978
327d522k00L988N106n635m976N94P612O959j0995r078O763K930P470K848j5860
$$ plain form
342 -6996 -8801 -737 2830 5526 -3102 -7104 3624 5143 1169 -2291 -8506 627 8889 5103 102
357 102 -6878 -2886 6401 5028 1338 -3466 -3301 7457 5279 -1627 -182 -3093 2062 6385 587
372 587 1853 -302 -2788 4094 992 -2430 4101 1435 1514 171 -4070 3196 819 -4624 3709 4222
388 4222 -1996 -2654 -3174 -314 939 1338 4820 -6021 -8595 4105 4458 -2018 -5794 -4319 4796 1783
404 1783 -3859 731 -6244 -5546 8022 3558 -6932 -6485 394 6408 -1263 -7722 -750 57 1884
419 1884 5897 -2806 -7830 -3295 4643 8627 -2175 -6963 2301 1504 59 2827 -1715 -750 2363
434 2363 2377 2347 -3027 -1401 4331 978 1188 3049 -2496 951 3753 -721 1596 2123 -98 -282 876
451 876 4577 2059 -5011 -1102 3559 1361 3851 541 -5223 -3223 1755 7008 1105 -8108 -2449
$$ packed form
342f996j805Q064L567K696q628m002J0728J519l974l460o215R133Q262l786n001
357A02o980L992R287j373l690m804J65J0758k178o906J445k911N155M323n798
372E87J266k155k486O882l102l422O531k666P9j343m241P266k377n443Q333N13
388D222o218o58n20K860J253L99L482j0841k574J2700L53o476l776J475R115l013
404A783n642M590o975O98J3568m464j0490M47O879O014p671o459O972Q07J827
419A884M013q703n024M535P938L984j0802m788R264p97j445K768m542R65L113
434B363J4l0n374J626N732l353K10J861n545L447K802m474K317N27k221j84J158
451H76L701k518p070L909M661k198K490l310n764K000M978N253n903r213N659
$$ plain form
466 -2449 5590 1645 -2401 -3801 -2126 987 3116 4135 -6240 -11679 4089 10295 -3070 -7033
480 -7033 -3184 -1456 4148 3430 -3918 -7587 -3522 6004 6684 -5339 -8931 -379 4445 2004 -1502
495 -1502 -1997 -3968 -406 8820 -637 -10091 1177 5215 102 3674 -1513 -6962 1636 5412 3221
510 3221 -14 -3846 -959 3702 3201 201 -374 88 -752 2015 7327 -1204 -7400 4505 4802 -1375
526 -1375 3246 73 -4909 2551 5054 1620 -3077 -5400 3188 6577 1342 -4293 -6009 1089 4778
541 4778 1711 2270 -6407 -8862 7953 6608 -5197 -4486 -3617 1942 6821 -2662 -6831 -1602 108
556 108 3278 2862 -5034 -8987 134 11163 -729 -10700 317 1162 -593 5910 -2426 -8886 686
571 686 3087 4000 675 -7639 -762 5330 891 -934 -1388 100 572 731 4205 -1831 -5183 4531
$$ packed form
466b449Q039l945m046j400J675L113K129J019j0375n439J5768O206j3365l963
480g033L849J728N604p18p348l669M065R526O80j2023l592Q552M824k441l506
495a502m95j971L562R226r457r454J1268M038n113L572n187n449Q598L776k191
510C221l235l832K887M661n01l000n75M62q40K767N312q531o196J1905K97o177
526a375M621l173m982P460K503l434m697k323Q588L389n235n635j716P098L689
541D778l067N59q677k455J6815j345j1805P11Q69N559M879r483m169N229J710
556A08L170m16p896l953R121J1029j1892r971J1017Q45j755O503q336o460R572
571F86K401R13l325q314O877O092m439j825m54J488M72J59L474o036l352R714
$$ plain form
587 4531 3484 96 805 -2287 557 2839 -194 3210 1302 -4237 1486 3389 1877 19 -2402
602 -2402 1169 1245 752 4597 -2041 -4919 3782 2284 632 1134 -4764 107 4792 -127 -1833 -3020
618 -3020 -949 3681 1569 -1201 -4673 -3819 4238 2954 -2195 -2327 -4764 933 5013 -2542 -3447 -1146
634 -1146 -1251 2362 386 -3448 -1989 -1639 2872 2196 -4860 -2218 2300 346 -422 -1121 -1356 -92 -340
651 -340 2840 192 -4399 1122 2161 -787 1249 794 230 -185 -1062 2447 1386 -962 1829 -588
667 -588 -203 2985 567 -189 97 -138 2777 2030 -1312 -573 462 2552 2411 -1741 -1246 449 1828
684 1828 2987 -747 -3268 -256 1879 2660 -72 -3918 -677 1463 1396 420 -3181 -2017 1706 898
700 898 -235 -2186 -3045 1308 1793 -991 -2106 -2973 233 1485 -372 -896 -2510 -1387 1634 149
$$ packed form
587D531j047l388P09l092K844K282l033L404j908n539N723J903j512j858k421
602b402L571P6m93L845o638k878Q701j498j652N02n898M871M685m919j706j187
618c020K071M630k112k770l472Q54Q057j284n149j32k437N697M080p555r05K301
634a146j05L613j976l834J459L50M511o76p056K642M518j954p68o99k35J264k48
651c40L180k648m591N521J039k948K036m55n64m15q77L509j061k348K791k417
667e88L85L188k418p56K86k35K915p47l342P39J035K090j41m152M95J695J379
684A828J159l734k521L012K135P81k732l846L241K140o7r76l601J164L723q08
700H98j133j951q59M353M85k784j115q67L206J252j857n24j614J123L021j485
$$ plain form
716 149 -1637 -704 -838 134 -172 -140 154 -1268 -627 660 -565 287 1160 -906 -412 483 624 434 -1224
735 -1224 110 1075 957 1003 -832 -1554 1588 2528 1166 -569 -2111 1210 2873 1696 -257 -2272 82
752 82 3192 1730 -685 -1650 -435 2705 2376 -552 -1606 -1179 2072 2378 -831 -2096 -943 1401 2469
769 2469 -670 -2679 -921 390 1874 302 -2500 -1621 28 932 327 -1644 -1574 53 -249 -164 -928
786 -928 -1628 79 -141 163 -606 -1084 -289 -419 -719 389 -306 -1217 -37 -610 489 1048 -858 -952 -698
805 -698 809 1891 257 -1222 -685 505 2164 1248 -1519 -374 740 1649 1356 -774 -750 1119 2043
822 2043 1559 -1369 -1552 1343 2418 1425 -404 -2148 413 2353 1990 -11 -1816 -620 2124 1796
838 1796 -101 -1671 -1114 1603 965 -390 -989 -792 244 304 -177 -832 -1281 -23 1026 -412 -1465
$$ packed form
716A49j786R33j34R72l06L2K94j422O41J287j225Q52Q73k066M94Q95J41j90j658
735a224J334R65j18M6j835p22L142R40j362j735j542L321J663j177j953k015K354
752H2L110j462k415r65J215L140l29k928j054M27L251L06l209j265J153K344J068
769B469l139k009J758J311J484j572k802Q79J649R04o05j971P0J627l02Q5p64
786i28p00J707k20L04p69m78P95j30l00J108o95r11J180n73J099N59j906r4K54
805f98J507J082j634j479N37J190J659r16k767J145J114R09k93k130K4J869R24
822B043m84k928j83K895J075r93j829j744K561J940l63k001j805J196K744l28
838A796j897j570N57K717o38j355n99J97J036O0m81o55m49J258J049j438j053
$$ plain form
855 -1465 -975 -214 160 -746 -501 -159 -1371 -907 452 -19 -638 -777 -815 -583 -754 598 291 -1495 -769
874 -769 294 1173 201 -1823 -528 1741 188 348 -96 -2015 543 2047 1091 -925 -2011 741 2761
891 2761 588 -810 -1101 310 2410 896 155 -116 -1792 2048 2713 -1251 -907 341 1086 1741 -514
908 -514 -930 631 -387 1697 944 -1621 -450 -43 1669 851 -2122 -104 935 -1224 842 556 -1383
925 -1383 -463 -798 463 1110 -1614 -557 -141 -1188 1136 110 -1349 -815 -1778 1447 1432 -2614 -1199
942 -1199 44 -81 1870 -1176 -2604 411 -254 1796 818 -3541 -1050 1386 1650 1146 -2827 -1762
958 -1762 2052 1027 1222 -638 -2789 1429 1967 1191 469 -3421 318 4379 -195 -663 -778 -1237 3152
975 3152 1802 -630 136 -2269 1438 3571 -862 -1190 -395 259 2391 -230 -545 326 -2215 1903 2238
$$ packed form
855a465M90P61L74r06K45L42j212M64J359m71o19j39l8K32j71J352l07j786P26
874g69J063Q79r72k024J295K269j553J60m44j919K558J504r56k016j086K752K020
891B761k173j398k91J411K100j514p41k71j676L840O65l964L44J248P45O55k255
908e14m16J561j018K084p53k565J171M07J712q18k973K018J039k159K066k86j939
925a383R20l35J261O47k724J057M16j047K324j026j459N34r63L225j5m046J415
942a199J243j25J951l046j428L015o65K050r78m359K491K436K64n04l973J065
958a762L814j025J95j860k151M218N38p76p22l890L739M061m574m68j15m59M389
975C152j350k432P66k405L707K133m433l28P95O54K132k621l15Q71k541M118L35
$$ plain form
992 2238 -2200 -252 -137 -75 2051 -802 -1406 449 -1626 1262 1264 -2269 -709 -712 368 1957 -1575 -1612
1010 -1612 -536 -1463 2408 1054 -3449 -369 -146 354 1979 -1883 -2124 122 368 2076 -827 -3225
1026 -3225 565 891 1430 475 -3401 -97 1968 457 1419 -2167 -3020 3397 1905 -357 180 -2157
1042 -2157 947 3239 316 -262 -1148 -300 3072 829 -889 -356 -678 2413 1672 -1341 197 -821
1058 -821 493 2603 -707 -1111 718 -339 1404 545 -1307 136 -356 60 1376 -836 -661 461
1074 461 -1043 634 446 -1144 128 -622 -436 1405 -1377 -1176 86 -603 645 242 -1896 -507 -525
1091 -525 550 970 -1963 -1276 312 636 1377 -775 -1965 233 421 851 600 -2357 -302 1631 99
1108 99 68 -723 -1027 1346 1091 -514 -321 -924 887 1699 -180 -328 -428 212 1697 314 -538 -11 -157
$$ packed form
992B238m438J948J15O2K126k853o04J855k075K888Kl533J560lJ080J589l532l7
1010a612J076r27L871j354m503L080K23N00J625l862k41K246K46J708k903k398
1026c225L790L26N39r55l876L304K065j511R62l586q53O417j492k262N37k337
1042b157L104K292k923n78q86Q48L372k243j718N33l22L091p41l013J538j018
1058h21J314K110l310m04J829j057J743q59j852J443m92M16J316k212J75J122
1074D61j504J677j88j590J272p50J86J841k782K01J262o89J248m03k138J389j8
1091e25J075M20k933O87J588L24P41k152j190K198J88M30k51k957K055J933j532
1108I9l1p91l04K373k55j605J93o03J811Q12j879j48j00O40J485j383q52N27j46
$$ plain form
1127 -157 982 918 -596 590 161 -6 1064 -192 74 972 -424 348 486 -406 954 -86 -366 885
1145 885 -15 -160 49 -950 332 719 -471 -557 -1029 -394 1158 -152 -912 -844 -730 793 380 -1063 -881
1164 -881 -566 249 767 -1021 -1070 -112 -97 941 -458 -1669 -172 516 449 303 -1239 -481 920 505 254
1183 254 -522 -951 695 889 136 -209 -607 461 896 72 152 -464 303 725 54 267 298 5 652 661 -98
1204 -98 621 37 -31 700 278 365 391 -535 -55 652 380 92 -366 -713 753 856 50 -465 -629 520 829
1225 829 106 -674 -988 -120 973 -135 -912 -1392 -284 1108 139 -1085 -1139 -459 549 597 -878 -1294
1243 -1294 -339 290 678 -742 -1390 -360 355 269 -488 -1228 -349 426 579 -56 -650 -361 277 493 358
1262 358 -461 -217 427 337 351 278 -334 323 291 83 495 262 -122 488 131 567 723 130 -134 -24 514
$$ packed form
1127a57J139o4j514J186m29j67J070j256K66Q98j396P72J38q92J360j040k80J251
1145H85r00j45K09r99J282L87j190q6m72O35J552j310p60O8J14J523m13j443J82
1164h81L15Q15N18j788m9R58J5J038j399j211J497O88o7j46j542P58J401m15k51
1183B54p76m29J646J94p53l45l98J068M35q24Q0o16P67M22o71K13L1k93O47Rp59
1204i8P19n84o8P31m22Q7K6r26M80P07k72k88m58l47J466J03q06n15j64J149L09
1225H29p23p80l14Q68J093j108p77m80J108J392r69j224n4O80J008M8j475m16
1243a294R55O29L88j420o48J030P15q6p57p40Q79P75J53o35n94K89O38K16j35
1262C58q19K44O44r0J4p3o12O57l2k08M12k33l84O10l57M36J56n93k64J10N38
$$ plain form
1283 514 862 338 -367 -22 588 847 139 -540 -346 327 945 204 -863 -440 491 460 177 -708 -1186 237
1303 237 612 265 -597 -1084 -145 865 241 -881 -967 -639 689 389 -813 -739 -288 275 449 -466 -962
1322 -962 -292 57 276 -455 -518 -53 186 401 -1 -477 -82 367 -17 166 36 -133 504 -15 18 309 281
1343 281 -16 -66 -113 588 309 -307 137 -148 422 1170 -144 -295 212 344 1003 301 -753 -129 535 836
1363 836 460 -937 -450 437 752 434 -942 -926 298 512 259 -455 -1386 -53 965 -88 -533 -639
1381 -639 -562 864 253 -880 -459 -660 563 355 -625 -309 -474 -93 972 -730 -667 49 -565 382 254
1400 254 -732 209 -378 -450 496 -428 -11 81 -450 57 495 -317 283 -430 -94 1190 -338 -92 -40 -457
1420 -457 1300 1020 -718 252 -11 571 1738 -556 -834 244 363 1670 71 -1566 422 580 952
$$ packed form
1283E14L48n24p05L45O10K59p08o79J94O73O18p41j067M23R31l1k83q85m78J423
1303B37L75l47q62m87R39J010o24j122q6L28J328l00j202P4M51N63J74r15m96
1322i62O70L49K19p31o3M65K39K15m02m76L95M49l84J83j30j69O37n19L3K91k8
1343B81k97n0m7P01k79o16M44k85N70P48j314j51N07J32O59p02j054O24O64L01
1363H36l76j397M87Q87L15l18j376J6J224K14k53p14r31J333J018j053m45j06
1381f39P7J426o11j133M21k01J223k08r80L16j65L81J065j702O3P16o14R47j28
1400B54r86R41n87p2R46r24M17R2n31N07M38q12O00p13L36J284j528K46N2m17
1420d57J757k80j738R70k63N82J167k294k78J078J19J307j599j637J988J58L72
$$ plain form
1437 952 951 -1739 -509 1201 519 1207 -655 -1340 1269 743 311 -146 -1669 293 1535 -319 -32 -1410
1455 -1410 -666 1553 -12 -616 -490 -1135 899 572 -1186 -61 -845 -93 1326 -807 -617 62 -1083
1472 -1083 705 438 -1253 -177 -492 -213 1012 -613 -449 -24 -868 1070 141 -843 241 -710 279
1489 279 1362 -558 -383 59 -325 1458 235 -1121 330 -156 771 1301 -1097 -293 561 25 1222
1506 1222 -733 -1186 534 320 862 346 -1708 164 1204 367 796 -1006 -494 1562 262 10 -807
1523 -807 -1171 978 795 -407 77 -752 117 1646 -1008 -691 -246 -628 1122 183 -1381 94 -684 49
1541 49 681 -1158 -341 112 -386 409 -276 -829 549 -352 -8 242 -496 219 -286 -601 450 -13 -284
1560 -284 276 -844 36 670 -638 22 -157 -546 1031 87 -238 216 -222 843 879 -418 77 290 275
$$ packed form
1437I52jk690J230J710o82O88j862o85K609n26m32m57j523J962J242j854K87j378
1455a410P44K219j565o04J26o45K034l27j758J125p84P52J419k133J90O79j145
1472a083J788k67j691J076l15K79J225j625J64M25q44J938r29r84J084r51R89
1489B79J083j920J75M42l84J783j223j356J451m86R27N30k398Q04Q54n36J197
1506A222j955m53J720k14N42n16k054J872J040q37M29j802N12K056j300k52q17
1523h07l64K149j83j202M84q29Q69J529k654L17M45l82J750r39j564J475p78P33
1541D9O32j839Q17M53m98P95o85n53J378r01L44K50p38P15n05l15J051m63k71
1560b84N60j120Q80O34j308O60j79l89J577r44l25M54m38J065L6j297M95K13j5
$$ plain form
1579 275 1055 -285 -558 471 53 749 16 -718 414 440 300 284 -568 -36 754 184 184 -193 -671 604
1599 604 244 -357 20 -417 83 402 -354 -107 2 -170 277 -210 -418 25 -106 -220 -86 -431 -141 136
1619 136 -366 -191 -140 126 70 -381 -237 -83 55 316 -379 -656 -120 225 159 -296 -720 60 704 277 -189
1640 -189 -411 114 599 541 -403 -406 227 552 616 -418 -329 103 474 531 -74 -455 124 557 714 54 -329 -202
1662 -202 368 602 -142 -78 -263 411 413 6 -287 -267 332 318 -232 -117 -117 -104 202 -27 -262 -41 -73 -24 130
1685 130 -169 -29 71 -254 -220 -129 19 -15 -393 -258 -60 191 156 -486 -283 97 94 126 -284 -552 81 203
1707 203 97 -270 -438 -189 391 614 -571 -583 -137 432 420 -314 -329 258 717 488 -279 -519 45 555 544
1728 544 62 -169 -44 430 454 -55 -330 96 636 584 140 -267 87 168 403 108 -88 -129 96 -35 -280
$$ packed form
1579B75P80j340k73J029m18O96p33p34J132K6j40j6q52N32P90n70%l77m78J275
1599F04l60o01L77m37N00L19p56K47J09j72M47m87k08M43j31j14J34l45K90K77
1619A36n02J75N1K66n6m51J44J54J38K61o95k77N36L45o6m55m24P80O44m27m66
1640a89k22N25M85n8r44lO33L25O4j034Q9M32L71N7o05l81N79M33J57o60l83J27
1662b02N70K34p44O4j85O74Km07k93K0N99j4n50J15%J3L06k29k35K21l2M9J54
1685A30k99J40J00l25L4R1J48l4l78J35J98K51l5o42K03L80lL2m10k68O33J22
1707B03j06l67j68K49N80K23j185j2M46N69j2p34j5N87M59k29p67k40N64N10j1
1728E44m82k31J25M74K4n09k75M26N40n2m44m07L54Q1K35k95j96m1K25j31k45
$$ plain form
1749 -280 -70 31 -95 283 -237 -135 225 106 -31 -235 158 174 12 -349 -220 -378 116 -88 -303 -374 86
1770 86 392 -103 -588 -225 74 270 379 -500 -470 92 586 172 -268 -635 198 150 131 -353 -513 -68 738
1791 738 160 -241 -321 -236 549 522 -165 -263 111 482 545 138 -91 -39 404 340 -68 -184 201 3 418 164
1813 164 -247 180 273 68 143 -239 99 164 88 -112 170 309 68 -72 -51 177 80 -64 -158 -271 21 185
1835 185 -88 -363 -456 -151 609 -345 -74 -417 -18 515 -118 -488 -316 93 318 339 -505 -619 -117 224 175
1856 175 -451 -606 610 374 352 -207 -573 42 482 -37 -104 -295 -77 675 -59 58 -216 -228 346 519 5
1877 5 75 188 275 473 10 -74 106 64 43 60 -174 496 -77 50 184 -230 148 -59 -239 267 291 -32 212
1900 212 -721 -149 337 261 -139 -229 -285 333 114 -305 -381 -461 437 526 -343 -561 -348 38 391 -349 -659 -336
$$ packed form
1749b80K10J01j26L78n20J02L60j19j37k04L93J6j62l61J29j58M94k04k15p1M60
1770H6L06m95m85L63K99J96J09q79L0N62M94m14m40l67Q33m8j9m84j60M45Q06
1791G38n78m01q0Q5P85k7o87r8L74L71O3m07k29N2M43o4m08j16L85j98M15k54
1813A64m11M27R3k05P5l82L38O5p6k00K82J39k41j40K1K28r7j44r4j13K92J64
1835A85k73k75r3L05P60r54K71l43L99N33o33l70J72M09K25K1q44j14N02L41m9
1856A75o26j55J216k36k2n59l66O15M40n19o7j91K18P52p34J17k74j2N74J73n14
1877EP0J13Q7J98m63q4J80m2k1J7k34O70n73J27J34m14L78k07j80N06K4l23K44
1900B12r33N72M86p6m00r0n6O18k19m19p6q0Q98Q9q69k18K13L86L53p40l10L23
$$ plain form
1922 -336 67 637 -35 -574 -264 239 463 253 -511 -545 217 462 303 -499 -819 295 564 8 -161 -280
1942 -280 69 731 299 -61 -132 -197 630 313 -39 -106 -152 284 620 -264 -151 197 27 480 78 -30 -12 243
1964 243 264 292 -145 72 -133 -105 282 139 -52 -187 -451 275 506 75 -79 -296 -144 420 -142 -252 -119
1985 -119 -140 168 331 -412 -628 -108 191 592 -297 -351 146 259 365 -280 -452 -4 281 460 115 -644 -120
2006 -120 420 52 -144 -359 -282 417 206 -142 -355 -388 76 482 -234 -167 -22 -35 508 -142 -193 -49 160 442
2028 442 325 -261 158 412 98 325 -129 95 477 100 303 -91 149 420 -270 -197 160 92 350 98 -598
2049 -598 -156 97 -22 209 -296 8 568 -56 -197 -210 -425 48 -83 -193 -139 -356 138 383 -233 -529 -257
2070 -257 -119 324 -225 -614 10 -106 116 -100 -566 -108 171 199 148 -269 -230 355 -173 -165 -135 -118 78 237
$$ packed form
1922c36M03N70o72n39L10N03K24k10p64l4P62K45j59q02l20J114K69n56j69j19
1942b80L49O62m32l60p1o5Q27l17l52o7m6M36L36q84J13L48j70M53m02j08J8K55
1964B43K1K8m37K17k05K8L87j43j91j35k64P26K31m31j54k17J52N64n62j10J33
1985a19k1L08J63p43k16N20K99M01q89n4M97J13J06o45j72M48K85J79l45p59N24
2006a20N40l68j96k15P7O99k11l48k13l3M64M06p16O7J45j3N43o50n1J44K09K82
2028D42j17n86M19K54l14K27m54K24L82l77K03l94K40K71o90P3L57o8K58k52o96
2049e98M42K53j19K31n05L04N60o24j41j3k15M73j31j10N4k17M94K45o16k96K72
2070b57J38M43n49l89O24j16K22k16m66M58K79K8n1m17L9N85n28QL0J7J96J59
$$ plain form
2092 237 -354 -141 173 -173 287 -291 12 205 -11 175 -178 0 156 135 115 -74 -174 392 341 -219 39
2113 39 34 540 254 -131 -157 48 299 248 145 -480 308 189 214 13 -466 8 200 305 -11 -236 -172 227
2135 227 239 -443 -601 -299 290 86 -117 -455 -252 95 161 -437 -240 -1 -125 166 -109 -420 -237 44 175
2156 175 -32 -165 -215 -164 314 250 -167 -155 -6 -125 243 213 -35 332 -171 -53 -140 372 207 135 -50 150
2178 150 178 169 168 -312 389 358 -68 -108 -152 32 306 323 -116 -172 117 537 -35 -263 16 16 309 88 -123 -525
2202 -525 -53 152 132 -267 -413 -49 392 -56 -162 -454 29 151 78 -91 -426 -119 36 -3 -130 -373 -133
2223 -133 109 -9 -126 -310 -350 48 -155 -401 -235 -88 41 -82 -132 -111 -257 108 79 -152 -132 209 42 -155
2245 -155 -33 238 186 194 31 -116 389 360 198 -15 -61 86 409 125 -138 -136 268 160 122 -259 -112 195 357
$$ packed form
2092B37n91K13L14l46M60n78L03J93k16J86l53J78J56k1k0j89j00N66n1n60K58
2113C9nN06k86l85k6K05K51n1j03o25P88j19K5k01m79M74J92J05l16k25O4L99
2135B27J2o82j58L02N89k04k03l38K03L47O6n98J97K39j24K91k75l11J83K81J31
2156A75k07j33n0N1M78o4m17J2J49j19L68l0k48L67n03J18q7N12j65p2j85K00
2178A50K8rjm80P01l1m26m0m4J84K74J7m39n6K89M20n72k28K79%K93k21k11m02
2202e25M72K05k0l99j46L64M41m48j06k92M83J22p3j69l35L07J55l9j27k43K40
2223a33K42j18j17j84m0L98k03k46J66J47J29j23n0K1j46L65k9k31K0L41j67j97
2245a55J22K71n2Qj63j47N05k9j62k13m6J47L23k84k63KM04j08l8l81J47L07J62
$$ plain form
2268 357 182 -9 -64 -6 355 119 -274 -362 248 222 190 -187 -297 -173 39 -185 -195 -312 -161 95 31 -272
2290 -272 -198 -166 172 42 -160 -289 -99 22 36 68 -150 61 58 -62 -152 -93 196 30 -282 -275 -170 76 192
2313 192 -292 -76 115 388 59 -49 -341 207 121 127 189 -205 176 429 202 -47 98 330 629 206 -182
2334 -182 -220 -173 418 329 -219 -6 86 208 389 -363 -230 224 192 388 -78 -494 208 200 77 -170 -156 -40 344
2357 344 -87 89 -153 -178 511 3 -110 -97 -405 192 243 -517 149 101 -406 343 -96 -59 327 -324 -138 318
2379 318 -112 89 -253 -390 310 -62 -16 150 -497 -72 31 -174 -202 -212 -61 390 344 -21 54 -412 473 568
2401 568 -344 -211 -137 -50 655 -63 -376 115 40 515 239 -355 230 151 459 179 -455 -96 322 -45 231
2422 231 -7 -411 319 294 24 40 -364 20 229 -281 225 -6 -238 296 -185 -292 202 -360 181 146 -113
$$ packed form
2268C57j75j91n5N8L61k36l93q8O10k6l2l77j10J24K12k24j0j17J51K56o4l03
2290b72P4L2L38j30k02j29J90J21J4L2k18K11lj20r0N9K89j66l12PJ05K46J16
2313A92m84K16J91K73l29j08k92N48q6OO2l94L81K53k27k49J45K32K99m23l88
2334a82l8M7N91q9n48K13R2J22J81p52J33M54l2J96m66m16P02qj23k47J4J16L84
2357C44m31J76k42k5O89n08j13J3l08N97N1p60O66m8n07P49m39L7L86o51J86M56
2379C18m30K01l42j37P00l72M6J66o47M25J03k05k8j0J51M51m6l65P5m66Q85R5
2401E68r12J33P4Q7P05p18l13M91p5M75k76n94N85p9L08k80o34L59M18l67K76
2422B31k38m04P30k5k70J6m04L84K09n10N06k31k32N34m81j07M94n62N41l5k59
$$ plain form
2443 -113 98 -31 -283 133 -409 -215 313 -220 -87 74 -95 66 43 -336 356 -78 98 -76 -493 187
2463 187 281 -107 245 -257 -357 321 69 -49 177 -190 424 400 -117 196 -190 332 342 -178 -195 306 116
2484 116 426 324 -389 384 -21 237 224 -321 249 202 -31 32 -12 -212 490 57 84 -60 -244 382 434 -219
2506 -219 45 -75 9 486 -251 4 -86 -37 171 -105 -394 -148 -19 -250 203 -254 4 208 -127 -48 -386
2527 -386 -213 233 -167 -126 135 -221 119 2 -262 -52 176 -200 193 -396 17 341 7 -135 -199 -70 138
2548 138 98 -97 91 -295 -3 392 -1 203 -170 -152 187 160 -232 83 -208 96 366 -126 258 -29 -16
2569 -16 33 -48 74 235 -34 -59 57 262 186 -14 -157 218 -6 -38 142 -294 -248 -116 42 186 -8 -265
2591 -265 381 -99 -134 -210 -196 -37 157 -231 -5 198 -52 55 -147 -87 45 157 380 -254 -303 35 110 -88
$$ packed form
2443a13K11j29k52M16n42J94N28n33J33J61j69J61k3l79O92m34J76j74m17O80
2463A87R4l88L52n02j00O78k52j18K26l67O14k4n17L13l86N22J0n20j7N01j90
2484A16L10j02p13P73m05K58j3n45N70m7k33O3m4k00P02m33K7j44j84O26N2o53
2506b19K64j20Q4M77p37K55r0M9K08k76k89K46J29k31M53m57K58K04l35P9l38
2527c86J73M46m00M1K61l56L40j17k64K10K28l76L93n89M13L24l34j42o4J29K08
2548A38m0j95J88l86K92L95l93K04l73J8L39k7l92L15k91L04K70m92L84k87J3
2569a6M9q1J22J61k69k5J16K05p6k00j43L75k24l2J80m36M6J32J58J44j94k57
2591b65O46m80l5p6J4J59J94l88K26K03k50J07k02O0J32J12K23o34m9L38P5j98
$$ plain form
2613 -88 -183 -196 -209 160 54 1 -155 -196 159 373 -274 -255 100 110 183 -88 -38 79 -6 174 194 -48 73 -23
2637 -23 145 42 -160 -111 266 284 231 110 49 81 153 79 72 -24 44 153 -172 140 -119 -138 -41 -116 -27 -105 -35 -191
2663 -191 -128 -93 -17 -46 -170 -409 -386 -76 -22 -99 -96 -37 239 8 -146 -105 -230 21 32 -131 -31 59 116 30 -60
2688 -60 -133 -313 137 198 153 89 161 290 18 -156 107 103 92 416 -244 134 95 257 354 -74 -95 255 78 38
2712 38 459 157 173 99 31 282 76 -160 186 158 -284 176 160 -51 211 182 -129 -171 110 47 -31 27 -11 71
2736 71 -68 -127 -102 209 -175 -265 -214 89 174 105 -56 -270 120 58 126 -98 61 235 277 18 -307 -119 -10
2759 -10 -87 172 -166 -264 249 99 107 -3 -125 -100 122 32 126 19 -266 130 -24 -114 57 -90 -35 27 72 71 40
2784 40 -217 52 56 18 253 175 163 144 -3 165 59 -70 141 73 273 244 -32 -183 76 -82 128 0 -96
$$ packed form
2613h8r5j3j3L69j06n3j56m1L55K14o47J9L55J0P3k71N0J17q5J80K0k42J21r6
2637b3J68j03k02M9L77J8n3j21o1L2P2p4pr6O8J09l25L12k59j9R7p5Q9p8P0j56
2663a91O3L5P6k9j24k39K3L10N4p7LN9K76k31j54M1j25K51J1j63J00R0N7q6r0
2688f0p3j80M50O1m5o4P2J29k72j74K63mj1L24o60L78l9J62R7m28k1L50j77m0
2712C8M21l02J6p4o8K51k06k36L46k8m42M60j6k11K62k9l11m2K81o3p8N8l8Q2
2736G1j39n9K5L11l84r0N1L03Q5o9j61k14L90o2O8k24J59J74M2k59l25J88J09
2759a0p7K59l38r8N13j50Qj10j22K5K22r0R4j07k85L96j54r0J71j47N5O2M5jl1
2784D0k57K69Ml8K35p8j2j9j47J68j06j29K11o8K00k9k76j51K59j58K10j28r6
$$ plain form
2807 -96 148 -7 -29 26 -132 -95 187 -354 -218 -269 -140 67 28 -279 58 -104 98 -85 -253 -73 -40 70
2829 70 118 -292 8 312 -76 -32 35 -320 44 221 -21 -28 -175 -8 301 -14 140 159 65 147 167 -67 203
2852 203 -41 16 175 -41 -76 97 48 178 89 -216 230 245 38 422 -113 -25 203 -123 194 25 -29 89
2874 89 -144 68 300 265 -70 -24 -147 199 315 -114 87 -174 40 182 -240 33 -34 -137 216 -53 -363
2895 -363 2 -14 -103 -81 -393 169 171 -20 130 -360 -97 -93 -136 7 75 -16 19 153 -144 -77 -236 37 85 -214
2919 -214 -269 -115 -113 173 133 -296 260 -329 -74 320 -64 -85 -114 -154 -27 31 217 122 -42 22 281 -96 63
2942 63 -95 -39 229 -174 77 278 -258 297 351 217 301 -88 -231 302 -195 -160 255 129 231 -47 -80 -180
2964 -180 -63 6 92 -252 -68 81 97 125 -192 -431 41 -6 -341 95 -389 172 187 -277 -115 234 -12 247
$$ packed form
2807i6K44j55k2N5j58L7K82n41J36n1J29K07l9l07L37j62K02j83j68J80L3J10
2829G0M8m10L00L04l88M4O7l55L64J77k42pj47J67L09l15J54J9r4Q2K0k34K70
2852B03k44N7J59k16l5J73m9J30q9l05M46J5k07L84n35Q8K28l26L17j69n4J18
2874H9k33K12K32l5l35M6j23L46J16m29K01k61K14J42m22K73o7j03L53k69l10
2895c63L65j6q9K2l12N62Kj91J50m90K63Mm3J43O8r1L5J34k97O7j59K73M8k99
2919b14n5J54KK86m0m29N56n89K55L94l84k1k9m0J27N8J86r5j64O4K59l77J59
2942F3j58N6K68m03K51K01n36N55N4j34Q4l89j43N33m97L5M15j26J02k78l3j00
2964a80J17O9Q6l44J84J49J6K8l17k39M72m7l35M36m84N61J5m64J62L49k46K59
$$ plain form
2986 247 -51 -204 53 -27 -58 156 -76 112 86 -136 24 -215 -103 171 39 165 -87 42 128 -51 -17 -51
3008 -51 20 -40 215 98 -181 -57 -20 134 22 46 10 44 -9 -208 -113 0 63 220 216 -178 105 484 -89 -159
3032 -159 0 -98 38 62 -230 33 -140 61 283 -35 -24 192 -3 88 7 -81 -170 -15 27 -74 -211 -265 -165
3055 -165 -59 13 -120 243 95 94 -9 25 -30 -6 53 -28 8 -142 -98 -129 14 64 227 235 -54 -192 -11 166 150
3080 150 76 -15 138 359 23 -130 53 26 33 344 82 31 85 280 -12 70 -259 223 341 81 45 -170 -31
3103 -31 76 57 -60 -78 -254 -48 -124 172 -192 38 80 -67 94 52 -32 -127 -40 -92 229 101 -217 95 -191
3126 -191 93 -17 -107 -100 -59 -108 -166 53 78 101 176 215 -149 -88 37 -77 93 -268 -15 -223 196 56 -182 -5
3150 -5 -28 18 50 141 -80 76 37 244 180 126 77 5 112 131 -145 191 89 177 348 -495 154 -33 196 76
$$ packed form
2986B47k98j53K57q0l1K14k32J88k6k22J60k39J12K74j32J26k52J29Q6j79L4l4
3008e1P1o0K55j17k79J24L7J54j12K4l6L4n3j99R5J13O3J57ml94K83L79n73p0
3032a59J59r8J36K4k92K63j73K01K22l18J1K16j95R1q1q8q9J55M2j01j37n4J00
3055a65J06P2j33L63j48jj03L4n5K4N9q1L6j50M4l1J43N0J63Qk89j38J81J77j6
3080A50p4r1J53K21l36j53J83k7PL11k62n1N4J95k92Q2l29M82J18k60l6k15J39
3103c1J07j9j17j8j76K06p6K96l64K30M2j47J61m2q4r5Q7n2L21j28l18L12k86
3126a91K84j10r0PM1m9n8K19K5K3P5L9l64O1J25j14J70l61K53k08M19j40k38J77
3150ek3M6L2R1k21J56l9K07o4n4m9p2J07J9k76L36j02Q8J71q43O49j87K29j20
$$ plain form
3174 76 -190 -154 150 270 112 94 -20 -90 108 -5 240 188 24 -52 -194 109 33 -13 227 167 -164 -125 134
3197 134 -153 -109 -3 -17 -102 -72 -112 -18 -102 -210 50 145 108 -146 61 -161 -94 -29 -11 175 -66 95 22 -30 -62
3222 -62 -137 -37 -22 -88 -129 228 211 -184 -72 67 103 -124 121 -279 163 233 148 -35 199 -5 -24 12 -34 122
3246 122 124 125 -107 -122 -148 308 193 13 82 179 48 -85 -43 -60 37 119 -21 254 116 -57 -2 39 -68 -156 103
3271 103 -101 -70 -377 19 243 29 75 110 172 240 -26 148 -252 6 82 -36 -165 -173 91 12 -143 8 -257
3294 -257 198 -205 -2 78 -199 163 101 -208 73 -57 5 160 79 -153 125 -165 13 61 -167 -8 -89 5
3316 5 71 23 -9 -97 153 -24 151 38 -36 53 -49 -173 78 -56 -246 -12 -45 280 -94 -126 266 -28 15 -10
3340 -10 -172 120 -151 -25 -17 48 143 -30 140 118 -358 -24 202 35 313 -80 -11 51 77 -146 -185 -47 -234
$$ packed form
3174G6k66L6L04J20j58j8j14p0J98j13K45n2j64p6j42L03p6m6K40o0l31L9K59
3197A34k87M4J06j4q5L0m0R4q4j08K60R5l7k54K07k22O7O5J8J86k41J61p3n2l2
3222f2p5J00J5o6m1L57j7l95J12J39L6k27K45m00M42P0q5j83K34k04j9L6m6J56
3246A22KJk32j5k6M56j15j80O9R7j31j33M2j7R7Q2j40K75j38j73N5M1j07q8K59
3271A03k04L1l07L96K24k14M6L5O2O8k66J74m00K58P6j18j29qK64p9j55J51k65
3294b57M55m03K03Q0k77L62o2l09K81j30O2J55q1k32K78k90J78M8k28J59q1R4
3316EO6m8l2q8K50j77J75j13p4Q9j02j24K51j34j90K34l3L25l74l2L92k94M3k5
3340a0j62K92k71J26QO5R5j73J70k2m76L34K26j67K78l93O9O2K6k23l9J38j87
$$ plain form
3363 -234 70 -290 120 -135 -182 149 -126 -64 -171 -217 -31 153 -113 -112 -55 180 -46 -187 183 60 124 311
3385 311 403 6 160 152 235 -29 -72 158 114 24 57 206 -181 257 -4 24 155 73 -42 11 -201 -171 27 52
3409 52 171 66 -104 126 -207 127 19 -178 41 0 -130 57 -117 31 169 14 152 -193 -117 223 34
3430 34 -322 139 158 63 -48 -206 54 150 -37 26 19 93 90 -200 -51 46 62 106 157 13 25 -317 -82 95 -235
3455 -235 212 48 29 174 -76 -68 276 1 42 203 45 -197 254 -68 34 -29 -117 341 -50 88 104 -88
3477 -88 187 -138 49 93 132 -77 283 -134 -113 100 -20 13 -61 -49 178 -69 -76 -49 -62 140 -72 -115 -35 -30 -104
3502 -104 35 10 -41 -200 -35 243 -201 32 122 208 187 -12 -104 -24 247 -53 -210 -222 -170 214 -22 25 -447
3525 -447 -21 158 -20 -38 393 -148 -72 327 -57 -81 87 -47 2 166 -62 -67 206 -98 -90 177 165 26 -321
$$ packed form
3363b34L04l60M10k55m7L31k75O2j07m6J86J84k66JN7K35k26j41L70j23O4J87
3385C11R2l97J54qQ3k64m3K30m4r0L3J49l87M38k61K8J31q2j15N3k12L0J98K5
3409E2J19j05j70K30l33L34j08j97K19m1j30J87j74J48J38j55J38l45P6L40j89
3430C4l56M61J9r5j11j58K60R6j87O3pP4lk90J49R7J6M4N1j44J2l42K35J77l30
3455b35M47j64j9J45k50QL44k75M1J61j58k42M51l22J02o3q8M58l91J38J6j92
3477h8K75l25J87M4L9k09L60m17K1K13j20L3p4J2K27k47pK7j3K02k12m3Q0Np4
3502a04J39k5n1j59J65K78m44K33R0Q6k1j99r2Q0K71l00j57j2N2L84k36M7m72
3525d47M26J79j78j8M31n41P6L99l84k4J68j34M9J64k28nK73l04QK67j2j39l47
$$ plain form
3548 -321 6 130 187 124 154 -199 -11 -7 16 -119 -126 -46 151 149 -194 -110 -105 8 82 -187 -159 104 130 85 10 -229
3574 -229 -47 -107 126 -140 -31 13 -13 165 -177 -120 193 40 -15 -76 -218 12 -25 -20 2 -205 -98 186 -46
3597 -46 64 19 -106 1 108 17 103 178 5 -28 253 155 155 -243 -256 -85 82 -77 62 0 -17 -35 3 31 -37
3622 -37 -144 68 131 -55 -129 -114 -180 -116 181 149 61 91 107 67 -39 -22 -99 -9 108 -130 -288 -176 376 37 100
$$ packed form
3548c21L27J24N7o3L0l53J88MK3j35pQ0J97kl43Q4NJ13P4k69K8K63K6m5p5k39
3574b29J82o0K33k66J09M4k6J78l42N7L13j53n5o1j42K30l7NK2k07J07K84k32
3597d6J10m5j25J07J07r1Q6P5j73l3K81r8%l98j3J71J67j59J39o2j7j8L8K8o8
3622c7j07K12O3j86p4J5o6O4K97l2q8L0J6m0j06J7p7R0J17k38j58J12N52l39O3
$$ [...]
8191a1
##END NTUPLES=NMR FID
##END=
