##TITLE=1H_Pr 4687-02
 CDCl3,32 sc, 
 5.02.2021
##JCAMPDX= 6.0         $$ Bruker NMR JCAMP-DX V2.0
##DATA TYPE= NMR FID
##DATA CLASS= NTUPLES
##ORIGIN= UXNMR, Bruker Analytische Messtechnik GmbH
##OWNER= root
$$ XWIN-NMR		Version 3.5
$$ Fri Feb  5 11:54:55 2021 Russian Standard Time (UT+4h)  she@DPX200
##.OBSERVE FREQUENCY= 200.1315066352
##.OBSERVE NUCLEUS= ^1H
##.DELAY= (6, 6)
##.ACQUISITION MODE= SIMULTANEOUS
##.ACQUISITION SCHEME= undefined
##.AVERAGES= 8
##.DIGITISER RES= 18
##SPECTROMETER/DATA SYSTEM= spect
##.PULSE SEQUENCE= zg30
##.SOLVENT NAME= CDCl3
##.SHIFT REFERENCE= (INTERNAL, CDCl3, 0, 15.7039)
##AUDIT TRAIL= $$ (NUMBER, WHEN, WHO, WHERE, WHAT)
$$ ##TITLE= Audit trail, XWIN-NMR		Version 3.5
$$ ##JCAMPDX= 5.01
$$ ##ORIGIN= Bruker BioSpin GmbH
$$ ##OWNER= she
$$ F:/spectra/data/she/nmr/H-F/1/audita.txt
$$ ##AUDIT TRAIL=  $$ (NUMBER, WHEN, WHO, WHERE, WHAT)
(   1,<2021-02-05 11:53:45.59 +0400>,<she>,<DPX200>,
      <created by zg, POWCHK disabled, PULCHK disabled
       configuration hash MD5:
       00 E9 B6 7A A2 85 ED C7 34 08 36 98 17 FE 4E 26
       data hash MD5: 16K
       5D 69 6B 83 1B 85 3D 1A C6 2E 13 95 C0 E1 A1 DF>)
$$ ##END=
$$ 
$$ hash MD5
$$ BC 98 EF EF F7 D5 99 E3 E1 BD 9F 00 8E 7A A6 46
##$RELAX= 
##$RELAX= 
##$RELAX= 
##$RELAX= 
##$RELAX= 
##$RELAX= 
$$ Bruker specific parameters
$$ --------------------------
##$DU= <F:/spectra>
##$EXPNO= 1
##$NAME= <H-F>
##$PROCNO= 1
##$TYPE= <nmr>
##$USER= <she>
##$AMP= (0..31)
100 100 100 100 100 100 100 100 100 100 100 100 100 100 100 100 100 100 
100 100 100 100 100 100 100 100 100 100 100 100 100 100 
##$AQSEQ= 0
##$AQ_mod= 1
##$AUNM= <au_zg>
##$AUTOPOS= <>
##$BF1= 200.13
##$BF2= 200.13
##$BF3= 200.13
##$BF4= 200.13
##$BF5= 200.13
##$BF6= 200.13
##$BF7= 200.13
##$BF8= 200.13
##$BYTORDA= 1
##$CFDGTYP= 0
##$CFRGTYP= 5
##$CHEMSTR= <none>
##$CNST= (0..31)
1 1 145 1 1 1 1 1 1 1 1 1 1 1 1 1 1 1 1 1 1 1 1 1 1 1 1 1 1 1 1 1 
##$CPDPRG= <>
##$CPDPRG1= <>
##$CPDPRG2= <>
##$CPDPRG3= <>
##$CPDPRG4= <mlev>
##$CPDPRG5= <mlev>
##$CPDPRG6= <mlev>
##$CPDPRG7= <mlev>
##$CPDPRG8= <mlev>
##$CPDPRGB= <>
##$CPDPRGT= <>
##$D= (0..31)
0 1.2 0 0 0 0 0 0 0 0.06 0 0.03 0 0 0 0 0.0002 0 0 0 0 0 0 0 0 0 0 0 0 
0 0 0 
##$DATE= 1612511625
##$DBL= (0..7)
120 120 120 120 120 120 120 120 
##$DBP= (0..7)
150 150 150 150 150 150 150 150 
##$DBP07= 0
##$DBPNAM0= <>
##$DBPNAM1= <>
##$DBPNAM2= <>
##$DBPNAM3= <>
##$DBPNAM4= <>
##$DBPNAM5= <>
##$DBPNAM6= <>
##$DBPNAM7= <>
##$DBPOAL= (0..7)
0.5 0.5 0.5 0.5 0.5 0.5 0.5 0.5 
##$DBPOFFS= (0..7)
0 0 0 0 0 0 0 0 
##$DE= 6
##$DECBNUC= <off>
##$DECIM= 32
##$DECNUC= <off>
##$DECSTAT= 4
##$DIGMOD= 1
##$DIGTYP= 9
##$DL= (0..7)
0 120 120 120 120 120 120 120 
##$DP= (0..7)
150 150 150 150 150 150 150 150 
##$DP07= 0
##$DPNAME0= <>
##$DPNAME1= <>
##$DPNAME2= <>
##$DPNAME3= <>
##$DPNAME4= <>
##$DPNAME5= <>
##$DPNAME6= <>
##$DPNAME7= <>
##$DPOAL= (0..7)
0.5 0.5 0.5 0.5 0.5 0.5 0.5 0.5 
##$DPOFFS= (0..7)
0 0 0 0 0 0 0 0 
##$DQDMODE= 0
##$DR= 18
##$DS= 0
##$DSLIST= <SSSSSSSSSSSSSSS>
$$ [...]
##$SUBNAM2= <"">
##$SUBNAM3= <"">
##$SUBNAM4= <"">
##$SUBNAM5= <"">
##$SUBNAM6= <"">
##$SUBNAM7= <"">
##$SUBNAM8= <"">
##$SUBNAM9= <"">
##$SW= 16.9725356469052
##$SWIBOX= (0..15)
0 0 2 0 0 0 0 0 0 0 0 0 0 0 0 0 
##$SW_h= 3396.73913043478
##$TD= 16384
##$TD0= 1
##$TE= 0
##$TE2= 300
##$TE3= 300
##$TEG= 300
##$TL= (0..7)
0 120 120 120 120 120 120 120 
##$TP= (0..7)
150 150 150 150 150 150 150 150 
##$TP07= 0
##$TPNAME0= <>
##$TPNAME1= <>
##$TPNAME2= <>
##$TPNAME3= <>
##$TPNAME4= <>
##$TPNAME5= <>
##$TPNAME6= <>
##$TPNAME7= <>
##$TPOAL= (0..7)
0.5 0.5 0.5 0.5 0.5 0.5 0.5 0.5 
##$TPOFFS= (0..7)
0 0 0 0 0 0 0 0 
##$TUNHIN= 0
##$TUNHOUT= 0
##$TUNXOUT= 0
##$USERA1= <user>
##$USERA2= <user>
##$USERA3= <user>
##$USERA4= <user>
##$USERA5= <user>
##$V9= 5
##$VALIST= <valist>
##$VCLIST= <CCCCCCCCCCCCCCC>
##$VD= 0
##$VDLIST= <DDDDDDDDDDDDDDD>
##$VPLIST= <PPPPPPPPPPPPPPP>
##$VTLIST= <TTTTTTTTTTTTTTT>
##$WBST= 1024
##$WBSW= 4
##$XGAIN= (0..3)
0 0 0 0 
##$XL= 0
##$YL= 0
##$YMAX_a= 109109
##$YMIN_a= -116822
##$ZGOPTNS= <>
##$ZL1= 120
##$ZL2= 120
##$ZL3= 120
##$ZL4= 120
##$ABSF1= 10
##$ABSF2= 0
##$ABSG= 5
##$ABSL= 3
##$ALPHA= 0
##$AQORDER= 0
##$ASSFAC= 0
##$ASSFACI= 0
##$ASSFACX= 0
##$ASSWID= 0
##$AUNMP= <proc_1d>
##$AZFE= 0.1
##$AZFW= 0.1
##$BCFW= 1
##$BC_mod= 2
##$BYTORDP= 1
##$COROFFS= 0
##$CY= 11.3945322036743
##$DATMOD= 1
##$DC= 2
##$DFILT= <>
##$DTYPP= 0
##$F1P= 15.9154993809931
##$F2P= -4.1035820241983
##$FCOR= 0.5
##$FTSIZE= 0
##$FT_mod= 4
##$GAMMA= 1
##$GB= 0.15
##$INTBC= 1
##$INTSCL= 1
##$ISEN= 128
##$LB= 0.24
##$LEV0= 0
##$LPBIN= 0
##$MAXI= 10000
##$MC2= 0
##$MEAN= 0
##$ME_mod= 0
##$MI= 1.114404
##$NCOEF= 0
##$NC_proc= 0
##$NLEV= 6
##$NOISF1= 3.799351
##$NOISF2= 2.8
##$NSP= 1
##$NTH_PI= 0
##$NZP= 0
##$OFFSET= 15.70392
##$PC= 1
##$PHC0= -10761.48
##$PHC1= 11.80094
##$PH_mod= 1
##$PKNL= yes
##$PPARMOD= 0
##$PSCAL= 0
##$PSIGN= 0
##$REVERSE= no
##$SF= 200.130013532006
##$SI= 16384
##$SIGF1= 3
##$SIGF2= 2
##$SINO= 400
##$SIOLD= 16384
##$SREGLST= <1H.CDCl3>
##$SSB= 0
##$STSI= 0
##$STSR= 0
##$SW_p= 3612.71676300578
##$SYMM= 0
##$S_DEV= 0
##$TDeff= 0
##$TDoff= 0
##$TI= <>
##$TILT= no
##$TM1= 0
##$TM2= 0
##$TOPLEV= 0
##$USERP1= <user>
##$USERP2= <user>
##$USERP3= <user>
##$USERP4= <user>
##$USERP5= <user>
##$WDW= 1
##$XDIM= 8192
##$YMAX_p= 0
##$YMIN_p= 0
$$ End of Bruker specific parameters
$$ ---------------------------------
##NTUPLES= NMR FID
##VAR_NAME=  TIME,          FID/REAL,        FID/IMAG
##SYMBOL=    X,             R,               I
##VAR_TYPE=  INDEPENDENT,   DEPENDENT,       DEPENDENT
##VAR_FORM=  AFFN,          ASDF,            ASDF
##VAR_DIM=   8192,          8192,            8192
##UNITS=     SECONDS,       ARBITRARY UNITS, ARBITRARY UNITS
##FACTOR=    0.0002944,     1,               1
##FIRST=     0,             0,               0
##LAST=      2.4114304,     0,               0
##MIN=       0,             -116822,         0
##MAX=       2.4114304,     109109,          0
$$ Real data points
##PAGE= N=1
##DATA TABLE= (X++(R..R)), XYDATA
$$ [...]
2314A025k615K660j084O45k54j464J666j207K150k466J237j043J372N50k001J516
2330F87j627K274j292R36j330k87J345p72J398k289J313l74Q06m30j161Q28r69
2347i44K664k220P52j039M84N90n84Q32j760J428p61J378j217j06N2p77K161k157
2365a224J374j625J913p15K09K20j853J988j056K366k337L84L29k43P45j195J073
2382C53j449J909q59K26p61n70K075n77M02k097J742n18Q41K5j586J250j171K213
2400A448j836J656j923Q01N06n22J163k254K030j511J593r17n14N05p76J699j651
2417e03J383j928J349K04k92P2j403J914j547J910j801N43l01J28J325k066J247
2434B34j759J974n59K68l24q49J450j262J798k195J174o44Q48J84j084Q89j199
$$ y = [1025, -1590, 1070, -14, 631, 377, -1087, 579, -628, 1522, -944, 293, -750, 622, 1172, -829, 687, -940, 1334, 42, 978, -352, -639, 706, -66, 1332, -957, 356, -18, 788, 358, -803, 25, -944, 1720, -500, 252, -787, -303, 287, -297, 535, -1225, 203, -558, 820, -397, -503, -451, -1228, 933, -1224, 150, -1475, 438, -277, -68, 152, -1701, 287, -769, 1597, -740, -356, -27, -270, 475, -720, 353, -1096, 813, -46, 180, -581, -1151, 924, 347, 749, -1348, 394, -124, 717, 742, -844, 406, -765, 1448, -388, 1268, -655, 146, 652, 130, 1293, -961, 1069, -442, 1151, 234, -280, 225, -551, 1148, -503, 880, -1048, 301, 505, 213, 285, -1118, 796, -751, 1159, -642, -99, -400, -272, 1053, -1013, 234, -1525, 449, -110, 158, -166, -1015, 435, -827, 971, -1224, -50, -694, 154, 338, -746, 143, -1056]
2451a056K131j543N09o43J29R80p03J077k143J433o30J055k67q21O58r98K364
2468A532j610P32j224O85K89k62J112k035J557p65P66r10N00r31k03J840j990
2485i17J674j434J186o93M39j89q34J221j084J554j624O92l83L14Q19j295Q96
2502C42j498J854j154O88o31l19J109p77R91j940J446p43J058J3p81L55r48J854
2520I19j454Q52j330M35J144r30O23j328J380q07J346j173J15K40p02J804j439
2537c05J016j638J504l2m49J33j161J590j015J463j254l31O84k23J590k023J283
2554H32j221J667j468P84m89o99J618j229R98j452M88l0J152m22j149J271j396
2571g45J347j099P01o95J36O48l50N79j332Q61p56J237j76j265J859j707J349
$$ y = [-1056, 1075, -468, 41, -602, -473, 507, -196, 881, -1262, 171, -459, 596, 329, -492, 166, -832, 1532, -78, 654, -570, 115, 404, 142, 1254, -781, 776, 11, 777, -133, 367, -564, -767, 1073, -917, 757, -677, 509, -184, 255, 66, -768, 453, -631, 923, -701, -9, -392, -78, 741, -554, 342, -1156, 698, -456, 232, -399, -718, 391, -386, 605, -1335, 111, -632, 426, 439, -342, 13, -935, 919, -535, 317, -1013, -578, 566, -364, 259, -1069, 311, -496, 850, -323, -208, 32, -670, 1134, -305, 711, -927, 577, 545, 96, 229, -932, 658, -357, 1106, -148, -479, 205, -18, 1572, -451, 832, -389, 1278, -190, 594, 105, -594, 1024, -205, 793, -659, -171, -201, 951, 529, -620, 651, -745, 602, -497, 204, -491, -355, 293, -57, 522, -810, 51, -705, 532, 356, -909, 950, -757, 592]
2588E92j158l56O52k5k0N40J093j400J449j719L70p8o87P9N67J908k997J676j251
2607g65N87N53N34o87j790J825n40P21j838J599N89j227J880j953L38j88O1L23
2625B2J215k755J837Q40j497P23q50J339j845K435j680L50J50p08R34m66J012
2642A056k090J679o15k37N95j995K198j635K258j241j2N1m87J693j893J059q85
2659e01R76K11j408k55p83J887o64J424k056J176l11K1K91o9K28p06J535j478
2677d82M17J34r51K123j247pr98J610n76M87J86j336J494j510J582p87L97j115
2695e79O61P27n46L46j195J128r74J042l72k34N79p42J405j331Q66j490J238L7
2713E66n64L80q82J120q57J118j106j62K74j19Q83j186Q22j136J252k36Qn22m19
$$ y = [592, -566, -922, -270, -295, -315, 225, 1318, -82, 1367, -352, 18, -60, -747, -668, -101, 1807, -1190, 486, -765, -178, 375, 909, 222, -1568, 257, -283, 438, -1400, 199, 788, -439, 1441, -512, -174, -362, -301, 22, 1237, -1518, 319, 1159, -338, 385, -465, 874, -971, 1464, -216, 134, 284, -424, 510, 44, 1056, -1034, 645, 30, -207, 388, -1607, 591, -1044, 1214, -27, -39, 12, -475, 1218, -675, 384, -501, 475, 686, -722, -977, -1760, 127, -537, 887, -1169, 7, -304, -283, 8, -61, 167, -539, 996, -482, -65, 69, -882, 1241, -6, -13, -1011, 599, 23, 510, 696, -640, 854, -656, 926, 139, 536, -579, 82, 809, 263, 609, -586, 542, -432, 610, 238, 4, 583, -159, 1246, -85, 781, -709, 529, 566, 2, 382, -500, 620, -237, 881, -225, -387, -113, -232, 651, -535, 287, -849, 403, 167, 175, -347, -766]
2732g66J421j271J156j370O22MK24M37q87O39p73J282r99K83l66o9O09n51R09
2751E34j669J478o54rP43j239P68q97K131j206K77j606J330M31m3J4k071K273
2769E85j199J427k25j23l87k74J416j940R24m64Q29l82j96M43j064J493q80J021
2787A004j365L31m6K96O86j638R51r17J281p05K98n28k65J283j105Q08j244R73
2805I8n83O04m7p56R83j232J500q34L13n30J24P63j163J220j438J043n14R11m89
2824b7l50M44o17J285j357R50p24N76K41l36L69j258J349j025J204r76L35j70
2842h7K53N82j237J053j103R94m58K01o6m52J028j027J083j324O18P7R3K69r70
2861d73Q39q62J587j299M90m10q8P31p30R74j393R26l60K32M6m93M80n96J112
$$ y = [-766, 655, -616, 540, -830, -208, -204, 20, 457, -430, 209, -564, 718, -281, 2, -364, -433, 176, -375, 534, -1135, 343, -311, -320, 423, -816, -48, -945, 1186, -20, 257, -1349, -19, 412, 369, 383, -1688, 585, -614, 813, 588, 465, 78, -196, 1220, -720, 204, -260, 569, 187, -9, 434, -630, 863, -17, 1004, -361, -30, -76, 220, 906, -732, 219, -698, 583, -122, 176, -352, -617, 666, -439, 369, -875, 98, -485, 119, 72, -684, 299, -933, 567, -267, 46, -484, -360, 403, -760, 460, -978, 65, -449, 462, -27, -377, 67, -550, 735, -622, 328, -396, 180, 421, 85, 454, -804, 545, -480, 724, -252, 83, -87, 166, 748, -489, 564, -539, 455, -3, 198, 132, -320, 708, -319, 764, -560, 58, 135, 228, 497, -473, 366, -496, 1091, -208, 282, -128, -216, 515, -215, 759, -634, 292, -68, 164, 210, -283, 197, -399, 713]
2880G13j315P97p47O36m1n29R94j630J604q22Q02r82L03p0j7R21j170R30j119
2899g42J184n54m0K96j035J431q09Q19q69L84K9o4M12q00O83o73R47o56J92k1
2919A14m76J120j056J048j317R18j86K62K0q60R95j008J123j048O87o12K37M71
2937D32m08M40q98R53m63O71q73j86O83n13P30j113P11q25Q21k19k7K80r84J088
2957C00o37Q09j025K70L03l55P73j010J097j122J108o79r8K69p11J158q00P44
2975C94q84Q64n93K93J27o76Q41q15J299j080J03p2N9O33n59M74r86J066n70O06
2995E24p21l15N39r8R90j211Q02q64N91P1m82L51q47J242r51J248q55o4L41n88
3015b97J042j372J056q76R29l26l14K02p74J179r18J216j512O62l4q1N41j155
$$ y = [713, -602, 195, -552, 84, 43, -486, 508, -1122, 482, -340, 462, -520, -217, -287, -304, 617, -553, 377, -742, 442, -112, -152, 144, -891, 540, -269, 550, -319, 65, 94, 30, 442, -358, 325, -348, 599, -57, 135, 114, -362, 758, -298, 750, -567, 351, 165, 427, 447, -413, 582, -426, 697, -351, 336, -276, -39, 432, 24, 464, -434, 519, 56, 727, -146, -332, 351, -162, 568, -545, 166, -659, 162, -57, -84, 196, -788, 300, -337, 472, -553, -283, 20, -335, 438, -572, 525, -597, 511, -168, -266, 3, -708, 450, -350, 394, -490, 374, -219, 74, 201, -475, 366, -449, 850, -230, -127, -199, -140, 493, -66, 408, -578, 488, -82, 524, -197, -512, 27, -71, 919, -292, 510, -354, 237, 308, -174, 177, -670, 572, -379, 869, 14, -50, 291, -297, 745, -627, 429, -447, 482, 156, -158, 44, -730, 449, -469, 747, -765, -103, -137, -218, 323, -832]
3033h32J090q21R55n28K08n35k0R86r46O75r12R12n04M39j19o15O06n14J094j184
3053e65Q29p04M10L71l87M21j138R20l41O66o55j97O57p97J228j208N77l05R40
3072G22Kr95J85J53P02j149J381j853O88P95j16M86k032J244q58J899k019J307
3090E42p13j2Q97j847J944j265P90j601J249J18l81P0M44K9o48P07p53j39Q92
3109C23l75r9n08P15k53N91p14K7L24l53R15j097J036p96M58m50Q1N96j278J298
3129D41o60J66J29l27L57l14O96r73Q61q68P65k29Jql15R55r45J025j285Q04k60
3150A6j27O14j110J036p06Q84o31M1j47j47Q38o74P14j150J030o47L79j86l75
3169c48L74m21R11q12L63l01L10L39o30L52p62J104n60L05l58M5n3m8O41j314
$$ y = [-832, 258, -563, 392, -136, 72, -463, -483, 503, -443, 232, -680, 232, -272, 167, 48, -567, 39, -475, 619, -565, 264, -440, -30, 341, -46, 375, -763, 157, -184, 482, -173, -370, 287, -510, 718, -490, 87, -218, 722, 724, -271, -86, 67, 769, -380, 1001, -852, -164, 631, 515, 1001, -1031, 213, -645, 1254, -765, 542, -171, -183, 714, -1133, 811, -454, 336, -1265, -16, 102, -279, -209, 235, 264, -384, 323, -430, -569, 323, -52, -151, -659, 56, -197, 394, -320, -293, 31, -322, 593, -504, 532, -264, 194, -256, -175, 421, -857, 441, -219, -53, 76, -251, 106, -208, 488, -485, 376, -492, 273, 44, 45, 37, -278, 677, -268, 757, -528, 276, 16, -111, 503, -607, 429, -277, 607, -24, 17, -130, -277, 561, -113, 601, -549, 481, -166, 213, 27, -348, 26, -395, 516, -296, 67, -234, 76, 415, -215, 137, -625, 479, -81, 224, -134, -89, -142, -190, 451, -863]
3189h63J326q84O63l68j03M49p43R61n59N49q88L26J61j10M42j105R90p17J200
3208G27p79K12k01j56P29o26O18q34P47n34L83O1n35O60p87R36p56R1o2Q5K58
3229B37k18L12j009J148n78K82m26m2L38k11R37j153O26o60N41L08o08L87p64
3248e53P88m83O65o64J89M09o23N87p27O01o47N53l27J02J92l26N31o81Q57r35
3268d92O83l58K35J50m69L93n82P24m23L66n50J42L50j32K47q00Q05m82M91l18
3288b0j92O54p60R44q57L10k3K03K1m91L56l29Q18o08K74p89L76K39k46O13q54
3309c61M65m29O65r9j57L5o34J004p90P54q27M70j71lK59p60R67q07O81k20J13
3330A55l63k8O42p96O09o31M73o0Np2k45L78m30Q50o15L02o95M14L82m74L40n94
$$ y = [-863, 463, -421, 242, -126, -229, 220, -523, 438, -121, 428, -460, -134, 27, -83, 359, -746, 244, -473, 727, -52, 160, -41, -197, 532, -94, 524, -310, 437, -97, 286, 347, -188, 472, -315, 621, -135, -44, -106, -21, 237, 19, 331, -678, 470, -108, 174, -252, -294, 44, -167, 770, -383, 243, -417, 124, 432, -176, 211, -553, 235, -248, 417, -247, -58, 351, -272, 315, -412, 189, -458, 95, -232, -130, 62, -264, 267, -414, 443, -492, 191, -167, 68, 218, -251, 142, -440, 284, -139, 227, -323, -181, 169, 37, 284, -516, 289, -193, 298, -20, -212, 442, -318, 626, -231, 79, 56, 259, 280, -211, 145, -184, 634, 26, 300, -489, -113, 126, -120, 493, -361, 104, -325, 340, 241, 84, 119, -515, 489, -301, 453, -374, 96, -75, -78, 181, -579, 388, -419, 262, 42, 155, -208, -236, 406, -390, 219, -412, 61, 1, 6, -66, -311, 67, -363, 487, -128, 174, -521, -107, 275, -199, 141, -453]
3352d53Q50l99J65l02j53M59k38M99p80M18k56O93o18k38N29m34P01o71O09n32
3372a51L97N2m07M67n99N88l50L41l47K57k54j60P07n63J93o18N31q7L07l05l19
3393c20M54o15R33r20M79j94R5J58k97M01n45N09j80J80l81O5J84k48N19p87N91
3414H1k68L03R0l90J65n21R14o49J66M7j5l6l1M95p51N93l87N80k72P9j82k42
3436b31P60o38L91o06L75jR3K09m80M10l88M87l39j28P3jM56n53M24n60M16m03
3458b34N0J33k1K2J32K48o26N05k62R5J47k33R7n34Q03n01L85l45r0M26l20K98
3480A75m43J08j45K49j0K3K01l16M93l56L08n59M97O7m86M21m61M35o03O14m30
3501b18M48M7l70N42n39L38l54l4K91l4ml70M04m06O29k95l4Q0j73k1P5R4l77
$$ y = [-453, 397, -2, 163, -139, -292, 167, -71, 428, -352, 66, -190, 503, -115, -353, 176, -258, 443, -228, 381, -151, 246, 298, -109, 358, -241, 347, -3, 338, -9, 248, -6, -166, 541, -22, 171, -447, 84, -3, 304, -1, -320, 134, -481, 452, -468, 11, -183, -88, 70, -227, 174, -371, 138, -42, 138, -243, -178, 6, -242, 277, -510, 81, -187, 116, 206, -184, -19, -540, 374, -275, -109, -62, -77, -113, -144, 351, -400, 193, -194, 386, 114, 193, 11, -231, 529, -109, 282, -324, 51, 50, 143, 352, -128, 282, -106, 381, 42, -86, -13, -14, 442, -111, 313, -247, 169, -234, -184, -51, -72, -50, 82, 330, -296, 209, -53, 42, 189, -44, 53, -481, 322, -179, 206, -139, -229, 197, -123, 175, -268, -160, -305, -56, -66, -43, 158, -158, 335, -21, 287, -272, 225, 292, -194, 227, -234, 201, -402, 212, -218, 230, 277, -93, 449, -90, 248, -106, -140, 151, 117, 113, -257, 147, -259, 370, 75, 41, 121, -52, -73, 2, 96, -281]
3524b81N22j4j73Q6l65N25m13N76q47N46l76J16k5L88j37j97M73n27L87p90K71
3545b55K08l64L6j60J100n82j75J9K4O72o06M57r56O98m27k63Q04n61R17k92l47
3566e3o0L93l04l0J12j30L01l57K54m86M16k14K02Q5l04L15k11M12n02J28j43
3587a76J54J93k36J46m96O16k98L67m00O1K42k13L12o59O20n50O21o1q7o5j48
3608e7M34m39M21m46L28N7k32J26m30N33k21j16j80L47K2k99L65l48K74m66K97
3629c0J25k84K56j08J27l25O33n37O6j4k0J7l48K97k23O70n28N12l43k5J20MJ98
3652B40n95O12k32k1k2rK90l69L55l42J73l88K02J77j93N07q61Q48j43p6p3p6
3674Dl7k9M48o45M24k77L98l83N7L08m66M49m38J79PQ1j90L26L7k17K6l85L41
$$ y = [-281, 241, 227, 54, 140, -225, 300, -113, 463, -384, 162, -214, -98, -123, 265, 128, -69, 404, -123, 264, -526, -255, -47, -411, -375, -535, 565, -17, -192, -173, -149, 523, -83, 374, -582, 116, -311, -574, 230, -331, 586, 294, -53, -113, 280, -24, -54, 58, -72, 229, -128, 126, -360, 56, -158, 44, 129, -175, 140, -71, 341, -161, -33, -176, -22, 171, -65, 81, -415, 201, -97, 270, -130, -69, 173, -40, 272, -387, 233, -317, 304, 243, 156, 91, -57, 377, -62, 359, -87, 241, 298, 66, 192, -238, 295, 74, -42, -222, 125, 147, -152, 213, -135, 139, -327, -30, 95, -189, 67, -41, 86, -239, 394, -143, -77, -91, -111, -94, -442, -145, -368, 302, -226, 286, -57, -82, 38, 42, 240, -355, 257, 25, 4, -18, -27, 263, -106, 249, -93, 80, -308, -106, 71, -122, 385, -476, 372, 229, 153, 80, 4, -33, -62, 386, -259, 165, -112, 286, -97, -40, 268, -198, 251, -187, -8, -1, 80, -110, 216, 253, 36, 62, -323, 18]
3697A8p8J26p3j97K81p0N02n93J20k49L20K37m76J80r4K25j60M6l78K51L16m64
3719b10L95k51K41j36O4P0k66K90p10N71k01K28k61K8J98j68M48n95N64l70K02
3740A31j10K67k48k8L15l65K35n95N60k88K15j08O5O4j45J26k70J90l31K66K03
3761A49k78K59l01L07j11M6l99J12P4r7N65n25J10j06K37j0k7L8k56M97m12J54
3783B6j97O3M3j89K30m35N34l92M91l13j09Q7J0J66K8J89m95K49J12j66M43l93
3805a8M35l37J08k78o0k9K52k5j54L1j24M50k52K49j10J8m0J64Mk57k33K53j40
3828i3J89j82K08j11K51m13L78m26J97j39P8J17j29J9P9l2m4J33j36k28M54l09
3850a39J55k28J70J28K26j20k37N1k7L71m17R1J2j34O9j67J29r7J45n1J18j63
$$ y = [18, -60, 66, -7, -204, 77, 7, 509, -84, 36, -213, 107, 344, -132, 48, -46, 179, 19, 65, -313, -62, 254, -210, 185, -66, 175, 39, 103, 173, -93, 197, -513, 58, -143, 85, -176, -148, 50, -118, 330, -265, 299, -71, 131, 21, 288, 40, 12, 327, -38, 197, -398, 162, -126, 89, -19, 46, 110, -35, 91, -179, 11, -320, -54, 149, -129, 130, -171, 136, 25, 71, -328, -216, -142, -239, 326, -199, -89, -195, 42, 32, 5, 43, -213, 284, -128, 26, -171, -108, -65, -254, -24, -459, 75, -317, 174, -139, -248, -161, -151, 15, 43, 232, -263, -14, 98, -68, 375, -18, 417, 80, 188, -90, -150, -179, 73, 48, -106, -75, -199, 251, -1, 248, 138, 156, 116, 280, 284, 27, -206, 47, -93, 96, -86, 122, 11, 262, -151, 227, -199, -2, -141, -63, 54, -75, -56, 23, -9, -53, 80, -56, -284, 170, -139, 16, -212, -42, 86, 312, 192, -45, 6, -21, 350, -67, 24, 36, -98, -29, -196, -67, -164, -19, -70, 48, -115]
3872a15J47K40k85L12n35N72m60M14k27M3J17p46O76k14J10J3k66J47P0L01l13
3893Ar3j25L19J15l02M2J3K18j4j16J64p7j79J81j4l63M04k09k3m3J3R3l0J44
3917A19j66J56m39M76l32P7OM3L22l92M41n08K95k10K76j95j18J50j72K15j49
3938a05J01N7m39N48l20M51m04K23l30K78J46k51J92n36O27l38L42l16J96L3j29
3959B6J80k83M50l40J05r7j81J34J14j43L5J73j34j54N3J38j57m7J42k69O58m87
3981h4Q2M3n6j33n6M96n88K48J15J0p1n3L15m32J55j66J56J5q5K06j78J82l97
4004b76M36l86L91k17P8j9P8O3l15J38j71J26p5m2J69j4Q8j79J25m9M4K8j89L14
4028A46l93L05l11N61m22J47J10k03K57k71J37k75K85m0J2j1R0j08J39K00k05
$$ y = [-115, 32, 272, -13, 299, -236, 336, -124, 290, 63, 106, 223, -523, 153, -61, 49, 62, -204, -57, 13, 314, 1, -92, -217, 102, 217, -85, -43, -30, 188, 174, 58, 222, 145, -34, 147, 133, -230, 174, -35, -58, -101, -88, 5, -25, 119, -47, 109, -330, 146, -186, -109, -103, -60, 262, -130, 311, -197, 98, -112, 164, -31, -149, 1, -171, 44, -105, -4, 53, -386, 162, -158, 293, -111, 112, -218, 60, 206, -45, 147, -389, 238, -100, 242, -74, 122, 155, 26, 206, -77, 373, 33, 138, 41, -140, -6, 108, -35, 0, 173, 39, -115, -62, 76, -81, -128, 14, -255, 403, -84, -2, 41, -15, -148, -204, 292, -296, -48, 67, 77, 6, -47, 268, -164, -9, -175, -19, -4, -89, 117, -61, 121, -276, 160, -226, 165, -52, 26, 7, 85, 148, -167, -29, -200, -74, -149, -191, -22, -36, 52, -127, -2, -51, -7, 21, -168, 146, -247, 58, -253, 308, -114, 33, 143, -60, 197, -74, 63, -212, 73, 33, 45, 34, 124, 16, 155, 355, 150]
4049A50l2j98J99o6mM3k75M3N9N9l57M59J10l51J51J8J39m03L57p8Kpn7K84n39
4074b94L85n2m5q6o0L16l11J83o0K15l74OL25j73K47l86K98n55N14n3o2K4J30
4097A32j21l3K93l68K9j17L6J57k79K39k2J76j03j20N5k45N29l86K82j50K89m45
4119a72K28l5k85M22j43p3N6k7J89L0o7k6J41k96M3l7P4O2j78K17k13R8J16n4
4143G0k22J02j61J54J23l85M07n6J43k70j36K29j98J44mL61m70L55l94j3J44j35
4165b12J41N3J51k51J69Q1J75l27K46r1k08L16J8k54p7J03n0J67j82N0l3oJ02
4188H1o7J00m03L71q5NK67k83J78o5p9j77n9M96m61J98p9J6J15j95J92j43L01
4211B24l13R1M3j8M4r4j80j1K07k66M98k68J25j33K8Q0j79K23q8N2k86L16K28
$$ y = [150, 118, -80, 119, 53, 49, 92, -183, -140, -81, -22, -379, 80, 190, -161, -10, 8, 147, -256, 101, 23, 25, 18, -39, 245, -294, 91, 39, -6, -92, -152, 164, -147, 36, -24, 191, -183, -177, 148, -25, 222, -164, 134, -421, 93, 40, -22, 2, 132, 11, -22, 271, -97, -68, -185, -149, 8, -271, -32, -54, 122, 19, -101, -46, -291, 238, -148, 134, -16, 273, -172, 56, 21, -264, 158, 15, -58, -2, -29, 160, 190, 123, 97, 238, -58, -15, -52, 22, 84, -94, 123, -90, 8, 124, 70, -152, -50, -211, -57, 66, -319, 88, 32, 175, -95, -231, -2, -200, -56, -60, 301, -169, 186, -208, -221, -77, -212, -71, -18, 133, -118, 51, 132, 307, -20, 226, 135, -73, 243, 261, 7, -70, 33, -17, 150, -32, 18, -15, -21, 81, 14, 114, -289, 82, -3, 2, 269, -14, 164, 99, 20, -157, -216, 280, -181, 17, -62, -46, 69, -126, 66, -77, 224, -89, 2, 45, 27, 71, -23, -203, -214, -7, -273, 225, -43, 82, -51, -23, 57, -122, 101, 13, 65, -221, 95, 323]
4234C23n69L57q3J30k66M04l82Q1l6J76q6k42J61k8j0q0O1J86o8r9R4L6j29K22
4258A53j65m9Q4l33M34k45N2m1K57k55o9L62l93M38j60rj68O9K06j44Pk12K52
4281G1j0M3k54R7J93j08L03l92l9K0K21l19J47j26J44K55l16J85j33J63J73k93
4303B5mN9j1k1j6j40m3L79l72M78m77J70J7j8o3K52k71r0J34j63N94p15M47m41
4327b90L87P4n93O13m41P94o54M85k23j96N81j038J67K28k1j6K00J80k81J01j71
4348a14J31OJ68l61J21J2q7J89q9J52j80J22j90J12K14n81M57k82L80j77J6P2
4370I1p0j0k20J69J35k23j0K93n4K0j3j63m1K03j17K4r5L6m5kR6J07l72M96q9
4395A46J8n5j25K3O4L8k57oP3J8J21J19lk34K62k70M6m0J61o9M2j14R2J34j15
$$ y = [323, -246, 111, 28, 158, -108, 296, -86, -5, -41, 135, 49, -193, -32, -60, -70, -150, -89, 97, 29, -70, 24, 60, -69, 153, -12, -61, 23, -310, 124, -121, -69, -110, 147, -108, -177, 185, -208, 230, 70, 61, -107, -38, 168, 24, 31, -181, 71, 61, 104, -150, -53, 140, 32, 335, -57, -96, -76, 145, -174, -27, -153, -9, 246, -70, 115, -18, 145, 318, 25, 21, 80, 69, 48, 32, -108, -151, 228, -144, 334, -143, 27, 44, 26, -37, 215, -56, -146, -12, -175, 419, -296, 151, -290, 97, 171, -422, 191, -250, 544, -110, 375, 152, -44, 537, -501, -334, -106, -127, -143, 57, 237, -44, 57, -114, 17, 23, 191, -170, -49, -37, -124, 65, -24, 128, -52, 70, -120, -8, 206, -375, 82, -200, 180, 3, 19, 91, 21, 11, -209, -40, 95, -128, -138, 155, 101, 121, 108, -55, -96, 107, -10, 14, -81, -45, -90, -92, 4, 111, -261, 235, 146, 164, 109, -16, 7, 71, 109, -148, -154, -81, -63, 58, 177, 174, -60, 202, -68, -22, -62, 99, 30, 72, -42, 50, 184, 69]
4420F9j92n4K99J3m7o8j84K42k28Q7l3J26R1r0k6j42L46l55M94m42NKK61j53j86
4445a65K70%Mm0j27J64j94Q6O3R6j78j29J72j47L99l62J11k70L01l9n8L1o1J32
4469E9k45K92k02K32l90J08K13k76L06r3J14j4jk5k04M23m66J06j7J93n6j63J1
4492i5K3JJ14J01j68q4J82j85l6nnO9K07l41M73j61o0K7l2j64O7J61L1j60q7j38
4518b65K08Q0J99m21K33j38O3J6j16J98j70P5j4J10l99L47J85k25Qm08N50p5J68
4541B09k79jN32n87N6M2J21k10J29j8P0M0m19L12J56l71J42L11l26M30l93j17
4563a71J60l45N68j97J6M8k69M33j65J16l22M14k89J3j49j14O54n54L37m59J61
4584a14Lo8K07m2Kj71N37m14J64m31L75J44M0j41l99J89K47l31K65P9M6k38L65
$$ y = [69, -123, -177, 122, 135, 88, 20, -164, 78, -150, -63, -96, 30, 121, 31, 5, -137, 209, -146, 348, -94, -89, -87, 174, 21, -165, 105, 105, 109, 69, -58, 106, -88, -2, 61, 157, -21, -150, 22, -125, 274, -88, 23, -247, 54, 15, -43, -12, -73, 59, -186, 106, -96, 136, -254, -146, 67, -209, 97, 4, 118, 104, 103, 78, -126, 297, -169, -63, -80, 113, 57, -106, -95, -72, -71, 43, 144, -24, -108, 74, -111, -147, -152, -157, -88, 119, -222, 251, 90, 30, 57, 25, -139, -72, 89, 120, -40, -127, -265, -57, 23, 222, -199, 34, -104, -41, -25, -141, 57, -113, -38, -52, 58, -341, 6, 191, -34, -26, -434, 116, 41, 209, -70, -71, 461, -126, -70, -28, 93, -117, 12, -6, 64, 104, -315, -3, 153, -218, -76, 235, -91, 339, -54, -171, -11, -356, 212, 15, 31, 79, -190, 243, 78, 194, -128, 286, -3, 10, -139, -253, 401, -153, 184, -275, -114, -111, -179, 28, -14, -12, -183, 354, -60, 104, -327, 48, 192, 232, 91, -308, -119, 128, -203, 62, 141, 187, -51, 314]
4607C14k30m08L47J52R4j43m3o2k89K23J34k54M50k4j88J36k87j4L09l79Q3J62
4629H3j1K1M7l37N58l06k08J92J99j02j93R8k76J08J14J12l5O2L9k19J80r2J78
4652B12l66K00J54j46N3l50j34J98J44l3K17k53j20K32k82K21O5k41J83O7K60
4673B81k86M5k1K49k49L9j93J44p4j12K66k28j65K81J94l91L05j07j70N15m62
4694a39L44k30J46r7j30J2J49J53k73L0k35K45L8K28r1mj24m0J77L0k20Q3j43
4717i1K02k41L77m96L02k18P8r6K09K24m12L43k22P5j99P3lk11L72j59Q1j00J77
4740F5k56L62L9l56n2r7K68L0j63J05l7J14j83N01m65L9J11J72j38r4J7K7o6j34
4764a91M65l97R5O5J24k1j56K7l2N3J63l15J06q9J27q1J58K9Pj39Lj12p2L08k28
$$ y = [314, 84, -324, 23, 175, 269, 126, 83, 21, -268, -45, 89, -165, 285, 261, 73, 209, -78, -92, 217, -162, -79, 83, 72, 93, 140, -197, 361, 55, -153, 39, 238, 136, -57, 41, -235, -127, -13, 99, 64, 126, 165, -54, 126, 34, 212, -154, 46, 200, 54, 107, -243, -377, -179, -35, -68, 149, -104, -224, 8, -274, -53, 12, -229, -46, 21, 281, -5, 40, 19, 268, 19, 58, -135, 9, -65, -177, 89, -139, -304, -23, 171, -220, 85, -22, -192, 323, -139, 205, -25, 121, 24, -106, -94, 55, 208, -65, -35, -270, -25, 13, 241, 150, 146, 22, -18, 159, 189, -31, 52, -91, 111, -130, 247, -249, 53, -165, -87, -183, 26, 250, -162, 181, -41, 34, -165, -92, -95, -306, 66, -93, -12, -112, 65, -191, 171, 210, -146, -198, -295, -27, 3, -160, -55, -92, 22, -161, 340, -125, -86, 25, 197, 59, -35, -18, 9, -57, -191, 274, -123, -28, 37, 161, 140, -16, 11, -21, 32, 195, -120, -14, -103, 24, -57, 101, 130, 137, -2, 1, -111, -183, 125, -103]
4789a03P0O8R1j42K8K01l95J99k05J66k39K4M80k87Q2l16L96j75L02k32P5K2j58
4812d8o4J21j08j12J60O4k47J92n3K02j92j02K48q5M5j46J27k12K81j48K19l12
4834a70K07M4r4J16k34K02k67K58k56K71N2l17J49j7j3J05J51j95n8J90l49O7
4856a58l7K85k88k9J23J26M4j2P6m25L98q1M8L6O9j48o6K33k49J05qJj15L46j42
4881A32j3J45l13k0J3J01n4J3K8m46M85k02L03j80j36L67k41n1j60L98m40J25
4903a46L1K20m6P7k40j71L04K4L01m62J41j15J00K05m91K19J19j83J97J01j40
4924D5l2L55n95M9K42r2r1J30q9q4L96l24J26k28L47N0l95L05j91K15j21p5L12
4947B55k45J05r9R6j10O9l16M76m14K54j4j20J91m80K95k4J85k82N7P7M3j00j34
$$ y = [-103, -33, 35, 126, -16, 12, 213, -182, 17, -188, -22, -261, -237, 243, -44, 38, -278, 118, -57, 245, 13, 88, 110, -48, -112, 9, -99, -211, -51, 13, -234, -42, -95, 107, -85, -187, 61, -24, 21, -125, 2, -210, 71, -77, 142, -170, 37, 81, -13, 103, -131, 71, -196, 62, -194, 77, 129, -188, -39, -56, -69, 36, 187, -8, -66, 124, -225, -158, -195, 90, -198, -227, -104, 22, 66, 54, 130, -295, 103, 22, 70, 106, 175, 27, -39, 194, -55, 50, 42, 43, -72, 274, 132, 119, 264, -49, -69, -56, 45, -9, 4, 32, -414, 71, -131, 172, -8, -144, 223, -18, -69, -229, 169, -271, -146, -115, 105, 59, 136, -104, -275, 29, 53, 354, -108, 33, -82, 18, 223, -268, -49, 70, -113, 84, 185, 45, 13, 368, -227, -178, 64, -28, -119, 11, -78, -162, 234, -90, 36, -192, 155, 205, -190, 115, -76, 139, 18, -57, 255, 10, 115, 16, 112, 2, 71, -245, 231, -183, 71, 57, -63, 128, -352, -57, -81, 104, -178, -121, -44, -1, -101, -235]
4970b35j9M6K93K4j22o5k15L77j50K76l32K99j0m20L80k69J65q7K81l83J95j13
4992h4k4K27J0j58K4n6J85M2k44n5J57m8J30j01j78J98r6Q4K0J55j54N0k06P9
5016d3Ro2J20j81L86l28k4j06J98M3j66L9k0L21l84R0M1M5J5o0L23l33K72j98
5040cJ26k84J25K0j67L82k00J11o6L6k18M14k67o6J32j16L13j74j94J0J99K7k18
5063g8K20j67K34k25K3J47k51K97m71M65l09K67k26P2J74j66J90k65N2L3L8J29
5085A83r8j91N8K5l6J03J22j4p0k05K34m13N06n00J92ll9J53PK09n92M88l88N74
5109C05k16j22K06l53K83j11k9L4N8O5J94l06p0K65k99K72j35r2j58L26p7k39
5131a99J52j83M25j33J88j41j74J96k4k8j16K65k22L25k56j13J46k23J96j52L61
$$ y = [-235, -254, -208, 85, 109, -13, -78, -293, 84, -66, 210, -122, 177, 167, -253, 127, -142, 23, -64, 217, -166, 29, -84, -108, 119, 129, -29, -5, -61, 124, 166, -78, -133, 24, -24, 106, 5, -173, 25, -71, 13, 33, 188, 34, 84, -122, -43, -34, -96, 24, -157, 229, -99, -123, -229, -31, 12, -154, -115, -135, 186, -198, -108, -67, -22, -7, -67, 256, -77, 195, -3, 123, -161, -36, -16, -183, 199, -1, 110, 44, 80, -138, 276, 9, -57, 75, -41, 272, 98, -96, -86, 113, 140, -78, 142, -25, 209, -16, 7, 154, -97, 200, -271, 194, -115, 152, -74, -2, 172, 6, 196, -69, -17, 16, 54, 183, 85, -106, -48, -23, -59, 44, 166, 152, 82, -123, 111, -302, 204, -296, -104, -107, -146, 7, 14, 223, -369, 119, -269, 305, 89, -33, 173, -180, 103, -8, -37, -3, 55, 120, 314, 8, -62, 203, -96, 176, 41, -51, -209, 117, 40, -199, -47, -230, 195, 62, 250, 109, -65, 131, 107, 79, -37, 228, 6, 331, 75, -38, 108, -115, 81, -71, 290]
5152B90m98J41K97l20J68k00L93m31L59j49q8j07J04K27k29l9J68Mk31J44J67
5173A70m59K05J28J76l48j06K12j0K95n88M88o5j31m6j98R5l9J99l7J90o34M94
5195ij76K56P4k36M69k78J29n76L31j4l80M30m0N8K43l64p9J43K93j91J05n94
5217d06M73n11O25o86M19J9j42n3L69k7n0nj26K12j82k01PK94M45r02N16L25l64
5240D9K66k0k72j97K3J03L25o18m34R42L81p7n72J47L04j59n2O4L62q89R01n45
5262C2K50o23L85k94n51R28l05M66p72N28j56k21j05L69O7l16J4M77p17J82J004
5283F42j058N88O45k094J552J42n14J39J87J89n90J146o82k54K33p4J92%j33r1
5303A65m7L21q42K15n00J337p61O73j403J012K73k62p36L72O1L21o30O57n89O17
$$ y = [290, -208, -67, 230, -90, 78, -122, 271, -160, 199, 50, -38, -145, -41, 186, -43, -82, 86, 90, -141, 3, 170, -289, -84, 44, 220, -128, -234, -22, -32, 263, -325, 163, 98, -33, -79, -277, -182, -221, -22, -59, 131, -503, -9, -185, 71, 145, -91, 378, 100, 229, -347, -16, -30, -410, 20, -20, 38, 281, -83, -162, -19, 274, 83, 188, -406, 67, -444, 181, -505, -86, -67, -209, -262, 107, 80, 30, 25, -101, 111, -71, -272, -265, 29, 474, -428, 88, 413, 49, 315, 295, 23, -174, -151, -48, 277, -341, -775, 167, 548, 471, -101, 46, 350, 191, 139, 203, 565, -324, 577, 32, 282, -341, 44, -250, -801, 127, -178, 288, -484, 44, -112, -333, -438, -69, -2, -318, -304, 173, -544, -362, 642, -416, 172, 817, -1277, 275, 417, -97, 42, 229, 418, -172, 974, 292, 38, 271, 197, 389, 389, 256, 165, 118, 439, -403, -188, -688, 649, -112, 561, -842, 170, 443, 181, -555, -183, -122, 199, -431, 226, -363, 254]
5323B54M04p19M40q03L38mo11R06j195M17J29N04N46j032J3Q6J49L95r87Q40q97
5344h27J001k60J128n84m26j54M39M66q32n8L0N39o02K83O09r60k04j80J066p33
5364b59k3k09O23J22p2K51L97o79o16J381j189L42k31M26n71o6J371j249P36j256
5384g71M75k3r2N73m52j41K98M99k56K04n00j88L95J36l4J6l45K15q76J267m42
5405d2K32m10M49o46M40M7K84p1n73J14p21J096j61p0J68q4k59k07nN33K95l94
5427A5k68J19K47j19l30Q20p10L41m6l46N9L21l7o15Q77k19l42j03P14j8n40k60
5449d40Q27Mm02l00O94m20j21P1K38m48N05P5k84L1J49J98n64P66n17J79R9q10
5471d70Q97m60k84P54j52l13q15M42M16M46q53j1P86m10J60n24L76J82J00l07
$$ y = [254, 658, -61, 379, -424, -86, -90, -701, 205, -990, -573, -444, 60, 606, -426, -413, -327, -178, 217, -770, 70, -827, 174, -86, 1042, 458, 32, -122, 317, 783, -49, -107, -77, 462, -140, 143, 752, -208, -412, -592, 474, -259, -282, -491, 132, 254, 182, 433, 830, 151, -465, 916, -273, 69, -162, 264, -307, -373, 998, -251, 485, -771, -296, -319, -411, 162, -290, -431, -133, 366, 110, 314, -186, -374, 21, 157, 123, 139, -206, 9, -867, 400, -42, 190, -220, 229, -417, 23, 70, 354, 283, -290, -176, -897, 199, 38, -32, 136, 52, -207, -414, -419, 114, 409, 15, -253, -134, 113, -6, -336, 484, -226, 115, 69, -277, -218, 103, 66, -549, 328, 109, -233, -336, 378, 360, -180, -440, 387, 391, -11, -311, 383, -37, -158, -87, 151, -297, 208, 283, -1, 30, 179, 377, -187, 579, 62, 241, 340, -470, 427, -33, -317, 437, 285, -28, -843, -401, 15, 461, -392, -403, 383, -27, 133, -391, -15, 167, 267, -40]
5491d0J13J10n79k11N07R7j52J33NJ33K56n18L5Q02o64P1q32J37J045q14K48k19
5513c37q6N35K62r74K2O11M5M95k44n53P95q83O65n02K37J16J37N9o92J32N85
5534D25m58m0L05k42M27n57K16O67k29q18K66L24j57J92n70L41j74n95P32m20
5554c65K14o75O58O0K12k67K40J38n10R41K03l01l94j96j31n76O29j93M18r34
5574h29N57l94J041J95j234J589j393R10l80l94O67l96J131r99k12m00n03J814
5592G70p54q60J205r97J321J1j030l42R56n22J149m82j46o24R69p14l49N41m77
5611c75K65k99Q44l61j02j046J311K73o85l46O41j95R75j478N48J03J06j74j42
5630a37K5J25L2L2o53N85p8J95Q0q33J075r63L93j7j26J99m22M19l21P16m49R3
$$ y = [-40, 73, 183, -396, -607, -100, -3, -155, -22, -17, 116, 372, -146, -111, 691, 27, 98, -734, -597, 448, -366, -118, -337, -423, 112, 374, -600, -578, 33, 78, 573, 329, -224, 571, -312, 353, -149, 88, 204, 341, 400, -292, -160, 425, -33, -73, 232, -10, 417, -140, 76, 743, 514, -304, -38, 286, 129, 321, -249, 92, -82, -677, 55, -365, -151, -826, -168, -108, 104, -163, 77, 215, -295, 646, 849, 548, 154, -42, -173, -749, -120, -313, 105, -829, -272, -666, 375, 570, -664, 925, -468, 442, 62, -332, 335, -61, 1070, 71, -141, -541, -1044, 770, 16, -844, 361, -636, 685, 696, -334, -676, 280, -242, 907, 425, 279, -345, 624, -90, -439, 102, -375, -110, -409, 435, 74, -28, -1074, 237, 510, -175, -521, 120, -75, 900, -578, -30, 73, 179, 5, -137, -112, 13, 45, 77, -576, 9, -69, 126, 206, -627, 448, -515, -122, -139, -265, -66, -488, -69, -390, 326, -123, -30]
5652c0J08K01l79o5O19j88l09r4J27N04o68j76N46l95j63O1K27k81P99p63L77
5673E8m28M29J3J29k92J64nm00L10j53N61l43k18Q34o54O13j162L75m39O48K82
5694C22l85L12l38N06q09J46k5Q94q90L97r3j14m18M44K4k76K96m79J87O06o40
5715c33O0k32L31q4j7L19P9o47l00J090m15J03j17L64K57r07K61K82j26j37M17
5736B48L7n16L10l45L31L9J3q20Q64l99M80J48r21Q46p03N40L44m62Q8p57N88
5757d7Rn09O72L82r04O25k68J28P85j127K0J78J115j921Q62J67O73p80n25Q86
5777D21o04N95q09Q17K99j142m2R04P9m53j70l38K07n3m92J004O60n25j020O75
5797A3n19L21N59K41K53l62m41k2J54j09j30n66L67M27o33O97q1k67k35k6J59
$$ y = [-30, 78, 279, -100, -165, 454, 266, -43, -137, -10, 494, -174, -350, 196, -199, -362, -301, -74, -355, 444, -319, 58, -370, 59, 72, 201, -91, 73, 68, -332, -22, -175, 386, 43, -175, 659, 5, 618, -544, -169, -608, 40, 322, -63, 249, -89, 417, -392, -246, -271, 623, -267, 130, 37, -77, -495, -51, -27, -303, -7, -486, -299, 307, -333, -273, -505, -174, -258, -275, 44, 123, -524, -824, 266, -149, -46, -163, 201, 458, -449, -188, 94, -32, -169, 248, 285, -231, 79, -266, 65, 104, 117, -703, 161, -238, 242, 390, -531, 315, -388, 152, 496, 34, 122, -635, -47, -38, -547, 125, 507, -397, 228, -40, 88, 873, -254, -234, -56, 1059, -862, 0, 167, 840, 60, -465, 421, -183, 412, -397, 420, 719, -423, -465, 439, 518, 65, -105, -443, -236, -289, -781, 223, 883, 358, -662, 13, -506, -185, 374, 615, 868, 506, 65, 43, 197, 88, -42, -608, -241, 186, -447, 250, 169, -98, -333, -359, -200]
5818b00O6M0J46l88J33K63k55L87O6j0p53L78J61Q7k79Q2l50L49M6j47L13n06
5840c71N03j52L77n32M35k41m4Rm1rn4K6k8K78k51J68j53K61l09k42M59l32M99
5863B56m92K85J10j95K99k42P2k4J7j55J30l3q1J70k56K16j23K49k95K7J59j78
5885h4J77k46K83l02K80j23m3j0J84j06K7K89j68j21M4n3l36L58O08p86Q76j018
5907b70n82J315m13p2j10K62k55L37l79L03j69k22M25k43j3K2K32j84J79k53j27
5928b17K20l19L27j34M24m46Q5R6q7K26l93M04l62n7L0J83J61q2M7k37M43k19
5950I3j7n2M6j08k25L13k09M47m43K51j48K8M51m63K25l85R1J10Q0N7j80nj49
5973a92M71j90K3N1l53L2J03M90m81K56n00M84j9j85O6m1L24m19Pr5J01P9rr5
$$ y = [-200, -134, -94, 52, -336, -203, 60, -195, 192, 258, 248, -505, -127, 34, 121, -158, -76, -426, -77, -31, -178, 135, -371, 132, -20, 357, -175, 260, 19, -25, -16, -57, -66, -120, -94, -122, 156, -95, 73, -80, 181, -128, -370, 89, -243, 256, -236, 49, 159, -36, 263, 21, 93, 69, 86, -69, 61, 28, -53, 117, -139, 77, -46, 203, -92, -65, 94, -84, 93, -153, 130, -172, 108, -15, -58, -68, 116, 10, 37, 326, 158, 37, 81, 28, -308, 50, 658, -128, 748, -270, -852, 463, 50, -22, -132, 130, -125, 212, -167, 136, -33, -255, 170, -73, -86, -64, 168, -16, 163, -90, -217, 3, -316, 11, -123, 301, -145, -60, 36, -51, 175, -218, 186, -176, -233, -203, -20, 141, 59, 106, -131, 312, 93, 76, 24, 70, -38, -263, 50, -159, 288, -155, 96, -52, -24, 427, -36, 189, -196, -105, 5, 85, 142, -38, -43, -192, 279, 89, 112, 163, -190, -158, -55, 435, -46, 210, -290, 194, 175, -10, 56, 15, 339, -80, -73, -168, -67, 12, 3, -92]
5997i2k76L74j29nJ36k22M14k37k3j22J20r1J48k39K04K44m39O20m73J93j92L23
6019B36k12k1J2j04q0L8jK88L24p45L88K45o25P63l64n0j76oj13K82L41p20M93
6042A93k32J22m60Lk03J26O58k05k09p8L07k73N01J03l61L6q7L24j57Q4o8pR8
6065B15l61K99l05N53l43J90j0k11J03j23O2k13J47j60j2L11m25J57J56L03o34
6086c01M04j46L25l82m2J26j62L01j26K81k91J06o5j86J92k59N15l38J84j86R
6107d1L48k97L31l69o0l5K69j27Q0J25n70Q63k93Ml55L66p8j85K54m23N34l84
6129d3L25k77j03K56k41J45M3Kj10J86l41K91n2k23L48m16L68j80p7J15J60J8
6151A94k27J25l78J82J23J08J5m67N25n61M95k70K06k98L30j49n6J10l49L26j92
$$ y = [-92, -368, 6, -123, -128, 8, -214, 200, -37, -60, -182, -62, -153, -5, -244, -40, 204, -235, 385, -88, 105, -87, 236, 24, 3, 15, -89, -169, -131, -132, 156, 480, -265, 123, 368, -257, 506, 142, 92, -84, -90, -203, 79, 420, -300, 193, -39, 83, -377, -374, -577, -451, 207, 2, -207, -285, 22, -251, 250, 353, -8, 28, -59, 265, 108, 192, 124, 117, 215, -146, 153, -152, 401, 58, 248, 238, 27, 130, 7, 69, -144, 3, -157, -169, 142, -283, -126, 30, 333, -301, 103, -43, 282, -100, -142, -16, -178, 123, -3, 278, -13, 93, 28, -158, 34, -225, 290, -48, 136, -50, -41, 307, 10, 341, -28, -88, -123, 146, 19, 99, 224, -346, 517, 224, 228, -127, 239, 161, -24, 230, -193, 341, -43, 282, 5, -98, 158, -83, 62, 105, 107, -3, 183, -158, 133, 81, -142, 206, -210, 158, -22, -99, 16, 176, 194, -33, 92, -286, -104, 19, 127, 142, -325, 200, -361, 134, -136, 70, -228, 102, -47, -103, 7, -342, -16, -208]
6172b08M02l51K07J4l34L73M4j60q6L28l08O9J90j81J77p39R73l76J32n07L47
6193FJ53k07J44k59L04k97L78n84O42k83K57r6p44Q17m73N41k51K54K30n68N0
6214A4k40k33J0L02L27l48K75m34M94K4O14n70j23J9J48k45o5m34N48k09o6L23
6236A31J47J52m80q7M25o35P06m46k32M40k25M02l20L02n53L63j64k48M41l63
6256b44K94k82L28j76Q7n7pJ19j76L60j21n9Q9o4r5j16L44l57J50j07QP6Q1K1
6280I6k22M08l93J51j87J58l3N9l2j5J54j65K22m11L43R2k25M8k02K58j95J28
6302C7r4j56J26j51L39l81L32l50L53k5j08K30k72K44l29K75k30L21L2j91K23
6323B25m06K83j92K36j88J27m04J61K53k28J83l45L25j16K60n3j59M05m46K45
$$ y = [-208, 194, -157, 50, 64, -270, 103, 147, -13, -99, 229, -79, -10, 180, -1, 176, -563, 410, 34, 166, -341, 6, 159, -48, 96, -163, 141, -156, 222, -362, 280, -3, 254, 158, -586, 231, -242, 299, 48, 302, 532, -36, 14, -226, -459, -449, -147, 180, -168, 107, -327, 167, 191, 805, 235, 112, 131, 279, 34, -31, -465, 83, -126, -192, 131, 278, 430, -50, -137, 288, -347, 359, -87, -319, 121, -104, 298, -22, 280, -273, 90, -74, -322, 119, -244, 50, -232, 96, -80, 7, -50, -57, 62, -114, 246, 125, 66, 155, 91, -4, -120, 224, -133, 17, -90, -82, -6, 75, 96, -126, 282, -111, 40, -147, 11, -22, 37, 5, -10, 144, -21, 201, -210, 133, 225, 0, 48, -154, 104, -91, 37, -57, -213, -87, -238, 101, -280, 52, -298, 55, 30, -78, 152, -120, 124, -205, 70, -160, 161, 193, 2, 225, -181, 102, -90, 146, -42, 85, -319, -158, 95, -133, 50, -295, 30, -86, 174, 121, -38, 367, -79, 166]
6343A66l50M54l01O9Q6j66J80k51J79l12K21j18O4N0M9l4j60L18j44N4J71k34
6365iJ25j71M03n57L02j73K47j36rJ19k15L56l30K93l44Q7K15o75O12j63K88k12
6387E3j43j82J67K42k53L53n28M98l21J52qk76K78j13K46k64rM6Pj88J38K94k01
6410a2K12k86K89m52L35j02k06M93l56J28k20L21k16M6J1j35J79l82M70m12L86
6431I1mL5Lj19p4j49K63j1j83L29k32M9o6J49j42K24l18L56k60j58M82m59K94
6454A00l48L76j20N3k6J18k58K8M19o04L26Q6j26L7l6P2m12M64p1J3m1r4m5l09
6478c98N60l65K59j92Q4K2K21j91k7P8j88J80l35K37J51k11L32n58M19PK56K9
6500C70j60N5n79N03j20N4k36L55k43P8K7k3J88k47K43m89K77r5n5O1n6K18l78
$$ y = [166, -184, 270, -31, 38, 124, -42, 138, -113, 66, -246, -25, -143, -79, -29, 20, -14, -174, 144, 0, 54, 225, -9, 116, -55, 348, -209, 93, -80, 167, 31, 22, 141, -74, 282, -48, 245, -99, -12, 203, -472, 140, -23, 265, 53, -90, -272, -105, 137, -116, 237, -291, 207, -114, 38, 30, -246, 32, -81, 165, -99, -108, -62, -55, -243, -105, 189, -12, 200, -86, 203, -249, 86, -16, -222, 271, -85, 43, -177, 144, -72, -26, -15, -150, 29, -353, 117, -295, 91, 87, 122, 125, 6, -68, -217, 46, 35, -148, 181, -51, -2, -68, 81, -61, 163, -155, 201, -59, -217, 265, -194, 100, -248, 128, 8, 61, 35, 153, -105, -77, 342, -262, 64, 150, 24, 61, 25, 97, -315, 149, 78, 91, 50, -44, -89, -398, 162, -203, 56, -136, -52, -30, 191, 0, -27, 51, -137, 43, -292, -55, 96, -115, 217, -341, 78, 85, 341, 370, 210, 265, -314, 189, 69, 123, -113, 242, -1, 77, 104, 81, 269, 22, 265, -224, 53, -42, -97, -36, -92, 126, -252]
6523b52L56k45kK02jp7r0Q0o5K48n71M99k08r8K30j35K22k45K87k58K50k11oJ70
6547H0m3j79K29L5n7j85K34j77J62l27L22j95L9L94m70K17m55O12n56Q46l96l17
6569a87M39j96m7K18k63L51l9n10L59J3k72M43n82k63M86L46q17N27k22K15L33
6590C32r79J509j571L32N53l1K45l63N6q56J073J57l78m4R33q81j85M1L96k56
6610H3J48l27P1M19m63n66R40L73n12L93k18n11L51J68j019R54n01l5k76J293
6630G65m64l71j24r2L92K52k35K4J79j32m78L54J37r0k73k07K16j8O34o98Q00
6651E71p67O27l31k66j31N98J24o75O04n16Q2P23r34L55J24n9l82K02L12J86m71
6672b4k20j37q11J403m13K89J0L61l08J92k11l7L31j176J043k44n04O72n8Rl11
$$ y = [-252, 104, -141, -143, 59, 58, -19, -109, -29, -94, 154, -417, 82, -126, -224, 6, -129, 93, -152, 135, -123, 127, -84, -90, 80, 37, -142, 87, 122, 65, -120, 114, -63, 99, -228, 94, -101, -62, 332, -138, 79, -376, 236, -320, 526, 130, -187, 252, 56, 9, 227, -36, 315, 276, -234, 125, 138, -134, 309, -273, -536, -50, 296, -521, 6, -216, -1, 332, -647, 862, -709, -377, 176, 145, 390, 27, 83, -773, 300, 457, 79, 35, 968, 87, -98, -57, 339, 83, 231, -96, -25, 394, -69, -635, 305, 678, 166, 559, 341, -170, 181, 349, -670, 284, -217, -252, -528, 765, 301, -70, -194, -286, 106, 358, 123, 147, 326, 194, -284, 70, 207, 117, -156, -363, -147, -165, 469, -229, 571, -196, 431, 100, -166, -297, 301, 425, -250, 354, -162, -80, 643, -291, 64, 188, 129, -253, -51, 261, 447, -24, -244, -381, -1192, 211, -202, 87, 97, 458, 150, 342, 131, 94, 425, -751, 292, 48, -456, 216, 158, 167, -144]
6693a44Q60j304P49k24K03l00k66K63MJ12m2j14J43J84L06j21p05K84j59K50n9
6714h0J79k9O0l24O45p28P44q37J29K02j59M59l92q2K42L91k98k97L00R6j62K64
6736C23j81o75N53J98n9m50K36M66n31K08k18K67k08N55q36K26R8N84o94r9K23
6757a4j24L9J42J85j14m33Q10J63q32K08n19K19K21M63j192R09JR0O8o46O41p91
6779e06Q33m73M93N5m65l61J082L31j039m7K71K01m5m1J07o86J77O25R1l39J20
6800C84j145N20L77m9N76j173M67m01K94m04J17Q3J47K38K76m23M18J51l53k33
6820a33N84o07R1r8QK62j00Q8lk03N46o89j45j73O00K60k35p94L82N91p54P03
6842A81o96O52m42N18o73L81L56o19J66R24q17P8k43p9M98j41N22r29Q81n54J0
$$ y = [-144, 716, -588, 161, -63, 140, -160, -426, -163, -159, -47, -89, -203, -60, 124, 430, 309, -396, -112, -271, -21, -80, 99, 70, 130, -194, 451, -277, 467, -370, -241, -39, -198, 261, -131, -213, 29, 420, 122, -175, 125, 221, 59, 323, 142, -533, 20, 218, 159, -291, -55, 411, -120, 88, -130, 137, -71, 484, -352, -126, -28, 556, -138, -237, -14, -138, -99, 43, 228, 114, -319, 491, 654, -178, 30, -489, -270, -49, 414, -778, 131, 132, 222, 290, -356, 285, -506, 327, -146, 347, 402, -63, -424, 658, 989, -50, -97, 174, 375, 330, 289, 396, -290, -113, 512, 603, 264, 384, -761, -241, 136, 87, 663, -510, -43, -444, -150, -554, -437, -354, -207, 31, 307, -116, 302, 453, 100, -133, 451, -156, -65, -163, -155, 107, 7, 95, 92, -111, 435, -254, -399, -572, 28, 288, 53, -741, -359, 232, -522, 181, -515, 137, -305, 213, -460, -79, 277, -342, -176, 748, -69, 9, -234, -313, 185, 44, 566, -363, 518, -36, -26]
6863b6n50N83M79j29m91k07O07q10L79m96J101Qn19J55L94n14L20m15O54j100
6883e77O27K2k30K50o40M98N97q56L29Km16K05r3j60R96o85k1o04Q55K15m68m75
6905f29J77M99j65O8K78k65R1J34j38m55P09n14K87k04L47K70o42K42j45M6J23
6926A14J81o59M58o0n2K83n99K07L73j73Q5L33m91r6K71k4k45J09j13M0K67l19
6948a10K58M7m33L55k18K86l64J01L04k24K42k87N9N2N2m5Kn4k81O19m94K18j47
6971f2j07K80l72L61k31K9J16P8o4P5j19j71L62k78K10l09L45n5M1J46l74Rm3
6994a33L94l96j16K70J05k44J9J88k36K46j28J66j16N6R8k49J69l76N57j86j92
7015a04J58P0m6j89L21k35K93l65J63J23k30J49k57L36j82J40k96J62Q9l44L49
$$ y = [-26, -576, 7, 486, 357, -134, -341, 266, -544, -165, -661, 440, 448, -71, 84, 478, -36, 284, -131, 523, -577, 50, 72, -158, 92, -548, -50, 547, -309, 20, 22, -394, -189, -282, -442, 554, -131, -152, -756, 99, 314, -154, -629, -452, 47, -118, -50, 228, -37, 54, 188, 50, -405, 304, -210, 77, -127, 220, 490, -152, 90, -55, -9, 114, 295, -364, 94, 34, -18, 265, -334, -127, 246, 73, 158, 491, 0, -96, 175, 151, -94, 15, -98, -58, 209, -110, 148, 195, -238, 117, -101, 185, -179, -78, 226, 2, 244, -43, 16, 68, 120, 75, 77, 23, -258, 361, -133, 85, -62, -169, 111, -261, 100, -131, -102, 14, 92, 28, 103, -16, -187, 175, -103, 107, -202, 143, 88, 129, 275, -99, -90, -133, 261, -135, -251, 19, 124, -120, -101, 87, -149, 97, -31, 135, 19, 75, 173, -76, 93, -283, 274, 88, -104, 54, 124, 78, -111, 210, -25, 268, -97, 66, 189, -41, 108, -149, 187, 5, 145, -151, 11, 100, -244, 105]
7036A05l29K78j05L8J1k02P6J28L0p9K1j21K15k07m8J90k74K66j64J33j10K46
7058I8M9l11L00k01L2J1L33l67n0K33j48MQN6k49L43j68lP5k43M23l29K27j60
7082c7L26k45N0P0m17N69m89L86m63J2L03o7n6NK05p8L83o23r8L88j60O9j60L11
7106A84l01J05l1j26J83k63K72j84L70k86J90k44K18qk74L04q3j4kJ08j12j25
7128a19j95K59O2m61O00k93J92m6o7K65m83L06j23L21l89L8rJ99N3k2R0m40M17
7151A55QJ08m11J76Rj21K29k18L2J39J2k78Q4J34l58O51o03N30l99k0M01l70M55
7174C45n39L12k50K21M5l50J67o6J87k4j4l73J77L91l13P2O7p6j41K08j44K2L31
7197B55r2n4k00K58m11J19K34l43L03j1J97l11R5j94J67N1j51m2o4M20n41K93
$$ y = [105, -224, 54, -51, -13, -2, -204, -128, 0, 30, -49, -28, -149, 66, -141, -189, 1, -273, -7, -171, -38, -148, 98, 147, -164, 136, -65, -33, -22, 311, -56, -106, 127, -21, -17, -9, 47, -202, 141, -27, -30, 45, -198, 225, -104, 123, -37, 289, 44, 94, 164, -253, 316, -173, 213, -250, -238, 65, -2, -58, -53, 152, 74, 457, -166, -264, 124, -36, 33, -127, 184, -117, -12, -43, -169, 14, -249, 23, -161, 209, -77, 113, -131, 87, 79, -195, 109, 26, 12, 10, 118, 6, -119, -314, -55, 7, -454, 146, -147, 45, -1, -68, 197, -286, 20, -103, 218, -171, -133, -142, 57, 110, 88, 178, -262, 155, 163, 271, -140, 36, 45, -76, 153, -65, -33, 106, 118, -160, -76, 58, -300, 351, -252, 278, -121, -141, 260, -110, 345, -194, 118, -132, 89, 134, -216, -49, -115, 72, 48, 34, -339, -162, 229, -84, -12, 55, -21, -162, 46, -98, -76, 255, 163, 109, -91, 167, -244, -125, 109, -234, 69, 58, 255, -56, 39, -155, 12, 63, -88, -130, -194, 226, -315, -22]
7219b2j39K0P0Q3Q1j34K37k52J83j39r0K66k41J09k31K47o0J91N9l14m1%L46n82
7243c53Q31p23L72mJ21J47k26m5k07J99L22l96L52k42No16L27l8J45k14J44L22
7265B23l96L08n29M46k20J56Oj6k5R3J74l21L2J34k34O7N9K57j10K25o34J90j01
7288b16J45K12q9r5o3J24j6N19n47o6M1k8M52k43l28K00o9j7J17Q3j73K52n79
7311c84M80l9J14n9n07N20q1Kj03L88k48R1j37M1m11P8K25k76K42l80L62o9k5
7334a76M50k18r6J36O8J4k22J43j26K81n68K39l5p8L06N8j82j45R5m20M23r1k5
7357a69L4l1J69J9m80L89j55N5J88L6m50J85K73j18n9K52o07M01j24J45J16m53
7379c84J77M83J93q30j10R2J91N70m09j09J43K00j41k13Q65j048N06J26r3j52
$$ y = [-22, -161, -141, -71, 12, 93, -41, 196, -56, 127, -12, -102, 164, -77, 32, -199, 48, -12, 179, 238, -76, -117, -117, 229, -353, 478, -245, 127, 123, 244, 391, 165, 120, -87, 112, 434, 38, 390, 148, 153, -463, -136, -174, -29, -243, -99, 223, -173, 135, -394, 52, -168, -12, -6, -22, -47, 46, 220, -101, -69, 65, -169, -102, -43, 214, 104, 329, -305, -115, -216, -71, 141, 52, -43, -106, 18, 2, 521, -26, -92, -51, -79, 373, 130, -198, 2, -67, -84, 33, 116, -57, 195, -384, 96, 57, 171, 112, -395, 125, 44, 46, -57, 331, 83, 174, 37, 78, -333, -255, -30, -306, -64, -444, -82, -151, -176, 274, 56, -40, 96, 164, 178, -44, 99, -27, 254, -314, -75, -110, -188, 118, 176, -6, -151, -56, -476, -53, -144, -169, -135, -166, 3, 22, -458, -69, -224, -169, 19, 55, -395, -210, 63, -55, -114, 138, -469, -68, -192, -47, 69, -384, -207, 276, 469, -361, -471, -379, -188, 382, -27, -136, 7, 207, 66, -147, 718, -330, 176, 302, 209, 57]
7399E7J83l14k41M34J82k49j50L94l93J0j4R6J91r8L50q59K67N7J77j10N05p36
7421b61K62m02O14rO2j94l27m38M88m14O8K42P22q19M54q74M9O88j08Q66j203
7442e34K31P25j094J540l32n51l10P32m65P41l20n22L55m49J003r33N16j42P4
7461B65n37N19l6k0j97l15R91j073M32o0k13Q60o6K18j082O88l33J13Q1k10L43
7482C68o52P24j1k89l79n3K15n7n6J16M3k82P37o77K48jK70j02o07N59l25J99
7504a2K21o60K71J79j04k83L84M80l00k32M02n9o04M49J7l67Q8J15k78L35k09
7525a67M23K59k53j30m5J32k07j77M68m18P8K2j56J09J51j57OJ82p28N92j98J38
7547g6j33k03Q65n71J06k08P2k98N84k35J08j43K2j25Q8L44m15L01n37K04N80
$$ y = [57, 240, -74, -315, 119, 301, 52, -98, 296, -97, -87, -101, -5, 186, 88, 438, -421, -154, -97, 80, -30, 475, -261, 1, -401, 213, 204, 266, 72, -255, -693, -205, -619, -551, -309, 413, -406, 48, -826, -777, -89, -197, 669, -534, -303, 422, -672, 868, 536, -15, -325, 407, -58, 683, 363, -159, 196, -253, 750, -183, 333, 191, 265, -272, 247, 211, 191, -6, -321, 670, -403, 29, -31, -244, 616, 550, 768, -314, 374, 41, 154, 235, 25, 368, -284, 440, 429, 140, -239, -292, -77, -134, -190, -74, -31, -313, 424, -253, -5, -6, 264, 162, -445, 114, -211, -12, 209, -451, -180, -1, -105, -388, -4, 476, 176, -56, 346, 287, -317, 132, 149, -218, -130, -15, -293, 42, -167, 256, 515, 262, 132, 87, 219, 12, -165, 303, -115, -37, -15, -171, -62, 89, -68, -62, 120, -608, -16, -214, -76, -209, -412, 453, -118, -12, -220, -148, -446, 138, -97, 11, -132, -110, -235, -147, 197, -218, 83, -454, -250, 330]
7568C30l63J92k90L16l90J31L22k38L11n34L61r1j20K36p5j95J31K14j92k03J96
7589D9j37J70j10M3j4Q9n5R1k39J01Q3j43J13j91M23l54K53k19j29K68l54M16
7611A54k9K2m1j54K07k23J48l2j50N5K00k99J0L02l2k94K75n8l04J77Q0J65j74
7634Ej7J63l03J00K1M3j24K53o7k09J92J85j11m20K22k07M83l91k2K68N6k32l5
7657a47P2J58k64L25q52Q45k20L0K08k24j88J99J08m76N97L41n99J78m18M00q7
7678a4k82O3M45k51K05q9l19K47J29J91m42q45N31J76J37j04M78n11J242q59r2
7699C6j20k20K41J07k70O41m91l36P19l08k10J54l77O68n22L80l5J31k35k7q6
7720a60K93J7j74n4J33J94j47j27J01j94J48o6j07mJ54J44l6N7k68J31k07L70
$$ y = [330, -33, 159, -131, 185, -205, -74, 248, 10, 321, -213, 148, 57, -63, 173, 98, -97, 34, 248, 56, -147, 49, -88, 82, -28, 15, 1, 90, 35, 126, -113, -12, 71, -72, 41, -150, 273, -81, 172, -47, -176, 92, -262, 154, 125, 147, 106, -48, 159, -64, 84, 52, -98, -43, 157, -142, -132, 170, 138, -156, 119, 61, -243, -66, 14, 179, 5, -12, 151, -152, -52, -31, 12, -112, 141, 74, -135, 57, 242, 131, -289, -67, -274, 209, -182, -204, 64, 120, -112, -147, -75, 83, -181, 144, -708, 137, -83, -53, 155, -69, -257, -58, 50, -426, 171, 512, -87, 91, -327, 73, -14, -296, -233, 212, -39, 166, 77, -242, 5, 134, 325, -117, -962, -431, -255, -118, -222, 256, -255, 987, 128, 36, -84, -304, -63, 44, -226, 415, -76, -412, 307, -1, -211, -57, -434, 234, -288, 92, 57, 188, -47, -74, -160, 133, 150, -24, -78, 55, 249, 102, -25, 76, -118, 30, -36, -143, -147, 7, 151, 115, 172, -96, 35, -172, 198]
7742A98k40J04k54J52M5k78M45r6j32K09j74jj15K63k73M36r9r4k47L14j87j33
7764a57OM7J13L7j43J9k1K52j65J68k12OJ01j75J97r1J71l11K15r4p7L29K0j48
7788H7l80K80j61K00k11L20n22K90K03j62L38j19k16l10L69j35P7j5k07K60n0
7809f4L32k59K6O6k33l4K7L04m02K37k59J95r9k3K94j86m8Q3q2j00K19O4l21J02
7833a61Q3M00m95L15j39KK6j19K57m69L19k75N02l78J93J03k49J3k71L81j09o0
7855a31K54k10n1J29M2j40k8J32J03Kj00L1k96K59n4L32n61K89m1J99P3l49O6
7878e0p5K73l02J18l4K6L32n37P29q16K07J60l92J23J44L01m12K24L7M8p7j91
7900a64M17l19K06l91M53m34J31Mj1L13k45J62p0J49m82K46J2K3P7p7j66J65L39
$$ y = [198, -42, 62, -192, -40, 5, -273, 172, 76, -56, 153, -21, -22, -137, 126, -147, 289, 190, 96, -151, 163, -24, -157, -151, -104, 9, 46, -97, -78, -99, 153, -12, 156, -56, -50, 51, -124, 73, -18, 153, -158, 57, -37, -114, 215, 235, 87, -293, -13, -174, 26, -185, 135, -387, -97, 106, -56, 282, 163, -53, -363, 6, -129, -52, -67, -274, -14, -64, 268, 9, 35, 101, -132, -166, -139, 165, -237, 0, -259, -64, -163, -186, 108, -78, -126, -43, -125, -225, -6, 58, -263, -161, -78, 322, -173, 142, 3, 5, 31, -88, 169, -300, 19, -256, 246, -132, 61, 164, -85, -72, -343, 38, -71, -131, 123, -87, -138, -9, 33, -107, -135, -3, 100, 102, 2, 33, -263, -4, -58, 274, -287, 2, -39, 160, 233, -116, -50, -125, 148, -154, -36, -70, -44, 288, -249, 480, -336, -129, 31, -361, -238, -94, 207, -205, 19, 56, 104, 27, -164, 253, -66, 140, -251, 202, -232, -101, -97, -108, 205, -40, 122, 52, 201, -281, -35, -23, 0, 77, 0, -166, -1, 338]
7923C38k92j28M7J88N6l71K26j82N32k33k28K98k23Q3j35Q0r7j60K77K5j74M31
7945C58l03k81L48j3j02j19J53J19j00K04m49L84O6k63l60K37k41L13k77K82k74
7966c18M4P29o15j4N77n47k06P95n67L74R3m61l69J58K2K14L52R0j82n05J31J65
7988d0l02K1K71l37L78M55N7k17m30K36j89N84l44N5M15l18O2k53l40Q78l1o93
8010h2K8L23o27N68n3M57k45q52O22MJ1l30qj62J02k06Q56K66r62O68N5m73j6
8033e6K62n44P08m43P6q2O60m47j6Mn93J013l31N52o90o25M58n0j23m78M71N90
8055C16P7m69K92m5J30l70N10p46P51o72O82j275M89Q02n3j385Q35q8Q45j004
8075c78J9l00M31J16O18j137J269m93k23O7l00o24J384n45N60J55k28J43r59O61
$$ y = [338, 46, -82, -35, 153, 209, -162, 64, -118, 414, 181, -47, 251, 28, 111, -24, 56, -41, -201, 76, 101, -73, 358, 55, -226, 122, 109, 7, -112, 41, 160, 60, 264, -185, 199, 265, 2, -358, -121, -362, -49, -326, -44, -318, -274, 455, -160, -174, 403, -144, -350, 445, -122, 252, 345, -116, -485, -327, -305, -91, 261, 351, 169, -336, -205, -40, -342, -321, -50, -387, -9, 446, 503, 286, -144, 92, -97, 487, 143, 198, 613, 295, 357, 104, -236, 642, 611, -82, -54, 269, -358, 210, 157, 614, 369, -483, 139, 143, 154, -176, -184, -346, -244, -450, 406, 672, -290, 378, 433, -40, -56, 206, -338, 370, -73, 3, -79, 581, 134, 118, 122, -471, 542, 211, 763, 73, -552, -94, -144, -267, -745, -274, 316, 393, -76, 216, 171, 301, -69, 441, -305, 446, -226, 456, -819, -330, 472, 419, -966, -131, -219, 626, -378, -359, -659, -228, -112, 506, -631, 638, 145, -78, -11, -311, -935, 449, -96, 464, 619, 391, 534, -425, 236]
8095B36r27J246J9n96o94M81M16O1l64J52j93P16j644M42N75J09Q4j31k34J260
8115A014r61j21N36p96J030j205J032k58L8n21Q5o7J37k46L52K30k38O3Q0j43
8135D1J72k49p36N76O02m4M1r88l48K82P56J97p79N72O1j37N01j060J615q97n8
8156A20o3j10J59k76L99p42O99k36j29O89p49L32l26J98K02m94N69l66K51q9N4
8177I2j08j2J99l61N6L28k11L25n55N31j19j46j43K30
$$ y = [236, -691, 555, 574, -22, -716, -235, 181, 242, -122, 30, -163, 553, -1091, -649, -74, 35, 119, -12, -246, 1014, 53, -68, 468, -328, 702, -503, 529, 271, 309, -212, -127, -194, -57, -303, 49, 279, 41, 104, 184, 41, 213, -36, -772, -196, 406, 362, 403, -585, -933, -651, 105, 302, -477, 95, 156, 19, 520, -540, 1075, 178, 120, 57, -53, 106, -170, 229, -513, 186, -50, -179, 510, -239, 93, -233, -35, 167, -327, 242, -124, 127, 38, 92, -16, -28, 171, -190, -134, 194, -17, 308, -247, 284, 165, 19, -124, 106]
8191A06
$$ Imaginary data points
##PAGE= N=2
##DATA TABLE= (X++(I..I)), XYDATA
0@%%%%%%%%%%%%%Qj6J6j6J6k4L2l4M2n0N8p2Q8j03J19j37J55j79K09k39K71l04
35a60L43l88M37m90N48o13O81p56Q40r32J031j140J259j387J529j687J860k047
53a072K253k485K745l034L361l738M172m680N285o021O938q120R713j2005J5650
68H962k2718O3713j43415M9163J53404j08478m4453R4588k5711p0437O7204k3611
80a789N6713q3957l0605Q7681L0037j16529J5848J05275j15905K8470N8392l8022
92d391m6975L9517L0764k2195J2975o7573P1961P823l3321Q344J0994j4520j1622
105a8219N7611m2394J2872l7621K0950N9489n5942l0336L6589L2354q2099P1660
117B4914k73p1808L7247L1029j1699l1401K6270l7932N8844j2115m2865M7822
$$ y = [0, 0, 0, 0, 0, 0, 0, 0, 0, 0, 0, 0, 0, 0, 8, -8, 8, -8, 8, -16, 16, -18, 24, -26, 32, -40, 48, -55, 64, -73, 82, -97, 112, -127, 144, -160, 183, -205, 232, -258, 290, -323, 358, -398, 442, -490, 541, -599, 660, -727, 802, -885, 975, -1072, 1181, -1304, 1441, -1593, 1768, -1970, 2202, -2478, 2807, -3214, 3724, -4396, 5317, -6688, 8962, -13756, 49957, -93458, -44295, 109109, 631, -43822, 50766, 25055, -45382, 21822, -1789, 54924, -29033, -59638, 28043, 58080, -58449, -42601, 62674, -53231, -24761, 33631, -4391, -51366, -11849, 18915, -3280, 9695, -57878, 14083, 21906, -11415, -3071, 7923, -6597, -18219, 39392, -3002, 9870, -27751, -6801, 52688, -3254, -33590, 2999, 35353, -46746, 24914, 24641, -47167, -9920, 21109, 9410, -21991, 4279, -33653, 25191, 13076, -29789, 18033]
129A8033k4586j1190L5803K7416r5436N3872L3910n5947L9619j815l5965l13P2634
142E6035o1052m590K6355k9100K3401n70J259l3078K3637j2624L0455p878n5399
155d3149M8901J718j1733q283L2942m9506R441N0167l3070m932j4668L2726r242
168A312P238j5170K529M301j5577M8485l7489j2011Q472K5576k1043K213J1326
181A0162m2704M2993k765n072j7961J0935k940P435J7948m1543K4702j3056J5954
194D088O129q293j9129R475L2193l4976K5219j9689l189J3107J5209j3790j8437
207a2083K4964k3992L2559j1000j4140m617J2546J0570j5941J1828k9552K6174
219G316o401M497K027j9854K683J0391K6018m6405J6635L107k731O627Q98m34
$$ y = [18033, -6553, -17743, 18060, 45476, -49960, 3912, 37822, -18125, 21494, 19679, -16286, -16599, 56035, -5017, -9607, 16748, -12352, 11049, 10479, 11738, -21340, 2297, -10327, 20128, 12250, -43149, 5752, 7470, -4263, -12546, 20396, -29110, -19669, 30498, -2572, -7504, -22172, 10554, 1312, 8550, -6620, -4091, 210, -15367, 33118, -4371, -16382, -7910, 17666, -3377, -1164, 10162, -32542, 10451, 7686, 2614, -15347, -4412, -7352, 83, 18031, -23512, 1190, -11866, 4088, 10217, 1924, -17205, -7730, 24463, -10513, 14706, -4983, -8172, 4935, 20144, 6354, -12083, 12881, -11111, 21448, 10448, -3692, -8309, 4237, 14807, -1134, 10694, -18858, 7316, 915, 5412, 7439, -12415, -9732, 659, 26677, -19728, -3093, 14, -2717, 3910, 4808, 4374]
233D374k7705L1822m721J0448k5104k317K3618r794N054j1768J2916k9056L0387
246H154O897k3824m3j925K0580j5146J3728k4868J0303N561p59J1471k4150Q152
260e869m264K5636j8825M82k145n711K5281j3149K715j7068J8930p489J1765M15
274A0704k5218J6971j829J6836k0806N635r533R538J1391j5860J0024k2639J8532
287C746J059Q249j9668k693J6214j0806J9193j9765L183q506J8569O4j0081K600
301A358j5809K7035j0592N653j4545L070M372K933R689k6592J4353q569J5928
314H284m813n701n789k397K2407j6826R495j7869Q490L432N164q50j7636J3668
328i41q013K1933j5798k808j342L964J1451j0568P570k1128J9435j036M184o488
$$ y = [4374, -23331, 8491, 3770, 14218, -10886, -13203, 10415, 621, 5675, -6093, 6823, -22233, 8154, 15051, -8773, -8816, -10741, 9839, -5307, 8421, -16447, -6144, -583, -1342, 10129, -14021, -5869, -10133, 15503, -3322, -2840, -4985, -10696, 14585, 1436, 4151, -12917, 6013, -1476, 10289, 10704, -14514, 2457, 628, 17464, -3342, 2293, -7240, 2298, 13689, -2171, 7853, -14786, 3746, 4805, 13054, -6614, -9307, 6907, -3899, 15294, -4471, -1288, -9794, 8775, 8839, -1242, 1358, -14451, 12584, 1992, 7645, -6900, -3830, 542, 3475, 13164, -13428, 925, -7644, 8284, 3471, -2230, -8019, -10416, 11991, -4835, 4660, -13209, -4719, -1287, 3877, 3027, -14609, -941, -8954, 12979, -2819, -5627, -6969, -3005, 8446, -2122, 5448, -15680, 3755, 2719, 6903, 415]
342D15r907J1155l455J7333k1959O012n188Q718N972j0013L441j5175K0808o761
356A396Q881j5663k635J3469k475P070j7952J2019j1563J4655J139p822k832p121
370i434K3321j1617L954j4925R533K138p83P842j8637P700n919K0158j2432m914
384d015j668R59J4673j3784P158j5047J1312j133P006l878j5911J4708m579J4053
398I854j5141K710o397Q222J0007j4243O059j2602J5601m829Q155j0644o390J1794
412B156l040J2335j8904N002m580J4705k816r821P282j0968J3610m173J0475k0281
426i018J869J4088j408M69j5685J4490q612J1703n018m88k685q876K0383m339
440F873j678k0624K1052M186j1390L792k189K069j3120K6226j0655j0673k138
$$ y = [415, -9492, 1663, -1792, 15541, -6418, -406, -5594, 3124, 9096, -917, 2524, -12651, 8157, 1396, 10277, -5386, -8021, 5448, 2973, 10043, -7909, 4110, -7453, 7202, 8341, 519, -2313, -9434, 13887, 2270, 6224, -8701, 832, 2970, 2187, 10029, -8608, -908, -6827, 13331, 899, -4015, -5683, -4724, 9949, -3835, 3323, -11724, -412, -1545, 5461, 1583, -14328, 380, -4199, 9854, -5287, -2577, -8974, -752, 9255, -4988, 1071, -11531, 4070, -759, 7396, -3248, -9638, 2156, -884, 11451, -7453, -2451, -7031, 7674, 4858, -4963, 2319, -8649, 4961, 788, 11263, -9018, -7149, 6939, 5531, 6000, -9685, 4805, -3807, 7896, 2878, 2390, -295, -9171, 11212, 6873, 5195, -15429, 5623, 9809, -1581, 2211, 22, 2091, -11029, 15197, 4542, -6131, -8269]
453h269J0357J0026j7154M041p319J6173j2899O266N778j6194P36R749J6815l2579
467a4473P666Q748J51l372O3M666j7626J8500m189O119j2089m446J2001L307N49
482E575k0331J9176q306L358M159j460q240m219K2968j4376M633r109L209M845
496A882M618k988j4964J8204j0375Q804r62k327r258N597J6121j6776O105j0249
510f568Q954J705L787q613n965J4210j2589J3903n280m857q828J5938N911j8050
524f342P374o736J1031n893O017q370j394N494n268J6771j6747l997K197J8812
538A2949j3145j0278J6589j1435L629J413J0658k1814L118J3715k979J85j3955
551a1350J1796k480O596q962M950j051j2362K0485j662p462j3466K1585l353o455
$$ y = [-8269, 2088, 12114, -5040, -999, -8318, 7855, -5044, 1222, 7000, -9194, -8458, 1291, 18106, -14473, -6807, 1941, 2092, -1280, -1217, 3449, -14177, 4323, 134, 6253, -5836, -10282, 1719, 5026, 5575, -14756, 4420, -3886, -528, 3631, 2171, -6069, -10288, 12680, -1696, 2937, -6172, -2963, 1882, 6500, 3512, -11452, 6752, -3623, 5181, 4219, 1892, -7366, -1769, 14352, -2424, 3681, -6568, 2386, 4091, 7878, -735, -6700, 7510, -5079, 8824, 3544, -1313, -10141, 5797, 11708, -6342, 1032, -5704, 5327, -566, 5451, -2919, -4313, 1181, -4087, 12684, -4063, -8060, -5863, 12949, -196, -10474, 6115, -5320, -1691, -278, 10380, -11434, -8316, 5399, 2420, 2605, -11350, 446, -2034, 4562, -4400, 550, -501, -12863, 7622, 5960, -1502, -14968, 6617, 3264, -3191]
565c191P439q818K964k071J5387j4587J246j199J950J0677j0447R89p135J3831
579G035p268N185l090q388R068m42P759j5206P490n511O731L981q626O48o193
594f827J5441q810M243o737j161O073j66N202j5266R320n761R989j813o929j034
609d236N72J2937j4171P933q026J348L475M500j474j4161J1703k958Q694q978
623b842j769L564o31M689n290P350j7582J1100P277k663q829r8J1188j0643J1300
638F121p385R36n277O475P683j0122j38o051J6553q728J828l047j831L868k80
653F05Q714j4878N187k542R847k632p285L401l922J1229q317N549r227L275M376
668C380j176M092j2791O885j518J0249j0606j172L068l776R515o518L572j1863
$$ y = [-3191, 4248, -4570, -1606, -3677, 11710, -2877, -1631, -2830, -880, 9797, -650, 339, -6796, 7035, -233, 4952, 1862, -6526, 2542, 2100, 9859, -5347, 2143, -3368, 3363, 7344, -1282, -634, -6827, 8614, -196, 4047, -2690, -3851, 2222, 2056, 7258, -8008, 1312, -4449, 5540, 3727, -3202, -4236, -3664, 9273, -4898, 3035, -4991, -3643, -168, 4332, 2858, -11303, 400, -2558, 6136, -2842, -4611, -1047, -1678, 3011, -2279, 5071, -12511, -1411, 5866, 3203, -5626, -5724, 5464, -5179, 6121, -1264, -328, -5605, 870, 8553, -1569, -1707, -7758, 8795, 67, 1895, -1152, -2983, 885, 605, 9319, -5559, -372, -2914, 6933, 4301, -2984, 417, -3505, 7724, -593, 4956, -4271, -996, 3380, 2204, 6296, -6495, 390, -1128, 9121, -1485, -2657, 411, -3365, 6150, -368, 3204, -8659]
682h659R728J641m69j534q832J0685m546Q149r125J615l766L630Q535j0832L114
697f66o847J0934l849L188n224m440Q799m189Q939j2372M120k408P538l19p204
712d000M357q147J3638n272K144p641K874M452j977O641j3424P245k298P835m999
727A428l477K144k900J0427q240M380r331N942L270J21j501q504J0247n965Q582
742F623o012j795j439K619P694r753M057q688J0223j598O74k840m851O840l528
757a774R394j2463L362j168M149K669p515L199p497J2145n057K208n828n76O879
772B127l419O104j1813O116k936P141j794n223K451l960J0938p432M285q689M315
787a789M824k373K353r382P862l865Q668n990k236O62l99Q884r008M395q142Q111
$$ y = [-8659, 1069, 2710, 2241, 707, -8125, 2560, -1986, 6163, -2962, -1347, -5113, -1483, 7052, -3780, -666, -7513, 3421, -428, 2760, -2464, -6904, 1895, -2294, 6645, -5727, -1607, -4015, 3523, 3204, -4000, 357, -7790, 5848, 576, 2720, -4921, -2047, 2405, 428, 7069, -6355, 890, -1408, 6427, 1428, -2049, 95, -2805, 7622, -618, 3762, -5569, 373, 3643, 3764, 2263, -6241, 4006, -1959, 6623, 611, -1184, -2623, -4, 7690, -2063, 1994, -6694, 3529, 1931, 2605, -235, -5086, 1754, -1774, 7620, -4843, -1481, -2649, 1500, 4169, -3346, -147, -7644, 4501, -556, 1652, -4176, -4752, 2127, -1292, 4812, -7001, -885, -3821, 3320, 1526, -3697, -1246, -5206, 5732, -1700, 2585, -6104, -1789, 3035, 662, 3015, -6367, 1495, -2370, 6298, 308, -1928, -1266, -1665, 7219, -1789, 2606, -5536, 2575]
803B575nJ13o10p550Q303l496Q862j0291K015n85K466M561q120M986r040J0953
819E137l695Q48l215m308Q413l444O372j1658N122j924N471K23n327J968n903
834e920J1253n356J665p901L583N314m268L899p634N213m442R294m542l637J094
849b385j033R380q308L098o692N886L15J86K160r088P247l071Q477r811J175O49
865a815P20O968q734N354q556R589j742L84k570n038Q511l157O430j0984N431
880G91j168L038K387p029L602o676J1839o073K504m923j307O117j671L797j1120
895e892P973l401M283q74l408L51l197J1091q078K697n734L024L728j223n71p050
911f281R731p317P107k089l514k698M392P692j2534O490n654M669R03L08k210
$$ y = [2575, 2570, 2683, 2073, -5477, 2826, -670, 8192, -2099, -84, -669, 1797, 6358, -1762, 3224, -5816, 5137, 1442, 2290, -925, -5233, 3180, -264, 6108, -5550, -428, -2352, 3119, 3342, -1985, -17, -5920, 5333, -23, 1642, -6259, -2676, 2638, -1630, 2269, -5365, -152, -4594, 4700, 158, -3479, -2385, -3418, 5962, -2346, 752, -5940, -54, 261, 447, 2607, -6481, 766, -2305, 6172, -3639, -2464, -1815, -1095, 5873, -2861, 2493, -6063, 3526, 1784, 2168, -402, -5440, 3071, -86, 6344, -4640, 791, -377, 2661, 5048, -1981, 1621, -5055, 6784, 711, 3215, -1708, -3015, 3102, 1431, 5228, -5892, 2081, -1320, 2963, 2089, -1319, -968, -4165, 6926, -1152, 1545, -4189, -1165, 2563, 1340, 769, -6281, 3450, -3867, 3240, 1151, -2363, -5061, -669, 7023, -5511, 979, -4675, -6, 897, 1205, -1005]
926a005m148O670n627J0695r692j176K715M749r74o689P650r104P981q37J786
941B994o305p15P849l987N760j0813N604j003L833j323l329L393o720J0295l573
956A960L81p035N283L919n010N094q441M558j806P559o748j171K382m193R427
971F159n606K49o358R199k341j972M206r267O341p3M674r521M329j773p19Q780
987F307q536O17l137Q816n876L173j252o676Q719k490L555q164M612l526N199
1002A341K620r297M904k949O988n429M388n649q20P023k632K552q935P418k668
1017a145M546k181l461K342l075Q446o378L470o324L526M536k977k57n539Q865
1032D394o590O850l125l331P63J970M933q310N208p315P106L40j864j368k348
$$ y = [-1005, -5153, 1517, -4110, 6585, -3107, -4283, -1568, 3181, 2207, -4482, 3168, -5936, 2045, 1208, 2994, -3311, -4026, 3823, -164, 5596, -5217, 387, -616, 3217, 1894, -1435, 1958, -4762, 5533, 1960, 2341, -4694, 589, 4508, -502, 4592, -3849, 709, -1097, 6462, -286, -1457, 925, -3268, 6159, 553, 802, -5556, 3643, 1302, -670, 3536, -5731, 610, 537, 5211, -4310, 19, -1754, -2473, 6307, -2229, -1612, -4749, 4067, -1809, 1364, 112, -6564, 2155, -335, 3220, -4944, -332, -3858, 1341, 3961, -5336, -432, -3381, 3607, -1822, 2566, -3083, -3903, 3120, 488, 3040, -5895, 1523, -1145, 3401, 1220, -2241, 101, -2974, 5472, -906, 2564, -3760, -234, 4302, 1325, 1068, -4471, 4394, -2196, 4654, 1529, -1802, -1039, 931, 5864, -2446, 2762, -4553, 2553, 2893, 1029, -339, -2687]
1047b687N477m915Q783r261N19J769K123O98n159L621o508J0020m136J63k287
1062a780j189M543k204M764r964N620j109L337r12m270J938k981Q629o534L027
1077I15m875K132L864k455K383p309O360l034O030m623k100K830j905O637o175
1092a325K537n753O387l06o22N15n989P414k993M853o798J874l74Q30N098p750
1108b402L824m365P086k793J044k390l304O995l891M362p533L368q28L700J66
1123C039o080M319m486P117l804J383m917J962L668l033M129q480N927k075M927
1138C596m534j601K268k901P962p120K702m321L976O08o20J041o777P496l760
1153a985M910m581m76O80J35N441p499M357n240N998o03l45j300l097O088l515
$$ y = [-2687, 2790, -2125, 6658, -2603, -2084, -315, 1808, 2506, -2653, 968, -5540, 4480, 344, 507, -1780, -2969, 1574, -630, 4134, -5830, -210, -1319, 2018, 1106, -3164, -1226, -4207, 4422, -2112, 915, -3960, -1828, 2036, -419, 1964, -5345, 1015, -2019, 4011, -612, -2712, 118, -1787, 4850, -1325, 1212, -4541, 1846, 1540, 918, 1433, -4556, 2858, -135, 4718, -2080, -206, -580, 250, 5348, -2402, 1422, -2943, 4143, 1350, 2394, 4, -3300, 3695, -196, 4166, -3367, 1, -827, 2873, 3039, -3041, 1278, -3208, 3909, 105, 1488, -3429, -1467, 2201, -832, 3297, -5183, 744, -1331, 3596, -938, -2539, -271, -3172, 4790, -2330, 372, -3949, 27, 635, 15, 1056, -5721, 1775, -1985, 2925, -1656, -2132, -1452, -1317, 4124, -3375, 982, -4258, 1740, 1137, 792, -508, -3605, 2483, -1032]
1169a032N200p234K432K17K086J484n149L272m670Q386m452R64k324j058N106
1184C228k665L298p919N708k254L297k20m618K545k399O880n824K766m689K554
1199c12L478l073J785n897N758l004N148m647j522K255j552N374o037K667n058
1214d637O158m09j586Q20n063O278k898M681o694J733L31P62L644o333L044l522
1230c691O472l009N48k114k002O701l882L997o691L664j160L194l8m800L727l722
1246b806P088m167R44l219J909L358l024K982o861N229j476L383k947j982K152
1261E63j981O906o629K328l353L361J117j447M28n314O738l436L941m369j40R31
1277c56N32L572o541M014m550N229o88j147j011k296N367l734M686o788K729L34
$$ y = [-1032, 4168, -3066, -634, -417, 1669, 3153, -1996, 1276, -3394, 4992, 540, 1504, -820, -1878, 3228, 563, 3861, -4058, 1650, -604, 2693, 2473, -2145, 400, -1999, 4881, -943, 1823, -2866, -312, 3166, 93, 1878, -4019, 1739, -1265, 3883, -764, -2286, -31, -1583, 3791, -2246, 421, -4637, 1521, 1112, -474, 346, -4717, 1561, -1337, 3344, -3350, -1617, -1286, -524, 3120, -3213, -169, -3691, 2781, -228, 320, -1794, -3796, 2905, -977, 3020, -3671, -7, -1167, 2027, 1989, -2811, 916, -2806, 4282, 115, 1059, -2160, -251, 3107, 83, 3065, -3796, 1433, -43, 3340, 393, -1589, 563, -1418, 5488, -1141, 1187, -2166, 1195, 2312, 865, 1293, -4021, 2717, -719, 3222, -1147, -1287, -356, 176, 3748, -2793, 1221, -3329, 1900, 1212, 65, -946, -3242, 2125, -1609, 3077, -3711, -982, -648]
1293f48Q98J647m825K951l745P118l713Q0j426p68M435k571K193n905M433j612
1309a458K891q6l713K319j987N652n014J922l009K688K594k796J427m817N346
1324A959l115M800l927j896K956j155L569m592L211m125M414n6j060o96k925N636
1340B998l318L851n294P85J453N24J998n161L074m469O687k366j20j844r30M264
1356B132k996M163p337M011n32J980q0m125K835l127O418m392K89k659K894K267
1372A741k923K663o123N241j516K321k442j087J973k236O046n405J389k038L633
1387A237m81j155J609m901O014k525L233m866J195K09L92M036o186K193k427N253
1403B830j207j30p86k849N425k780K472n131K626p86J376J981n250L091l052M792
$$ y = [-648, 250, 1897, -2928, 23, -3722, 3396, -317, -237, -1663, -2431, 2004, -567, 1626, -4279, 154, -1458, 1433, 1347, -2366, -47, -2034, 3618, -1396, 526, -2483, 205, 2799, 3, 1430, -3387, 1959, -1156, 3644, -283, -2179, 777, -378, 3191, -1401, 1810, -2315, 2099, 2043, 983, 287, -2638, 2998, -320, 3531, -1763, -978, 475, 999, 2997, -2164, 910, -3559, 3128, 762, 642, -1202, -2132, 2132, -864, 3299, -4038, -27, -559, 1421, 1341, -2784, 51, -3076, 3342, -1050, -761, -3420, -526, 1741, -1182, 1481, -4642, 599, -917, 1404, -1038, -2125, -152, -2388, 3658, -1747, -358, -2396, 1237, 756, -399, 1210, -3691, 2323, -202, 3031, -1835, -640, -431, -39, 3997, -2189, 4, -2423, 2830, 1623, 1493, 707, -2142, 3283, 503, 2975, -2156, 470, -316, 1060, 3041, -2209, 882, -2170, 2622]
1419B622k404R42l044r4M944m142K840l834K816r95K431j073l880L107j245M040
1435C031m516J910l510L033J948l244J270l365M421k303M773m442j695K761j015
1450i43L541m530K792m443M733L3k113M36k320M487k867M188n327R24J933k17
1466C07J567l791K646l650O086k421j038k22n13L059j724K861o694M528l33Q09
1482A477L34k952J576j921N993n127J530j720O95K511j894O53m475N408k653K822
1498B257k031j861J970q24L922n256K571l165L344N59j615K85l556N002k797L093
1514A898m207J314J65N57K300m680K693k183M120j994j59r30j321M351k504J633
1530A053k621J368p6M09J020m064M287l971L216K15o39j943P57L589l442K998
$$ y = [2622, 218, 1160, -1884, -1978, 2966, -1176, 1664, -2170, 646, -349, 2082, 1009, -2871, 236, -1009, 3031, -1485, 425, -3085, -52, 1896, -1348, -78, -3443, 978, -1325, 3448, -994, -2689, 72, -943, 2598, -1932, 860, -3583, 1150, 1183, -930, -494, -2814, 1673, -1194, 2994, -2333, -1409, 524, 307, 1874, -1917, 729, -2921, 3165, 744, -294, -516, -1029, 2030, 306, 3167, -3527, 1001, 668, 1477, 1811, -1141, 435, -1486, 4507, -620, 910, -810, -115, 2396, 502, 1155, -3320, 2088, -565, 2257, 226, -1635, 335, -489, 3433, -1823, 748, -2417, 927, 1486, -129, 156, -3400, 1602, -1195, 1898, -2309, -995, -830, -273, 2027, -2653, 40, -2143, 1977, -17, -176, -1106, -2427, 1924, -580, 1053, -1568, -200, -276, 133, 1153, -2911, 1376, -2595, 621, 836, 197, -1746, -989, 2600, -842, 2156]
1546B156m690L517r42K249j556j831J708j067M864n491J457j688K669Q15k246
1561g6J575l793M095j619J643k626K63Q65k24L621n917K950k343L219n64r23l11
1578a65k389N065l407L134m187J199O48N53Q97l906K793k916M994k599n07l02
1594a095o61L564k799K102m458L435n70J139j79k935K206j304M344m108J464j522
1610a377P28K473k401J356l742M574k360K925k292j574K384j258L755m649K297
1625H39k484L063J30j661R74l038M311k057K472l744P16J172l50K198m215K578
1641I04k210L672j672m91m51j341M014k734K223m072K471m30J031K39l541K636
1657B48j869L933l162P02j283M38K613k431J647m012L725j280J848j279k032K053
$$ y = [2156, -2534, 983, 41, 2290, 734, -1097, 611, -456, 4408, -1083, 374, -1314, 1355, 2170, -76, 1499, -2294, 1801, 182, 1825, -801, -538, 327, 103, 3724, -2193, 757, -1586, 1633, 1069, 146, -165, -2554, 2511, -896, 2238, -1949, -750, -102, 451, 1348, -2558, 235, -2681, 2313, -286, -793, -1095, -1756, 1808, -991, 1111, -3347, 88, -482, 657, 478, -2457, -251, -1555, 2789, -1319, 145, -1377, -649, 1824, -577, 779, -2963, 1611, -749, 2176, -116, -1690, 694, -564, 3191, -1458, 839, -1645, 1418, 1548, -113, 861, -2177, 2134, 77, 2549, -1195, -479, 693, 343, 2541, -1674, 904, -1306, 2366, 694, 203, -248, -1589, 2425, -309, 1914, -2158, 313, -117, 914, 1153, -2388, 248, -1621, 2312, -850, -148, -1431, -993, 1620, -811, 836, -3176, 549, -731, 1117, -162, -2194, -141]
1673a41j166L676m059J671j934K088Q50j765J075l277M386k042K142k743J17J379
1689B57k96K316m318K595k237L191l52j316L21j865L960k624K219l387J703J64
1705C31N02R50l360K563k240L829k018o27n01L0L092k779K069l857K622j52R20
1722A374n67k382K152j633M092m074J029j378J478J526k343J643l549L769j827
1737f90K011k142q98J919j027L045m101J848j961K834k75j687J005k326L989k509
1753i65K311l063J042Q80m31K010l991K457j969L516j887N4k55j360L779k575
1769d47K092l674K370j11Q78M03l484K689j617L541k822O76j181N28K404k651
1785d06J825l807L919j108J140j285j509K183j843L521l885J778j564J753M83
$$ y = [-141, -1307, 2369, -1690, -19, -1953, 135, 985, -780, 295, -2982, 1404, -638, 1504, -1239, -1122, 257, -39, 2277, -2041, 554, -1683, 1508, 1156, -160, 161, -1704, 2256, -368, 1851, -1536, 167, 331, 833, 1783, -1577, 986, -1254, 2575, 557, -70, -571, -541, 2551, -228, 1841, -2016, 606, 454, 1374, 807, -1575, 577, -1056, 3036, -1038, -9, -1387, 91, 1617, -726, 917, -2632, 1137, -690, 1321, -821, -1719, 200, -827, 2218, -1883, -35, -1996, 838, 563, -1124, -119, -2445, 1544, -965, 1346, -1717, -675, 205, -226, 1784, -2207, 250, -1719, 1797, -90, -36, -291, -1651, 2128, -447, 1645, -2029, 341, 230, 1108, 1511, -1973, 716, -901, 2640, -182, 494, -687, -159, 2245, -406, 1419, -2388, 1531, 423, 1563, 278, -1231, 952, -891, 2630, -1255, 523, -1041, 712, 1195]
1800A195j269N14k849M208k178J703k337L3R12k18K479m559K558j687K495q09
1816A91p86O8j455L918k919J999l223J740L23L62O71l247K715j806L153k275J61
1833d10q36N18K769l214K188l222K735o72J381j172k001K914j879L225l192J308
1849D40j585J606J574k584J771k813L123j383J716k425m80K240j380K422l247
1864a005J707k092L034n32j509J333k657L680j970J585l085J190P98o23J819l366
1880a693J987k003L512k101n78L07o75K634j926J396l266K771m82K40O01k849
1896b125K062j254L360l444J150p47L05J929j776R50l116L855j835J344n34j743
1912a619K179q26K344l753K117j692J599J046k017R60k071L537k299K028k119
$$ y = [1195, -74, 440, -2409, 1799, -379, 1324, -1013, -980, -68, -286, 2193, -2366, 192, -1495, 1000, 191, -595, -527, -1982, 1936, -983, 1016, -2207, -467, -144, 218, 889, -2358, 357, -1449, 1704, -571, -410, -1246, -728, 2041, -1173, 1015, -2207, 528, -144, 1237, 65, -1936, 978, -901, 2324, -868, 440, -1145, 461, 2035, -549, 1222, -1591, 1532, 149, 1865, -560, -1040, 1200, -180, 2242, -1005, 702, -1390, 1644, 1112, -397, 936, -1721, 1959, -11, 1574, -1511, -321, 477, -146, 1673, -1693, 294, -1709, 1803, -298, -876, -569, -1244, 1390, -536, 860, -2406, 365, -117, 123, 724, -2125, -63, -1317, 2043, -1401, -251, -998, -693, 1236, -540, 410, -2706, 1149, -686, 658, 124, -1619, 560, -266, 2078, -1675, 442, -1250, 349, 1395, -622, 338, -1733, 1804, -495, 1533, -586]
1927e86j7J299l15J801l754K704k188K976j036j148N47j126L005k765K303k789
1943a089J723p6J34N23l217L174k393L074k467Q50p03L77J702k459J824l199L546
1960A324j560P26m57j492J462j072K945k621N79q33J413M00j764J881l097L335
1976A169j436N59j392K08J840j781K542k960J189r89K114q94q92J117j912L289
1992A771k089J538k750J455P51o7O07k839K826k386L098j823J65m6p62K469k245
2009c27J580l040K643k96M66j73k183K247j440L093l243J142j003O40J417j948
2025d25J180k374K810j693J471j305r42J954j292K381l399K112j898J754K64j685
2041a087R71j752L184k222J623k279P22J179o98J563l125K220j621K568j189o81
$$ y = [-586, -603, 696, 381, 2182, -1572, 1132, -1056, 1920, 884, -264, 283, -843, 2162, -603, 1700, -1089, 634, 558, 692, 1215, -2002, 1172, -1221, 1853, -614, 236, -467, -90, 1612, -847, 977, -2222, 1324, -236, 490, 33, -1459, 3, -1069, 1876, -745, -166, -999, 414, 814, -950, 931, -2166, 1169, -267, 292, -1100, -892, 948, -833, 1709, -1251, -62, -1051, 1063, 169, -723, 394, -1518, 1771, -318, 1220, -1530, -75, 676, 609, 1216, -1623, 1203, -1183, 1915, 92, 257, 211, -551, 1918, -327, 1253, -1787, 856, 560, 1026, 853, -1330, 917, -523, 2570, -673, 469, -534, 106, 1523, -425, 755, -1619, 1191, -502, 969, -336, -1278, 676, -616, 1765, -1634, 478, -1420, 334, 598, -1087, -116, -1868, 1316, -906, 717, -1562, -840, 339, -359, 1204, -1921, 299, -1322, 1246, 57, -624]
2057f24M28j390L090k364K030k792J861J36J5M93k571K386j602K762j970K29l96
2074b79j04K272k456J854k936K512n84N60n58j220K128j878K850k987J226p94
2090c94Q04J011j761J219k543L234j747J095j409q6J316j257K003l086K107j334
2106h28J876n74j196N10j495L284k450J739k430J232M18k38R09k659K410j968
2122a460K783j860R4l9m49J993k066J552k466K325m85L41p1j661K126j797K920
2139A780k761R62m74L07J304j806J432k319K652j245J058j156n83J754r81J860
2155A784k929J890j229J503k68j137J009j758K798j749J135k010P90Q98n90J265
2171A402k776K047j446K034j298l02M00j054K472k132J204k272J994j31r0N11
$$ y = [-624, -196, -1586, 1504, -860, 1170, -1622, 239, 375, 390, 883, -1688, 698, -904, 1858, -112, 117, -279, -383, 1889, -567, 1287, -1649, 863, 279, 839, 281, -939, 1189, -689, 2161, -826, 400, -394, 410, 1421, -340, 879, -1664, 1570, -177, 918, -491, -577, 739, -518, 1485, -1601, 506, -828, 1048, 474, -722, -212, -1707, 1577, -873, 866, -1564, -332, 86, -152, 757, -1902, 508, -1460, 1323, -537, -443, -482, -931, 1062, -1004, 548, -1918, 407, -78, 263, 192, -1469, 657, -1140, 1780, -981, -19, -493, -186, 1118, -688, 744, -1575, 1077, -168, 890, -266, -849, 905, -76, 1784, -1145, 745, -484, 1019, 751, -386, 623, -1135, 1663, -86, 1049, -961, -171, 727, 137, 1402, -1374, 673, -773, 1261, -37, -339, 61, -993, 1479, -653, 551, -1721, 273, 142, 52, 563]
2187E63j949K014j666K400k194O95n93n0J867k082J319k295K447q13M74m22j280
2204a565J944j466K296k189R51r69Q08J367j768J208k179K940j983J502j303l06
2220g12J461j422J881k557J699j037J520l50j269P94q11K851l150K264k547J558
2236A73P02q45R57k278K397k066K616j615K13l88j76J877k115R95k214K573o68
2253A38q5K34j928K065j343K550k643O18p6P32J27q76J037k599K812p15O22j522
2271h52j51J262k59J302k357J469j473J375j84n61P42j923K941j789Q98j610Q56
2288c14O91o37J230k304J858j305J705r48j47K46r88K650k235J035j663J755j78
2305D51L2K13j654J917j464K092k144P43k91m1J663j709Q58j858K197r88N94q02
$$ y = [563, -1386, 628, -1038, 1362, -832, -137, -730, -780, 1087, -995, 324, -1971, 476, -337, 137, -285, -1565, 379, -1087, 1209, -980, -29, -998, -190, 1177, -591, 617, -1562, 1378, -605, 897, -406, -712, 749, -673, 1208, -1349, 350, -687, 833, 483, -786, 8, -803, 2048, -1102, 1162, -1385, 173, 875, 30, 987, -1291, 1106, -960, 1656, 41, 254, -134, -310, 1567, -548, 447, -1767, 806, 138, 53, 287, -1641, 424, -919, 1631, -1012, -394, -470, 262, 389, -487, 550, -2049, 763, 48, 670, -852, -1003, 259, 0, 1302, -1055, 414, -1059, 316, 132, -429, 313, -1610, 1331, -458, 440, -1170, -314, 377, -260, 970, -1334, 524, -781, 924, -24, -171, 75, -913, 1737, -498, 537, -1126, 629, 451, 483, 696, -958, 959, -505, 1587, -557, 186, -105, -146, 1517, -192, 666, -1192, 1005, 17, 611, -191]
2323a91q50J795r27J374k564J755j144J108O07j849J146j369K358k023J555j550
2339g69k39J761r34J376k622K377k601J932L3j153R70j132K585k343J362k192
2355a589J666K65m61Q80k213K370j904J923j608K61N58o07J547k045J958j885
2371h84J530m83J19n6j432K327j656J713j739Q40q45R05Q73j581R24j770J901
2388F86p13R34j455L94J392j640K008k862J534o43R52K3q98N37r07J801j475J013
2406F81j554P89M84m11Q03k388K045j296J408j030j08K63o38K228k236J062j296
2423a194J385j76K01n3j594K088j258J535j758N43p2L01Q93j759J419j527J873
2440H47j072N73l78p45J452q47J418k183J197o93Q92O48j790J214j347K303j637
$$ y = [-191, -1041, 754, -173, 1201, -1363, 392, -752, 356, 963, -886, 260, -1109, 1249, -774, 781, -769, -1008, 753, -181, 1195, -1427, 950, -1651, 281, 314, -839, 131, -1001, 1584, -759, 603, -1589, 77, 342, -119, 761, -1452, 918, -986, 937, -671, -410, 148, -459, 1088, -957, 1001, -884, 646, 163, 282, 226, -1206, 1121, -535, 1178, -561, 279, -566, 339, 1212, -369, 555, -1215, 686, -27, 907, -548, -154, 1238, -402, 1606, -1256, 278, -365, 587, 610, -288, 249, -658, 1143, -332, 681, -873, -84, 400, -11, 792, -1596, 449, -847, 561, -469, -577, -314, -952, 1276, -960, 102, -1194, 191, 15, 216, 163, -1431, 657, -601, 934, -824, -281, -353, -52, 841, -918, 501, -1026, 847, -225, 348, -30, -775, 677, -170, 1248, -935, 262, -431, 461, 1109, -681, 533, -814, 1489, -148]
2457a48R44r20m7R61p82Q39j895J827j043J367n69r24Q82j275K110j550J037k217
2475a403J752Q1m16J33r32J659j953K033j478M77J89k56N26j101Q58j827K006
2492C48l43M05m26r02J399j338J669j866Q42n48R91K56j369J227j710K072q46
2509a39J76m98Q8R52r74J642k325J304m78Q39k21o27N87j318K133j333P44q12
2527b60M49N04m88O74k048J920r79J263r93j35N80p75J482k110J567j629J608
2544F30k30j39R0r64J307j152J176j505M89j68M35R64j095M49j433J486j56L63
2562E47j064n09J079o63J530j931J172r20R89o91o48R66j304J643m65Q21j406
2579h54L00O74j087J235j600J420n18J300m95j517J023L54L49j217J408j632J703
$$ y = [-148, 796, -124, -171, 790, 8, 847, -1048, 779, -264, 1103, 534, -390, 492, -783, 1327, -223, 814, -1403, 349, 430, 14, 147, -785, 874, -1079, 954, -524, -47, 142, -114, 412, -689, 169, -1658, 348, 5, 410, -16, -918, 481, -857, 812, -1054, -212, -760, 231, 487, -882, 345, -1365, 707, -139, 37, -461, -373, 579, -395, 1247, -1078, 226, -252, 587, 366, -261, 326, -992, 1141, -192, 552, -260, 189, 693, 205, 879, -1169, 751, -228, 1035, 42, -93, 487, -288, 1194, -916, 651, -978, 630, 400, 261, 351, -613, 694, -458, 718, -787, -298, -466, -31, 933, -162, 287, -1146, 340, 184, 547, -517, -1026, 53, -610, 920, -1011, 161, -759, 230, -461, -1109, -143, -1447, 196, -269, 552, -854, -554, 120, -967, 268, -1332, 88, -430, 870, 375, -1142, -119, 235, 584, -633, 775, -857, 846]
2596H46j555M67P56q34O10p43K084k188l86O06N61J421k176K098j859P69m21P74
2614H30k90j534O29Q0J318k333O92k51K049o08j888K637j936O55r62Q30M17j031
2632f96L507l397K80q38J192q2M26q67j128J945j201J850j288R28j686M69M24
2649a62o87P38n03J486m33j40l30l77L56q07J921j852J468j335R72K24m59Q9n66
2668c97N80r5Q03j559Q94l79n99K476k025O12n35O89o84N58j11n58N96M05J3j056
2688c72J65M37L25O9p43K83r39K225k035J024p56K26R7l7Q46k026J719j162J773
2707A119j080q66J235p64J313j467P63j109J107j46m12M04j015J466j071R48j066
2724f41L71j04K69Q07j471R73r27J187n68K19m6j032J909j553J091r36N84l12
$$ y = [846, -709, -242, 514, -320, 290, -453, 1631, -557, -943, -337, 224, 1645, -531, 1567, -292, 477, 56, 830, 540, -994, -365, -285, 1033, -1300, -608, -859, 1190, 582, -1306, 1331, -605, 50, -912, -82, 335, -696, 2811, -586, -306, -1144, 48, -34, 392, -475, -1603, 342, -859, 991, -297, 631, -1055, -586, -162, -849, -111, -614, 872, 439, 299, -31, -408, -52, -859, 1062, -790, 678, -657, 315, 539, 80, 169, -397, 183, 88, 891, -668, 226, -153, -752, 1724, -301, 311, -224, 465, -219, 339, 228, -330, 266, 671, 684, -372, -207, 230, 555, 624, -119, 164, -775, 1450, -585, 439, -317, -91, 6, -31, 815, -1211, 508, -654, 1119, 39, -827, 408, -356, 957, -510, 253, -856, 251, 105, -307, 97, -918, 548, -523, 425, -641, -270, -374, -105, 702, -769, 204, -723, 464, -104, 115, 69, -963, 946, -607, 484, -452, 132, -180]
2742a80L65L51j033O48n21J130r10L61l52n9J368j168N22j329J229j072J116j88
2760B78r46P09j87J134j054k38k88J627l12n58J27j151J833j080J371j626J90
2777a71N4m0J033j545R39j145Q88J21j37p7o23R17r24J311j107N20l26L12L72
2796C72j159P99q34J479r97M47k51m81Q98p14Q96j313P83pL57j04p30J062j204
2815g01J678j498Q38n27J98L66m81O62j467J691q23M94l74m06M77j30R91j392
2833d04Q42r70R47J5j58l9o47J140o98M55r23P23k49J64N34j195R01j060J061
2852D39o43M93l81l83J172r92O36j036J120q22L68M04r58Q73p47J052j153P51
2870A93p37K03Q63r66Q90j386J239q40P43k30k63M65p32J143j420R92n99M39O69
$$ y = [-180, 185, 536, -497, 151, -370, 760, -150, 211, -141, -200, 1168, 0, 522, -807, 422, -650, 466, 278, -668, 41, -146, 988, -66, -304, -592, 1035, 723, 165, 292, -859, 974, -106, 1265, -361, -171, -117, -157, 876, -669, 270, -875, 13, 134, -3, -80, -703, 214, -710, 601, -506, 14, -312, 0, 372, -787, 12, -822, 657, -340, 107, -144, -625, 273, -441, 455, -858, -75, -82, 275, 171, -559, 503, -701, 977, -521, 317, -210, -12, 354, -127, 535, -932, 759, -64, 430, 56, -350, 127, -3, 988, -404, 438, -532, 415, 430, 272, 233, -414, 726, 28, 483, -440, 283, 34, 198, 732, -463, 438, -622, 439, -204, 289, -92, -475, 697, -295, 341, -695, 425, -397, -29, 375, -583, 290, -457, 595, -558, 193, -544, -341, 522, -444, 446, -940, 299, -541, 202, -28, -291, 174, -558, 585, -835, 157, -442, -3, 666]
2889F66q92N04j013J257q04J023j060K27K16j66O24j024J035j168J145m67k3p9
2907Am79J034n17N72j032P20k44J55J92q56Q94r53J386j004M02l67q9O54o70J116
2927I15j694R56l84N03l37k50N29q90J334j172M94l81P7O42m69L86j300J376p87
2946d52Q58q75L7M22n17J026j438J134q73O94j31m5J77q00J278o60Q19j017L23
2965d0J76j47M98r80R02p14R28n86J96j26n97J123p46P83j232Q71m32M64j55m32
2985b46N39p27J101q48N81n59J96N76o98K05n87Q21o32R43o46k47M22o35Q97q83
3005d27O34o36M38j11j47N22q83R75q53Q72q20K30Q5k16O92o53M24p89R39m24
3025a48Q5m6m30R15p71P39j050O69j11J43J27n04O95p06Q73n89J43j91J5O42o07
$$ y = [666, -226, 278, -735, 522, -282, 741, -319, -92, 124, -42, 582, -442, 593, -575, 570, 103, 80, 1, -478, 556, 39, 611, -421, 299, 55, 210, 402, -454, 440, -513, 873, -131, 271, -96, -185, 469, -201, 915, -779, 177, -207, 296, -41, -291, 238, -652, 682, -490, 4, -377, -300, 342, -127, 259, -1041, 335, -452, 406, -469, -432, -10, -527, 499, -939, 195, -678, 16, -115, -160, 17, -783, 495, -165, 654, -363, -40, 136, -11, 487, -493, 409, -305, 623, 37, 233, 107, -490, 633, -113, 670, -562, 309, -123, 341, 186, -246, 293, -434, 667, -181, 400, -159, 37, 613, -85, 120, -467, 354, -278, 665, 19, -228, 194, -441, 456, -427, 207, -429, 9, -102, -249, 273, -610, 365, -488, 384, -436, -206, -121, -337, 355, -298, 126, -663, 276, -148, -63, -109, -539, 376, -395, 344, -706, -37, -148, -5, 122, -382, 313, -393, 480, -109, 34, -157, -142, 500, -107]
3046a07O98j176R25n65O87l41l55M29n94J367j340Q68q48M32L91n36J68o50J200
3065F53r38Q88p06p9Q44r65J000j315J117r65L01J35l07M45m93P24q95N86l42
3084c12p8P7K46P67r94m6R6O22l50J32M0l98L87p76Q52o56l7J123q89p3j27K55
3106a39M7J266j116j025P42K53Q33j046O26j615K160j098P05rj175O79l23J272
3124A037j344M94l49J82j37R7L69r28R95q76R02o14j29L46N1M26j122R15n58Q58
3144F15n00k22J4j99O58o60O96q06M44j72J27J91n70L84k69Q54r82K96o5J99K27
3165B60o10Q00j128P19k51L29k17n20P54p57J023p11K87m46N35J54o11M21o91
3184f60J084k60L63r87L33K87k94O15p82N80o72R66l00j21q0m97P68o76Q73q44
$$ y = [-107, 591, -585, 340, -225, 462, 121, -234, 195, -399, 968, -372, 496, -352, 80, 471, -65, 103, -547, 653, -285, 603, -103, -182, 662, -303, 697, -618, 499, -466, -165, -30, -337, 108, -385, 339, -556, 30, -312, -390, -313, -67, 700, -294, -340, -244, 378, 28, 160, 200, -198, 189, -587, 265, -391, -428, 695, -194, -267, -394, -139, -92, 1174, 58, -967, -225, 28, 861, -185, 441, -1174, 986, -112, 593, 584, -591, 88, -235, 1037, -307, 187, -162, 20, -117, -20, 349, -579, 416, -460, 442, -172, -301, 45, 96, 522, -600, 315, -243, 615, 115, -107, -93, -292, 366, -294, 402, -404, 40, -132, -5, 186, -384, 0, -269, 585, -397, -101, -166, 33, 260, -350, 450, -678, 41, -210, 119, -98, -618, 136, -621, 402, -309, -22, -468, 67, 221, -390, 31, -660, 424, 164, 527, -460, -127, 160, -134, 481, -301, 279, -393, 573, 273, 152, 72, -425, 343, -333, 540, -304]
3204c04K47J02J63K90n32L13l91O56o16K48k08o0O52p31N20q42O50l73N48k2p56
3225d46O93n88J156j010K63k14j3L09j89K24p98P90n16N93l88j81L52k42O75j064
3245e94Q18o56N71k59J3J69o39Q91o03N89l25nJ88l76P02j127Q26m98M14m6J24
3266A77j33n38J076j062J115r31N02k50K97J1n77N69m68P37p94O09m29J74M2k21
3286i4M33q30R97n65M47n28j03L53m58R24q71O16o15M35K08o18M99o46Q07o47
3306b56M67l86k6L17k17N23p26M47m86P58l63j04K00m62O77o23N19p43M08k10
3326b86K14K08o16O37n83P24l94Q6j27M8N26r78Q99q06Q76n82M71k30L1J5k81
3347a48M74o00M87m88M19J7j67L85p91Q96o31L86k13j48L92m20P52r37P08o73
$$ y = [-304, -57, 45, 208, 498, -34, 279, -112, 544, -72, 176, -32, -92, 560, -171, 349, -493, 157, -216, 332, 310, -446, 247, -341, 815, -195, 68, -146, -159, 150, -39, 185, -613, 177, -339, 254, -134, -315, 37, -205, 470, -594, 224, -432, 139, -120, -107, 62, -577, 314, -289, 300, -25, -30, 158, -218, 484, -643, 183, -315, 99, 53, 177, 44, -494, 582, -480, 635, -296, 206, -44, 253, 264, -313, 256, -212, 525, -269, 340, -89, 85, 127, -94, 339, -491, 506, -59, 388, -140, -243, 110, -348, 576, -295, 321, -294, 141, 349, -269, 230, -416, 391, -256, 211, -175, -201, 116, -101, 422, -304, 143, -343, 415, 52, -52, 148, -314, 363, -260, 259, -484, -76, -286, -72, 136, -480, 157, -426, 298, -96, -10, -137, -89, 437, -541, 358, -448, 428, -154, 317, 87, 118, 133, -148, 326, -274, 213, -275, 144, 161, -6, 379, -412, 484, -147, 239, 26, -122, 270, -150, 602, -335, 373, -300]
3367c00N94l96k6L70o78Q10o08O80o20K67r5j06L48q98Q64m67P25o28j1l9j9M89
3389B56l49J12m07K79k70L26J67m62M51m03M72m88K52R1j94M72n33O16q72Q93
3409D09o25M58l78L6K85m65O84n97M84l91J54R1p6j27m13Q87n51M63l58J0J20
3430A00n0J71l92K58j34M29l67Rj32M9K57m13M49n70M15o5J78J77n70N22m11N18
3452D28o66l6R0J83J25j96K91o11O95m12R6R8j59Kk28O30n48L27j24J2M6j78J51
3475A6n61P68n36M18l11O0J73j99O35o70N25p06P06l44p5O8l42P22p32O88k59
3496D4K66p2J26m2n79M44k57M57l10j09k7K24K01n06N10o12L90Qj40N3k47K71
3518I3n09O08n04M63l30J42K21k46K88m23L34j90K05l79%M02k42M73m86Mk11M99
$$ y = [-300, 294, -102, -128, 242, -436, 374, -234, 446, -174, 93, -2, -108, 240, -658, 206, -261, 464, -164, -175, -214, -233, 256, -93, 19, -388, -109, -379, -53, 114, -348, 103, -300, 172, -316, -64, 27, -167, 305, -228, 388, -484, 409, -216, 242, -136, -100, 185, -280, 404, -193, 291, -100, 54, 145, 69, -58, -471, 416, -135, 328, -30, -20, 100, 50, 221, -171, 87, -47, 382, 15, 24, -108, -59, 198, -215, 234, -336, 79, 14, 192, 369, -201, 321, -90, 428, -238, -274, -184, -1, 124, -72, 219, -392, 303, -109, -13, 85, -74, -72, -300, 330, -218, 109, -15, -3, 43, -135, 16, -545, 223, -313, 105, -206, -146, 27, -172, 463, -207, 318, -388, 318, -26, -101, -33, -375, 347, -385, 303, 44, 310, 238, 364, 322, -257, 187, -70, 387, 77, -32, -59, 165, 366, -140, 370, -242, 148, 156, 16, 69, -178, 93, -416, 192, -312, 151, -179, -37, 184, -62, 226, -197, 137, -53, 152, -227, -227, 175, -67, 406, -80, -76, -287, 212]
3540B12j0o62N48o07R61p50K99m96K68N28j39J14r63P71l76N02l71K18K03n31
3560b81L30l38l12L53K67o8K38J82o75O08l79L08l11L33l14K03K39o26M38q3k1
3581I1P3Mk77P1K04j93M25p17M29l32M44o7l89K78k26L39l48K94k56J49R6j71
3603g9K83m18K00n3L60l56J13o9l00M16m82O01n34K68j40M6L58l03K64m52O70
3624C93m49P1p3p7J18j81Q9k42M44j60J38Kk45J08pL37o43M31j34R3K4RO3l42
3648b33N00m41J87R8k52L79l56M52n21M66l75K42o7LJ21l66O30m56L2j77J95j5
3670D6l2J72k56L45m41K85l23K66m1m4n4l0K93m81M56J1k76M4k26M82m8n1m85
3693c88M60N4o3l6l51L88m43N02o0n5r0j45N47n21M57l67N6j31J43M4j4J64m87
$$ y = [212, 202, -460, 88, -519, 442, -308, -9, -505, -237, 291, 152, 266, -697, 74, -302, 200, -171, 47, 250, -281, 49, -289, -601, -248, 19, -49, 189, 371, -304, 304, -75, 233, -78, 255, -59, 144, 383, -243, 195, 112, 91, 164, 168, -109, -38, 166, -27, 398, -319, 110, -222, 222, 155, -234, 44, -182, 157, -191, 103, -153, -4, 92, -79, 204, -214, -14, -67, 293, -63, 50, -19, -319, 97, -385, 216, -318, -50, -190, -144, 214, -89, 175, -277, 393, -56, 15, -58, -135, -17, -198, -109, -351, 93, -67, 71, 73, -172, -64, -71, 266, -377, 54, -80, 13, 37, 46, 109, -233, 267, -174, 13, 111, -141, 238, -118, 334, -187, 279, -96, 146, 79, 82, 203, -163, 467, 11, 43, -134, 61, 46, 14, 186, -70, 275, -166, 119, -204, 62, 21, -23, -77, -107, 186, -295, 161, 172, -104, -60, -286, 196, 148, 97, -388, 72, 126, 63, 27, -324, 64, -379, 123, 63, 8, -82, -227, 320, -201, 256, -111, -55, -186, -43, 1, -13, 151, -336]
3716c36P57j97j2j07k50K47j37J37l44L19j15L47m38J67K44n38M64l42L34l53
3736a53K03r6K36Mm45M74k69L03l43J11j00J52o8j34J67k08M84m10KR6j65O2j63
3759b60L71l64J97j54J42J46j13J58n64P80m37K1q6K24o2K4K53l27N3k35L61o8
3781F0q1R1k59K78k52L78m17K15Q2k21J39l33M90l34M83n29J14J14j09L39m96
3802b48L17k85N06k56q8J78k50L50m07N11n50M13l13M18k59l16M14m55N88k84
3822a6J19j36R0o9k62M17j38J53m88L75L11o55M88m00M06k79m9J9N1K7j12J92
3844D4l83M17k47L72l25R3o8J42N7l68K91k46M08j41k30K08j16P6r7L02p7k46
3866a34K13J16j96j6J88n45O59l54R4m4M8m3J42J86m31J85j11K17m11L58R2k66
$$ y = [-336, 421, 224, 212, 105, -145, 102, -35, 102, -242, 77, -38, 309, -129, 38, 282, -256, 208, -134, 200, -153, 50, -46, 190, 194, -251, 223, -46, 257, -86, 25, -75, 77, 9, -125, 42, -166, 318, -92, -90, 6, -159, -97, -260, 111, -253, -56, -210, -68, 78, -35, 123, -441, 339, -98, -77, -163, 61, -1, 23, 276, -51, 2, -233, 128, 60, -21, 70, -189, 89, -163, 215, -202, 13, 95, -126, 13, -320, 170, -164, 319, -210, -96, 18, -91, 248, -248, 69, -216, 290, 34, -54, 124, -126, 224, -183, 328, -222, 191, -122, 296, 37, -279, 135, -320, 268, -16, 103, -33, 57, -12, -274, 143, 5, 158, -330, 45, 356, -299, 189, -211, 195, -84, -133, -114, -63, -36, -148, 44, -339, 78, -169, 203, -122, -29, -97, 45, 102, -266, 25, -221, 187, 46, -184, 24, -92, -16, -113, 189, 112, -134, 79, 195, -1, -17, 171, -374, 285, -69, 25, -19, 29, -14, 128, 314, -117, 68, -43, 174, -237, 121, 213, -53]
3888e3L52l17K19j95j23K15j76K55m88N42l32M14m90O5L97l90L55n97K66l67K88
3909a60K89k51O3j86M02l32J99k06N0q2J11O8M7J33m51M77k32N5J66m23N00m97
3931b60L38l55N04k33Q5k20O4L71n29L99j28L21m15o9M13k24P3l96M70l69L54
3952A94j77O7j75m3J79Q6N3m38P0J41J64j89r0K21m2K09r8j34k12Q8O3j19J53
3975b9p3L39l83j29L99j5J43m32L34l46K32MOm1NJ09k36J75o2j3j43N8J8j74M82
4000B28l76K94j44J6L19n72M50l50L85k77p9N1kN3L8J44o5K36n33L93o6j8pj76
4024e8L15r8Rj06j36J42j91J75j56K22j28J26j94J12MP5R8k78L17l15K51k38r6
4047a48K21k94P0J26M5j58R7q2K49j24q8K45k63K03l11K58j35J83n7mm5k6L46
$$ y = [-53, 299, -18, 201, 6, -117, 98, -78, 177, -311, 231, -101, 313, -177, -112, 285, -105, 250, -347, -81, -448, -160, 129, -122, -59, -245, 157, -175, 24, -182, -132, -214, -103, -35, 12, 145, -306, 171, -61, -6, 160, -263, 237, -260, 78, -277, 227, -6, 79, -141, -77, 294, -235, 164, 36, 357, -58, -127, 286, 62, 135, -261, 209, -160, 194, 17, 84, -91, -134, 45, 131, 184, -254, -184, -43, 121, -68, -158, 63, 21, 230, 132, -2, -214, -126, -63, -182, -29, -102, 237, -146, -275, 124, 109, 252, -180, 154, -192, 40, 44, 50, 9, 14, 123, -113, 62, 0, -13, -156, -98, -80, -254, 228, -148, 146, 2, 18, 337, -235, 215, -135, 250, -27, -106, -55, -57, -4, 34, 178, 113, 349, -184, 209, 143, 125, 118, -58, 257, 159, 168, 62, -74, 68, -123, 52, -104, 118, -10, 116, -78, 34, 38, 113, 211, -67, 250, -65, 186, -52, -148, 73, -221, -151, -25, 20, -138, -41, -123, 126, 2, -86, 159, -104, 99, -212, 46, -89, 94, 37, 33, -12, -38, 308]
4070C08k88Q6k19j8J19j9N5j28M04l08P4j57j27M9J62J37l54K31j46R8Q4PJ08
4093A58j83Q2l54K33J64J7j76K08p6j21M3j76L73j65k0K02j44j13J5J81l79K56
4115B5k3K4j20J8K66m64K89k16K35J37l80J95j72K11o6L88k76l74L06o3J61o3
4137C8K48j53j25j08K3P6m9j08OJ91m4K90n14K42qj68R7k15K59l2jL7J43M1l39
4162a73J81P2K05m08J75K3j70M32k37o6q6m5J04Q3J7K2j05J52J82l30J11j66K18
4185A91j27m7K91n65O52n49K67j27K27n64N19j2l56K46l47L07q2L53m43L1K55
4206A20k53R4k11J18L42j06O3q2k4j21P3J9N7j12P4j00k03M62k44L8J8m5j18j68
4230c09K80n3K22j85J63J37k72J31j68L44l23J25Oj2L1k81L33l95L56m01M68k66
$$ y = [308, 20, 106, -113, -131, -12, -31, 24, -104, 300, -8, 66, -91, -218, -169, -7, 130, -224, 7, -139, -41, 43, 50, 158, -25, 57, -297, -64, 100, 117, -59, 149, 73, -48, -5, -181, 192, 27, 7, 209, 65, -48, -33, 148, -231, 25, 2, 26, -94, -76, 190, -274, 15, -201, 34, 171, -209, -14, -186, 25, -41, 347, 71, -303, 3, -60, 101, 38, 286, 133, 8, -100, -77, -1, -50, -158, -152, 39, -5, 285, -229, 13, 5, -163, -66, -281, -22, -54, -55, -18, 125, 166, -173, 8, 80, 285, -123, 52, 75, -95, 337, 100, 34, -52, -97, 7, 90, 107, 129, 24, 176, 358, 28, 139, -27, 191, 64, 17, 308, -257, 395, -154, 113, -14, 213, -351, 168, 156, -200, 46, -301, 6, -76, 277, -166, -135, 120, -133, -39, -250, -132, 210, 104, 167, 85, 61, -60, 13, 32, 89, -23, 51, -49, -252, 210, -34, 4, 22, -23, -141, -309, -29, -82, 140, -45, 118, 255, -17, 114, -54, 290, -33, 92, 98, 86, 117, -164, 169, -226, 130, -271, 197, -69]
4252f9R0Q2j60m4r4L75l64M60l88K12k17l1L05l7N4j84J44m58K55l6r2K37k04
4275a64J29j13L32m60J06K37j91J03jm5J4J02k21J17K51r2P5m05J84k16L89K27
4297C58l52j75J0J86p4K79o05M46j66J28J08j04p2O8J01j14j32J3L84o9k34K22
4319B06k51J57p7j83k52L82j44J45J71Q2k11J26m02L82k1N80n44k40L92k98j25
4340a25R4J89l33N20l06P7p6q0j6P1j79o4M39l49J64j84K52j15n2J29l07K08K2
4363b1J26K6k9q2J90j55j90M5K15j11J87m79M35l4j23j05J24j69O3K09L6k07l8
4386h7Qm4L25k80j7L93o9j31L2m3k94K28k12J26J78q9J1K4J41m41M01j10N9K9
4410A38kr6o3K22m80M93l45J24J5j12K45k32K47k33K35K5l06J24K30j00q6J94
$$ y = [-69, 21, 103, -57, -101, -195, 180, -184, 276, -112, 100, -117, -148, 157, 120, 174, -10, 134, -324, -69, -105, -197, 40, -164, -35, -148, 184, -276, -170, 67, -124, -21, -22, -67, -53, 49, -172, -55, 196, 104, 179, -226, -42, -258, 131, 358, 6, -169, -159, 27, -47, 232, -373, 73, -93, 35, 143, 39, -33, 35, 136, 22, -110, -97, 287, 218, -16, 206, -45, 112, 35, -148, -400, -18, -162, -17, 154, 236, 25, 151, -251, 131, 110, 690, 146, -94, 298, 0, -125, -31, 158, -175, 345, 39, 116, 40, -40, -56, 15, -164, -228, 211, -138, 26, -158, 94, -21, -73, 56, -251, -43, -21, 105, 131, 102, 20, 210, 55, -135, -90, 125, 14, 201, -278, 157, 123, 0, -105, 19, -150, -87, 122, 158, -49, -87, -79, -123, 202, -78, -95, 298, 229, 98, 130, 87, -207, 21, -191, -65, 113, 24, 35, 59, 200, -241, 160, 50, 109, 138, 136, 40, -23, 199, -281, 212, -133, -9, 6, -106, 139, -93, 154, -79, 156, 181, -125, -1, 229, 129, 43, 237]
4432B37l74M59l06k5J11o7ql50M51n6p7j27N0M3N2R2j92K08qK7j41k8j23Q1L02
4457B31l30J58j41k7N6J40K5k58K64j08j07K2K98q0o9P8m94L91p4k8Q9q8L11l72
4481a13M24l91n2mJ27O4m9o7j32K05k38M44l31J70n6k51L12l07K20pJ95k45N7
4504b5K0j35J57q9K64l01Q7k8j42K97j52M2p4K96k94J61J2k37J25J66m1k15j1
4527a17o3K80N9r1J18l10K22k20K07l3j34j0J93k4J3r4J94k48j43K43p9K77j41
4550I9k92L88l99n2M2L73M8k08o1J70Q5j53Qk25Q5K13j83K16k16L15P8k56J08
4573A83l49K33J17j10J75k23k22K67m65K61L90k70j83K45N3l42K74k8O9ml17J51
4595i5j49K46N5l63L84Op8L38l35j78M86n61J08j26J27M19m65L98n16K26J78J59
$$ y = [237, -137, 322, 16, -9, 102, 35, 27, -323, 128, 72, -5, -132, -82, -39, 13, 105, -87, 121, 113, 140, -1, -29, -152, -71, 231, -99, 59, -82, -109, -53, 87, 112, -146, 118, 10, -97, -75, 223, 143, 74, 152, -342, 49, -25, -53, 36, -52, 259, -113, 311, -80, -132, -136, -9, 55, 6, -61, -193, 12, -226, 218, -113, 57, 1, -250, 62, -245, -25, -32, 163, -82, -25, -5, -140, 17, -72, 192, -109, -22, -50, -192, 105, -47, -5, -79, 217, -77, 84, 96, -141, -16, 150, 109, -106, -117, -180, 100, 159, 68, 186, -124, 98, -122, 85, 52, -82, -92, 101, 77, 90, -4, 190, -58, -201, 42, -37, 240, 99, -193, 195, -204, -256, -214, 159, 207, -1, -62, 108, 193, 40, 48, -177, -92, 121, -62, 154, -62, 253, 331, 75, 183, -166, 67, 184, 74, 249, 26, -196, 71, -394, -133, 257, -13, -196, 49, 102, -240, 34, 6, 75, 71, -246, -95, -244, 2, 57, -306, 78, 84, 6, 344, 9, -169, 317, -244, -136, -262, -135, 284, -181, 217, -299, -73, 105, 264]
4617B64j40j80J76k62K71l66J40M29l97j81J70R3j78M87o29K51O9O3Rl52L79k58
4639a42k0P6M90k07J3j97l56M48p0O3j23j41L69k49O1j17P8k5J20Q8l2j87j39
4662a99J50q6L2n7K20l22L3L16j48J67j60J27o1K6Q3k72J47k45J10J72m7j9M0
4685GJ24PP3k21J17j75J69j29j33K49j44J33j15K66k91o3P0J4J48k69K12%J68
4708B17n08M03K07m03jj36L83j84M17m88k2L6M24m53l7K07k87J43m0L56l59j68
4730b93K10p8K61j94k7J5K10J26j54j37N8J35l18M04l03R2j3J6J63k87K47j55
4752b2O2L1q7J27k73J62mJ14k73L90p8j56J40J11j69m7J53k37q3L9l3R4M4J05
4776A10o4Q1q5K32l17j28k6j26L32r2K36k47O8J19j20M0l3M44o61K30O1J5K05
$$ y = [264, 124, -56, 120, -142, 129, -237, -97, 332, -65, -246, -76, 17, -161, 326, -303, -52, 17, 80, 89, -263, 116, -142, -162, -86, 404, 197, 210, 13, -343, 105, 35, 98, -25, -166, 203, -46, 15, -102, -24, -49, 71, 159, 127, -60, -199, -49, -135, -103, -160, 60, -262, -229, 87, -61, 106, -54, 73, 12, 38, 121, -151, -4, -249, -139, 33, -14, -33, 7, 131, 138, 211, -10, 107, -68, 101, -28, -161, 88, -56, 77, -38, 228, -63, -126, -56, -42, 106, -163, 49, 49, 217, -291, 112, 319, -84, -85, -221, 162, -22, 395, -93, -115, -79, 345, -108, -145, 62, -225, -82, -122, 234, -125, -293, -83, -161, 100, -94, -121, -106, 104, 230, 76, -61, -3, 132, -186, 218, -85, 7, -6, 10, 173, -114, 133, -22, 40, 71, -16, 111, -162, 0, -4, 110, -163, 227, 149, -7, 133, 244, 75, 28, 181, -56, -139, -100, -133, -39, 5, 110, 46, 127, 42, 274, -43, -171, -197, -323, 9, -83, 153, -94, -26, 93, -27, 13, -20, 424, -237, -7, 54, 69, 274]
4799B74n40M03l18K19j67J96j25M1K52n93O88l08J12j05n9R6j8K51m07Q8K60j47
4821I3p6P0M8j05R4j13J10K52j61p5k29j33J94J48k57L35r8j11N6k6Q6j33K7m3
4845d7k3N8L6l7j3J20M0q0j30J09J21l1k96J12K00p1o5o5j0k2J8q6K0M11m72J01
4871a02M4j02R4j07L20k01K37j85J71m45L84J6j98J92q2J50j51m9j27K3J03Pj22
4894a30L56l76L2J64N6j79O0J0Qm1K3o1J25j57Q2J49k07j1n2L79k46L66l97J03
4918E6M7j77J33j99M57l85J95k52J29p9J1p3m5L08r3j82j7Q4J87m62K33K64k55
4941a15k8J31K55l52J94p7J04j96J21j38R2%k83K84m9R7l7k9k8J57n5O1j23o5
4965g9J94k73K12J8j89J53j79L35k13J53k18K09k28j6J67j27K76K8j26k25K74
$$ y = [274, -266, 137, -181, 38, -129, 67, -58, -17, 235, -358, 330, 22, 134, 29, -30, 66, 48, 299, -108, -20, 240, 93, 17, 87, 135, 30, 124, 11, 121, 373, 212, 137, -92, -225, -31, 117, -140, 195, 97, -14, 42, 16, 102, -31, -4, -47, -70, -12, 24, -13, -26, 94, 134, 54, -76, 33, 154, 123, -173, -61, 139, 68, 3, -62, -72, -94, -76, -162, -142, 269, -203, -102, -58, -160, -66, -173, 147, -54, 183, -2, 169, -276, 108, 124, -74, 118, 36, 186, 35, -14, -141, -118, -15, -8, -130, 226, -150, -118, 46, 102, -77, -17, -7, 1, -40, -17, -78, 47, -110, -28, 121, -86, -97, -149, 230, -16, 350, -47, 56, 103, -74, 59, -140, 317, -68, 127, -125, 4, -75, -64, -137, -182, 126, 33, -149, -166, -82, 105, -357, -124, 140, -115, -143, -12, 243, -109, 85, 8, 112, -84, 37, -101, -9, -9, -292, -8, -57, 40, 3, -26, -54, 103, 48, 109, -14, -79, 115, -158, 54, 72, -117, 36, -143, 192, -21, 132, -86, 123, -105, -121, 46, -81, 195, 223, 97, -128, 146]
4986A46p7QJ61l58J57Q8k19QQ0r3O9K99m67L39k35P7j9M1j04J3J82j77K99k16
5010BJJJ57q4k23L74k82K72m02N01m17J1J39j48L33k08qj13M8m2m8L00j71l5p0
5035a12J10L7j25J0J60K03j46K27n32K66k84K04K58m48M43k24J10k51kL66l95
5056a25J51j09O4M6M0k15J85J90k27K52k92K21o2l2j6l48O06l83J33j39J56l21
5078b25N37k86o8J30k54J81r0L82k90M4j84pJ97j31J41m06J19K17N3k13j4K7j51
5101b91M08j28L5L3j9j13j51K32k08J66j19K51J06k44L1j46J99j21M41p48L93
5122GJ53Mq7k20N34m50N60o20J32l93N59m7k90K42j85K94m90N11k28J06j40J47
5144I9p3j85K15j17K60n8j16j12pJ66j07J11k57J56j93J92O6j44R7j91L46j07
$$ y = [146, 69, 77, 238, -120, 37, 125, -94, -86, -6, -99, -30, 269, -198, 141, -94, -17, -36, 5, -99, -86, 96, -81, 218, 2, 3, 4, 161, 77, -146, 228, -54, 218, -184, 317, -100, -89, 50, -98, 235, 27, 19, -94, -46, -88, -136, 164, -7, -42, -112, -2, 35, -90, -80, 80, 283, 137, 364, -168, 98, -186, 18, 276, -172, 271, 47, 157, -94, -96, 270, -125, 26, -83, -19, 27, 67, -148, 37, 227, 0, 252, -40, 181, 119, 87, 71, -277, 329, -54, 79, -60, 96, -225, 312, 26, -42, 88, -166, 15, -75, 307, 17, 61, -123, -130, 67, -64, 77, -329, -210, 7, 60, -153, -167, -140, -291, 117, -11, 24, 57, 38, -75, -226, 6, -202, -36, -155, 96, 202, -42, -11, -157, 42, -79, 362, -386, 7, 160, 164, 77, -143, 391, -59, 501, -119, 13, -380, 179, 132, -158, 84, -101, 193, -297, 214, -14, 92, -48, 99, 26, -159, 56, -61, 199, 141, 25, -87, -94, 72, -35, 76, -181, -25, -218, -26, 40, -104, -7, -198, 148, 41]
5166D1j67J6m8L64l85K72m8M1j04j63N7j11L77l02M59j06k48j03P3O1N4J84n49
5189c35K82j40K12l31K57q5J58r3q5M56j06j20j9j7n4j39J55J45l40Q6O32k92
5211B27o6j16q2L0M1M77n09O41p33m7j31N5M13l97l3K15M4J88k20J10j99O5P1
5234D4J11n33L17%j8L77j84L76k9m45J89o32P33m15O23l4n28K78o54M17L6N45
5256E74j260N37l46P16K41p10N25p76O95K11k76J69N69o33r9l92J18J82k89L41
5276I7p16M14J79m35j55j6R37n84J481j808O40p50R33j23J64j60m70K94k95K59
5296a14Q8%j06o3o92P85J000n87J16j01km27l4R42j140M67N53l44n30L67j37m47
5318d06L92m8J79O12q48k07L54l65L62l81M80n66J076l13o8k36N96n86P5k40l33
$$ y = [41, -126, -110, -158, 206, -179, 93, 45, 86, -18, -181, -124, -235, 142, -160, 299, 193, -55, -158, -85, -24, 30, 214, -335, -53, -193, 19, -312, -55, -140, 18, -75, -160, 296, 190, 70, 51, 34, -20, -159, -4, 141, -199, -113, 519, 227, 161, 45, -37, -7, 34, 511, 2, 643, -90, -137, -268, -213, 200, -197, -230, -15, 29, 217, -3, 107, -92, -27, 44, 155, -378, -61, -61, -79, 298, 114, 490, 461, 16, 205, -427, 306, -109, 514, 480, -48, 230, -424, -7, 29, 574, -686, -149, -495, 221, 462, -248, 277, -499, 196, 407, 131, 300, 869, 236, 137, -255, -137, 45, -244, 97, -619, -205, -26, -461, -616, -632, 305, -279, 1202, -606, 34, -716, 217, 94, 258, 98, -372, -78, -373, -114, -26, -26, -132, -195, -887, -102, 898, 311, 427, 326, 324, -103, -137, 805, -335, 132, 685, 341, -189, 178, 41, -406, -14, -62, 117, 729, -119, -326, 28, -337, 25, -356, 124, -442, 634, 321, 253, 17, 613, 27, 102, -138, -471]
5339d71k17J372q35m68J124o90K10O54m53l08L87L24r48N24j33j042J623j136
5357d83J122n86j48N12k77K94O32j038J77J86k69L3L29K75k03q81O61m8m98M55
5377B45N20p10o09O00l6Q2k7rn55N32J14K16m12K15l2j72L00L41m43k19J19K42
5399C02n62L19k15k47M41j07K01l6q9J30K11n06O23p57N99Pqj18j9k50l32M55
$$ y = [-471, -688, 684, -151, -619, 505, -185, 25, 679, 226, -82, 305, 629, -319, 205, 72, -970, 653, -483, 639, 53, -95, 417, 140, 434, 1066, 28, 205, 391, 122, 155, 484, 759, 556, -325, 336, 288, -210, 245, 765, 55, -554, 46, 10, 92, 65, 56, -499, 33, 147, 363, -49, 166, 134, -38, 262, 603, 160, -59, 60, 302, -260, 59, -156, -403, 38, -69, 132, 96, 7, 137, 348, -158, 465, -292, 307, 314, 306, 188, 169, -81, -413, 42]
$$ [...]
8191d35
##END NTUPLES=NMR FID
##END=
