##TITLE=1H_Pr 4647-Van
 CDcl3, 8 sc, 
 30.1.2020
##JCAMPDX= 6.0         $$ Bruker NMR JCAMP-DX V2.0
##DATA TYPE= NMR FID
##DATA CLASS= NTUPLES
##ORIGIN= UXNMR, Bruker Analytische Messtechnik GmbH
##OWNER= root
$$ XWIN-NMR		Version 3.5
$$ Thu Jan 30 14:13:48 2020 Russian Standard Time (UT+4h)  she@DPX200
##.OBSERVE FREQUENCY= 200.1315
##.OBSERVE NUCLEUS= ^1H
##.DELAY= (6, 6)
##.ACQUISITION MODE= SIMULTANEOUS
##.ACQUISITION SCHEME= undefined
##.AVERAGES= 8
##.DIGITISER RES= 18
##SPECTROMETER/DATA SYSTEM= spect
##.PULSE SEQUENCE= zg30
##.SOLVENT NAME= CDCl3
##.SHIFT REFERENCE= (INTERNAL, CDCl3, 0, 15.7039)
##AUDIT TRAIL= $$ (NUMBER, WHEN, WHO, WHERE, WHAT)
$$ ##TITLE= Audit trail, XWIN-NMR		Version 3.5
$$ ##JCAMPDX= 5.01
$$ ##ORIGIN= Bruker BioSpin GmbH
$$ ##OWNER= she
$$ F:/spectra/data/she/nmr/H-F/1/audita.txt
$$ ##AUDIT TRAIL=  $$ (NUMBER, WHEN, WHO, WHERE, WHAT)
(   1,<2020-01-30 14:12:41.75 +0400>,<she>,<DPX200>,
      <created by zg, POWCHK disabled, PULCHK disabled
       configuration hash MD5:
       00 E9 B6 7A A2 85 ED C7 34 08 36 98 17 FE 4E 26
       data hash MD5: 16K
       F4 A3 46 54 0D E7 19 AF F5 AF 21 D7 A4 19 54 77>)
$$ ##END=
$$ 
$$ hash MD5
$$ 16 97 48 4F 11 EC 29 32 A4 E2 B9 7E 9F B1 50 42
##$RELAX= 
##$RELAX= 
##$RELAX= 
##$RELAX= 
##$RELAX= 
##$RELAX= 
$$ Bruker specific parameters
$$ --------------------------
##$DU= <F:/spectra>
##$EXPNO= 1
##$NAME= <H-F>
##$PROCNO= 1
##$TYPE= <nmr>
##$USER= <she>
##$AMP= (0..31)
100 100 100 100 100 100 100 100 100 100 100 100 100 100 100 100 100 100 
100 100 100 100 100 100 100 100 100 100 100 100 100 100 
##$AQSEQ= 0
##$AQ_mod= 1
##$AUNM= <au_zg>
##$AUTOPOS= <>
##$BF1= 200.13
##$BF2= 200.13
##$BF3= 200.13
##$BF4= 200.13
##$BF5= 200.13
##$BF6= 200.13
##$BF7= 200.13
##$BF8= 200.13
##$BYTORDA= 1
##$CFDGTYP= 0
##$CFRGTYP= 5
##$CHEMSTR= <none>
##$CNST= (0..31)
1 1 145 1 1 1 1 1 1 1 1 1 1 1 1 1 1 1 1 1 1 1 1 1 1 1 1 1 1 1 1 1 
##$CPDPRG= <>
##$CPDPRG1= <>
##$CPDPRG2= <>
##$CPDPRG3= <>
##$CPDPRG4= <mlev>
##$CPDPRG5= <mlev>
##$CPDPRG6= <mlev>
##$CPDPRG7= <mlev>
##$CPDPRG8= <mlev>
##$CPDPRGB= <>
##$CPDPRGT= <>
##$D= (0..31)
0 1.2 0 0 0 0 0 0 0 0.06 0 0.03 0 0 0 0 0.0002 0 0 0 0 0 0 0 0 0 0 0 0 
0 0 0 
##$DATE= 1580379161
##$DBL= (0..7)
120 120 120 120 120 120 120 120 
##$DBP= (0..7)
150 150 150 150 150 150 150 150 
##$DBP07= 0
##$DBPNAM0= <>
##$DBPNAM1= <>
##$DBPNAM2= <>
##$DBPNAM3= <>
##$DBPNAM4= <>
##$DBPNAM5= <>
##$DBPNAM6= <>
##$DBPNAM7= <>
##$DBPOAL= (0..7)
0.5 0.5 0.5 0.5 0.5 0.5 0.5 0.5 
##$DBPOFFS= (0..7)
0 0 0 0 0 0 0 0 
##$DE= 6
##$DECBNUC= <off>
##$DECIM= 24
##$DECNUC= <off>
##$DECSTAT= 4
##$DIGMOD= 1
##$DIGTYP= 9
##$DL= (0..7)
0 120 120 120 120 120 120 120 
##$DP= (0..7)
150 150 150 150 150 150 150 150 
##$DP07= 0
##$DPNAME0= <>
##$DPNAME1= <>
##$DPNAME2= <>
##$DPNAME3= <>
##$DPNAME4= <>
##$DPNAME5= <>
##$DPNAME6= <>
##$DPNAME7= <>
##$DPOAL= (0..7)
0.5 0.5 0.5 0.5 0.5 0.5 0.5 0.5 
##$DPOFFS= (0..7)
0 0 0 0 0 0 0 0 
##$DQDMODE= 0
##$DR= 18
##$DS= 0
##$DSLIST= <SSSSSSSSSSSSSSS>
$$ [...]
##$SUBNAM2= <"">
##$SUBNAM3= <"">
##$SUBNAM4= <"">
##$SUBNAM5= <"">
##$SUBNAM6= <"">
##$SUBNAM7= <"">
##$SUBNAM8= <"">
##$SUBNAM9= <"">
##$SW= 24.9337058887773
##$SWIBOX= (0..15)
0 0 2 0 0 0 0 0 0 0 0 0 0 0 0 0 
##$SW_h= 4990.01996007984
##$TD= 16384
##$TD0= 1
##$TE= 0
##$TE2= 300
##$TE3= 300
##$TEG= 300
##$TL= (0..7)
0 120 120 120 120 120 120 120 
##$TP= (0..7)
150 150 150 150 150 150 150 150 
##$TP07= 0
##$TPNAME0= <>
##$TPNAME1= <>
##$TPNAME2= <>
##$TPNAME3= <>
##$TPNAME4= <>
##$TPNAME5= <>
##$TPNAME6= <>
##$TPNAME7= <>
##$TPOAL= (0..7)
0.5 0.5 0.5 0.5 0.5 0.5 0.5 0.5 
##$TPOFFS= (0..7)
0 0 0 0 0 0 0 0 
##$TUNHIN= 0
##$TUNHOUT= 0
##$TUNXOUT= 0
##$USERA1= <user>
##$USERA2= <user>
##$USERA3= <user>
##$USERA4= <user>
##$USERA5= <user>
##$V9= 5
##$VALIST= <valist>
##$VCLIST= <CCCCCCCCCCCCCCC>
##$VD= 0
##$VDLIST= <DDDDDDDDDDDDDDD>
##$VPLIST= <PPPPPPPPPPPPPPP>
##$VTLIST= <TTTTTTTTTTTTTTT>
##$WBST= 1024
##$WBSW= 4
##$XGAIN= (0..3)
0 0 0 0 
##$XL= 0
##$YL= 0
##$YMAX_a= 526022
##$YMIN_a= -305477
##$ZGOPTNS= <>
##$ZL1= 120
##$ZL2= 120
##$ZL3= 120
##$ZL4= 120
##$ABSF1= 10
##$ABSF2= 0
##$ABSG= 5
##$ABSL= 3
##$ALPHA= 0
##$AQORDER= 0
##$ASSFAC= 0
##$ASSFACI= 0
##$ASSFACX= 0
##$ASSWID= 0
##$AUNMP= <proc_1d>
##$AZFE= 0.1
##$AZFW= 0.1
##$BCFW= 1
##$BC_mod= 2
##$BYTORDP= 1
##$COROFFS= 0
##$CY= 11.3945322036743
##$DATMOD= 1
##$DC= 2
##$DFILT= <>
##$DTYPP= 0
##$F1P= 16.9975609425685
##$F2P= -3.02152046262296
##$FCOR= 0.5
##$FTSIZE= 0
##$FT_mod= 4
##$GAMMA= 1
##$GB= 0.15
##$INTBC= 1
##$INTSCL= 1
##$ISEN= 128
##$LB= 0.24
##$LEV0= 0
##$LPBIN= 0
##$MAXI= 10000
##$MC2= 0
##$MEAN= 0
##$ME_mod= 0
##$MI= 1.114404
##$NCOEF= 0
##$NC_proc= 0
##$NLEV= 6
##$NOISF1= 3.799351
##$NOISF2= 2.8
##$NSP= 1
##$NTH_PI= 0
##$NZP= 0
##$OFFSET= 15.70392
##$PC= 1
##$PHC0= -9787.86
##$PHC1= 13.80081
##$PH_mod= 1
##$PKNL= yes
##$PPARMOD= 0
##$PSCAL= 0
##$PSIGN= 0
##$REVERSE= no
##$SF= 200.130013532006
##$SI= 16384
##$SIGF1= 3
##$SIGF2= 2
##$SINO= 400
##$SIOLD= 16384
##$SREGLST= <1H.CDCl3>
##$SSB= 0
##$STSI= 0
##$STSR= 0
##$SW_p= 3612.71676300578
##$SYMM= 0
##$S_DEV= 0
##$TDeff= 0
##$TDoff= 0
##$TI= <>
##$TILT= no
##$TM1= 0
##$TM2= 0
##$TOPLEV= 0
##$USERP1= <user>
##$USERP2= <user>
##$USERP3= <user>
##$USERP4= <user>
##$USERP5= <user>
##$WDW= 1
##$XDIM= 8192
##$YMAX_p= 0
##$YMIN_p= 0
$$ End of Bruker specific parameters
$$ ---------------------------------
##NTUPLES= NMR FID
##VAR_NAME=  TIME,          FID/REAL,        FID/IMAG
##SYMBOL=    X,             R,               I
##VAR_TYPE=  INDEPENDENT,   DEPENDENT,       DEPENDENT
##VAR_FORM=  AFFN,          ASDF,            ASDF
##VAR_DIM=   8192,          8192,            8192
##UNITS=     SECONDS,       ARBITRARY UNITS, ARBITRARY UNITS
##FACTOR=    0.0002004,     1,               1
##FIRST=     0,             0,               0
##LAST=      1.6414764,     0,               0
##MIN=       0,             -305477,         0
##MAX=       1.6414764,     526022,          0
$$ Real data points
##PAGE= N=1
##DATA TABLE= (X++(R..R)), XYDATA
$$ [...]
2285a204J434K721K031j718m206k531J063L574K784n24j586j798q19n5J337P20
$$ -1204 230 2951 4982 3264 -942 -3473 -2410 1164 3948 3424 1838 40 -779 -834 503 1223
2301A223P76q22k480j882J572L500K155q83l445k648Q9J790J865M90R7K21j233
$$ 1223 1999 1177 -1303 -3185 -1613 1887 4042 3159 -286 -2934 -2845 -1055 810 1300 1397 1618 385
2318C85j433K05J757K182j19l432k246K99L136K779M34j213j858j240j013M4J816
$$ 385 -1048 -843 914 3096 2977 -455 -2701 -2402 734 3513 3947 2734 876 -364 -1377 -1333 483
2335D83K348K35k186k769l28K596L313r8l162k945j273J517K003K022O49k97k728
$$ 483 2831 3066 880 -1889 -2217 379 3692 3594 432 -2513 -3786 -2269 -266 1756 2405 2108 -620
2352f20k657k95J963K778Q26k493k881j07J946K944R03j084k028j846l38O88J448
$$ -620 -3277 -3572 -1609 1169 1995 -498 -3379 -3486 -1540 1404 2307 1223 -805 -2651 -2989 -2301 -853
2369h53K437J503j261k854j508J434K542J496j526j998j178O69J299J550J733
$$ -853 1584 3087 1826 -1028 -2536 -1102 1440 2936 1410 -588 -1766 -1097 202 1752 3485
2384C485j31k020l045j935J096L854K377j198l418k155N30K849J505n81k004j625
$$ 3485 3354 1334 -1711 -3646 -2550 1304 3681 2483 -935 -3090 -2560 289 1794 1213 -791 -2416
2400b416j277j82K530L031J494j740l630k436J338K961J940j50j567j478J99J486
$$ -2416 -3693 -3875 -1345 1686 3180 1440 -2190 -4626 -3288 -327 1613 1463 -104 -1582 -1383 103
2416A03J131Q19O32q28k507j640Q82L027L084L47k073k677j363J469J596Q50m76
$$ 103 1234 2053 2685 1857 -650 -2290 -1408 1619 4703 5050 2977 300 -1063 406 2002 2852 2376
2433B376o60j718q60N49K324K224o75l329l891k49K538L046Q42j405j792j178
$$ 2376 1716 -2 -862 -313 2011 4235 3560 231 -3660 -3909 -1371 1675 2517 1112 -680 -1858
2449a858j91Q88J224R97p25j829k062O51K980K725L75k380k674r24R83J791J305
$$ -1858 -2049 -1161 63 1060 335 -1494 -3556 -2905 75 2800 3175 795 -1879 -2803 -1820 -29 1276
2466A276P24j25q32j608o97J429K200O28k442k681p00J529L097J228j39j738j976
$$ 1276 2000 1875 1043 -565 -1262 167 2367 2995 553 -2128 -2828 -1299 1798 3026 2887 1149 -827
2483h27j039m56J119K151R50j552k228j107J641K815J161j983k526j620M71J653
$$ -827 -1866 -2322 -1203 948 1898 346 -1882 -2989 -1348 1467 2628 645 -1881 -3501 -3030 -1377
2499a377J584J258k19r00k155p63M98K257J260r46k301q96J134J959J218m63j214
$$ -1377 207 1465 1246 346 -1809 -2572 -2074 183 1443 497 -1804 -2700 -1566 393 1611 1148 -66
2516f6j763o25n57J387K793j55l7j201j900q6J412J845m77j502j578k98J104J539
$$ -66 -1829 -2454 -3011 -1624 1169 1014 977 -224 -2124 -2210 -798 1047 570 -932 -2510 -2808 -1704 -165
2534a65J084K17p11j862k095K11K257K421K42j589k096M79J379J210K90n43j107
$$ -165 919 1136 425 -1437 -3532 -3321 -1064 1357 1599 10 -2086 -1607 -228 982 1272 729 -378
2551c78j223J63R43J383J535L45k024j959n62J433J127M30o70j183K10J63O30
$$ -378 -1601 -1438 -495 888 2423 2768 744 -1215 -1777 -344 783 1213 543 -640 -430 -267 363
2568C63M10L9l17j351j591n63J306K502P93j018k209p10L30Q03M69k66O4l90o25
$$ 363 773 812 495 -856 -2447 -3010 -1704 798 1591 573 -1636 -2346 -2016 -1213 -744 -1010 -946 -1336 -1961
2587a961L53J344J547N34j604k325o09J368K267J392o27q64n9O81j81j8M71L14
$$ -1961 -1608 -264 1283 1817 213 -2112 -2721 -1353 914 2306 1679 815 756 1437 1256 1238 1709 2023
2605B023p02j075N2J204J920J95j356j713l39J43J22K97k16N41K65q08o89m58
$$ 2023 1321 246 298 1502 3422 3617 2261 548 209 352 474 771 555 1096 1361 553 -136 -594
2623e94P34M02j022j161j036L78J869J190k46p19n11n52m40N0J068N18K65m45
$$ -594 140 542 -480 -1641 -2677 -2299 -430 760 514 -205 -716 -1268 -1708 -1658 -590 -72 193 -252
2641b52o42P76J359P17p88j365p39Q82R41O02N91J77J0m73q17k14M52J58m61l76
$$ -252 -894 -118 1241 1958 1170 -195 -934 -52 889 1491 2082 2259 2269 1796 979 765 1217 1375 914 538
2661E38l40Q07J024P5n92j033m26o9m98n65L26J061O95m62n77r45O72M99o42m57
$$ 538 198 1005 2029 2104 1512 479 53 -16 -514 -1079 -753 308 1003 541 -36 -981 -309 190 -452 -909
2681i09p43O79N88M65N22Q1n3n50q40j02O40J013J77n07q7L09J169r2o00j260
$$ -909 -1652 -973 -385 80 602 683 630 80 -760 -862 -222 791 968 461 374 683 1852 1760 1160 -100
2701a00j21M42O17K99P2J56L31j00p50n05L37p0l35o11Q3Q37N89L75j233m40j5
$$ -100 -221 221 838 1137 1209 1365 1696 1596 846 341 678 608 273 -338 -255 582 1171 1546 313 -127 -142
2722a42j79j59o55O4O95Q59l52m96J8M23j40r30n47k4J032K59L78L45K2J9r21
$$ -142 -321 -480 -1135 -1071 -376 483 131 -365 -347 76 -64 -994 -1541 -1565 -533 -274 104 449 471 490 -431
2743d31m87j81J050N48m25m98j61J123Q48K50r85j214q69M87O59O57K38K99l68
$$ -431 -918 -1099 -49 499 74 -424 -585 538 1386 1636 651 -563 -1432 -945 -286 371 609 908 540
2762E40r22l42K64N22N4n56j233j01J461J046n9m06p51l72j90l29R6R38Q17K97
$$ 540 -382 -724 -460 62 116 -440 -1673 -1774 -313 733 674 268 -483 -855 -1045 -1374 -1278 -340 477 774
2782G74j035j20K29N29N63n82j008O7J1O20P97J066J25m09j253r12k19J261J242
$$ 774 -261 -381 -152 377 940 358 -650 -583 -572 48 845 1911 2036 1627 374 -538 -757 504 1746
2801A746J58j693l80K11J167O07l42r45j125m22J11O19J794J62Q4j596r95J39
$$ 1746 1904 211 -169 42 1209 1816 1474 529 -596 -1018 -907 -288 1506 1668 1752 156 -839 -700
2819g00O95Q25n47q68j62M03O20P17M12l96l78r51q90L04Q42J136O43o87j075
$$ -700 -5 820 273 -595 -757 -354 266 983 1395 999 621 -330 -1220 -916 -74 1062 1705 1018 -57
2838e7j44L29N95J44m27o73m20l52M31J229J519j89j623k166o76J362J544O60
$$ -57 -201 128 723 867 440 -233 -653 -1005 -574 655 2174 1985 362 -1804 -2480 -1118 426 1086
2856A086j049o21m92L81Q07J67J16p36j631q72N20J634J572k3j109j387o38O16
$$ 1086 37 -584 -1076 -695 112 279 395 -341 -1972 -2844 -2324 -690 882 859 -250 -1637 -2275 -1659
2874a659N44N61k71r5k42l97K19R37R95o3j304j438p76J015J690J213K94j147
$$ -1659 -1115 -554 -825 -920 -1162 -1559 -1340 -403 592 529 -775 -2213 -2989 -1974 -284 929 1223 76
2892G6j238p91M85P31P46L30j326j342j03J537J659O98j074k631j168M18J438
$$ 76 -1162 -1953 -1468 -737 9 339 -987 -2329 -2432 -895 764 1462 388 -2243 -3411 -2993 -1555
2909a555J129O04m04j002r68l3Q78J146J05j010j400p43J365J446J310r7m66j482
$$ -1555 -426 178 -226 -1228 -2196 -2229 -1351 -205 -100 -1110 -2510 -3253 -1888 -442 868 771 305 -1177
2927a177q13K24Q48J520K87j14r47p02O39R09J017q1j331j368o68J182J363J528
$$ -1177 -1990 -1766 -918 602 889 775 -172 -874 -235 674 1691 1610 279 -1089 -1757 -575 788 2316
2945B316j12j368j574j072L01J500J047j64j749j378J80J458J280O3p89k092r05
$$ 2316 2204 836 -738 -1810 -1509 -9 1038 874 -875 -2253 -2073 -615 665 728 -61 -2153 -3058
2962c058k9J245J480J069l12j458q23j64R56J084K82j030o53l43J023J244J070
$$ -3058 -3087 -1842 -362 707 395 -1063 -1886 -2050 -1094 -10 272 -758 -1411 -1754 -731 513 1583
2979A583J70q52j238j370k4J417J808Q06j092j389n27M16J143M26k9j234r98j181
$$ 1583 1753 901 -337 -1707 -1731 -314 1494 2300 1208 -181 -708 -292 851 1277 1248 14 -984 -2165
2997b165J123J743J218k47j819k239o82R92J485Q46m64q46p71N2R98R30L98o81
$$ -2165 -1042 701 1919 1672 -147 -2386 -3068 -2076 -591 255 -209 -1055 -1826 -1774 -776 154 552 -129
3015a29j593j080L36J897J321R54l22j415j213K69R89R24M01k70m08n36K78J106
$$ -129 -1722 -2802 -2466 -569 752 1706 1384 -31 -1244 -975 14 938 1339 1069 661 125 403 1509
3033A509J118M61q41j894j142M27J933J405J57n20j638m91l02J396M04L15r34
$$ 1509 2627 3088 2247 353 -789 -362 1571 2976 3133 2613 975 484 182 1578 1982 2297 1363
3050A363j112j108J139K048J107r54k045j478J35N58J416J052Q8j088p10p6O52
$$ 1363 251 -857 282 2330 3437 2483 438 -1040 -905 -347 1069 2121 2209 1121 411 335 987
3067I87J007J13m19j021p57L62J430J418M51n44j361r84m5N62O73Q87K14q86j002
$$ 987 1994 2107 1688 667 -90 272 1702 3120 3571 3027 1666 682 637 1199 1872 2759 2973 2087 1085
3086A085K2Q24J148Jj331j809q75M96J314J412L88j067j805q32j50J148J122k91
$$ 1085 1107 1931 3079 3080 1749 -60 -935 -439 875 2287 2675 1608 -197 -1029 -1179 -31 1091 800
3104H00p66j244j54J098J575L05p55j192j076J18Q04J290R30L9n04j036n65K55
$$ 800 34 -1210 -1364 -266 1309 1614 859 -333 -1409 -1291 -487 803 1733 1772 1268 232 -333 -78
3122g8J295N6n47l88p93L28R86O47K95k71j269j057q60O36J222P42m03j144p86
$$ -78 1217 1273 726 338 -455 -127 859 1506 1801 1530 261 -796 -1656 -1020 202 944 541 -603 -1389
3141a389OP68M72j90q71q68n82N78J107J210K29j128p77j176O72J089P77J40l73
$$ -1389 -1383 -615 -143 -333 -1204 -2072 -2654 -2076 -969 241 470 -658 -1435 -2611 -1939 -850 -73 67 -306
3160c06n30K23P58O13J64l72m93r11M88M67R85R50j65q52o16l96J50N34j48M68
$$ -306 -836 -613 145 758 922 550 57 -854 -366 101 1086 2036 1871 1019 403 7 157 691 543 1011
3180A011m70l74J24R7O62K4r3j224j238m03J155R13R03o09r07n82K8K9O28J79
$$ 1011 541 167 291 388 1050 1074 981 -243 -1481 -1884 -729 184 1087 478 -429 -1011 -983 -954 -326 -147
3200a47n39o56m9Q7J228R24j14p50j197k39M97Q97P27p7q0m12N17r8J39J23l08
$$ -147 -686 -1342 -1391 -1304 -76 848 734 -16 -1213 -1452 -955 -58 669 592 512 100 617 519 658 781 473
3221D73k31k16q2Q07O15P33o52p03n81j77m6j17O02n7l6k95n2k03L64K03p05o93
$$ 473 242 26 -56 751 1366 2099 1447 744 163 -14 -60 -177 425 368 332 37 -15 -218 146 349 -356 -1049
3243a049m14l80R50P20K83k89n39l95o8L21L25m3l44k88N11O10O52J90n66o83
$$ -1049 -1463 -1843 -893 -173 110 -179 -718 -1113 -1181 -860 -535 -578 -922 -1210 -699 -89 563 753 187 -496
3263d96l4l36O06K49J16Q0J57J07j95m6Q1l73m95p1M55K76K94K6l44J27l31j89
$$ -496 -530 -866 -260 -11 105 185 342 449 254 208 289 -84 -579 -650 -195 81 375 401 57 184 -147 -336
3285c36o28j75J83N85L78l40k39J60L27%m87m74k22K77N28L81K17k85K11n72O4
$$ -336 -964 -1139 -956 -371 7 -333 -572 -412 -85 -85 -572 -1046 -1268 -991 -463 -82 135 -150 61 -511 -447
3306d47j39L17n2n19L03L47M90N27k85p66l51j34j61M1N50k5j16Q3L01K5Ll63
$$ -447 -586 -269 -321 -840 -537 -190 300 827 542 -224 -575 -709 -870 -829 -279 -304 -420 -337 -36 -11 -8 -371
3328c71k59k37j26J66L32O02K4L58l29nn86k77j01M91L66Q9p2J77R1J73k9n46
$$ -371 -630 -867 -993 -827 -495 107 131 489 160 155 -431 -708 -809 -318 48 137 65 242 333 506 477 -69
3350f9m41n54J25P97O50O2J64n04o79p7M99Q2J4m23n31L08O30P12j29k57p43m64
$$ -69 -510 -1064 -939 -142 508 570 734 230 -449 -526 -27 55 69 -354 -885 -577 53 765 636 379 -364 -828
3372h28j13L59K38N04k01J30n40N50L77q9n57k96m25l9P65M74O40l13j63j012
$$ -828 -941 -582 -344 160 -41 89 -451 99 476 387 -170 -466 -891 -930 -165 309 949 636 473 -539
3392e39l52j23N67J20N29m9l53K01JM45N6o0o71q23j44Q26Q71O77K56j115q61
$$ -539 -891 -1014 -447 -327 202 153 -200 1 2 447 503 443 -228 -1051 -1195 -369 502 1179 1435 320 -541
3413e41l6L24P10j84L6j145K61K51Q32O52l58l74j047m71j89Q85Q04J56k26p21
$$ -541 -577 -253 457 273 309 -836 -575 -324 508 1160 802 428 -619 -1090 -1279 -394 410 566 340 -381
3433c81n8Q0N50K34l09m89j73n6P71N28M20K84p01m84p07J20N00R27K59q8o76
$$ -381 -439 -359 191 425 116 -373 -546 -602 169 697 1117 1401 700 216 -491 -371 129 1056 1315 1227 551
3454E51j51J58P31M79p22q12o74j38P99J439L0l38r96p22o88Q82Q46R4l75l73
$$ 551 400 558 1289 1768 1046 234 -440 -578 221 1660 1690 1352 356 -366 -1054 -172 674 768 393 20
3474B0k80k1J010N42k16p68q53m49K53J031Q61M16m04q57m98K36L71L45j0k39
$$ 20 -260 -281 729 1271 1055 287 -566 -1015 -762 269 1130 1546 1142 285 -213 23 394 739 729 490
3494D90j59n16O27M94O55k28m67j228n80k1J364P88O20p33j250m33K49Q01N37
$$ 490 331 -185 442 936 1591 1363 896 -332 -912 -933 431 1219 1839 1106 -144 -577 -328 473 1010
3513A010m71p97p98J21P72J108N08m51j538p12k05N42R59N60l88n13o32J88O93
$$ 1010 539 -258 -1056 -935 -163 945 1453 1002 -536 -1248 -1453 -911 48 608 220 -293 -925 -737 -44
3532d4M00j61l19j096m68M17J141O71N10k53j166k25o41Q69P53N62m86o01l38
$$ -44 356 195 -124 -1220 -1688 -1271 -130 541 1051 798 -368 -593 -1234 -365 388 950 464 -137 -475
3551d75M29Q81O09J01j241r63k61K71J139Q58J72m69j463m17M06P89M48n56q82
$$ -475 -46 835 1444 1545 304 -659 -920 -649 490 1348 1520 1051 -412 -829 -423 366 814 258 -624
3570f24o47L37Q40P19N76r26r05j060pQ55Q46N91j20l24r35k92O73N68K63r0o58
$$ -624 -1271 -934 -94 625 1201 275 -630 -1690 -1697 -842 4 595 475 151 -784 -1076 -403 165 428 338 -320
3591c20l97K38Q76R38L02n36r96q57m7N72Q46Q87m25q94p94J79R44P07l66q87
$$ -320 -717 -479 397 1335 1637 1101 105 -752 -799 -227 619 1506 1081 187 -607 -428 516 1223 857 -30
3611c0j050o07P18J162O21K86j166j397j30N46P27%m4o56l41Q5N82O90L69n92
$$ -30 -1080 -1687 -969 193 814 1100 -66 -1463 -1593 -1047 -320 -320 -364 -1020 -1361 -1276 -694 -4 365 -227
3631b27r11n70m0L41J179N02K82j084l22m10K85N81M05k43k27o31l7R27P05N51
$$ -227 -1138 -1708 -1748 -1407 -228 274 556 -528 -850 -1260 -975 -394 11 -232 -459 -1090 -1127 -200 505 1056
3651A056r32j293o40O5Q65Q48O19m01j024n88K23R67L53k68q39p31J43P30J310
$$ 1056 124 -1169 -1809 -1744 -879 -31 588 187 -837 -1425 -1202 -235 118 -150 -989 -1720 -1577 -847 463
3670D63L96k43j013m32o35N49J007Pj9j18n53O19mM04L74k3n78o51l02Q97Q93
$$ 463 859 616 -397 -829 -1464 -915 92 99 80 -38 -591 28 24 428 802 779 201 -450 -752 145 1038
3691A038M72K19q98o95n79J032Q9L23K03o76n91J81N66O91K05p48j008p67L56
$$ 1038 1510 1729 831 136 -443 589 678 1001 1204 528 -63 118 684 1375 1580 832 -176 -943 -587
3710e87J011R55J36j78j181m99r2Q86M06j05n67l44l30O66Q96J64m14l92l03m95
$$ -587 424 1379 1515 1337 156 -343 -435 451 857 752 185 -159 -489 177 1073 1237 823 431 128 -367
3730c67L42K44O67K17k59l04l34j28L52Q9K33n10r18l3Q41L15P07k04n67j115
$$ -367 -25 219 886 1103 844 540 206 78 430 519 752 242 -676 -709 132 447 1154 950 383 -732
3750g32m59L02M90P14j70n60l50k4M68L00j26m99o35k00L22N99O33L6k47m34n51
$$ -732 -1191 -889 -399 315 145 -415 -765 -789 -321 -21 -147 -646 -1281 -1481 -1159 -560 73 109 -138 -572 -1123
3771a123K30N92M87l57r1M8J58J54Q5M32l43o13l35o7J41K69O48J85K6o81p3k92
$$ -1123 -893 -301 186 -171 -262 -214 -56 98 183 615 272 -341 -676 -743 -602 -333 315 500 526 -155 -228 -520
3793e20M5L56j12l2k51k44J78J004J41J2p75p50l6J43Q21L21J01j84n0k78pM19
$$ -520 -475 -119 -231 -263 -514 -758 -580 424 565 577 -198 -948 -984 -841 -20 301 402 218 168 -110 -117 302
3815C02m2k37l40J00O82J31N35l83j02k75k91k48L04L62q0L68j58j11r2l5k17
$$ 302 260 23 -317 -217 465 596 1131 748 646 371 80 -168 136 498 418 786 628 517 425 390 173
3836A73J96m62k2k44n0M84N20M8l77j89l64j75n3K50K16r4j02K44K68J12J94o62
$$ 173 369 -93 -115 -359 -409 75 595 643 266 77 -287 -462 -515 -265 -49 -143 -245 -1 267 379 573 -89
3858h9k08j71M3N62P9M08k36l7j90l9rK12n17j16J12L73Q0Jj89J19k15l54K14
$$ -89 -297 -468 -425 137 216 624 388 351 161 122 113 325 -192 -308 -196 177 257 258 69 188 -27 -381 -167
3881a67m09q8J51K80O99j12l10l19j70O3k57mK53M1J07P5N7L31j74j45l64Q6l3
$$ -167 -576 -664 -513 -233 466 354 44 -275 -445 -382 -639 -643 -390 -349 -242 -167 -110 221 47 -98 -462 -376 -409
3904d09K20O6k6M27k4O5K2l33l51O5K88N9N35k77Q3l33L97J41k07o68R2r3NN33
$$ -409 -189 -123 -149 278 254 319 341 8 -343 -278 10 69 604 327 410 77 474 615 408 -260 -168 -261 -256 277
3928B77M36n2j87k87k95J14j05K10l33j79N7K74O5K95N5n75k44j68L16l34M00
$$ 277 713 661 474 187 -108 6 -99 111 -222 -401 -344 -70 -5 290 345 -230 -474 -642 -326 -660 -260
3949b60L00J59J93k16j79k30R5M09l56R2K04l25O00J22L19m4k42p39l76L98L65
$$ -260 40 199 392 176 -3 -233 -138 271 -85 7 211 -114 486 608 927 883 641 -98 -474 -76 289
3970B89M81j7l87l10JL6M00m75K98o95l07J63M92Q65k84No16o45l6L96r3L11J99
$$ 289 770 753 366 56 57 93 493 18 316 -379 -686 -523 -31 834 550 555 -61 -706 -742 -346 -439 -128 71
3993G1k27j20M41j0n2K05k99l37l14R9P36M74L06m96l77k6k26j00M6L66mj63l13
$$ 71 -156 -276 165 155 103 308 9 -328 -642 -543 193 667 973 477 100 74 -152 -252 -206 160 156 -7 -320
4016c20O38J68M80n57n63l78m01N26P29K13r3k95n98O1K01K66R4l59n98M75m59
$$ -320 318 486 966 409 -154 -532 -933 -407 322 535 442 147 -451 -390 -189 77 171 -188 -786 -311 -770
4037g70J037L70o0m12n55l39p4L55N58PJ19l40j78L4m9L74q8j25l77j28Q1O29
$$ -770 267 637 577 165 -390 -729 -803 -448 110 117 236 -104 -282 -248 -297 77 -11 -136 -513 -641 -560 69
4059F9L92M75l39p65m91l51P48M82L82l55o02k25M40N27N23n97n87o94N0M08P79
$$ 69 461 936 597 -168 -659 -1010 -262 220 602 247 -355 -580 -140 387 910 313 -274 -968 -918 -510 269
4080B69O24l46l10o21l62M89J51J01K01m59k17m9P14N01J37l06n33r08J73O53
$$ 269 893 547 237 -384 -746 -257 -106 -5 196 -263 -480 -529 185 686 823 517 -16 -924 -751 -98
4100i8K50P12nm84l29P6J53L21m23J00m91p3J41M22O34N48o61r56p35M04P45L94
$$ -98 152 864 859 375 46 122 275 596 173 273 -218 -291 -150 272 906 1454 793 -163 -898 -494 251 645
4122F45M51p17m67j31L08J70J75j57m88l90j16O55L97N99k27m17p76m8K75J97
$$ 645 1096 379 -88 -219 89 259 434 277 -211 -601 -717 -62 335 934 707 290 -486 -534 -259 -62
4142f2K41M34p04n4K01J15J28K03n9o30r37J03M60J039M05n6n31q51k86M04M89
$$ -62 179 613 -91 -145 56 171 299 502 443 -187 -1124 -1021 -561 478 883 827 296 -555 -841 -437 52
4163E2JL86o96m08k30J104M45J84p69o50o99L82P31O74J66l64n17n22K84K10P38
$$ 52 53 439 -257 -665 -895 209 654 838 69 -581 -1280 -898 -167 507 673 309 -208 -730 -446 -236 502
4184E02m61m86r0m7L36N99O43l88o54m26k37L32M44N38J52k04m87J10k74N02L57
$$ 502 41 -445 -535 -582 -246 353 996 608 -46 -472 -709 -377 67 605 757 553 66 176 -98 404 761
4205G61m54l02p56J25O69P13Q41m34o60q06k76K75M81O32J2n09p56M79L38N27
$$ 761 307 5 -751 -626 43 756 1597 1163 503 -303 -579 -304 177 809 821 312 -444 35 373 900
4225I00k34n46o99k99O17N10N41p9j73m67l63m13P56L98j76J44p04J88L62J49
$$ 900 666 120 -579 -878 -261 249 790 711 538 71 -292 -705 51 449 273 417 -287 -99 263 412
4245D12J69K82n87p53j28K56M05P49N3l89n86l07L30J18L48k30l87n75K48L93
$$ 412 581 863 276 -477 -605 -349 56 805 858 469 -117 -424 -94 24 372 142 -245 -820 -572 -179
4265a79P01J8j97j156l29p0K89P10L96m43k00k51j86N23N92m80j30n06j42K21
$$ -179 522 540 343 -813 -1142 -1212 -923 -213 183 -260 -460 -711 -897 -374 218 -262 -392 -898 -1040 -819
4285h19L37Q48O3n45j21l60j44L66J27K96J63k65k55R6L54M00j90r6p36n36J91
$$ -819 -482 366 429 -116 -237 -597 -741 -375 -248 48 211 -54 -309 -213 141 541 351 255 -481 -1017 -826
4306h26R35L8L81k72n06n61M02K12K45j3j86m18r2P51K81J84j42j116R6l29M24
$$ -826 109 147 528 256 -250 -811 -409 -197 48 35 -151 -569 -661 90 371 555 413 -703 -607 -936 -512
4327e12N98L89J59m71k10l6M97n31N40k92j35q5K29M51K35m1l47m06k93L12j69
$$ -512 86 475 634 163 -47 -83 414 -117 423 131 -4 -89 140 591 826 785 438 32 -261 51 -118
4348a18N45M2K17n4l78J32j44J64o0n17n24Q0M29M11M00j1o26k55m36K84L0O00
$$ -118 427 469 686 632 254 386 242 406 346 -171 -695 -615 -186 225 625 614 -12 -267 -703 -419 -389 211
4370B11k85J05k88j18N89K46j85m49l64N3Q0M41j00O16M2j79l87Pj04KJ91n9p6
$$ 211 -74 31 -257 -375 214 460 275 -174 -538 -485 -405 36 -64 552 594 415 28 35 -69 -67 124 65 -11
4393a1j48r1N48%K31k97m24l71J99P0j43O38J02l50k05j72q6M75l73j63qk64K80
$$ -11 -159 -250 298 298 529 232 -192 -563 -364 -294 -437 201 303 -47 -252 -424 -510 -35 -408 -571 -579 -843 -563
4416e63J82M90n7l35l81M7k34L75K36oq4L10J12l9p1j86m11jP25j37L82Q9O4J47
$$ -563 -381 109 52 -283 -664 -617 -851 -476 -240 -246 -330 -20 92 53 -18 -204 -615 -616 109 -28 354 443 507 654
4440F54l38Jl68q2k41L53j00L16J41j50k94K87m57L74k85n51O5M4M48M24o2l38
$$ 654 316 317 -51 -133 -374 -21 -121 195 336 186 -108 179 -278 96 -189 -740 -675 -631 -183 241 179 -159
4462a59J57k96r3J9q6pJ7J70JL31R4J5q1j95k04L25K0J47k32J95L43j92L2l34
$$ -159 -2 -298 -391 -372 -458 -465 -448 -278 -277 54 148 163 82 -113 -317 8 28 175 -57 138 481 289 321 -13
4486a3R3j24k72O23o0k8K22j09k13K60m32o2m27K85M9M58J7P7k31Q2k22m50L18
$$ -13 80 -44 -316 307 247 219 441 332 119 379 -53 -115 -542 -257 -208 250 267 344 113 195 -27 -477 -159
4509a59n3k31N81j67P0M20M1l96j70K08j85k88Q4J77L82K93l4m89rk13m0K15L86
$$ -159 -212 -443 138 -29 41 461 502 106 -64 144 -41 -329 -245 -68 314 607 573 84 75 -138 -178 37 423
4532D23p5qk24m9J37N86mo95m58J59n3K70J62K99q2k91j6J0k82J91j13ol01L84
$$ 423 348 340 116 67 204 790 786 91 -367 -208 -261 9 171 470 388 97 81 91 -191 0 -113 -119 -420 -36
4556c6L77k37K6N7l5l81l93LK59K57N32l3r5l93m2K71k20kN30n97j21R5O91k1
$$ -36 341 104 130 187 152 -229 -622 -619 -360 -103 429 396 301 -92 -134 137 -83 -85 445 -152 -273 -178 513 492
4580D92j2j19n51k78mK71L39K35l68k80PM46M7j30j28m05l40L37K70O03j53O0
$$ 492 480 361 -190 -468 -472 -201 138 373 5 -275 -268 178 225 95 -33 -438 -778 -441 -171 432 279 339
4602C39n47l26L8K69j61M81j18n1j54J18K81L42j62n02j0n95L12J74M73L02j16
$$ 339 -208 -534 -496 -227 -388 93 -25 -76 -230 -112 169 511 349 -153 -163 -758 -446 -272 201 503 387
4623C87k86j45m04L90J31J73j25k8k94K20N10L57k31n23l49l54J63O85J97m3n6
$$ 387 101 -44 -448 -58 73 246 121 93 -201 19 529 886 655 132 -217 -571 -408 277 474 431 375
4644C75l05MJ61J82j54k45k81K0J21k5O95K66j68j25n42r1j86J76L85K70k19o3
$$ 375 70 74 235 417 263 18 -263 -243 -122 -147 548 814 646 521 -21 -112 -298 -122 263 533 314 251
4666B51j31mL78j98m07m27J68k81K97R38M3k60k69p62K02N4M78J31m32j75j00
$$ 251 120 116 494 296 -111 -538 -370 -651 -354 584 627 367 98 -664 -462 -408 70 201 -231 -406 -506
4687e06L88N30K71m58l69n52j83L69N04L02J32n63n2j10K5K3r9L64l67m8jO41
$$ -506 -118 412 683 225 -144 -696 -879 -510 -6 296 428 -135 -187 -297 -272 -249 -348 16 -351 -399 -400 241
4709B41k69M81j27k94l12n56L68O06M10J81m58m69l85N89k3J83j10j19m28J50
$$ 241 -28 453 326 32 -280 -836 -468 138 548 729 271 -198 -583 6 -17 166 56 -63 -491 -341
4729c41K84P80n4o7m66p88Q6K74N25J89k20n52K30j04M81q6J05m31l27J53J23
$$ -341 -57 723 669 602 136 -652 -566 -292 233 422 202 -350 -120 -224 257 171 276 -155 -482 -329 -206
4750b06N83M6L43n18k40j04k36M09K1K21l1L9m06M95L2J03q9l16p46k6N89N53
$$ -206 377 423 766 248 8 -96 -332 77 98 319 288 327 -79 416 448 551 462 146 -600 -626 -37 516
4772E16K23K20o58k90k96K19K18K82j64m36l74O2M83N89P7o55k83m81l9M24N71
$$ 516 739 959 301 11 -285 -66 152 434 270 -166 -540 -478 5 594 671 16 -267 -748 -787 -363 208
4793B08j30M6l03j55j18J23L87k54j75k47k51O64L92K73J23o23n8n70L97l76O75
$$ 208 78 124 -179 -334 -452 -329 58 -196 -371 -618 -869 -205 187 460 583 -40 -98 -668 -271 -647 28
4814B8K11j96m22k43M19K28K72n1m55m70j19P03K65R1oj54o56J7K73K22R5j70
$$ 28 239 43 -379 -622 -203 25 297 246 -209 -679 -798 -95 170 261 255 101 -555 -538 -265 -43 52 -118
4836a18J66n29N28R5K42R7k70q37L3n4M18J77K72K21r8n12l70N29O1J05k88L66
$$ -118 48 -481 47 142 384 481 211 -626 -593 -647 -229 -52 220 441 343 -169 -539 -10 51 156 -132 234
4858B34l20n4K25K79K6p4m81j80k03M48K65K78j75l50K99l35L57m9m1j41k90K01
$$ 234 -86 -140 85 364 390 316 -165 -345 -548 -100 165 443 268 -82 217 -118 239 190 149 8 -282 -81
4880h1n4O06K91l27l19k63m72M39K46j34O3q7K95j73j00K33l34Q7l19j75J24J82
$$ -81 -135 471 762 435 116 -147 -619 -180 66 -68 -5 -92 203 30 -70 163 -171 -84 -403 -578 -454 -272
4902b72M53K41k16j35j44l69j62N08m5K86r5k02J40N0L15j23J63q21J4j35Q47
$$ -272 181 422 206 71 -73 -442 -604 -96 -141 145 50 -152 -12 38 353 230 393 -428 -414 -549 298
4923B98J56l10K45n39Q5N5j14r2R1K00n30k84O69O16k06j66j94l01k63N50j23
$$ 298 454 144 389 -150 -65 -10 -124 -216 -125 75 -455 -739 -70 546 340 174 -20 -321 -584 -34 -157
4944a57P6K99pN6n1m3j5O0P3l99L3M22o3J04m1O02k86o34j63K70L30k63K89k73
$$ -157 -81 218 211 267 216 173 158 218 291 -108 -75 347 284 388 347 949 663 29 -134 136 466 203 492 219
4968B19J73K02k68K04l89ll56k25L35L69OR8k33j90l7K87j52k33J61q3j07L76
$$ 219 392 594 326 530 141 138 -218 -443 -108 261 267 365 132 -58 -95 192 40 -193 -32 -115 -222 154
4990A54O6k68J51q1k14M45n06J18J61N95l25K00k60m8p7m12K71M5K91k97J77L4
$$ 154 220 -48 103 22 -192 253 -253 -135 26 621 296 496 236 188 111 -301 -30 15 306 9 186 220
5012B20q3O3N4l86j78p5L46K27l20N49m44j60J61J0Q7k92K0k28J57J4L77J12k04
$$ 220 137 200 254 -132 -310 -385 -39 188 -132 417 -27 -187 -26 -16 71 -221 -201 -429 -272 -258 119 231 27
5035B7j80J38k37L7K70m60J60J69O8J68k43J67k11o0j20J9J34nJ42J56j09O06
$$ 27 -153 -15 -252 -215 55 -405 -245 -76 -8 160 -83 84 -127 -187 -307 -288 -154 -159 -17 139 30 636
5057F36m36l06j8k46J55K74j35K07k9L3j07mQ3k70l57L31J67K77l21l0J82L8j36
$$ 636 200 -106 -124 -370 -215 59 -76 131 102 135 28 24 107 -163 -520 -189 -22 255 -66 -96 86 124 -12
5080a2J19p09J72K15J80L25l33M51o25L73k40M3J10j99k85J70K64K16J37k20P0
$$ -12 107 -602 -430 -215 -35 290 -43 408 -217 156 -84 -41 69 -130 -415 -245 19 235 372 152 222
5101B22j69m71J20L37j70O6J64k7n0J2j3J1Oj76k30M41k35K03K58K1l37o4J23
$$ 222 53 -418 -298 39 -131 -65 99 72 22 34 21 32 38 -138 -368 73 -162 41 299 320 -17 -81 42
5124D2l98q4O67j20m2L08k26k69L68n5K1n7k91lr6L49K61L22j78o71K02k9J6k55
$$ 42 -356 -440 227 107 65 373 147 -122 246 191 212 155 -136 -139 -235 114 375 697 519 -152 50 21 37 -218
5148b18L93l04j29J99M9N30k64m8m33k71J06M34j1j84K07Ko8P5J30j1l02K51j21
$$ -218 175 -129 -258 -59 -10 520 256 208 -225 -496 -390 44 33 -151 56 58 -10 65 195 184 -118 133 12
5171A2k77J99N61k90L22l18j95m69J45K37p2L90J52q4m01PJ84J6n1o8l11m22L21
$$ 12 -265 -66 495 205 527 209 14 -455 -310 -73 -145 245 397 313 -88 -81 103 119 68 0 -311 -733 -412
5194d12M33N20j69o29j91L5m6J0M82k89J13j41J26l0J61j25J31k60k78K8K22j4
$$ -412 21 541 372 -257 -448 -413 -459 -449 33 -256 -143 -284 -158 -188 -27 -152 -21 -281 -559 -531 -309 -323
5216c23L45L01j30m79q5k31J02N31m1k61K9J57L31j15j1l5k20j60l48K80N50M34
$$ -323 22 323 193 -286 -371 -602 -500 31 -10 -271 -242 -85 246 131 120 85 -135 -295 -643 -363 187 621
5238F21k18q06K64K0J28M1K6j96k78r8J42L63L82p8k75k51l64K83L28j34L01L1
$$ 621 403 -403 -139 -119 9 50 76 -120 -398 -496 -354 9 391 313 38 -213 -577 -294 34 -100 201 232
5260B32P9n62O6L43j21L3J17m63Q6J82K71M54k92j16n99P9J9N75r1J03J40o28
$$ 232 311 -251 -185 158 37 70 187 -276 -190 -8 263 717 425 309 -290 -211 -192 383 292 395 535 -93
5282i3j3L97m5K79k34j75n45K77N3O06J39o2n47n2l90K19n5K35L6j68R1J98l4
$$ -93 -106 291 246 525 291 116 -429 -152 -99 507 646 584 37 -15 -405 -186 -241 -6 30 -138 -47 151 117
5305A17K06j59j65l34j04m2N67j41L37MM2j94j28k81K33L65o16p7J14K73L67J63
$$ 117 323 164 -1 -335 -439 -481 86 -55 282 286 328 134 6 -275 -42 323 -293 -370 -256 17 384 547
5327E47k32l14n25k50L55L24Q6K36m83O1k66L37J53k7n01J89m99L62L55K82K07
$$ 547 315 1 -524 -774 -419 -95 -9 227 -256 -195 -461 -124 29 2 -499 -310 -809 -447 -92 190 397
5348C97l35p5l34k04J65M89j00k27L58l59K19J24M3K91n53l47Q2K31l8L11L23
$$ 397 62 -13 -347 -551 -386 103 3 -224 134 -225 -6 118 161 452 -101 -448 -366 -135 -173 138 461
5369D61q3j00m29k71O88m88M10j64kjJ7N8M96j27k41l83k33K95K53M41K84m93
$$ 461 378 278 -151 -422 266 -222 188 24 22 21 38 96 592 465 224 -159 -392 -97 156 597 881 388
5391C88j43j14K46q8K91k60l74N3l2M85J65m9J07n76l63L74j09K55L9M4rLk11
$$ 388 245 131 377 289 580 320 -54 -1 -33 452 617 568 675 99 -264 110 1 256 295 339 330 333 122
5414A22L6j15m1K94k06k40K04Q0N01m37K08q5l08k17j12J81K03M29n50k44Q5K88
$$ 122 158 43 2 296 90 -150 54 134 635 198 406 321 13 -204 -316 -135 68 497 -53 -297 -212 76
5436G6M1J20m81R8j93P3M00K07J52l75j78j27P3K72j68J45k71j38K94l4L67j58
$$ 76 117 237 -244 -146 -339 -266 134 341 493 118 -60 -187 -114 158 -10 135 -136 -274 20 -14 353 195
5458A95l22q7j65M0r8O44Q4j35j82o7k43R1K69j0j37n6q0J79J76jN9j23J55n45
$$ 195 -127 -214 -379 -339 -437 207 291 156 -26 -93 -336 -245 24 14 -123 -179 -259 -80 96 95 154 31 186 -359
5482c59j37M40J42P1m4N5m89L81J13q9j60k82P1K35P6j89K62O9j5k52K02n26N58
$$ -359 -496 -56 86 157 113 168 -321 60 173 84 -76 -358 -287 -52 24 -165 97 166 151 -101 101 -425 133
5505A33r1J12Q8k60j9q3L65J11k41o27M09P4j74L22K67j54J64m37m5R5J85m09
$$ 133 42 154 242 -18 -37 -120 245 356 115 -512 -103 -29 -203 119 386 232 396 -41 -86 9 194 -215
5527b15J40MJ07o4J46p1L66m30l58J4M8K6J99M65l10l87K49l0O9J16l07J94l0
$$ -215 -75 -71 36 -28 118 47 413 -17 -375 -361 -313 -287 -88 377 67 -320 -71 -101 -32 84 -223 -29 -59
5550e9j90L94L8%k4J42k8k06k97L18J32Q3l7K2n0k49o6L31q0j38kj59R4L38K82
$$ -59 -249 145 183 183 159 301 273 67 -230 88 220 303 266 288 238 -11 -77 254 174 36 34 -125 -31 307 589
5575E89l76j51J17j37m48M56q2O4K01j57K0j16J15q7oj58k2J13K49l7j03J48l55
$$ 589 213 62 179 42 -406 50 -32 32 233 76 96 -20 95 8 2 -156 -178 -65 184 147 44 192 -163
5598a63K92j80J03k90N2p7L18j34j2N02m25L01j63j28K6J4P4j16P4o7M8j13k10
$$ -163 129 -51 52 -238 -186 -263 55 -79 -91 411 -14 287 124 -4 22 36 110 -6 68 1 49 -64 -274
5621b74L28k82q3K56j29K6j28M30K99l85l03jn0r1J0L14Q2r4K50J76l36l21K1
$$ -274 54 -228 -311 -55 -184 -158 -286 144 443 58 -245 -246 -296 -387 -377 -63 19 -75 175 351 15 -306 -285
5644b85j12J59J7J06rk3K50k13L90j93j70m6r0N8K20k6K90j13j53o7r7m5j80J81
$$ -285 -397 -238 -221 -115 -124 -147 103 -110 280 87 -83 -129 -219 -161 59 33 323 210 57 -10 -107 -152 -332 -151
5668a51j98J03n6K10L42O3l73j11K29l66K32j96k0M36k4J63n26J95K10k38N3J74
$$ -151 -349 -246 -302 -92 250 313 -60 -171 58 -308 -76 -272 -292 144 120 283 -243 -48 162 -76 -23 151
5690A51l69K57J10j31L39j8m4k96j88j68K95O7K95j35J40L4k16k8r3O4ol2j31
$$ 151 -218 39 149 18 357 339 295 -1 -189 -357 -62 5 300 165 305 339 123 95 2 66 60 28 -103
5713a03n3J38L71k29P1l32qj28J75m7m8L37jl7l1o8J14j98Kk36Q7j52M90m8K64
$$ -103 -156 -18 353 124 195 -137 -145 -273 -98 -145 -193 144 143 106 75 7 121 -77 -75 -311 -224 -376 114 66 330
5738C30j28n55K55k49L85J00k79J61p4J99J11J86l46K09q89L34N07l36K11KK35
$$ 330 202 -353 -98 -347 38 138 -141 20 -54 145 256 442 96 305 -584 -250 257 -79 132 134 369
5759C69k52J28l86j03J1L42l35K67j84L44n3j35j05k06J92j37L5P5M61l51L5K56
$$ 369 117 245 -141 -244 -233 109 -226 41 -143 201 148 13 -92 -298 -106 -243 -208 -133 328 -23 12 268
5781B68l31R4j64L11k27L68m40K59j97M87j39M3O5k42l19J27K89o0j08J06k23
$$ 268 -63 31 -133 178 -49 319 -121 138 -59 428 289 332 397 155 -164 -37 252 192 84 190 -33
5802c3L20oL06Q7k91k54K1J73j55Mj60L19k39j81k48J99j73L25l08K02l1L26j33
$$ -33 287 281 587 674 383 129 150 323 168 172 12 331 92 -89 -337 -138 -311 14 -294 -92 -123 203 70
5825G0J24j36j20K26n80K29j18M59m6L53m56j29j23O3J21J67j8m05K61j28L78
$$ 70 194 58 -62 164 -416 -187 -305 154 108 461 5 -124 -247 -184 -63 104 86 -319 -58 -186 192
5846A92r5M14l47k45k22J70qM82k27o6j14J08j7l16N11m99J64k5q3J26L30n9j45
$$ 192 97 511 164 -81 -303 -133 -141 341 114 48 -66 42 25 -291 220 -279 -115 -140 -223 -97 233 174 29
5869B9K9m28K77P1k97M19M8r3J62k13r2K35L5l17j16k6J54O5M15pj64k35MP1j71
$$ 29 58 -370 -93 -22 -319 100 148 55 217 4 -88 147 182 -135 -251 -277 -123 -58 357 350 186 -49 -45 26 -145
5894a45M26q8j15j22L52l32L90K35m32l3j98k36K82J98K23l05K79l71L7j99K4
$$ -145 281 193 78 -44 308 -24 366 601 169 136 -62 -298 -16 182 405 100 379 8 45 -154 -130
5915a30K71j78J71j26j37K43K00L3j85nl57o4L60j89K48P4j16kj07q9L31J85l20
$$ -130 141 -37 134 8 -129 114 314 347 162 157 -200 -264 96 -93 155 229 113 111 4 -85 246 431 111
5938A11j51j13O9J72L48j12j22j0k54k41J21O40k58l2j87o5J05K21n3p1k32M2
$$ 111 -40 -153 -84 88 436 324 202 192 -62 -303 -182 458 200 168 -19 -84 21 242 189 118 -114 -72
5960g2l2L2J62R6K35l05j65l54J82K85j27Q1k09J36j8R2K06q2K6k30q0m67J37
$$ -72 -104 -72 90 186 421 116 -49 -403 -221 64 -63 18 -191 -55 -73 19 225 143 169 -61 -141 -608 -471
5983d71M74L97n15K12K1k08K18l04J18m64L27O8j56L83j82j14N12m19j35k09K18
$$ -471 3 400 -115 97 118 -90 128 -176 -58 -522 -195 -127 -283 100 -82 -196 316 -103 -238 -447 -229
6004b29L7J57N0J6N2R3j74l39K76j74j65J62J82KJ77J95L1l27k97J69K3j42K65
$$ -229 -192 -35 15 31 83 176 2 -337 -61 -235 -400 -238 -56 -54 123 318 349 22 -275 -106 -83 -225 40
6027D0R5J14m10J34Q7O0p5Kk00k13M32Q5m3L08k21k14K4j3m44K84K08Q7l25K58
$$ 40 135 249 -161 -27 60 120 45 47 -153 -366 66 151 108 416 195 -19 5 -8 -452 -168 40 127 -198 60
6051F0j52M29k5n55P1j48N5j2L30P5L0l01K94k29J20k60K04k5k30K11K56Q9k32
$$ 60 -92 337 312 -243 -172 -320 -265 -277 53 128 158 -143 151 -78 42 -218 -14 -39 -269 -58 198 287 55
6074E5K04l66l13N30k53J07r1K37L3l1k02j22k0J58J20l58K12N2J5l1J45K28o98
$$ 55 259 -107 -420 110 -143 -36 -127 110 143 112 -90 -212 -232 -74 46 -312 -100 -48 -33 -64 81 309 -389
6097c89K30Ojj82L97k31J33q5K9J10j36j27j95o3N75l88L56j36J55r1k57K32j98
$$ -389 -159 -153 -154 -336 61 -170 -37 -122 -93 17 -119 -246 -441 -504 71 -317 39 -97 58 -33 -290 -58 -256
6120b56K00j14J94J51j94L91L3L2m06R0J5r9j89j89K06L23J80k08k29rK33l18
$$ -256 -56 -170 24 175 -19 372 405 437 31 121 136 37 -152 -341 -135 188 368 160 -69 -78 155 -163
6142a63Q5M7R6l25N30j76n0M8p4n4j75j14K11J6j9O7L02k17K03l17K30j83l39
$$ -163 -78 -31 65 -260 270 94 44 92 18 -36 -211 -325 -114 -98 -117 -50 252 35 238 -79 151 -32 -371
6165c71M84k54Q3N47m80J49p8p1j18L55l04J18M9MJ17L27k15m40J68o5J46j80
$$ -371 113 -141 -58 489 9 158 80 9 -109 246 -58 60 109 113 230 557 342 -98 70 5 151 -29
6187b9j18L79p1L00k68q8p0R0j91L33m26j75L76J80R7k59n5J02k33K2J09P5j40
$$ -29 -147 232 161 461 193 105 35 125 -66 267 -159 -334 42 222 319 60 5 107 -126 -104 5 80 -60
6210f0P9l00J85R2K76j86k28j97M14r3J66l36J95K34j82k6Q7K15r8m84M5K72j0
$$ -60 19 -281 -96 -4 272 86 -142 -339 75 -18 148 -188 7 241 59 33 120 335 237 -247 -202 70 60
6233F0P8J29l59r1K97l33K19l28j94L42m0L89j08j94R4J3M3j36j25K24L6k4J81
$$ 60 138 267 -92 -183 114 -219 0 -328 -522 -180 -220 169 61 -133 -39 -26 17 -119 -244 -20 16 -8 173
6256A73k86J99j39k27q3r8L00J69k73o9K70J23k43J66j31J44j03N3P3o8K80j26
$$ 173 -113 86 -53 -280 -363 -461 -161 8 -265 -334 -64 59 -184 -18 -149 -5 -108 -55 18 -50 230 104
6278A04j59j42M1M5nK66m37L94j3J15J76n69N25j65k79K51p79M49K10J04R6m14
$$ 104 -55 -197 -156 -111 -116 150 -287 107 94 209 385 -184 341 176 -103 148 -631 -182 28 132 228 -186
6300a86L05O7m81J83j08QJ52m1k8M05J30K24k93m55J94N8L7j90J56j92M09j56
$$ -186 119 186 -295 -112 -220 -212 -60 -101 -129 276 406 630 337 -118 76 134 171 -19 137 -55 354 198
6322A98N8k38J3J43Q9l57J00L7K89K19m91j31J11N1j72Q2l27L07L30j88k66j47
$$ 198 256 18 31 174 263 -94 6 43 332 551 60 -71 40 91 -81 1 -326 -19 311 123 -143 -290
6344b90L74p6j79k81M61j96N9P2J96J13m1m00P2J80k10rL85j69m61L50L5Q7j66
$$ -290 84 8 -171 -452 9 -187 -128 -56 140 253 212 -188 -116 64 -146 -155 230 61 -400 -50 -15 72 -94
6367i4o5L1K42j14N5l4k40K76J2l68J25K62l06K30k34%j40J48J81J09j69K05j85
$$ -94 -159 -128 114 0 55 21 -219 57 69 -299 -174 88 -218 12 -222 -222 -362 -214 -33 76 -93 112 -73
6390g3l35N7K39k9L14j57LmqJ66m14m4J74J39N6k85M36R7K13n87rk21J73K84J88
$$ -73 -408 -351 -112 -141 173 16 19 15 7 173 -241 -285 -111 28 84 -201 235 332 545 -42 -51 -272 -99 185 373
6415C73j44m13M05j3K06m20N03m78j7J06k2l36M47L43k97k23NM4J84k34P2L5j0
$$ 373 229 -184 221 208 414 -6 497 19 2 108 86 -250 197 540 243 20 25 69 253 19 91 126 116
6438A16l11L87R4N8P1k59m03K73m08J9O93l57O6k40J9J89j45j29K38J20O8k81
$$ 116 -195 192 286 344 415 156 -247 26 -382 -363 330 -27 39 -201 -182 7 -138 -267 -29 91 159 -122
6460a22N5jL7n6K87o76L76M0j29R6P9j10J63k99M81l65k7M49m79k19L55M05l50
$$ -122 -67 -68 -31 -87 200 -476 -100 -60 -189 -93 -14 -124 39 -260 221 -144 -171 278 -201 -420 -65 340 -10
6483a0K41j25m35M48k22N8j5r0K78q9o4K3%K02o1l73P7j77K00M76k54j74J03J8
$$ -10 231 106 -329 119 -103 -45 -60 -150 128 39 -25 -2 -2 200 139 -234 -157 -334 -134 342 88 -86 17 35
6507C5n6J61%j70J30J7k11m1J71K51K9k07k48j86K62pJ42J56j76K39O9o05J70
$$ 35 -21 140 140 -30 100 117 -94 -135 36 287 316 109 -139 -325 -63 -70 72 228 52 291 360 -245 -75
6530g5L4r2J39l2j77J66M10j03o1J24l57j59j44K84lL01K7r4k48J86J04l40K28
$$ -75 -41 -133 6 -26 -203 -37 373 270 209 333 -24 -183 -327 -43 -46 255 282 188 -60 126 230 -110 118
6553A18r9j08m2k9J95Q6l5K25m01j33m6K29k8q0M14m90K09K48k44qJ3j62J75J17
$$ 118 19 -89 -131 -160 35 121 86 311 -90 -223 -269 -40 -68 -148 266 -224 -15 233 -11 -19 -6 -168 7 124
6577A24k56P2L30o9j46n4N0j51M99m70J68k02L1K1L6J75J25k80N4P9m89K26M2
$$ 124 -132 -60 270 201 55 1 51 -100 399 -71 97 -105 -74 -53 -17 158 283 3 57 136 -353 -127 -85
6600h5L11J43j25o4P6l73K91k9j61j65J46N1m8K63M34l68m22J58j02J43o2Q5k00
$$ -85 226 369 244 180 256 -117 174 145 -16 -181 -35 16 -32 231 665 297 -125 33 -69 74 12 97 -103
6623a03J91L41m98k7l2J96J58m05r5K28J94l3j77J18j32J50m62RL11L25m45J53
$$ -103 88 429 -69 -96 -128 68 226 -179 -274 -46 148 115 -62 56 -76 74 -388 -379 -68 257 -188 -35
6645c5Q2Q9k28Q4L7k73r3L25O9J29M8j37j4L49k82q6P0j61J92j54J60j85L16j78
$$ -35 47 136 -92 -8 29 -244 -337 -12 57 186 234 97 83 432 150 64 134 -27 165 11 171 -14 302 124
6669A24J47n34K95K23k06l58K03J91J84k86J93J25n48M57l93J53J77m6J60k32
$$ 124 271 -263 32 255 49 -309 -106 85 269 -17 176 301 -247 210 -183 -30 147 101 261 29
6689B9mK93j75J81l42k9j82R6K04k52M03l26K58k54J43k15j22J45J92n6j07K87
$$ 29 25 318 143 324 -18 -47 -229 -133 71 -181 222 -104 154 -100 43 -172 -294 -149 43 -13 -120 167
6711A67k38k03J64q2L21l95M8j71K39L46j2j39L2m13J01nOOj02J36J56k42L04
$$ 167 -71 -274 -110 -192 129 -266 -218 -389 -150 196 184 45 77 -336 -235 -240 -234 -228 -330 -194 -38 -280 24
6734B4j81n1J22P7j86Q1l74M77K9J76k03K09j88ll18J37K38j61K02N0k52J21K09
$$ 24 -157 -208 -86 -9 -195 -114 -488 -11 18 194 -9 200 12 9 -309 -172 66 -95 107 157 -95 26 235
6757B35k84J00R8l54N0j4J84n1Q7P5o6k71K18j12o7L04l8K4O1L0l26J36JJ36r6
$$ 235 -49 51 149 -205 -155 -169 15 -36 51 126 60 -211 7 -105 -172 132 94 118 179 209 -117 19 20 156 60
6782F0m0K9N8O9n7k20j1N08m94K7p7L9J06R7J59k0K9r1k91j74J30J36J86Qj66
$$ 60 20 49 107 176 119 -101 -112 396 -98 -71 -148 -109 -3 94 253 233 262 171 -120 -294 -164 -28 158 166 0
6807@j60N87Q2m95K19n96J96J82k94L41j31R2K24j75j94j07L64k67J03K80k62
$$ 0 -160 427 509 14 233 -363 -167 15 -279 62 -69 23 247 72 -122 -229 135 -132 -29 251 -11
6828a1n2M76k61o5l39L7K77j09j31Q0J27L5k94m0M72l93J95l28P6K39p7n3J07
$$ -11 -63 413 152 87 -252 -215 62 -47 -178 -98 29 64 -230 -270 202 -191 4 -324 -248 -9 -86 -139 -32
6851c2o0J9J73j6j12l18J05J35K06O6M2J8M4j11j77Nl2L2J5l60J40M05J81l01
$$ -32 -92 -73 100 84 -28 -346 -241 -106 100 166 208 226 270 159 -18 -13 -45 -13 2 -358 -218 187 368 67
6875F7j5j14K27k80Q1K3K12j40j76K10n4j06K04Jl96j1K41nL9L3k38J45J4j2m98
$$ 67 52 -62 165 -115 -34 -11 201 61 -115 95 41 -65 139 140 -256 -267 -26 -31 8 41 -197 -52 -38 -50 -548
6900e48O63j05k80J57j12P2L34j28j14J25k72JJ96j74QK72j6J78q9k50J26k20
$$ -548 115 10 -270 -113 -225 -153 181 53 -61 64 -208 -207 -11 -185 -177 95 79 257 168 -82 44 -176
6922a76J64k86J77K88J09mj57k80j77L78k56J82O0j20N20m10j01O3N8k2j77M5
$$ -176 -12 -298 -121 167 276 272 115 -165 -342 36 -220 -38 22 -98 422 12 -89 -26 32 10 -167 -122
6944a22N1r2M81l72J39O8n8n8j27N5r1K62r7j64K38J10l1k8j61RK13l77M78j03
$$ -122 -71 -163 318 -54 85 153 95 37 -90 -35 -126 136 39 -125 113 223 192 164 3 12 225 -152 326 223
6968B23k02J71J01l63j2j18J84L7N4p7j30L18R2L5P4k80j57J08j77j0j75N00j45
$$ 223 21 192 293 -70 -82 -200 -16 21 75 -2 -132 186 278 313 387 107 -50 58 -119 -129 -304 196 51
6991E1o7N4L9J00l25p7L94j37j00m4R6j24M58j53l13j87J61J03j00K15k98J31
$$ 51 -16 38 77 177 -148 -225 169 32 -68 -112 -16 -140 318 165 -148 -335 -174 -71 -171 44 -254 -123
7013a23M1Q7K16l09j56J86J36m68M16k8J4J54Ok81Q4j82n1K04J35K73j45k01j4
$$ -123 -82 5 221 -88 -244 -58 78 -390 26 -2 12 166 172 -109 -25 -207 -258 -54 81 354 209 8 -6
7036fK7j45K93k90o6k1K12K70k34j8k50M63M0k21j25K52ok73K08k37L72J8j73
$$ -6 21 -124 169 -121 -187 -208 4 274 40 22 -228 235 275 54 -71 181 175 -98 110 -127 245 263 90
7059I0J13p4k51J66Mj87L09k94M82m00q2J01l2K17Mk0l87RM63j49oO0j67Oj45
$$ 90 203 129 -122 44 48 -139 170 -124 358 -42 -124 -23 -55 162 166 146 -241 -232 231 82 76 136 -31 -25 -170
7084a70n4J40p1L98l7j05j17J50Qk28K4mJ2J16j37m6J69J41k47J77j89k46L4j09
$$ -170 -224 -84 -155 243 206 101 -16 134 142 -86 -62 -66 -54 62 -75 -121 48 189 -58 119 -70 -316 -282 -391
7108c91J65N1j24J35L16l44K73j65l2l9J4L38j02l09J62J24j0M1k02j44K28l2
$$ -391 -226 -175 -299 -164 152 -192 81 -84 -116 -155 -141 197 95 -214 -52 72 62 103 -99 -243 -15 -47
7130d7R9j73J44j4K20k53j01K07k04J13Q0o1k26J76P5o5M07k70l6j07J43j12O2
$$ -47 52 -121 23 9 229 -24 -125 82 -122 -9 71 10 -216 -40 35 -30 377 107 71 -36 107 -5 57
7153E7M9p4R1j37j51M0L82k41NL5j36L17j3J24k96j66J55p9n9j39M39m75N21L43
$$ 57 106 32 123 -14 -165 -125 257 16 21 56 -80 237 224 348 52 -114 41 -38 -97 -236 203 -272 249 592
7177E92n08p4N9q5j63K08j05J03j1L33n08j43K83J31l25J58k43J78J52J2j03k7
$$ 592 84 10 69 -16 -179 29 -76 27 16 349 -159 -302 -19 112 -213 -55 -298 -120 32 44 -59 -86
7199h6J57O0k67j60K96J1R7j35l1K88j77J50k49J03l46L17j19r6J0K55oL6rj20
$$ -86 71 131 -136 -296 0 11 108 -27 -58 230 53 203 -46 57 -289 28 -91 -187 -177 78 72 108 99 -21
7223b1J75K1l37M2j72K77J23L0j98J06o1k8Ql07K89J41N5J03m48N07k41l0l4R
$$ -21 154 175 -162 -120 -292 -15 108 138 -60 46 -15 -43 -35 -342 -53 88 143 246 -202 305 64 34 0 9
7247Ip1l5L09j03k38J56J95l98j87L09J29m6J54o6k45j70K94Q3o8k12M29l12M5
$$ 9 -62 -97 212 109 -129 27 222 -176 -363 -54 75 29 183 117 -128 -298 -4 79 11 -201 228 -84 -39
7270c9J71K22n7k04o9l12L97q5j68j3l1J34M8J48j19j69L68l02K6jk68K29L4J67
$$ -39 132 354 297 93 24 -288 109 24 -144 -157 -188 -54 -6 142 23 -146 222 -80 -54 -55 -323 -94 -60 107
7294A07k72R6O6n8J9K4k78L10n9J71m53N52l00K54k02o1j09J78k92M41m3k32J61
$$ 107 -165 -69 -3 -61 -42 -18 -296 14 -45 126 -327 225 -75 179 -23 -84 -193 -15 -307 134 91 -141 20
7317B0m03M75j63J38l02J31J95r8j23K63n0r2o4J66l1m2q9J18J89j69n5p3J94
$$ 20 -383 92 -71 67 -235 -104 91 -7 -130 133 83 -9 -73 93 62 20 -69 49 238 69 14 -59 135
7340A35n1J35n42M68m14J26J06J76j49K67j80m67N35k84L08l42K16l48L54J38
$$ 135 84 219 -323 145 -269 -143 -37 139 -10 257 77 -390 145 -139 169 -173 43 -305 49 187
7360A87j05r0J07k27r7J74j45j29L43m5J31j25K80j37k85K45j70K8m42R43n20
$$ 187 82 -8 99 -128 -225 -51 -196 -325 18 -27 104 -21 259 122 -163 82 -88 -60 -502 441 -79
7381g9l04O04j88K0J80k89j32J28J17oj24J31O5j31Q7l8j14j41L11l12J47J17
$$ -79 -383 221 33 53 233 -56 -188 -60 57 51 -73 58 123 -8 79 41 -73 -214 97 -215 -68 49
7403D9K2M0R3k81J29q4k15L16m6k0k64M71k59j6P2J03l60J27O4O4K26q9j08j08
$$ 49 71 111 204 -77 52 -32 -247 69 23 3 -261 210 -49 -65 7 110 -250 -123 -59 5 231 142 34 -74
7427g4R1j65K2Q8j58Q3j29M86n7J07q1j16J74j43j38r6j64M82j37p4p3K22j96
$$ -74 17 -148 -126 -38 -196 -113 -242 244 187 294 213 97 271 128 -10 -106 -270 212 75 1 -72 150 -46
7450d6Q8m0RN9k21J91J68j05j96Q5k27L53k35M92o32J67J8J67Q0P6l58m5J75M4
$$ -46 42 2 11 70 -151 40 208 103 -93 -8 -235 118 -117 375 -257 -90 -72 95 175 251 -107 -152 23 67
7474F7j33j12L20oMM7l56K25K15m28o1J01r5M43p9k3k84J81J82k51J68j26M9N2
$$ 67 -66 -178 142 136 140 187 -169 56 271 -157 -218 -117 -212 231 152 129 -155 26 208 -43 125 -1 48 100
7498A00kJ34l48J87K78k37k11N3k34K02K5m1kP8K30j52j6k22R7J54j76p5L6L59
$$ 100 98 232 -116 71 349 112 -99 -46 -280 -78 -53 -94 -96 -18 212 60 44 -178 -81 73 -103 -178 -142 217
7522B17j23M6r7K1k50J68j53J56R7mR8o5j30K35k05l51o8J71J75K28q3k42j92
$$ 217 94 140 43 64 -186 -18 -171 -15 82 78 176 111 -19 216 11 -340 -408 -237 -62 166 83 -159 -351
7545c51M21j00M1l77O40l07q8K9K24Oj16j43O9p4k11J65N1J66O0K9L9k49J06k47
$$ -351 70 -30 11 -366 274 -33 -121 -92 132 138 22 -121 -52 -126 -337 -172 -121 45 105 134 173 -76 30 -217
7569b17p1J85o1J71k69L97j27J65k80Q9k48K95j22l21M19k58J12P8K45j95j7K67
$$ -217 -288 -103 -164 7 -262 135 8 173 -107 -18 -266 29 -93 -414 5 -253 -141 -63 182 -13 -30 237
7591B37l66K96k80jK07Jk25J20K2K12j24j30k67K26J05P3o9M7K5j32Q6j99L2k
$$ 237 -129 167 -113 -114 93 94 -131 -11 11 223 99 -31 -298 -72 33 106 37 84 109 -23 63 -136 -104 -106
7615a06L6j17J90K0Q9o5j51Q9O2J17O1m79L4J52J50q8o2M41p0l02k07K65l06M64
$$ -106 -70 -187 3 23 112 47 -104 -15 47 164 225 -254 -220 -68 82 -6 -68 373 303 1 -206 59 -247 217
7639B17n2n67J72K67ll24K7K53k88J39j8j04J22K13q9J29l32Lj04K52J19K27l39
$$ 217 165 -402 -230 37 34 -290 -263 -10 -298 -159 -177 -281 -159 54 -35 94 -238 -235 -339 -87 32 259 -80
7662h0O0J1K1j64K83k46j49K95p6j56o0M42j33P3k39J16J04Q1k44J45M7k34Q2
$$ -80 -20 -9 12 -152 131 -115 -264 31 -45 -201 -261 181 48 121 -118 -2 102 183 -61 84 131 -103 -21
7685b1J90J13j44j40k71J65OK79O5%j15k38j28K81Nj57Kj60L38j59J4N9K54k27
$$ -21 169 282 138 -2 -273 -108 -102 177 242 242 127 -111 -239 42 47 -110 -108 -268 70 -89 -75 -16 238 11
7709A1qj50J26j70P3K66l16K16k88J65J02l11K9J81n6J36QL8K40k06J7j0L48n67
$$ 11 3 -147 -21 -191 -118 148 -168 48 -240 -75 27 -284 -255 -74 -130 6 14 52 292 86 103 93 441 -126
7733a26j12o4n2K34J01j34J50J61M1k10j56J08l38M75j73mM78m25O7L9O2k03J73
$$ -126 -238 -302 -354 -120 -19 -153 -3 158 199 -11 -167 -59 -397 78 -95 -99 379 -46 21 60 122 -81 92
7756I2k43J85l1L48j09k22n8J56l54K31qp2J3P2K92k59j53M74n27J02j14l8O6
$$ 92 -151 34 3 351 242 20 -38 118 -236 -5 -13 -85 -72 0 292 33 -120 354 -173 -71 -185 -223 -157
7779a57K96N7l11N2K22l18K31j53m3j25L43j55L26j32o8J54j45N5l64J25R8J87
$$ -157 139 196 -115 -63 159 -159 72 -81 -124 -249 94 -61 265 133 65 219 74 129 -235 -110 -12 175
7801A75q4k79L29p5q3J95l40J2j11P1J60q5Q7J46k3K14n90L30k4j00J55k73J20
$$ 175 91 -188 141 66 -17 178 -162 -150 -261 -190 -30 -115 -28 118 95 309 -281 49 25 -75 80 -193 -73
7824g3K86j63Q2r8l24L29J7j08KOK09j95J26k41J92j16J5j53K14m4O5MJ13j92
$$ -73 213 50 132 34 -290 39 56 -52 -50 -44 165 -30 96 -145 47 -69 -54 -207 7 -37 28 32 145 -47
7848d7K98k86J47L8k27P0m1J13k84M02O2k66k8K15n42M61j82J90J42n08K22k5
$$ -47 251 -35 112 150 -77 -7 -48 65 -219 183 245 -21 -49 166 -376 85 -97 93 235 -273 -51 -76
7870g6O8K55l04Q3P61q82K60n75N88n78Q6M35p1k33j18L46N2j88J03l9P9k55J77
$$ -76 -8 247 -57 26 787 -95 165 -410 178 -400 -314 121 50 -183 -301 45 97 -91 12 -27 52 -203 -26
7893b6K03k54k57K15k17M25OK0K10p2n1j25P5n9k71M0K14m5J49Q4n3m73M82n9
$$ -26 177 -77 -334 -119 -336 89 95 115 325 253 202 77 152 93 -178 -138 76 31 180 264 211 -262 220 161
7917A61j41k22Q4J73J05j65r3M2L8q2J93K23l98J84Q5j22n8J59k14o7J1m6P8p3
$$ 161 20 -202 -118 55 160 -5 -98 -56 -18 -100 93 316 -82 102 187 65 7 166 -48 -115 -104 -150 -72 -145
7941a45K26k11j30k6J92L07l73j3K92J50j92j90M0K35l4k53K01k51N8j27K52P0
$$ -145 81 -130 -260 -286 -94 213 -160 -173 119 269 77 -113 -73 162 128 -125 76 -175 -117 -244 8 78
7963G8k37L62k94k31N06k27L4J36j96Q0R4k92J64RL1m8J66J32j31j7k98o6J68
$$ 78 -159 203 -91 -322 184 -43 -9 127 -69 11 105 -187 -23 -14 17 -31 135 267 136 119 -179 -245 -77
7986g7M8k5J59p4K08k08j01L0r1k32pK68j68M54n1k46k34K52qJ47L6k03kj5J72
$$ -77 -29 -54 105 31 239 31 -70 -40 -131 -363 -370 -102 -270 184 133 -113 -347 -95 -103 44 80 -123 -125 -140 32
8011C2q7Q3j16J39Jk12J15J30J33k72j01K10N7L5N3k20j84K61j96L92l41nj1j55
$$ 32 -55 28 -88 51 52 -160 -45 85 218 -54 -155 55 112 147 200 -20 -204 57 -139 253 -88 -93 -104 -259
8035b59J75R6r5J66k56o3j90N49l36L04l23K31J35l06KN4J70j73k1J08j48k09
$$ -259 -84 12 -83 83 -173 -236 -426 123 -213 91 -232 -1 134 -172 -170 -116 54 -119 -140 -32 -180 -389
8057c89N43n07L17r2L19J51k62K44m3l36m3K43q9k22N69k85j57J80k77J23J22
$$ -389 154 -353 -36 -128 191 342 80 324 281 -55 -98 145 56 -166 403 118 -39 141 -136 -13 109
8078A09m7M3m03O15l12K16N9j50n8J2J32m4M1j0k55J18p8j05J89J9j74J43q6M9
$$ 109 62 105 -298 317 5 221 280 130 72 84 216 172 213 203 -52 66 -12 -117 72 91 -83 60 -26 23
8102B3N9l0k3l06J22J23o4m0j14K28j45j2L78l55M32L1l06r5q0j06K83j48P6k76
$$ 23 82 52 29 -277 -155 -32 -96 -136 -250 -22 -167 -179 199 -156 276 307 1 -94 -174 -280 3 -145 -69 -345
8126c45N28l04J00J3j41J35j3m4J20k62N9J27K05O9k01j33J56l46R4J20K45j9
$$ -345 183 -121 -21 -8 -149 -14 -27 -71 49 -213 -154 -27 178 247 46 -87 69 -277 -183 -63 182 163
8148A63j75J96L7j74L07k54l35J38o0J53j29K18K18m6o1j25j30J66m2K12k47J9
$$ 163 -12 184 221 47 354 100 -235 -97 -157 -4 -133 85 303 257 196 71 -59 107 65 277 30 49
8170D9m8n1J65j06k29L29l1j80R8Lm4k4J21J22j23P2rl15J76L9j42
$$ 49 1 -50 115 9 -220 109 78 -102 -4 -1 -45 -69 52 174 51 123 114 -201 -25 14 -128
8191a28
$$ Imaginary data points
##PAGE= N=2
##DATA TABLE= (X++(I..I)), XYDATA
0@%%%qJ6qQj6K4l2M0n6P2q1R7j20J44j71K03k41K81l28L79m37N02n75O58p50Q51
$$ 0 0 0 0 -8 8 0 8 -8 16 -16 24 -32 40 -41 56 -64 80 -91 112 -129 152 -176 203 -234 268 -307 351 -399 452
29D52r63J087j222J369j533J713j909K124k360K621k906L218l563L945m368M840
$$ 452 -511 576 -646 723 -810 903 -1006 1118 -1242 1379 -1527 1691 -1872 2073 -2295 2545
45B545n367N958o633P407q301R350j0602J2131j4045J6519j9864K4664l2183M5747
$$ 2545 -2822 3136 -3497 3910 -4391 4959 -5643 6488 -7557 8962 -10902 13762 -18421 27326
59B7326p7864K88331K88229m81897j80335J68770K29844q8829q7772O2547N7016
$$ 27326 -50538 237793 526022 44125 -136210 32560 262404 173575 85803 148350 205366
70B05366j75286j29356J19918K00869n3832j88571m7162J17410K7422q1700j9643
$$ 205366 30080 -99276 20642 221511 167679 -20892 -68054 49356 76778 -4922 -24565
81b4565J01393M0856q8044r3362K7128P5890K5597k4158p627L259j6846k6862
$$ -24565 76828 117684 29640 -63722 -36594 39296 64893 40735 33108 36367 19521 -7341
93g341J7056O2306L9691n0454r8559k2192J00607R4771m7780j18781k336J11978
$$ -7341 9715 72021 111712 61258 -37301 -59493 41114 135885 88105 -30676 -33012 78966
105G8966L0539j16490p1270R7453J04189o7587j28744J9459J18131O464j04381
$$ 78966 109505 -6985 -78255 19198 123387 55800 -72944 -53485 64646 71110 -33271
116c3271k2070R2396K3576j06561o4947P9618R0489k7663o9355K378K6367l5549
$$ -33271 -55341 37055 60631 -45930 -110877 -31259 59230 31567 -37788 -35410 -9043 -44592
128d4592l6587N6418Q4128k3149j06210l8936O9709O8832k937k5170j493j4781
$$ -44592 -81179 -24761 59367 36218 -69992 -108928 -39219 29613 26676 1506 13 -14768
140a4768m7362j2764P2634Q7427p567r3648n8440M5335Q1470J5315n0836l0930
$$ -14768 -62130 -74894 -2260 85167 77600 -16048 -74488 -29153 52317 67632 16796 -14134
152a4134L0180L1775k7043m5699K0914P8347L1892o4844q4435o499O3246M9927
$$ -14134 16046 47821 20778 -24921 -4007 74340 106232 41388 -43047 -49546 13700 63627
164F3627k615k9980k8288k4423q369K8363M6558Q730n1986o2481q981M5957M7699
$$ 63627 61012 31032 2744 -21679 -30048 -1685 44873 53603 1617 -60864 -69845 -23888 23811
177B3811L695l2368l1354q483R678J2003P828J22p210k277R626O636j6284j6927
$$ 23811 27506 -4862 -36216 -44699 -35021 -23018 -15190 -15068 -22278 -24555 -14929 -8293 -24577 -41504
191d1504K5995N6687P681p5712p0057L8146J07197L9199o6788o7695J2560M0739
$$ -41504 -15509 41178 48859 -26853 -96910 -58764 48433 87632 20844 -46851 -34291 6448
203F448l410j9389K1737L0602l2975o8575n828P0889M8639l4389o0442j2452K1622
$$ 6448 3038 -16351 5386 35988 3013 -65562 -71390 -501 48138 13749 -46693 -59145 -37523
216c7523N890q381Q705K0207j835k4699j5562Q992J7454J1279N767l876j9745
$$ -37523 -31633 -40014 -31309 -11102 -12937 -37636 -53198 -44206 -26752 -15473 -9706 -13582 -33327
229c3327j6815J4642M2822K7066j7586l4243n976K5310J8177j2685j3417J8399
$$ -33327 -50142 -35500 7322 34388 16802 -17441 -23417 1893 20070 7385 -6032 12367
241A2367K8261r609m1500j1516M3716L8324k8009n9375r993M5848K5351k9771
$$ 12367 40628 31019 -10481 -21997 21719 60043 32034 -27341 -37334 8514 33865 4094
253D094k8896J9153K7037j8863m1475l184L3368J3650k2494j6535J2053J1815
$$ 4094 -24802 -5649 21388 2525 -38950 -42134 -8766 4884 -17610 -34145 -22092 -10277
265a0277j0572q935J3251J3607r947j8685l000Q297P799J2393J7599k292l4050
$$ -10277 -20849 -29784 -16533 -2926 -12873 -31558 -34558 -26261 -18462 -6069 11530 9238 -24812
278b4812k7415K1988M7162Q389m2102l1581K1411L6972o22k8195m915K4141Q093
$$ -24812 -52227 -30239 16923 25312 -16790 -48371 -26960 10012 9390 -18805 -23720 421 8514
291H514k9840k7888J5770M1969J4080k7252k7879L403K1648Q461q037m943L826
$$ 8514 -21326 -49214 -33444 8525 22605 -4647 -32526 -29123 -7475 986 -7051 -11994 -8168
304h168r82j1325l026J9410K4303j9k7457k6101J776K6479K2152l491k4300j7231
$$ -8168 -9150 -20475 -23501 -4091 20212 20193 -7264 -33365 -31589 -5110 17042 13551 -10749 -27980
318b7980Q276K4326J0630j5509k1632o91J4884K810j5281l056K2547J7552j6901
$$ -27980 -19704 4622 15252 -257 -21889 -22580 -7696 -4886 -20167 -23223 -676 16876 -25
331b5l1338l18L1674J7950k1750k6431P796K9209R632j6280j0482J2407J3238
$$ -25 -31363 -31681 -7 17943 -3807 -30238 -22442 6767 16399 119 -10363 2044 15282
344A5282r063k0158k438K0993J7279p538j9309n390J3989J2601o086j7547r407
$$ 15282 6219 -13939 -16377 4616 21895 14357 -4952 -10342 3647 16248 10162 -7385 -16792
357a6792P016R134j957p719l59Q787M274j0555j7296m161J4924J5432o555k0835
$$ -16792 -9776 -642 -2599 -10318 -10677 -1890 2384 -8171 -25467 -29628 -14704 728 -5827 -26662
371b6662n529J9933K0776n400k3312o459J7101J1603j3369j4315J3629K7091K549
$$ -26662 -32191 -12258 8518 3118 -20194 -26653 -9552 2051 -11318 -25633 -12004 15087 17636
384A7636k5508j6379J5569K4356j909k3687j1463J4568J6501k384j2756j259J1763
$$ 17636 -7872 -24251 -8682 15674 13765 -9922 -21385 -6817 9684 7300 -5456 -6715 5048
397E048N289j3802j7956q71J8794J5357m861j6365p641R813J2563K97j0313m967
$$ 5048 10337 -3465 -21421 -22292 -3498 11859 6998 -9367 -17008 -7195 5368 5665 -4648 -9615
411i615N814L695n890m988J1759J9980M173k1515k4004L022K6580J6595j2637
$$ -9615 -3801 -106 -5996 -10984 775 20755 24928 3413 -20591 -17569 9011 25606 12969
424A2969k1050j018J6903Q108j0271p929Q751R955j1330k2937l843K5177K4515
$$ 12969 -8081 -9099 7804 15912 5641 -2288 6463 16418 5088 -17849 -21692 3485 28000
437B8000m766k5171j5007Q972J6600K672q582l230O821K733p777n413J0838J9861
$$ 28000 23234 -1937 -16944 -7972 8628 11300 2718 -512 6309 9042 1265 -4148 6690 26551
451B6551M544j9957k4394j445K3885K0151j979j6044q540M281M478m939m079P966
$$ 26551 31095 11138 -13256 -14701 9184 29335 27356 11312 2772 7053 11531 6592 2513 10479
465A0479R840q376k4425j1107K0509L0574L886k7706k8183Q80J9230J0838m042
$$ 10479 20319 11943 -12482 -23589 -3080 27494 31380 3674 -24509 -23629 -4399 6439 2397
478B397l043M677M29j1522r675J0099K3746R319j9121k7549l751K5545K6412K988
$$ 2397 -646 4031 4460 -7062 -16737 -6638 17108 26427 7306 -20243 -23994 1551 27963 30951
492C0951j6731j3014K03L945p10J08J0094J0117m743k0151j1919J1881K4826R275
$$ 30951 14220 1206 1409 5354 4644 4752 14846 24963 20220 69 -11850 31 24857 34132
506C4132j8397k5656o775J3332J3885J861j271L614q1j3747j6666L569K6537K0449
$$ 34132 15735 -9921 -16696 -3364 10521 12382 11111 14725 14644 897 -15769 -12200 14337 34786
520C4786j2385l0716j3069J9990K9644Q616j5483j6769k831L014l24J570J1347
$$ 34786 22401 -8315 -21384 -1394 28250 36866 21383 4614 1783 4797 4473 6043 17390
533A7390J4596j739k2063j9047N413K3846J3810j2876k2726r251Q397J0184L263
$$ 17390 31986 30247 8184 -10863 -5450 18396 32206 19330 -3396 -12647 -4250 5934 9197
546I197M17L089j183j4632j9624k668K2156K5456P05k4901k2431M470K3781J5123
$$ 9197 9614 12703 11520 -3112 -22736 -25404 -3248 22208 22913 -1988 -24419 -19949 3832 18955
560A8955n657j2878m771J59l901m77J4071K2584N020k3914k9446k821K5879K4544
$$ 18955 13298 420 -4351 -4192 -8093 -8570 5501 28085 33105 9191 -20255 -23076 2803 27347
574B7347j627k1603j5498K225J0627M801J133L043J104j3160k2112p103K1134
$$ 27347 25720 4117 -11381 -9156 1471 6272 7405 10448 11552 -1608 -23720 -30823 -9689
587i689K9985N985k4431k7432k128J8740J4839j106p580l313j525o402k823J0807
$$ -9689 20296 26281 1850 -25582 -27710 -8970 5869 4763 -2817 -6130 -7655 -14057 -16880 -6073
601f073K1213R113j7735k9572r116K0523K7914P313j4377j5599k565M939K105
$$ -6073 15140 24253 6518 -23054 -32170 -11647 16267 23580 9203 -6396 -8961 -4022 -1917
614a917K458Q876P037r180k1782j1326J5566K9996J2859j8503k9225j0505J4112
$$ -1917 541 9417 16454 7274 -14508 -25834 -10268 19728 32587 14084 -15141 -25646 -11534
627a1534J7383L622m770k747l01o276r298K523J7469J4132r715k6595j5060J1780
$$ -11534 5849 9471 4701 1954 1653 -4623 -13921 -11398 6071 20203 10488 -16107 -31167 -19387
641a9387K4724J1365r549j4916n760m13k199j065Q791J3262k10j9276j9352M486
$$ -19387 5337 16702 7153 -7763 -13523 -13936 -16135 -17200 -8409 4853 4643 -14633 -33985 -29499
655b9499K5833J7849j0061k4457j2585O505J3307P526K834L487mj0612j5048j227
$$ -29499 -3666 14183 4122 -20335 -32920 -26415 -13108 -5582 -2748 739 735 -9877 -24925 -26152
669b6152J9418K1824M31k2684k0285N238K4509J7822m801j4944q624o7n57J25
$$ -26152 -6734 15090 15521 -7163 -27448 -22210 2299 20121 15320 376 -8248 -8315 -8872 -8747
683h747R286J5178N252j5756k1024k455J9496J9140j504j7377j3049K613J1061
$$ -8747 539 15717 20969 5213 -15811 -18266 1230 20370 18866 1489 -11560 -8947 2114
696B114P360K308L837M041p513j7431q775J4793K6154R982j6678k2474k630J6750
$$ 2114 9474 11782 15619 19660 12147 -5284 -14059 734 26888 36870 20192 -2282 -4912 11838
710A1838J5159o86r111o647k440m373m065O589J6681R853j3241k7493j4025J3199
$$ 11838 26997 26311 17200 10553 8113 3740 -325 6264 22945 32798 19557 -7936 -21961 -8762
724h762K2769N701j5897j8259k472P946N795l62J224K139o178j5063r704R870
$$ -8762 14007 19708 3811 -14448 -16920 -8974 -3179 -3541 -2317 -178 -6356 -21419 -31123 -21253
738b1253K2227J2103j1162j9503o113J0977J1815J296m385Q3J857l526o781K618
$$ -21253 974 13077 1915 -17588 -23701 -12724 -909 387 -3998 -3915 -2058 -5584 -12365 -9747
752i747J6003J3953o757k3086j5336Q348K1510J1027q764j5075m014N520K980
$$ -9747 6256 20209 13452 -9634 -24970 -16622 4888 15915 7151 -7924 -11938 -6418 -3438
765c438l701j042M929J919r164j3641K74J7087J5688m320j8085j0902N678J0857
$$ -3438 -7139 -8181 -3252 -1333 -10497 -24138 -23864 -6777 8911 4591 -13494 -24396 -18718 -7861
779g861L048k275K131N514j056q919l455J1834J5389J046j5612j2859N736J8024
$$ -7861 -4813 -7088 -4957 557 -499 -9418 -12873 -1039 14350 15396 -216 -13075 -7339 10685
793A0685J0171m229q046M22L454k839n793J154J1821Q733n895j5573o782J1115
$$ 10685 20856 16627 8581 9003 12457 9618 3825 4979 16800 25533 19638 4065 -2717 8398
807H398J6426K924j3915j5458k506Q702P404o43j129J964k252j0968r592M509
$$ 8398 24824 27748 13833 -1625 -4131 4571 11975 11332 10203 12167 9915 -1053 -10645 -6136
821f136J5461O219j3370j8141j765J4980J1988m331j0981n182J731r31m424K77
$$ -6136 9325 15544 2174 -15967 -17732 -2752 9236 4905 -6076 -11258 -9527 -10458 -14882 -14605
835a4605R936Q769n189j4331o566J0124J4212J388j2556r667M046J1289M658l371
$$ -14605 -4669 4100 -1089 -15420 -21986 -11862 2350 3738 -8818 -18485 -14439 -3150 1508 -1863
849a863j372N406L491o785j0743l8J4141J2283m221j4333n795J0509J1040j207
$$ -1863 -3235 2171 5662 -1123 -11866 -11904 2237 14520 10299 -4034 -9829 680 11720 10513
863A0513j0542n370L343K766l093k394N676Q091j810j2277p809M787J0766J246
$$ 10513 -29 -5399 -2056 710 -2383 -4777 899 8990 7180 -5097 -12906 -8119 2647 3893
877C893q701o842N426R869J809o936m163M829P293k947r093k576J0105J2755L01
$$ 3893 -4808 -11650 -6224 3645 5454 -1482 -5645 -816 6477 3530 -5563 -8139 1966 14721 15022
892A5022r972n772N841Q809r38q590l346O926P358k979p743K19Q919L714q235
$$ 15022 5050 -722 5119 13928 12990 4400 1054 7980 15338 12359 4616 4835 13754 17468 9233
907I233j1472r27R233N151n200o906J467O523%p515o095L629O733j887q998l450
$$ 9233 -2239 -3166 6067 11218 6018 -888 579 7102 7102 -413 -6508 -2879 3854 1967 -7031 -10481
923a0481R083J0425j695j1900o399O306Q973j311r045k958P289P998j115o983
$$ -10481 -1398 9027 7332 -4568 -10967 -4661 4312 3001 -6044 -9002 -1713 6285 5170 -1813
937a813k687M865M180m480p401k68Q166O528l634p657r98O919M171n465q308L98
$$ -1813 -4500 365 4545 65 -7336 -7604 562 7090 3456 -4201 -5199 1720 5891 426 -7882 -7484
953g484Q456M027n037m891M091Q317N07q909p442L976J0503L009o888n806M051
$$ -7484 972 4999 -38 -4929 -838 7479 7986 -923 -8365 -4389 6114 9123 2235 -3571 480
968D80Q049J022o830m179L773M857l844q065J713J1510P226p782j3436k522R752
$$ 480 8529 9551 2721 -1458 2315 7172 3328 -4737 -3024 8486 15712 7930 -5506 -8028 1724
983A724P411l737r324k132N919N083q99l346L7L722k90p346n441N261J1536M026
$$ 1724 9135 5398 -3926 -6058 -139 4944 4045 699 736 4458 4168 -3178 -8619 -3358 8178 12204
999A2204p803q389K177Q395K847o140m953K623M954j852n820O57R123O323o181
$$ 12204 4401 -3988 -1811 6584 9431 3291 -1662 961 5915 4063 -1757 -1100 8023 14346 8165
1014H165j3454n633P103J0820O36q273n702K937N209j604m381J63M562m01r037
$$ 8165 -5289 -10922 -3819 7001 7637 -636 -6338 -3401 1808 204 -4177 -4014 548 147 -8890
1029h890o774O064J3432N811q372j1957k362P794O222j714m697J52L975N1l457
$$ -8890 -15664 -9600 3832 9643 1271 -10686 -13048 -5254 968 -746 -5443 -5291 -1316 -1265 -4722
1044d722n15O429O618l607j2690o713P710J2137L029o699n538J634L282j750m562
$$ -4722 -5237 1192 7810 4203 -8487 -15200 -7490 4647 7676 977 -4561 -2927 355 -1395 -5957
1059e957J172O337K439o767q348J872J1646Q637m114j1844o567L728O969J926
$$ -5957 -4785 1552 3991 -2776 -11124 -9252 2394 11031 6917 -4927 -11494 -7766 -797 1129
1073A129j181J439K500k277o868k898P474J0536n23j2435j0368L916J2519Q225
$$ 1129 -52 1387 3887 1610 -5258 -8156 -682 9854 9331 -3104 -13472 -9556 2963 11188
1087A1188l366q130l853J028Nk547J906P911M344o754j1399j826J1443J0696j643
$$ 11188 7822 -308 -4161 -3133 -3128 -5675 -3769 4142 8486 1732 -9667 -11493 -50 10646 9003
1102I003j2331p912K551P866L240q4J682K306l193q880n260O638J2808L774r535
$$ 9003 -3328 -11240 -8689 -823 2417 2333 4015 6321 3128 -5752 -11012 -4374 8434 12208 2673
1117B673j1852n94J0052Q329j036n876m273j632j783j666M169R279N322o305j3721
$$ 2673 -9179 -9773 279 8608 7572 1696 -2577 -4209 -5992 -7658 -3489 5790 11112 4807 -8914
1132h914o244Q353J3561L023r335j0002l99O725N481J438J2Q49k306p818n784
$$ -8914 -15158 -6805 6756 9779 444 -9558 -9957 -3232 2249 3687 3699 4548 2242 -5576 -11360
1147a1360N153J2651P811o672j2282m263P181Q213J28n534k510J088j970m259
$$ -11360 -6207 6444 14255 7583 -4699 -8962 -1781 6432 6560 1026 -1484 -396 -2366 -6625
1161f625J309R435Q640m468j4683j0314M974J3162P155m842q135k927K695K346
$$ -6625 -5316 4119 12759 8291 -6392 -16706 -11732 1430 8585 3743 -4392 -7319 -4624 -2278
1175b278Q37K214L866j466r092p881L410J3730J1228l264j3512p806L255Q139
$$ -2278 -1441 773 4639 3173 -5919 -13800 -10390 3340 14568 11304 -2208 -10014 -6759 1380
1189A380L598j642j620j044k036k811n95O593Q033p00j2008j1705J102J1479R631
$$ 1380 4978 3336 1716 672 -1364 -4175 -4770 1823 9856 9156 -2852 -14557 -13455 -1976 7655
1204G655j470p373m367L75j43j485K392O471K494o857j0717r07J1702J3146J074
$$ 7655 6185 -1188 -5555 -5180 -5323 -6808 -4416 2055 4549 -2308 -13025 -13932 -2230 10916 11990
1219A1990j1793j0973m57P301O507K247k38J50j599o140k998N643J0847L289r873
$$ 11990 197 -10776 -11233 -3932 2575 4822 4584 4734 3135 -3005 -6003 -360 10487 13776 3903
1234C903j2872k056J0753J1767J419p032o286j693p70r21K328O657M724m902j0928
$$ 3903 -8969 -11025 -272 11495 12914 5882 -404 -2097 -2867 -3788 -1460 5197 9921 5019 -5909
1249e909m953Q168J2551K177r815r963r08N896M419J279J398K822j491p648p118
$$ -5909 -10862 -2694 9857 12034 2219 -7744 -8652 -2756 1663 2942 4340 7162 5671 -1977 -9095
1264i095K592J1360P872m598j1339o266N671J0486M294l730o220l449k081j058
$$ -9095 -6503 4857 12729 8131 -3208 -9474 -3803 6683 10977 7247 1027 -2422 -4503 -5561
1278e561K993P594N863k723j1526q342L941J1412N420n872r995l315M751M915
$$ -5561 -2568 5026 10889 8166 -3360 -11702 -7761 3651 9071 3199 -6796 -10111 -5360 -445
1292d45P26n65K102r9o860q547O84J0040J0115k058j0514o720L361P430K798k260
$$ -445 281 -284 1818 1719 -5141 -13688 -13004 -2964 7151 5093 -5421 -12141 -8780 -1350 1448 -812
1308h12k013n18j459k919mP601Q812R54r849j0244J91R809R289k69o299m315J463
$$ -812 -2825 -3343 -4802 -7721 -7725 -124 8688 9642 -207 -10451 -10260 -451 8838 8569 2270 -2045 -582
1325e82L145J315J682K922l64n122p023j418Q517J0660J598r418r424m38O096
$$ -582 2563 3878 5560 8482 8118 2996 -4027 -5445 3072 13732 15330 5912 -3512 -3950 2146
1340B146L866j681k629K1P45l173l636K684Q375L397p937j1657k592Q178R764
$$ 2146 6012 4331 1702 1723 2468 -705 -4341 -1657 6718 10115 2178 -9479 -12071 -3893 5871
1355E871Q07m924l688O01N96j153j15M113L778k666o949l583N704J0944L263o469
$$ 5871 6678 1754 -1934 -1333 -737 -1890 -2005 2108 5886 3220 -3729 -7312 -1608 9336 12599 6130
1371F130q920k418L493M330J307l05Q17o17l690m616R92O681M428n304j0060m631
$$ 6130 -2790 -5208 -1715 2615 3922 3617 4434 3817 127 -4489 -3497 3184 7612 2308 -7752 -12383
1387a2383O247R470J889n914n199K86J379k139j819K407N898P79n544n399K179
$$ -12383 -6136 3334 5223 -691 -5890 -5604 -4225 -6364 -8183 -5776 122 901 -4643 -10042 -7863
1402g863Q276M479m025o925j823M139L576N69K83L333K199l584o184j218O271
$$ -7863 413 4892 867 -6058 -7881 -3742 -166 403 686 4019 6218 2634 -3550 -4768 1503
1417A503O835k44o940n273L445P097L387l502m142j146J032r67j461J659N653
$$ 1503 8338 8094 1154 -4119 -674 6423 9810 6308 2166 1020 2052 1085 -376 1283 6936
1432F936K648n526p019k50O813M078l356o971j501M304L560j152k342J308K623
$$ 6936 9584 4058 -2961 -3211 3602 7680 4324 -2647 -4148 156 3716 2564 222 1530 4153
1447D153k061n173l257M161O075J386m715m017J134M303P00k254k809L58J559
$$ 4153 2092 -3081 -6338 -2177 3898 5284 569 -3448 -2314 1989 2689 435 -2374 -2016 -457
1462d57p45j439N53M508K961k862o424l194L725O003M33m734k985K155M322K15
$$ -457 -1202 -2641 -2088 2420 5381 2519 -3905 -7099 -3374 2629 3062 -1672 -4657 -2502 1820 2035
1478B035l688q02K169L89l395m098K990O831K315n350n853Q32N612J344m323l939
$$ 2035 -1653 -2455 -286 103 -3292 -7390 -4400 2431 4746 -604 -6457 -5625 -13 1331 -2992 -6931
1494f931K105M677J016l230j329L277K832j958m600k059L573N021O03l000j454
$$ -6931 -4826 -149 867 -2363 -3692 -415 2417 459 -4141 -6200 -2627 2394 2997 -3 -1457
1509a457K569K556p87k972r01K371K201j479k486J129M925K814l366n914j236
$$ -1457 1112 3668 2881 -91 -992 1379 3580 2101 -385 744 5669 8483 5117 -797 -2033
1524b033M469L682k417m646M3M309K477k659l324M64K870r65m952j758M706N078
$$ -2033 2436 6118 3701 -945 -902 3407 5884 3225 -99 365 3235 2270 -2682 -4440 266 5344
1540E344m24n739k887L119M317q56m889k420K593L623j14j716k13K593J092l103
$$ 5344 4920 -819 -3706 -587 3730 2874 -2015 -4435 -1842 1781 1667 -49 -262 2331 3423 320
1556C20l867o63M526L306j846l733q54L604K954j999m233p76K172J196k866k101
$$ 320 -3547 -4210 316 3622 1776 -1957 -2811 793 3747 1748 -2485 -3261 -1089 107 -2759 -4860
1572d860K947N673J89n348m974J477M888J442l492k903J725L047K41j922Q97K074
$$ -4860 -1913 3760 3949 -1399 -6373 -4896 -8 1434 -2058 -4961 -3236 -189 52 -1870 -973 1101
1588A101O26l878m486P07N617N274j440m812k751J885L787N66k204j580P06Q41
$$ 1101 1727 -2151 -6637 -5930 -313 4961 3521 -1291 -4042 -2157 1630 2196 -8 -1588 -882 -41
1604d1n19n93K106L419J080m832n225q5N323M443j430l288l29K554J009k659j109
$$ -41 -560 -1153 953 4372 5452 620 -4605 -4690 633 5076 3646 358 29 2583 3592 933 -176
1621a76K645K887k349n894j852O382P180J59o390n384O37L111J261j03j8Q58j026
$$ -176 2469 5356 3007 -2887 -4739 1643 8823 8982 2592 -2792 -2155 956 2217 2114 2096 2954 1928
1638A928k964j143L251M627K41n495o261j90N614N462K62l409l135O3Q23k98q46
$$ 1928 -1036 -2179 1072 5699 5940 445 -5816 -6006 -392 5070 5332 1923 -1212 -1149 -326 -624 -1470
1655a470K490K354r47m759k224L818O532J722n479o789m58L910K380O8M9J735
$$ -1470 1020 3374 2427 -2332 -4556 -738 5794 7516 2037 -4752 -5210 -1300 1080 1148 1197 2932
1671B932m35l673m453J237O162L303m771o880k314N013O038J210k830l166j482
$$ 2932 2497 -1176 -5629 -4392 1770 5073 302 -6578 -8892 -3879 2159 3369 539 -2627 -4109
1686d109r59p87J094M007L708j401n861l548L145O303L017l179o273k275L003
$$ -4109 -5068 -5855 -4761 -754 2954 1553 -4308 -7856 -4711 1592 4609 1430 -4843 -7118 -4115
1701d115L977K165M54N23q79l464m059N80O275M748j494o952k992L033N197K132
$$ -4115 -138 2027 2481 3004 2125 -1339 -5398 -4818 1457 6205 4711 -2241 -5233 -2200 2997 5129
1717E129k671k519j408n16k091M57M611N142K25n983o884J04N588N643o76m857
$$ 5129 2458 -61 -1469 -1985 -4076 -3619 992 6134 6359 376 -6508 -6404 -816 4827 4151 -706
1733g06l274N89K449K492K349N69j296m584n019K76O491O914Q68o101o121L77
$$ -706 -3980 -3391 -942 1550 3899 4468 3172 -1412 -6431 -6155 336 7250 8118 2017 -4104 -3727
1749c727M948L793r40k770r57m69r88j02L052N239J665n314p948j828N110O053
$$ -3727 1221 5014 4074 1304 347 -122 -1110 -1212 1840 7079 8744 3430 -4518 -6346 -1236 4817
1765D817R49l303l244k22K39J61J382K496P16l889o443j503N195P343L059m714
$$ 4817 5766 2463 -781 -1003 -764 -603 779 3275 3991 102 -6341 -7844 -2649 4694 7753 3039
1781C039p490k712K627M069K040k26j201j719k030q13K877M948K517l733p502
$$ 3039 -4451 -7163 -4536 -467 1573 1347 146 -1573 -3603 -4416 -1539 3409 5926 2193 -5309
1796e309l371M554P566L044k427m019j430K59L68J77K222K796j129n231l801K886
$$ -5309 -8680 -4126 3440 6484 4057 38 -1392 -1133 -765 -588 1634 4430 3301 -1930 -5731 -2845
1812b845O800L988m006o771l193J229K936J790J091J045j178l660l724L08N299
$$ -2845 3955 7943 3937 -2834 -6027 -4798 -1862 -72 1019 2064 886 -2774 -6498 -6190 -891
1827h91M020j327o603m386J875O485M362k45l572k934j277m94J228M202M134J06
$$ -891 3129 1802 -4801 -9187 -7312 -827 3535 3290 -282 -3216 -4493 -4987 -3759 443 4577 4683
1843D683m827m590P80O758M643j314n686m255J267L834K391J315O31r21k994m401
$$ 4683 -144 -4734 -3954 2804 7447 6133 447 -3808 -2541 1293 3684 4999 5630 4709 1715 -2686
1859b686j295M413M883O89m544n312O5M238L295N2k807k193k083j400k20L619
$$ -2686 -3981 432 5315 6004 1460 -3852 -3787 451 3746 3798 991 -1202 -3285 -4685 -4905 -1286
1875a286M818K113m232o405k496M119O285J004l700l861k52K124K792J847Q55
$$ -1286 3532 5645 1413 -4992 -7488 -3369 2916 3920 220 -3641 -3893 -1769 1023 2870 3725
1890C725J6l004m337j698L796O356K659l393n536j464L101L245J08j764j349l96
$$ 3725 3741 737 -3600 -5298 -1502 4854 7513 4120 -1416 -2880 221 3466 3574 1810 461 65
1906F5j412q96J857M068K670l146n954l918K213M966K223j190k716j696L27M60
$$ 65 -1347 -2243 -386 3682 6352 3206 -2748 -6666 -4453 513 2736 1546 -1170 -2866 -2539 -2079
1922b079L83J531J199j260m381l130J732O169M817j913n893l305J321L204J651
$$ -2079 -1696 -165 1034 -226 -4607 -7737 -6005 164 4981 3068 -2825 -6130 -4809 -1605 46
1937D6Nj81k97j145j076O55L659L224j355n508l812K309M995L134j215k372m79
$$ 46 51 -130 -427 -1572 -2648 -1993 1666 4890 3535 -1973 -5785 -3476 1519 4653 3438 1066 587
1954E87J08n64p93J054K379O38k175l532L30M306L510p74m105l197K20J642J636
$$ 587 695 131 -662 392 2771 3409 1234 -2298 -1968 2338 5848 5074 969 -2228 -2008 -366 1270
1971A270P91J131K90j707k976j153K737L382K97l524l631J30M264L336j98k091
$$ 1270 2061 3192 3482 1775 -1201 -2354 383 3765 4062 538 -3093 -2963 1301 4637 4439 2348
1987B348k355l64j37m66J119K397J370j554l398r64K877L241n81l509l272P22
$$ 2348 -7 -371 -508 -974 145 2542 3912 2358 -1040 -2004 873 4114 3533 24 -3248 -2526
2003b526K637J595p68J36J041j84k809k632O81L691J735j669l009m47K583J990
$$ -2526 111 1706 938 1074 2115 1931 -878 -3510 -2829 862 2597 928 -2081 -2528 55 2045
2019B045j07j849o91l55o89n10P65K993K297r89l572k617J788K936O82k164k472
$$ 2045 1938 89 -602 -957 -1646 -2156 -1391 1602 3899 2910 -662 -3279 -1491 1445 2127 -37 -2509
2036b509L01J880J407l18o63P00o69j910j915K38L011K157p07l060n58J687J713
$$ -2509 -2208 -328 1079 761 98 798 129 -1781 -3696 -3458 -447 1710 1003 -2057 -2615 -928 785
2053G85n79k535p29J190R52j98l48J194K258M61k742k436O6K275J799r23j184
$$ 785 206 -2329 -3058 -1868 -916 -1114 -1462 -268 1990 2451 -291 -2727 -2661 -386 1413 490 -694
2070f94K77J968O01j481p42M15P64j283k415M27K999K327n99k967j719J384J702
$$ -694 -417 1551 2152 671 -71 344 1108 -175 -2590 -2163 836 3163 2564 -403 -2122 -738 964
2087I64r84j673q15J738R59k58n60P1J036l07k022j325N38K381O84r64j672J057
$$ 964 -20 -1693 -2508 -770 189 -69 -629 -558 478 171 -1851 -3176 -2638 -257 427 -537 -2209 -1152
2105a152J931J85j503k053K52J548L70n73k90J204J483j91j837j451O76J344L15
$$ -1152 779 964 -539 -2592 -2340 -792 -422 -995 -1285 -81 1402 1211 -626 -2077 -1401 -57 258
2122B58j487l70J783J433l6j491m21N83K87j231j496Q68K650J864j063k575q46
$$ 258 -1229 -1599 184 1617 1581 90 -331 252 539 -692 -2188 -1320 1330 3194 2131 -444 -1290
2139a290J641J639j042j849n24J117J369L9j10J196P74j703k403j075K405K243
$$ -1290 351 1990 948 -901 -1425 -308 1061 1100 990 2186 2960 1257 -1146 -2221 184 2427
2155B427L18j813j457J036J704L43j339j315L6L71l00q8O83K200J051j533k409
$$ 2427 2745 932 -525 511 2215 2558 1219 -96 -60 311 11 -77 606 2806 3857 2324 -85
2172h5j281J308J461l31r59k68R17P26n78l55j40J179p07k781j592J373L667J852
$$ -85 -1366 -58 1403 1072 113 -155 762 1488 910 555 415 1594 887 -1894 -3486 -2113 1554 3406
2190C406j642k922q93J411R02o79m25J05K31p32k86Q29K346Q86k106l468j313
$$ 3406 1764 -1158 -2051 -640 262 -417 -842 -737 -506 -1238 -1524 -695 1651 2537 431 -3037 -4350
2207d350K095L072N41j248q08Q3m2K93r61Q10M70n10j472j186J840K964J269j390
$$ -4350 -2255 817 1358 110 -698 -615 -657 -364 -1325 -515 -45 -555 -2027 -3213 -1373 1591 2860 1470
2225A470k697j559P18P78L92P66O98L14j359j212K32K367J852j060l015k649J207
$$ 1470 -1227 -2786 -2068 -1290 -898 -132 566 880 -479 -1691 -1459 908 2760 1700 -1315 -3964 -2757
2242b757L572K273K8j747j352o32m68J45J767J255q2k259k049J378K902J920o84
$$ -2757 815 3088 3116 1369 17 -615 -1083 -938 829 2084 2002 -257 -2306 -928 1974 3894 3210
2259C210l673k564M14K224J206O17Q53m97j585j800o87J981K149J70k471k378
$$ 3210 -463 -3027 -2613 -389 817 1434 2287 1790 205 -1595 -2282 -301 1848 2018 -453 -2831
2275b831N14K613K369J32j324j289j288j323L54J928L269O27j851l143j097K423
$$ -2831 -2317 296 2665 2797 1473 184 -1104 -2427 -2073 -145 3124 3751 1900 -1243 -2340 83
2291H3K951K19k113k816q20J424J781J899K12o36k493k770p81K180L112J068j875
$$ 83 3034 3253 1140 -1676 -2496 -1072 709 2608 2820 2184 -309 -3079 -3860 -1680 1432 2500 625
2308F25k897p50J468K188P81j441j279j198p31M87J578K639J324j170l632k216
$$ 625 -2272 -3022 -1554 634 1415 -26 -1305 -2503 -3234 -2747 -1169 1470 2794 1624 -2008 -4224
2324d224J180L040J698q81k151o58L61R88J006J096O43j903k969k079J880M135
$$ -4224 -3044 -4 1694 813 -1338 -1996 -1635 -647 359 1455 2098 195 -2774 -4853 -2973 1162
2340A162K347n85l621k399N18J970J375j26j162o21j304l23J497K970J621j743
$$ 1162 3509 2924 -697 -3096 -2578 -608 767 641 -521 -1142 -2446 -2769 -1272 1698 3319 1576
2356A576l575k601R83K949K910l32j553j489l19L54O21R04R04n41k476j737Q54
$$ 1576 -1999 -4600 -3617 -668 2242 1910 357 -1132 -1451 -1097 -476 428 1332 791 -1685 -3422 -2568
2373b568L146K868L6k593l041p51J100J969J351J21k8j763j614J67K450K218p0
$$ -2568 578 3446 3482 889 -2152 -2903 -1803 166 1517 1638 1610 -153 -1767 -1600 850 3068 2998
2390B998l115l542k79L571L299J089j444k478j367p83R74J860J523M0k152k227
$$ 2998 -117 -3659 -3938 -367 2932 4021 2577 99 -1268 -2051 -1077 783 2306 2346 194 -2033
2406b033L21K555L116N8k833k931q64J410J483J613P08J62j407k220p93R37K556
$$ -2033 -1712 843 3959 4017 1184 -1747 -2611 -1201 282 1895 2603 2765 1358 -862 -1655 -718 1838
2423A838J025j522k556j168J574K556J960o52j922k252j442j56J936K727J185
$$ 1838 2863 1341 -1215 -2383 -809 1747 3707 3055 1133 -1119 -2561 -2717 -781 1946 3131
2438C131j288k939j973J521K785J347j639k566j704N01K025J640J082j80j438
$$ 3131 1843 -1096 -3069 -1548 1237 2584 945 -1621 -3325 -2824 -799 841 1923 1743 305
2453C05k758r24M84L201J889p94k206j796Q97K422J108l49j363q62j066l30J159
$$ 305 -2453 -3377 -2893 308 2197 1403 -803 -2599 -1702 720 1828 1479 116 -746 -1812 -2142 -983
2470i83K541J759m07k836k197j88J967K154j94j227j263n95M51J373J341L88j005
$$ -983 1558 3317 2910 74 -2123 -2311 -344 1810 1616 389 -874 -1469 -1018 355 1696 2084 1079
2487A079k818k379N52L139K988M7k141k619l20J222J145Q92n89j152j024m03J027
$$ 1079 -1739 -4118 -3566 -427 2561 2608 467 -2152 -2472 -1250 -105 787 198 -954 -1978 -2381 -1354
2504a354K020J647j0l021k397k12J839K207Q62r76q50o01oO27L35N14j83m56j610
$$ -1354 666 2313 2303 -718 -3115 -3327 -1488 719 1581 605 -245 -846 -852 -225 110 624 441 -15 -1625
2523a625m1J507K634P66j438j968j466P3J308J238Q38J32j110j142Q3J393K006
$$ -1625 -1666 -159 2475 3241 1803 -165 -1631 -1558 -250 988 1826 1958 848 -294 -211 1182 3188
2540C188K65k116k898o56J775K474J310l66j789j627J06k59O08R37M39o71j690
$$ 3188 3453 1337 -1561 -2217 -442 2032 3342 2976 1187 -440 -334 -593 15 952 1391 720 -970
2557i70m56J147J730M47j254j730j388K27J224R30Q81L58J17j071j120p54J536
$$ -970 -1426 -279 1451 1898 644 -1086 -2474 -2247 -1023 -93 788 1146 1263 192 -928 -1682 -146
2574a46J533K7j374j042N24J909J333J91r41j099j103l70O84J958J265K94j746
$$ -146 1387 1414 40 -1002 -478 1431 2764 2955 2014 915 -188 -558 126 2084 3349 3643 1897
2591A897j385k20J858R68q37j818j271N02J272R70L94o5m78j490j122o04R40J070
$$ 1897 512 292 2150 3118 2281 463 -808 -306 966 1936 2330 2265 1787 297 -825 -1429 -489 581
2609E81K06j065p40O26O42J52k44r15l27k27l25O4O77J855O11q25j700n97O35
$$ 581 787 -278 -1018 -392 250 402 158 -757 -1084 -1311 -1636 -1572 -895 960 1571 746 -954 -1551 -916
2628i16J244N79l51n77k05P80L92O09N32m97j051j396L8J151J840P16r49j179
$$ -916 328 907 556 -21 -226 554 946 1555 2087 1590 539 -857 -819 332 2172 2888 1939 760
2646G60o12J234N04p67j180l30O24M3J94L83M18j25p85j376p00Q66O13mk51k65
$$ 760 148 1382 1886 1119 -61 -391 233 276 470 853 1271 1146 361 -1015 -1715 -849 -236 -240 -491 -756
2666g56M94K53k34p43r3L07l08j38n87J025J285P28n85j121k69J16L25j7L0N64
$$ -756 -262 -9 -243 -986 -1079 -772 -1080 -1218 -1805 -780 505 1233 648 -473 -742 -626 -301 -318 -288 276
2686B76M10mQ5n2M31J17p05j237l20N05J656P1n90n66o1J66L3p24k85l25L28J6
$$ 276 686 682 767 715 1146 1263 558 -679 -999 -494 1162 1233 643 77 16 182 215 -509 -794 -1119 -791 -775
2708g75Q8O13J31j90m72j076j55O73N80o57q1Q46N74K61o29n56k64r9M08n21j11
$$ -775 -687 -74 57 -133 -605 -1681 -1836 -1163 -583 -1240 -1321 -475 99 360 -269 -825 -1089 -1188 -780 -1301 -1412
2729a412O92J229N33q96n26j89P3Q5n51K70M65j3L03q9L48J94n14p90j264L69
$$ -1412 -720 509 1042 146 -380 -569 -496 -411 -962 -692 -227 -240 63 -26 322 516 2 -788 -2052 -1683
2749a683R86J129J25m44p10K13M49L81k68r04j03l2K50M61J245N32o41r68j174
$$ -1683 -697 432 557 113 -597 -384 65 446 178 -726 -829 -861 -611 -150 1095 1627 986 18 -1156
2768a156K61P86Q89n83j16L99q9L34l74K1Q4l44o71o18J86J196R60K13n94p32
$$ -1156 -895 -109 780 197 81 480 391 725 351 372 456 112 -559 -1177 -991 205 1165 1378 784 52
2788E2m01OL47p3K33K0m4n72m1R20J199K3j784j424o6Q80J437J075n67m53r48
$$ 52 -349 -343 4 -69 164 184 140 -432 -473 447 1646 1669 -115 -1539 -1605 -725 712 1787 1220 767 -181
2809a81J43l42O30J96n39k33q47J93J436J279k98j151j760n05P29O22L29M01J78
$$ -181 -38 -380 250 446 -93 -326 -1173 -980 456 1735 1437 286 -1474 -1979 -1250 -628 -299 102 280
2828B80m87m58j01j3J098j52r16p95q32R91J434R24P4r45j221n85j45O54J074
$$ 280 -207 -665 -766 -779 319 167 -749 -1544 -2376 -1385 49 973 1047 102 -1119 -1704 -1849 -1195 -121
2847a21O58n48j190l79N72J915M17j071j645r96M06J180J468N89m25o83j293m60
$$ -121 537 -11 -1201 -1580 -1008 907 1324 253 -1392 -2388 -1982 -802 666 1255 830 147 -1146 -1606
2865a606M57J119P85r91j110j87R27J271L29L1j271q42n36l05J093J197J020j49
$$ -1606 -1149 -30 755 -236 -1346 -1533 -606 665 994 1025 -246 -1088 -1624 -1929 -836 361 1381 1232
2883A232j348j478M61Q29R61k68p93r27k68N71J715R13J63j211j483j336M17K046
$$ 1232 -116 -1594 -1133 -304 657 389 -404 -1331 -1599 -1028 687 1600 1763 552 -931 -2267 -1850 196
2901A96J721J58j334j260P8J046R54M47q82j024j110J53J032J654O95J78j941
$$ 196 1917 2075 741 -519 -441 605 1559 2006 1124 100 -1010 -857 175 1829 2524 2702 761
2918G61j626m00Q55J265N95o12q47l75L06R06M36J26m62j645j163L41J605J356
$$ 761 -865 -1265 -410 855 1450 838 -9 -384 -78 828 1264 1390 928 -717 -1880 -1539 66 1422
2936A422P96r09j173j730L98J272N64K56m29p59q69N60R62J532K74j688k211r10
$$ 1422 2218 1309 136 -1594 -1196 76 640 896 467 -292 -1161 -601 361 1893 2167 479 -1732 -2642
2954b642P46K469J151k53j261r41m50M02J178K28j33j439j206J65J678J642O35
$$ -2642 -1896 573 1724 1471 210 -731 -1181 -779 399 627 494 -945 -2151 -1986 -308 1334 1969
2971A969r08j669j009J36P52J087O43l40n58p49k25N91P94Q40m70j922j008O63
$$ 1969 1061 -608 -1617 -1481 -729 358 1001 661 103 -646 -871 -280 514 1354 884 -1038 -2046 -1383
2989a383J508J449O66r42j810r91k14J078J205P44n98j522r35Q99J712J177m93
$$ -1383 125 1574 2240 1298 -512 -1503 -1717 -639 566 1310 712 -810 -1745 -846 866 2043 1550
3006A550j869j573oJ044J625J112j44q67j275j61K49J123J066l87j123o37L06
$$ 1550 -319 -1892 -1898 -854 771 1883 1739 872 -403 -564 -315 808 1874 1487 364 -273 33
3023C3R11J619K34q46j225j063m30J070J283J281j65p32j945m09J005J438L11
$$ 33 944 2563 2797 1951 726 -337 -767 303 1586 2867 2702 1970 25 -384 621 2059 2370
3040B370j360j056q12O93J271J390J23o96j725j601N3J309J734L27q38j595l21
$$ 2370 1010 -46 -858 -165 1106 2496 2619 1923 198 -1403 -1350 -41 1693 2020 1182 -413 -734
3057g34Q17J145M80p86r74j286q9P74J535J171j86j456j371o33P58R34N09J43
$$ -734 83 1228 1708 922 -52 -1338 -1427 -653 882 2053 1867 411 -960 -1593 -835 99 608 751
3075G51q65q49J60P73O43M98l69j480j113m42Q80J496J538k18j631j415j11R43
$$ 751 -114 -963 -803 -30 613 1111 742 -738 -1851 -2293 -1413 83 1621 1403 -228 -1643 -1754 -811
3093h11P21L52n76n32p44J83P12J547L47j064k103r45M89J426J475K22j061p41
$$ -811 -90 262 -314 -846 -1590 -1407 -695 852 1199 135 -1968 -2913 -2424 -998 477 699 -362 -1103
3111a103l12N90J93P47l82o29o24l20N34J395J025l37j145j048m80L19R20N81
$$ -1103 -1415 -825 -632 115 -267 -896 -1520 -1840 -1306 89 1114 777 -368 -1416 -1896 -1577 -657 -76
3129g6K99l99k32o82K40P99N59m64q18j270r5J135J791N17k64j121r98m53R32
$$ -76 223 -176 -408 -1090 -850 -51 508 44 -774 -2044 -2139 -1004 787 1304 1040 -81 -1079 -1532 -600
3148f00P77P52m85q65lK9J174J070j81j167j153l90Q87J334P76j96k92n97o19
$$ -600 177 929 444 -421 -424 -395 779 1849 1668 501 -652 -1042 -155 1179 1955 1759 1467 870 251
3167B51L7M08K17o9l89o45Q4N14Q73k3n63n45p29p02M77M13Q66K23o64q44l17
$$ 251 288 696 913 844 455 -190 -106 408 1281 1258 695 150 -579 -1281 -804 -391 475 698 34 -810 -1127
3188a127N14L78M36l74q85k11O8R27J052L36l28j143r02J16Q24O92K17M2l99l08
$$ -1127 -613 -235 201 -173 -1058 -1269 -1201 -274 778 1114 786 -357 -1259 -1143 -319 373 590 632 233 -75
3208g5N28O20K32m05j051n19K73M88L41M74L00n53n84q41j26L02L01K23j01o50
$$ -75 453 1073 1305 900 -151 -670 -397 91 432 906 1206 653 69 -772 -898 -596 -295 -72 -173 -823
3228h23L99K43k6K4k08j89m24p58o5J212Q87q8n69o22R6M9L69N9Ml75l26O18M64
$$ -823 -424 -181 -207 -183 -391 -580 -1004 -1762 -1827 -615 272 184 -385 -1007 -911 -862 -493 -434 -430 -805 -1131 -513 -49
3251d9N32K31o60j036j03p0M09Q90j10K21M8l58L20L54l85p42j54K28P6O53K37
$$ -49 483 714 54 -982 -1085 -1155 -746 144 34 255 303 -55 265 619 234 -508 -662 -434 -358 295 532
3272E32J90l99j3n41j13j61J33j27L16L2K23L27l56l8l52O8j75n32J75L04Q45
$$ 532 722 323 310 -231 -344 -505 -372 -499 -183 -151 72 399 43 5 -347 -279 -454 -986 -811 -507 338
3293C38k28j20k1k82L5m21L19k92j08M24N5P55L85qn11p81k54J30N39K85L7j12
$$ 338 110 -10 -31 -313 -278 -699 -380 -672 -780 -356 -301 454 839 831 320 -461 -715 -585 -46 239 276 164
3315A64K27R1K43J24m15p62l19J49O95N02N92k12p74J00l26K12k99j78n3J1N15
$$ 164 391 482 725 849 434 -328 -647 -498 197 699 1291 1079 305 405 79 291 -8 -186 -239 -228 287
3336B87J57R3M17o82K16p06j07n1L4O83L51J89j07o29J03k98K11K61n07n94N85
$$ 287 444 537 954 272 488 -218 -325 -376 -342 341 692 881 774 145 248 -50 161 422 -85 -679 -94
3357i4J24O42N20m8n68r72o98O03M81N36p1j94m92L21L51J14k0m78m52k94J84
$$ -94 30 672 1192 1144 576 -396 -1094 -491 -10 526 455 261 -231 90 441 555 535 57 -395 -689 -505
3378e05P42P02K67l65q45j05p3L33J19J04k79Q7K0P7O9N46Q8q14o72l43J27M68
$$ -505 237 939 1206 841 -4 -109 -182 151 270 374 95 182 202 279 348 894 982 168 -504 -847 -720 -252
3400b52J029L18j05q86n64J90M04K97j29l68m40l6N43J133N21j47j248r65k84
$$ -252 777 1095 990 104 -460 -270 134 431 302 -66 -506 -542 1 1134 1655 1508 260 -705 -989
3419i89J001N96O50q2n03m46j33L07N04on32o34n25Q65Q39M47K07l50r74q85R4
$$ -989 12 608 1258 1176 673 227 94 401 905 899 367 -267 -792 73 912 1359 1566 1216 242 -643 -549
3440e49K59O11L42O0n55k31J56O04O12m18o33o34o15M17R70O82O59n07j130p46
$$ -549 -290 321 663 723 168 -63 93 697 1309 891 258 -376 -991 -574 396 1078 1737 1230 100 -646
3460f46p5J138L06J19l34q34k88J045P64K33l54j192j036L1M04J364M31k48o16
$$ -646 -721 417 723 842 508 -326 -614 431 1195 1428 1074 -118 -1154 -1123 -719 645 1076 828 212
3479B12p60l01O39M46J80n30o44k02K17R16O78K73o77o47j029n9O90J144P32k25
$$ 212 -548 -849 -210 236 416 -114 -758 -960 -743 173 851 1124 447 -200 -1229 -1288 -598 546 1278 1053
3499A053r64n79k15Q89P05l29o06q20n32L66J450N99M11r04j542m32L9J339L69
$$ 1053 89 -490 -705 184 889 560 -46 -866 -1398 -1032 418 1017 1428 524 -1018 -1450 -1411 -72 297
3518B97J77o64q44L13K93N45M14j06j088p08j9P33J127O99k40p26p11m55O22P00
$$ 297 474 -190 -1034 -721 -428 117 531 425 -663 -1371 -1390 -657 470 1169 929 203 -508 -963 -341 359
3538C59M11k01n40l72K06O34O91K27k85j217r99K24Q80R44P46j03j041j041J07
$$ 359 770 569 29 -343 -137 497 1188 1415 1130 -87 -1086 -862 18 962 1708 1605 564 -477 -370
3557c70M86P18L98p33j260k70P86P76Q60k86o51j846n47Q45J021P37L78p48q61
$$ -370 116 834 1232 499 -761 -1031 -245 531 1391 1105 454 -1392 -1939 -1094 -73 664 1042 294 -567
3576e67l81M84J001K55o52q31n01KN63J190P05m25p11p85l89O9R47O52J24n72
$$ -567 -948 -464 537 792 140 -691 -1192 -1190 -627 563 1268 843 132 -653 -1042 -973 -26 626 750 178
3596A78n53k69M57Q93M30q33p42j082N5Q70J419O47q77q85j093j21P18J123k75
$$ 178 -375 -644 -187 706 1136 303 -439 -1521 -1466 -596 823 1470 593 -292 -1385 -1506 -788 335 60
3615F0n10r60m27N08J127O10k47r56j176j40L58J105R71k78k99r70j7J81Q16L41
$$ 60 -450 -1410 -1837 -1329 -202 408 161 -795 -1971 -2111 -1753 -648 323 45 -254 -1224 -1241 -1060 -244 97
3635I7k54m93l22K2Q20P21M86J17o62j081o13P59R25O41K14q50p32k04M84O86
$$ 97 -157 -650 -972 -950 -130 591 1077 1194 532 -549 -1162 -403 522 1163 1377 527 -205 -409 75 761
3655G61K47o93o02q53J92J218O84N65n58j022p84j36O47R50J02m18o29J82r5N31
$$ 761 1008 315 -287 -1140 -948 270 954 1519 961 -61 -845 -981 -334 616 718 300 -329 -147 -242 289
3675B89L64M92r16j311K66O76L00J299K57p50p01o14K03J52O21K56m85n45J2M70
$$ 289 653 1145 229 -1082 -816 -140 160 1459 1716 966 265 -349 -146 6 627 883 398 -147 -135 335
3695C35L10Q49m08r57q42p62O50Q91J003j53r83p20k02L07N08N07o59o76j87K21
$$ 335 645 1494 1086 129 -713 -1475 -825 66 1069 916 -67 -787 -989 -682 -174 333 -326 -1002 -1189 -968
3715i68O86O90K00o49j038j47l61Q11J107l10jo74K35k02O5L04j17o20j75l76
$$ -968 -282 408 608 -41 -1079 -1226 -1587 -776 331 21 20 -654 -419 -621 -556 -252 -369 -989 -1164 -1540
3735a540L53O45Q14L28n93q61m60j03M32O91K26N4l13n22J0Q30K50p9q01o40k16
$$ -1540 -1187 -542 272 600 7 -854 -1314 -1417 -985 -294 -68 -14 -327 -849 -839 -9 241 162 -639 -1279 -1495
3756a495N13J032Q52o95l62j007K58L83M70K09k73k77l93N04K72Q08m33k49m98
$$ -1495 -982 50 902 207 -155 -1162 -904 -521 -51 158 -115 -392 -785 -281 -9 799 366 117 -381
3775c81n66K59O64N09M63L5n34j31N9n11M62Q3K7l40j50L98N42J37J46j97q88
$$ -381 -947 -688 -24 485 948 983 449 318 377 -134 328 411 438 98 -52 346 888 1025 1171 974 86
3796H6k94q6O33R5N39k99l34Q2j33O13k63k35m15n98L28M88N11M28m22m22k38
$$ 86 -208 -294 339 434 973 674 340 422 289 902 639 404 -11 -609 -281 207 718 1146 724 302 64
3817F4m60L72M11j99n8k97O82K48k14%l87o5j9n09L94R6L90r2L64m17n4l09l58
$$ 64 -396 -24 387 188 130 -167 515 763 549 549 162 97 78 -431 -37 59 449 357 721 304 250 -59 -417
3840d17k10M02k87L11J32n8P21l00Kj68p29O3k25N90J46L03J63j30k67k4K42m70
$$ -417 -627 -225 -512 -201 -69 -127 594 294 296 128 -601 -538 -763 -173 -27 276 439 309 42 18 260 -210
3862b10j46k77M3L41O21o6Q5l40J0l06j21k74J10R4ML99J88k39j12r1l34N7N4
$$ -210 -356 -633 -590 -249 372 306 391 51 61 -245 -366 -640 -530 -436 -432 -33 155 -84 -196 -287 -621 -564 -510
3885e10K58P7J66K7QK83j42j20m76l07N94j97K44M25K66k08K08k71K9l43l62L19
$$ -510 -252 -175 -9 18 26 309 167 47 -429 -736 -142 -339 -95 330 596 388 596 325 354 11 -351 -32
3907c2m2M79J27j40L2j3j55j29j27l82k02J20M33L00K46l71m86j05k6J28K82k92
$$ -32 -74 405 532 392 424 411 256 127 0 -382 -584 -464 -31 269 515 144 -342 -447 -473 -345 -63 -355
3929c55Q2j07K36L95N03m41j33n91k69N24k17N25n6K16k84r7L52l38j62J19K19
$$ -355 -273 -380 -144 251 754 313 180 -411 -680 -156 -373 152 96 312 28 -69 283 -55 -217 -98 121
3950A21k54J0L73p9N16n6k18m79m45l62O23K71L85j20k3k97k41N54J67k54l74
$$ 121 -133 -123 250 171 687 631 413 -66 -511 -873 -250 21 406 286 263 -34 -275 279 446 192 -182
3971a82o91M7M73L79N59J56m94m46m77R5M69K76J67l28n31N69J4M16j3m73m55
$$ -182 -873 -826 -353 26 585 741 247 -199 -676 -581 -112 164 331 3 -528 41 55 471 458 -15 -470
3992d70j69J16L38J66O07Q7k81l78j66k31K40K39Q9m18J04J22Q66k09Q6j88p99
$$ -470 -639 -523 -185 -19 588 675 394 16 -150 -381 -141 98 187 -231 -127 -5 861 652 738 550 -249
4013b49n10L4O90M48L31o1m94l12j14J81K73N8q83k39K93M02P69K46k06n32o56
$$ -249 -759 -725 -35 413 744 683 189 -123 -237 -56 217 275 -608 -847 -554 -152 617 863 657 125 -531
4034e31k47J26M99M16m15Pj10M5Q15k03q3n46l25m3J89M38L87L00j45l04q07J39
$$ -531 -778 -652 -153 263 -152 -145 -255 -210 605 402 319 -227 -552 -595 -406 32 419 719 574 270 -537 -398
4056c98M09M6M62j30k09n03J55P97M36m24l30q02n46L05P60O97K36n17p12M6N4
$$ -398 11 57 519 389 180 -323 -168 629 1065 641 311 -491 -1037 -732 28 725 961 444 -268 -222 -168
4077a68P6N10J28o40j29l98P71P68J56n80m80p31KL82K04P79l8m69l39N4K22J54
$$ -168 -92 418 546 -94 -223 -621 150 918 1074 494 14 -717 -715 -333 -129 650 612 143 -196 -142 80 234
4099B34k62J03p1o03L47J0J148J98k52n67q04j60m0R23O86k21o29k8PJ10N39K29
$$ 234 -28 75 4 -599 -252 -242 906 1104 852 285 -519 -679 -719 204 890 669 40 12 19 129 668 897
4121H97p97q12n00L95R39Q26p9j85r43o42J90N47J64k19l28j03p2L72N57J40m6
$$ 897 100 -712 -1212 -817 122 948 869 684 -259 -901 -711 -164 0 -219 -547 -650 -722 -350 207 347 301
4142C01l83q00m57M24Q95N58k16N0m65j90m05O74M08L10p16k19o9K14R29L73m82
$$ 301 -82 -882 -1339 -915 -20 538 322 372 -93 -283 -688 -14 394 704 -12 -231 -300 -86 843 1216 734
4163G34l88j094j5N14O45L26R5q57k68k37N99N06k30l69p16k58L71Q02J039k14
$$ 734 346 -748 -763 -249 396 722 817 -40 -308 -545 54 560 330 -39 -755 -1013 -642 160 1199 985
4183I85q25m86n98L93M39O78k37l2j06j29J45L53J9N0o53m37k24N75J01J243l39
$$ 985 160 -326 -924 -531 -92 586 349 317 211 82 227 580 599 649 -4 -441 -665 -90 11 1254 915
4204I15j46q75m24r0N92M59K5j73o41j7K51P15K79m46n08r37L2M64R01M98m08
$$ 915 769 -106 -530 -620 -28 431 456 283 -358 -375 -124 591 870 424 -84 -1021 -989 -525 376 874 466
4225D66q02j79l18L89N00J85m31n68L00J38O55M13k53j91o18p64O6O31N23J92
$$ 466 -336 -515 -833 -444 56 241 -190 -758 -458 -320 335 748 495 304 -314 -1078 -1012 -381 142 334
4245C34nm09n03N5J63m2O65l55m57m01K95M25M82M05o78p51n04K57J78P69K04
$$ 334 329 -80 -583 -528 -365 -407 258 -97 -554 -955 -660 -235 247 652 -26 -777 -1281 -1024 -846 -77 127
4266A27l11k58m34L33N67J52k7p62n23J76L42P89L51j16n21m07j77J69P45r7k
$$ 127 -184 -442 -876 -543 24 176 149 -613 -1136 -960 -618 171 522 406 -115 -522 -699 -530 215 118 116
4287A16J28m67M16J84K70j16k59n22j99P6K40N19M91m5n01k21l45M4K92M06l23
$$ 116 244 -223 193 377 647 531 272 -250 -449 -373 -133 386 877 832 331 110 -235 -191 101 507 184
4308A84j87k29J49K02R86m78l48m14n97K5N57P06R0k38m56P3j17M27R1n4l68o05
$$ 184 -3 -232 -83 119 1105 627 279 -135 -732 -707 -150 556 646 408 -48 25 -92 335 426 372 4 -601
4330f01N04N84J83P8j91k12l14j45k18L78M22Q7k76j67j47J20J20j46k18k56j92
$$ -601 -97 487 670 748 557 345 31 -114 -332 46 468 555 279 112 -35 85 205 59 -159 -415 -607
4351f07j40L12N70K09J32o46l99l68J65K90K97K4j60k05K7N62L17j67m58l62q8
$$ -607 -747 -435 135 344 476 -170 -569 -937 -772 -482 -185 -161 -321 -526 -499 63 380 213 -245 -607 -695
4372f95K8N65N01P9m57Q1Mj46l70L70m6P5Pr9J84J69oL08l54m06k88NL02N89j33
$$ -695 -667 -102 399 478 21 102 106 -40 -410 -40 -86 -11 -4 -103 81 250 244 552 198 -208 -496 -491 -189 400 267
4397B67k11k13p1j49m8J38r0rj24j34N44L64j69K41m73m05k80O11K64j5M3L38
$$ 267 56 -157 -228 -377 -425 -287 -377 -386 -510 -644 -100 264 95 336 -137 -542 -822 -211 53 38 81 419
4419D19k25L00j48k8Rj83m74J33N39N3M78m06j87j54J70j53l64LK97L81l39L57
$$ 419 194 494 346 318 327 144 -330 -197 342 395 873 467 280 126 296 143 -221 -218 79 460 121 478
4441D78q5r3j18k20r7m5j20j14N16K8J13J28k95j54k47J32l56N53q8j00L26L85
$$ 478 393 300 182 -38 -135 -180 -300 -414 102 130 243 371 76 -78 -325 -193 -549 4 -84 -184 142 527
4463E27k42P7j33m42J21l23K05K91K32K32k52K71k10j2j36m39o7R2N69K14n0j7
$$ 527 285 362 229 -213 -92 -415 -210 81 313 545 293 564 354 342 206 -233 -300 -208 361 575 525 508
4485E08O7k02j37j11j34p5J07M9K00J04o8J49l77l91O8P1j8j38K36J09Q5J74m7
$$ 508 575 373 236 125 -9 -84 23 72 272 376 308 457 80 -311 -243 -172 -190 -328 -92 17 102 276 229
4508B29o8m56M29k30j93Q8J52L00k66L63j66j01j30p1K88qk81N18k72m7J12K83
$$ 229 161 -295 134 -96 -289 -201 -49 251 -15 348 182 81 -49 -120 168 160 -121 397 125 78 190 473
4530D73q4l05p21J14J51K93O80j46m39k78m0M5n8J76l43j88M26Q9R3K88N0l16
$$ 473 389 84 -637 -523 -372 -79 601 455 16 -262 -302 -257 -315 -139 -482 -670 -244 -155 -62 226 276 -40
4552d0K13n54n03O10j45j39N25J83l22j15K62K0q5k00j69j61l3O10J51K37k79
$$ -40 173 -381 -884 -274 -419 -558 -33 150 -172 -287 -25 -5 -90 -290 -459 -620 -653 -43 108 345 66
4573F6j15l11k81N8N86K0j11Jk38L91J71J7M4o19k92j46K33M36J94L41k74m70
$$ 66 -49 -360 -641 -583 3 23 -88 -87 -325 66 237 254 298 -321 -613 -759 -526 -90 104 445 171 -299
4595b99R5n7K94k69K98k34J23j1K08J86J60l42m84P8j85j6O61Q9K1K76q16K35
$$ -299 -204 -261 33 -236 62 -172 -49 -60 148 334 494 152 -332 -254 -439 -455 206 295 316 592 -224 11
4617A1j7R2J12j9j59l69M67K5N44K2k42n39n22J5L18L70N40l21n89K78l73L18
$$ 11 -6 86 198 179 20 -349 118 143 687 709 467 -72 -594 -579 -261 109 649 328 -261 17 -356 -38
4639c8L04m0n73j08k8M40L38N60m58k58j14n93j42K83N78l85J71k28l39O27q1
$$ -38 266 226 -347 -455 -483 -43 295 855 397 139 25 -568 -710 -427 151 -234 -63 -291 -630 -3 -84
4660h4K67Pm34m90K62L03J09N30J23l37l10n04K55L27J7lkk92j92N79K38J49l75
$$ -84 183 190 -244 -734 -472 -169 -60 470 593 256 -54 -558 -303 24 41 38 36 -256 -448 131 369 518 143
4683A43m51p39M58N19L92p0j2j46n14pL20N72n27k34k74K99L22M40R5O8n42k43
$$ 143 -308 -1047 -589 -70 322 252 240 94 -420 -427 -107 465 -62 -296 -570 -271 51 491 586 654 112 -131
4705a31n61O4K80M40K73J2o4j61k31L92O8R0k81o44K18J24O69O05k27m47p43j60
$$ -131 -692 -628 -348 92 365 377 313 152 -79 313 381 471 190 -454 -236 -112 557 1162 935 488 -255 -415
4727d15J76O25r1J81k10p34N29K1N21j79l89k16q31N35P36K09J53Ol64l79k37
$$ -415 -239 386 295 476 266 -468 61 82 603 424 35 -181 -1012 -477 259 468 621 627 263 -116 -353
4748c53J83m2M06l11L8o3j09N03L80k6l45o79m70M78M07L83N23o45l75l29P1K79
$$ -353 -170 -212 194 -117 -79 -142 -251 252 632 606 261 -418 -888 -410 -3 380 903 258 -117 -446 -375 -96
4770i6J25O3l31n17K34M67J82M81j50l69o86j09J51M36L49Q0m31l74N12k72K62
$$ -96 29 92 -239 -756 -522 -55 127 608 458 89 -597 -706 -555 -119 230 310 -121 -495 17 -255 7
4791GJ07p4n43l72j1R38Q4K76j81l28n28L18l43M95L96k05m7r7Q2Q9N25j2l83
$$ 7 114 40 -503 -875 -886 52 136 412 231 -97 -625 -307 -650 -155 241 36 -11 -108 -26 63 588 576 193
4814A93k69l25r8M17P58L80n25m68m54K43K93r2R0k52M9k16J91M12K81l97k85
$$ 193 -76 -401 -499 -82 676 1056 531 63 -391 -148 145 53 143 -109 -60 -276 -85 327 608 211 -74
4835g4m49j72K02Q42m9kk57l49L62k11o6K72j1j63J78n1K83M55j15%n60k3m66
$$ -74 -523 -695 -493 349 300 298 41 -308 54 -157 -223 49 38 -125 53 2 285 740 625 625 65 42 -424
4858d24L47L63J76n9m92J36K3k7N27J6l86k92n52L90M93K25J33k99m30j07k65
$$ -424 -77 286 462 403 -89 47 70 43 570 586 200 -92 -644 -254 239 464 597 298 -132 -239 -504
4879e04n6N96J10k91k26L2M88J61n7j45o08n8K17N7P07l44K12k67l63L16q3M2
$$ -504 -560 36 146 -145 -371 -339 149 310 253 108 -500 -558 -341 -284 423 79 291 24 -339 -23 -106 -64
4901f4R6j28n0KJ5K06K77j31O1k92k43k12N61J06J71K99l39J74q55N81j70J23
$$ -64 32 -96 -146 -144 -129 77 354 223 284 -8 -251 -463 98 204 375 674 335 509 -346 235 65 188
4923A88l04k35K06P1K79L22K06o91P2n81M6N33K57J3k04L5N3o1QK41k80l84Q1
$$ 188 -116 -351 -145 -74 205 527 733 42 114 -467 -421 112 369 382 178 213 266 205 213 454 174 -210 -129
$$ [...]
8191D7
##END NTUPLES=NMR FID
##END=
