##TITLE=1H_Pr 4647-Van
 CDCl3, 24 sc, 
 31.1.2020
##JCAMPDX= 6.0         $$ Bruker NMR JCAMP-DX V2.0
##DATA TYPE= NMR FID
##DATA CLASS= NTUPLES
##ORIGIN= UXNMR, Bruker Analytische Messtechnik GmbH
##OWNER= root
$$ XWIN-NMR		Version 3.5
$$ Fri Jan 31 16:18:11 2020 Russian Standard Time (UT+4h)  she@DPX200
##.OBSERVE FREQUENCY= 200.1315
##.OBSERVE NUCLEUS= ^1H
##.DELAY= (6, 6)
##.ACQUISITION MODE= SIMULTANEOUS
##.ACQUISITION SCHEME= undefined
##.AVERAGES= 16
##.DIGITISER RES= 18
##SPECTROMETER/DATA SYSTEM= spect
##.PULSE SEQUENCE= zg30
##.SOLVENT NAME= D2O
##.SHIFT REFERENCE= (INTERNAL, D2O, 0, 15.7039)
##AUDIT TRAIL= $$ (NUMBER, WHEN, WHO, WHERE, WHAT)
$$ ##TITLE= Audit trail, XWIN-NMR		Version 3.5
$$ ##JCAMPDX= 5.01
$$ ##ORIGIN= Bruker BioSpin GmbH
$$ ##OWNER= she
$$ F:/spectra/data/she/nmr/H-F/1/audita.txt
$$ ##AUDIT TRAIL=  $$ (NUMBER, WHEN, WHO, WHERE, WHAT)
(   1,<2020-01-31 16:16:50.45 +0400>,<she>,<DPX200>,
      <created by zg, POWCHK disabled, PULCHK disabled
       configuration hash MD5:
       00 E9 B6 7A A2 85 ED C7 34 08 36 98 17 FE 4E 26
       data hash MD5: 16K
       5F 45 A0 2E 7B 45 C9 94 48 F1 6D 96 7B BB A4 D4>)
$$ ##END=
$$ 
$$ hash MD5
$$ 08 87 30 4D 65 A8 51 0F 60 10 6B 8A 98 AD 7A 0E
##$RELAX= 
##$RELAX= 
##$RELAX= 
##$RELAX= 
##$RELAX= 
##$RELAX= 
$$ Bruker specific parameters
$$ --------------------------
##$DU= <F:/spectra>
##$EXPNO= 1
##$NAME= <H-F>
##$PROCNO= 1
##$TYPE= <nmr>
##$USER= <she>
##$AMP= (0..31)
100 100 100 100 100 100 100 100 100 100 100 100 100 100 100 100 100 100 
100 100 100 100 100 100 100 100 100 100 100 100 100 100 
##$AQSEQ= 0
##$AQ_mod= 1
##$AUNM= <au_zg>
##$AUTOPOS= <>
##$BF1= 200.13
##$BF2= 200.13
##$BF3= 200.13
##$BF4= 200.13
##$BF5= 200.13
##$BF6= 200.13
##$BF7= 200.13
##$BF8= 200.13
##$BYTORDA= 1
##$CFDGTYP= 0
##$CFRGTYP= 5
##$CHEMSTR= <none>
##$CNST= (0..31)
1 1 145 1 1 1 1 1 1 1 1 1 1 1 1 1 1 1 1 1 1 1 1 1 1 1 1 1 1 1 1 1 
##$CPDPRG= <>
##$CPDPRG1= <>
##$CPDPRG2= <>
##$CPDPRG3= <>
##$CPDPRG4= <mlev>
##$CPDPRG5= <mlev>
##$CPDPRG6= <mlev>
##$CPDPRG7= <mlev>
##$CPDPRG8= <mlev>
##$CPDPRGB= <>
##$CPDPRGT= <>
##$D= (0..31)
0 1.2 0 0 0 0 0 0 0 0.06 0 0.03 0 0 0 0 0.0002 0 0 0 0 0 0 0 0 0 0 0 0 
0 0 0 
##$DATE= 1580473010
##$DBL= (0..7)
120 120 120 120 120 120 120 120 
##$DBP= (0..7)
150 150 150 150 150 150 150 150 
##$DBP07= 0
##$DBPNAM0= <>
##$DBPNAM1= <>
##$DBPNAM2= <>
##$DBPNAM3= <>
##$DBPNAM4= <>
##$DBPNAM5= <>
##$DBPNAM6= <>
##$DBPNAM7= <>
##$DBPOAL= (0..7)
0.5 0.5 0.5 0.5 0.5 0.5 0.5 0.5 
##$DBPOFFS= (0..7)
0 0 0 0 0 0 0 0 
##$DE= 6
##$DECBNUC= <off>
##$DECIM= 24
##$DECNUC= <off>
##$DECSTAT= 4
##$DIGMOD= 1
##$DIGTYP= 9
##$DL= (0..7)
0 120 120 120 120 120 120 120 
##$DP= (0..7)
150 150 150 150 150 150 150 150 
##$DP07= 0
##$DPNAME0= <>
##$DPNAME1= <>
##$DPNAME2= <>
##$DPNAME3= <>
##$DPNAME4= <>
##$DPNAME5= <>
##$DPNAME6= <>
##$DPNAME7= <>
##$DPOAL= (0..7)
0.5 0.5 0.5 0.5 0.5 0.5 0.5 0.5 
##$DPOFFS= (0..7)
0 0 0 0 0 0 0 0 
##$DQDMODE= 0
##$DR= 18
##$DS= 0
##$DSLIST= <SSSSSSSSSSSSSSS>
$$ [...]
##$SUBNAM2= <"">
##$SUBNAM3= <"">
##$SUBNAM4= <"">
##$SUBNAM5= <"">
##$SUBNAM6= <"">
##$SUBNAM7= <"">
##$SUBNAM8= <"">
##$SUBNAM9= <"">
##$SW= 24.9337058887773
##$SWIBOX= (0..15)
0 0 2 0 0 0 0 0 0 0 0 0 0 0 0 0 
##$SW_h= 4990.01996007984
##$TD= 16384
##$TD0= 1
##$TE= 0
##$TE2= 300
##$TE3= 300
##$TEG= 300
##$TL= (0..7)
0 120 120 120 120 120 120 120 
##$TP= (0..7)
150 150 150 150 150 150 150 150 
##$TP07= 0
##$TPNAME0= <>
##$TPNAME1= <>
##$TPNAME2= <>
##$TPNAME3= <>
##$TPNAME4= <>
##$TPNAME5= <>
##$TPNAME6= <>
##$TPNAME7= <>
##$TPOAL= (0..7)
0.5 0.5 0.5 0.5 0.5 0.5 0.5 0.5 
##$TPOFFS= (0..7)
0 0 0 0 0 0 0 0 
##$TUNHIN= 0
##$TUNHOUT= 0
##$TUNXOUT= 0
##$USERA1= <user>
##$USERA2= <user>
##$USERA3= <user>
##$USERA4= <user>
##$USERA5= <user>
##$V9= 5
##$VALIST= <valist>
##$VCLIST= <CCCCCCCCCCCCCCC>
##$VD= 0
##$VDLIST= <DDDDDDDDDDDDDDD>
##$VPLIST= <PPPPPPPPPPPPPPP>
##$VTLIST= <TTTTTTTTTTTTTTT>
##$WBST= 1024
##$WBSW= 4
##$XGAIN= (0..3)
0 0 0 0 
##$XL= 0
##$YL= 0
##$YMAX_a= 313564
##$YMIN_a= -146802
##$ZGOPTNS= <>
##$ZL1= 120
##$ZL2= 120
##$ZL3= 120
##$ZL4= 120
##$ABSF1= 10
##$ABSF2= 0
##$ABSG= 5
##$ABSL= 3
##$ALPHA= 0
##$AQORDER= 0
##$ASSFAC= 0
##$ASSFACI= 0
##$ASSFACX= 0
##$ASSWID= 0
##$AUNMP= <proc_1d>
##$AZFE= 0.1
##$AZFW= 0.1
##$BCFW= 1
##$BC_mod= 2
##$BYTORDP= 1
##$COROFFS= 0
##$CY= 11.3945322036743
##$DATMOD= 1
##$DC= 2
##$DFILT= <>
##$DTYPP= 0
##$F1P= 16.9975609425685
##$F2P= -3.02152046262296
##$FCOR= 0.5
##$FTSIZE= 0
##$FT_mod= 4
##$GAMMA= 1
##$GB= 0.15
##$INTBC= 1
##$INTSCL= 1
##$ISEN= 128
##$LB= 0.24
##$LEV0= 0
##$LPBIN= 0
##$MAXI= 10000
##$MC2= 0
##$MEAN= 0
##$ME_mod= 0
##$MI= 1.114404
##$NCOEF= 0
##$NC_proc= 0
##$NLEV= 6
##$NOISF1= 3.799351
##$NOISF2= 2.8
##$NSP= 1
##$NTH_PI= 0
##$NZP= 0
##$OFFSET= 15.70392
##$PC= 1
##$PHC0= -9791.775
##$PHC1= 22.20081
##$PH_mod= 1
##$PKNL= yes
##$PPARMOD= 0
##$PSCAL= 0
##$PSIGN= 0
##$REVERSE= no
##$SF= 200.130013532006
##$SI= 16384
##$SIGF1= 3
##$SIGF2= 2
##$SINO= 400
##$SIOLD= 16384
##$SREGLST= <1H.CDCl3>
##$SSB= 0
##$STSI= 0
##$STSR= 0
##$SW_p= 3612.71676300578
##$SYMM= 0
##$S_DEV= 0
##$TDeff= 0
##$TDoff= 0
##$TI= <>
##$TILT= no
##$TM1= 0
##$TM2= 0
##$TOPLEV= 0
##$USERP1= <user>
##$USERP2= <user>
##$USERP3= <user>
##$USERP4= <user>
##$USERP5= <user>
##$WDW= 1
##$XDIM= 8192
##$YMAX_p= 0
##$YMIN_p= 0
$$ End of Bruker specific parameters
$$ ---------------------------------
##NTUPLES= NMR FID
##VAR_NAME=  TIME,          FID/REAL,        FID/IMAG
##SYMBOL=    X,             R,               I
##VAR_TYPE=  INDEPENDENT,   DEPENDENT,       DEPENDENT
##VAR_FORM=  AFFN,          ASDF,            ASDF
##VAR_DIM=   8192,          8192,            8192
##UNITS=     SECONDS,       ARBITRARY UNITS, ARBITRARY UNITS
##FACTOR=    0.0002004,     1,               1
##FIRST=     0,             0,               0
##LAST=      1.6414764,     0,               0
##MIN=       0,             -146802,         0
##MAX=       1.6414764,     313564,          0
$$ Real data points
##PAGE= N=1
##DATA TABLE= (X++(R..R)), XYDATA
0 0 0 0 0 0 0 0 0 0 0 0 -16 16 -16 16 -16 32 -32 34 -48 52 -64 78 -85 97 -113 131 -149 173 -195 221 -249
31 -249 276 -313 352 -389 435 -484 541 -598 665 -734 813 -901 997 -1104 1226 -1360 1514
48 1514 -1691 1895 -2135 2422 -2769 3204 -3767 4527 -5619 7322 -10377 17614 -76918 37358
62 37358 163676 -28715 -146802 -97484 -8181 -51274 -72673 3042 66714 -19682 -113290 -66066
74 -66066 55253 59311 -19748 -33083 37022 54806 1354 -25580 26159 73512 59055 15073
86 15073 6895 26578 37183 32886 42246 57078 46607 8304 -16087 1371 42464 56392 19714
99 19714 -18714 550 41518 22237 -42411 -46622 26782 66891 6169 -64821 -43539 25495
111 25495 32870 -13439 -18412 19741 9014 -49744 -52839 23259 70516 26602 -32254 -31060 1435
124 1435 7695 546 19737 41142 14478 -35991 -34577 19687 52144 29834 -2651 -7317 -2697
137 -2697 -8472 -7755 17521 42970 29222 -14333 -32232 -3099 27551 17151 -8504 -4284 17572
150 17572 14195 -18381 -35521 -3295 42405 37313 -15639 -50032 -32476 4031 19431 15179 3262
163 3262 -12450 -26574 -25648 -6246 14571 14119 -5513 -18963 -13752 -2682 6673 11532 12479 8540
177 8540 6879 5344 -1064 -3094 13241 36449 42057 26096 3971 -5244 6391 31849 50631
190 50631 41368 8082 -16195 2571 45049 54236 17363 -9689 5728 28132 16655 -5793
202 -5793 -270 23940 28396 7424 -4953 6346 12468 -2702 -7913 16370 35138 16174 -14417
215 -14417 -14046 13608 36239 32695 14985 660 -3295 2104 18887 36719 36603 17933 3950
228 3950 7397 13329 13673 16317 25465 25550 8798 -10187 -9296 15628 36566 27728 -3080 -19621 -10476
243 -10476 6252 12328 10087 8360 9356 3147 -11530 -13071 8351 27175 17511 -6851 -13506 1998
257 1998 17357 18151 11174 10086 10795 4416 -3210 2523 16652 19497 10813 5473 5551 3429 2816 6905
273 6905 9936 4187 -4584 -2608 7429 8384 -5321 -10883 5208 18031 2364 -22256 -20605 2623
287 2623 15723 6205 -8137 -8531 256 -508 -8178 -7262 2631 4492 -4970 -12440 -9455 -1537 3091
302 3091 1127 -5920 -11640 -12281 -11027 -9771 -6093 -1951 -1293 -5050 -12548 -19307 -15031 -2749 4494
317 4494 -2633 -16151 -21310 -10493 7440 12046 -2170 -14441 -9740 1340 364 -5787 -2286 8713
331 8713 10822 -602 -10822 -2624 11654 10092 -3676 -8420 -415 4930 2284 -1092 855 4875
345 4875 4157 -3539 -10257 -7416 738 6202 4847 -690 -5741 -2499 4982 6731 1152 -2657 426
360 426 3483 4477 3278 5088 10115 14421 8499 -2374 -4289 7052 16025 12773 2591 -1975 5984
375 5984 14079 8553 -1293 -844 7648 5696 -4404 -6331 2406 11754 8380 -2745 -8395 -2781 4133
390 4133 1904 -3174 -2833 1825 4140 1853 -2458 -3716 2008 6920 2497 -5397 -8260 -2834 4370
405 4370 6828 2649 -3551 -5107 -3214 -5442 -8235 -5741 -309 -11 -6946 -15131 -14608 -2643 3771
420 3771 -4612 -17818 -18178 -9145 -4656 -6853 -8053 -4127 -505 -5169 -14362 -15495 -5274 4399 3445
435 3445 -4189 -10100 -8432 175 5924 2827 -2251 -3428 -3483 -6146 -6532 -1594 6426 9001 910 -10516
451 -10516 -13598 -4254 4083 3286 -2684 -6743 -5641 -2289 -772 -2504 75 5978 4551 -6860 -14222
466 -14222 -6533 9443 16069 8532 -2607 -4953 1221 5139 3782 4313 7742 7361 2364 -1935 -1048
481 -1048 5752 13025 11839 -218 -9003 -6480 1130 5818 5932 4107 4284 2068 -4212 -8888 -2980
496 -2980 9085 12761 4202 -5796 -7884 421 11961 15330 8280 999 208 694 1846 4830 11753
511 11753 17501 14189 1226 -7770 -1917 11280 15275 6847 -871 -2760 -790 739 805 1931 4333
526 4333 3813 -5255 -15494 -15186 -5214 6004 7524 -2817 -15061 -16005 -9487 -4677 -3666 -2588 -2281
541 -2281 -7600 -13843 -13929 -5881 5035 8264 -1790 -15297 -17449 -8136 1916 6649 2917 -1873 -3718
556 -3718 -6175 -8953 -7838 1848 9342 5610 -6036 -13367 -8236 4045 11206 6953 -1847 -6627 -6440
571 -6440 -4831 -2330 3785 8805 8835 1207 -10678 -12845 -2400 8998 8315 -1311 -8723 -8403 -4332
586 -4332 -1059 767 1796 2045 -3675 -13998 -17613 -9330 2865 8833 2656 -9451 -15787 -10198 -1897
601 -1897 1292 886 1326 -278 -4768 -8463 -4823 6206 15620 12272 -869 -9300 -6055 5013 13638
616 13638 15357 10272 3935 1120 -338 -891 4958 13683 14173 4016 -9050 -10456 413 12762
630 12762 13445 2627 -6470 -9215 -6844 -3395 2450 6880 7276 1485 -6705 -11344 -4581 7327 12206
645 12206 6308 -1701 -4605 -462 6343 9069 9093 10088 9575 3126 -3774 -1954 9036 18112 17801 7388
661 7388 -3575 -4081 3006 8309 8301 5875 3303 -444 -4884 -5902 -604 7451 9932 423 -13197 -16383
677 -16383 -9418 389 5155 2406 -3997 -9548 -11697 -11013 -6896 639 3848 -1332 -11566 -16103 -10745
692 -10745 684 7943 3018 -7663 -12278 -9820 -7012 -4044 237 3904 3575 -3225 -12513 -14287 -4047
707 -4047 6719 7096 -1894 -11480 -11549 -4041 3801 5050 1670 -882 -4064 -9660 -10638 -3248 6774 8775
723 8775 1565 -7792 -10354 -4773 744 2131 -20 -852 -3260 -5787 -6973 -3851 2322 8468 6244
738 6244 -4648 -12422 -8893 1361 9606 8940 3355 -1254 -978 1313 1888 5656 10906 11982 6195
753 6195 -447 -819 7592 17386 18241 9354 1396 1549 4969 7093 9686 11301 11365 7599 1455 -3178
769 -3178 -714 7318 10053 5206 -2331 -6178 -4086 1291 3455 1856 435 -1192 -5504 -10977 -9848
784 -9848 -1040 6821 5839 -4012 -11930 -10416 -2117 2840 845 -2331 -4588 -5569 -5549 -4398 -2036 2451
800 2451 4440 -2245 -12112 -14202 -7107 1606 3083 -1878 -8541 -11028 -9590 -7582 -6305 -4383 -4360 -8196
816 -8196 -12913 -13400 -8548 -2031 -152 -4959 -11718 -12394 -7330 -4431 -4533 -5031 -2699 437 -919 -6441
832 -6441 -9344 -3961 4009 4386 -808 -5300 -5123 -97 4349 5429 2278 176 -724 -2345 -2558 472
848 472 5101 8247 5544 -986 -4148 445 6058 5825 1879 1453 3008 2546 862 1013 5345 9428
864 9428 7460 -302 -5838 -2426 5329 9263 7313 2133 -1791 -24 2434 2780 2488 3498 3235 -42
880 -42 -2518 -1362 3283 7032 6655 344 -4005 -2581 2646 4603 4484 2757 2496 3766 3630 791 849
897 849 5072 7158 4216 -586 154 4484 8037 5831 1875 489 3176 2994 -569 -1093 2327 5475
913 5475 3967 348 -3503 -2205 1332 1828 -1092 -3268 -3887 -1683 -66 -538 -2072 -1500 538 -535
929 -535 -4545 -6147 -2576 2219 3400 351 -3125 -1660 1478 2503 -596 -1224 615 1314 -401 -1207
945 -1207 658 4051 4419 542 -3680 -3397 445 2483 397 -1654 -734 1541 2543 -35 -3069 -1512
961 -1512 2193 1839 -959 -3596 -1269 2862 5289 2706 -1461 -2497 -407 1390 840 626 1336 1756
977 1756 1342 -510 -986 2018 4007 653 -3955 -4548 38 3739 3461 -631 -2336 -417 1041 -437
993 -437 -2342 -108 2179 2451 371 -674 154 3874 6100 2757 -501 -1081 2351 4558 4486 3883 4217
1010 4217 5214 4728 1848 683 3209 6077 5525 2222 -79 1221 4651 5909 3209 717 221 1236
1026 1236 570 -467 900 3572 4847 2310 -2410 -3551 348 3467 2319 -758 -1460 128 1554
1041 1554 1145 262 987 2788 2659 -1750 -4018 -1157 3290 5989 3613 -1306 -2371 -482 675 -289
1057 -289 -379 1333 1359 -1401 -4255 -2552 955 4306 2881 -3160 -6661 -5295 -1460 1798 2072 -411
1073 -411 -2305 -2167 -3247 -4713 -2754 1181 1081 -2496 -6011 -6298 -1825 1907 1396 -2338 -5363 -5084
1089 -5084 -4834 -4432 -3017 -9 1218 -699 -4397 -7745 -5732 -586 1998 -817 -4275 -5690 -3189
1104 -3189 -918 499 623 1907 1012 -3035 -6138 -4458 1041 5917 5171 137 -3624 -3431 1016 2638
1120 2638 2315 1803 735 -469 -2210 -1940 871 4383 5571 551 -5025 -5230 -1510 2993 3655 2643
1136 2643 710 -530 -1049 -2066 -1171 2679 5908 3621 -1530 -4411 -1678 4569 7852 5715 889
1151 889 -1567 -945 -527 2787 5840 7116 5172 1339 -2853 -2212 2693 7272 6369 1427 -3287 -3622
1167 -3622 -293 3136 3718 2161 845 -1030 -5124 -6268 -2149 3311 4934 1363 -4150 -6842 -3688
1182 -3688 -344 909 -323 -1178 -2200 -4583 -5827 -3122 1581 4669 2127 -5034 -9199 -6302 -44
1197 -44 3549 2630 -699 -3190 -3309 -3620 -2625 81 2571 1735 -1740 -5267 -5125 -736 3815 4581 1085
1214 1085 -3645 -4959 -4001 -2254 1112 3578 3220 -108 -4423 -7067 -3786 2488 4085 451 -5040
1229 -5040 -6988 -4428 -634 1607 452 -129 -1703 -5132 -8026 -5841 354 4720 3459 -2121 -6580
1244 -6580 -5798 -429 3009 3342 1450 -609 -2347 -2218 366 3655 6707 6483 1856 -3484 -3378 1403
1260 1403 6209 7469 5326 2279 406 266 1090 2482 5061 6119 2602 -1320 -3419 -1817 4176
1275 4176 7679 4878 -1825 -5090 -3593 -1209 1533 2885 3510 2015 -1887 -5549 -4647 1483 5245
1290 5245 3696 -1520 -4324 -3541 -151 3957 4891 2693 1196 -1406 -2980 -2349 1328 5659 6634 3759
1306 3759 -1021 -3527 -867 3371 4541 3170 1694 -380 -1995 -1237 1383 3993 5773 3210 -3041
1321 -3041 -6584 -4353 2122 5286 3906 -720 -3704 -3268 -1612 -1497 25 1496 255 -3481 -5871
1336 -5871 -4729 -669 2916 2267 -1547 -5813 -6464 -4527 -1779 693 736 -137 -2225 -4832 -5772 -3082
1352 -3082 1455 2994 -530 -4868 -6036 -3581 731 2487 1201 -459 -1813 -3612 -4245 -2898 1268
1367 1268 4275 2640 -1907 -6407 -5081 250 2899 1561 -1209 -2981 -2834 -2659 -1005 1314 3178
1382 3178 2171 -1567 -5005 -4206 271 3292 3851 2187 -529 -1127 303 897 2363 3776 4039 2172
1398 2172 -205 -786 1127 5264 7335 5618 874 -1422 -75 2903 5100 5009 4546 3415 1498 -76
1414 -76 -371 3239 6046 4394 434 -2113 -1124 2702 5299 3611 1649 755 -451 -1470 -1016 995
1430 995 4128 4137 1633 -1520 -1936 -309 2834 2916 1187 -372 -1144 -879 536 1497 2526 2696 846 -2509
1448 -2509 -4422 -2355 857 2775 2480 -1719 -3436 -2451 -494 -821 -1883 -966 -1486 -3086 -4425 -3824
1464 -3824 -913 1144 314 -3956 -5220 -4276 -2775 -1744 -1269 -1523 -1877 -1898 -2942 -3295 -3101 -576 379
1481 379 -1643 -3636 -4309 -1996 -113 1710 -70 -2289 -2125 -1896 -2082 -934 841 1841 1436 -491
1497 -491 -2365 -1508 2144 3093 858 -1395 -1118 485 1747 2087 1095 1924 1940 1106 -1644 -1098 1371 3404
1515 3404 2475 826 211 489 1697 1598 1109 548 1222 273 374 624 1638 2377 2973 1991 -122 -947 1193
1534 1193 2455 2326 2145 1265 1341 2383 2210 949 1406 2523 2323 776 -203 1516 3252 4353 2274
1551 2274 -463 171 1521 1644 303 -176 1476 1702 902 -86 -206 1104 1657 -22 -2118 -1301 -419
1568 -419 427 984 -39 -584 -1044 -523 -1225 -1784 -916 -130 -99 -686 -1596 -1463 -401 932 -454 -2643 -2207
1587 -2207 -1267 -762 -531 -792 -870 -266 -282 -2665 -3589 -1313 1085 45 -2398 -3088 -1086 536 860 -928
1605 -928 -2002 -1627 -1327 -1270 -1145 -664 10 731 300 -1240 -2254 -1193 527 262 -362 -968 -915 -660 -143
1624 -143 143 411 965 -219 -2249 -2644 -1188 1596 2624 574 -1284 -2141 -10 1361 488 -227 285
1641 285 618 -398 -806 519 1604 3286 2144 -1063 -1835 -343 1750 2267 2298 1720 987 791 75 240
1659 240 1005 2374 2075 572 -481 -920 535 3196 3432 1036 -664 -916 -486 -27 1006 2310 1863
1676 1863 1656 -853 -2478 -918 2247 2655 709 -1588 -1670 -309 943 1609 1149 1370 467 -1569 -3093
1693 -3093 -1852 1608 2923 2099 -837 -2176 -1627 496 1097 1294 25 -735 -2031 -1767 -773 578 1775
1710 1775 1419 -759 -3963 -3701 -1764 524 1392 -126 -1167 -2151 -2175 -2106 -896 54 738 -1487 -3629
1727 -3629 -4414 -2209 1335 2704 161 -3588 -4161 -2820 -1962 -609 235 268 -203 -2283 -3282 -2468 238
1744 238 1575 285 -1906 -2820 -2851 -1634 1136 2177 1041 -486 -1955 -3343 -2606 27 2657 2611 306
1761 306 -3274 -3223 -1212 1607 1663 120 -1366 -1970 -2272 -1067 450 1958 2762 759 -2780 -4068 -1723
1778 -1723 1170 3165 2194 326 -960 -1444 -530 535 1972 3237 1511 -956 -2009 -64 2115 4992
1794 4992 4358 1690 -1130 -1496 -478 1602 3963 3642 2650 883 -530 -881 614 3314 3906 1162
1810 1162 -1838 -2460 -322 2564 3442 1990 387 -991 -2307 -2776 -795 1974 3161 1319 -1813 -3665
1826 -3665 -2135 1048 2289 963 -840 -2099 -2061 -1942 -238 1704 2888 2013 -1077 -3642 -3184 25
1842 25 2234 2979 1281 -1002 -1781 -1391 -59 1189 2015 1106 -1235 -2798 -2460 -192 2582 3947 1296
1859 1296 -2610 -3901 -2583 -566 880 1164 282 -1110 -2024 -3241 -2407 216 1905 50 -2649 -4595
1875 -4595 -3539 -501 952 1546 32 -1731 -3018 -3483 -2695 525 2376 1959 -99 -2802 -3338 -597
1891 -597 2540 2613 1177 -751 -1429 -1186 788 2178 3668 3249 1046 -1406 -2022 233 2952 3732 2761
1908 2761 634 -889 -200 1182 1635 1988 2439 1310 -880 -1751 -243 2363 4570 3431 403 -1810
1924 -1810 -1935 310 2239 2648 2452 1197 -292 -1108 -584 1516 3351 3717 902 -1485 -2078 314 3430
1941 3430 3873 2740 714 -300 -1052 -551 979 2797 2948 1441 -1103 -1638 -559 1422 2451 608
1957 608 -322 -957 -1406 -401 559 1487 1812 1197 -891 -2778 -2806 219 2262 2186 498 -1440 -1748 -222
1975 -222 1023 1102 731 223 -1453 -2216 -1804 -344 2238 2593 251 -2544 -2642 -1671 -206 699 781 -375
1993 -375 -1209 -1739 -2047 -1444 -67 460 -964 -2418 -3895 -2576 62 910 542 -1661 -2534 -2656 -2947 -1887
2011 -1887 -688 479 -18 -1200 -2711 -2611 -815 868 838 -946 -2032 -2310 -1571 332 1048 1509 827
2028 827 -69 -1527 -1753 -274 1712 2505 929 -96 -374 472 1543 1473 1059 1090 555 102 -196 460 1673
2047 1673 2818 1903 -127 -1442 -769 489 1114 1694 1031 361 105 -165 -22 550 1598 1513 100 -1604
2065 -1604 -1225 392 2186 2651 851 -407 -966 -298 264 907 1182 1210 484 397 104 634 1858 1401 399
2084 399 -200 -505 2 785 1136 1132 583 591 -248 -1697 -1516 405 831 587 -835 -1437 -1031 -312 101 -561
2104 -561 -1446 -1994 -1961 -2086 -1490 -713 56 -643 -1427 -2779 -2750 -1232 -844 -1035 -1459 -1673 -1387 -954 -1192 -1402
2124 -1402 -988 -1097 -910 -2180 -2140 -1198 113 69 -472 -1537 -1639 -895 -1080 -1348 -1150 -938 -279 134 -396
2143 -396 -1010 -53 -207 95 -1245 -1111 -841 222 657 349 -267 11 53 -105 -265 573 771 852 214 -81
2163 -81 884 1441 1566 531 -283 107 806 823 1153 1439 1385 1366 1646 1051 770 826 1509 1209 1169 997 1472 1857
2185 1857 2384 1759 863 1143 863 687 639 1662 1891 2078 1669 482 -119 1531 2155 1484 547 -202 428
2204 428 1098 1381 1191 973 898 647 -717 -188 955 1625 1211 282 -17 -272 841 1070 77 213 38
2223 38 -33 81 158 370 851 1045 208 -1185 -1512 -708 -313 403 576 226 -908 -681 -1008 -848 -387 -162
2243 -162 -727 -1742 -1535 -1270 401 861 357 -1328 -1933 -1722 -1094 -639 170 241 -38 -253 -908 -1658 408
2262 408 1212 -9 -918 -1551 -1488 -423 810 1237 320 -16 -708 -1384 -1090 -672 785 1039 421 -257 -1551
2281 -1551 -1061 605 1446 583 235 -324 -603 -261 835 1497 2300 1349 -191 -1400 -729 1077 2383 2178
2299 2178 993 520 145 705 1270 1431 1350 1509 411 -624 -97 907 2883 2956 1601 27 -469 68
2317 68 841 1454 2212 1492 429 -7 -185 575 2050 2383 1267 -726 -1102 -237 848 2665 2522 1290
2335 1290 134 -641 -422 289 1602 1981 1548 336 -539 -540 649 1922 1506 32 -733 -1075 -1138 725
2353 725 1294 1350 1207 -627 -1962 -2150 -965 249 1198 -280 -1080 -2142 -2021 -1160 -538 -222 -75 -1420
2371 -1420 -3234 -2512 -2171 -367 715 286 -2062 -3310 -3094 -1652 -260 579 371 -1606 -2204 -1328 -1566
2388 -1566 -227 1102 454 -1228 -2915 -1928 -858 1352 1472 799 -507 -1517 -1812 -955 311 1450
2404 1450 960 197 -1238 -2534 -518 675 1220 961 -1138 -2284 -2022 -1020 396 1443 1078 184 -1885
2421 -1885 -2311 -1931 267 1270 1249 -444 -1326 -1393 -487 836 1100 1062 -121 -958 -1131 -392 985 2605
2439 2605 2776 1178 -817 -814 -278 1001 2027 2076 1207 -120 -513 -111 773 2185 2401 886 -1035 -1621
2457 -1621 -883 987 2475 2085 120 -732 -1586 -1040 124 1356 1875 557 -763 -1480 -1131 384 2002
2474 2002 1234 -346 -1279 -1753 -1308 610 845 1522 652 -729 -2002 -1700 -884 540 1211 490 -920 -1706
2492 -1706 -1653 -91 498 463 -252 -1418 -2669 -2352 -1094 609 1427 366 -1935 -3620 -2436 -1579 168
2509 168 519 -549 -2041 -2806 -1988 -1066 -202 -188 -523 -2233 -2905 -2494 -900 592 1104 -44 -1731 -2028
2527 -2028 -1526 -1235 104 832 435 -120 -1544 -1700 -810 1161 1629 905 -671 -1667 -1566 -55 1346 1866
2545 1866 815 -109 -1176 -1737 -571 1002 1527 916 -524 -1339 -996 -78 1037 1098 368 -494 -1335 -1286
2563 -1286 -337 1061 1467 1537 329 -946 -1448 -8 870 1733 1923 150 -209 -297 612 1390 2212 1925 827
2582 827 -232 -857 550 1817 2525 2217 1005 -224 -579 207 848 1453 1160 802 -330 -689 -282 632
2600 632 1317 997 -248 -1206 -1133 -595 430 663 1164 128 -658 -1237 -1297 -392 798 827 -5 -1293 -1537
2619 -1537 -834 442 750 395 -90 -833 -1369 -954 -389 237 608 0 -1342 -1811 -1907 -540 462 5 -529
2638 -529 -1279 -1522 -1140 -262 -321 69 -333 -1723 -1840 -958 -507 443 521 -513 -1328 -1423 -1382 -430 -373 215 51
2659 51 -443 -646 -577 -288 700 458 173 -736 -949 -478 138 1203 1111 405 -131 -760 -231 482 1145 1455 711
2680 711 181 -222 386 1293 1496 1221 291 65 55 751 505 1214 1405 848 388 -92 18 461 707 851
2700 851 741 85 682 614 697 1109 777 729 485 96 369 576 1237 2160 1014 1045 229 636 1087 1081 1456 909
2722 909 689 1042 1132 1000 1678 1808 839 -172 178 592 447 1104 1276 82 308 307 -191 -254 2 227 -36
2743 -36 -471 -576 -581 142 -326 -265 -529 -1226 -853 -625 -622 -219 -279 -512 -368 -1064 -1152 -707 -454 -434 -822 -822 -914 -109
2767 -109 -519 -449 -294 -965 -1022 -756 -781 -231 -764 -236 -339 -539 -444 -165 -111 -443 -925 -345 -630 -245 -206 213
2789 213 4 -617 -228 -727 -651 -383 120 -61 -46 -104 -378 -244 -174 -111 -125 -224 -389 -284 -61 262 663 626 406
2812 406 -353 -557 178 447 763 944 599 333 871 634 1120 1078 737 634 69 453 1376 1580 1675 1830 1093
2833 1093 957 780 278 982 1105 1398 679 794 968 451 885 1293 825 187 -114 -318 896 668 1343
2852 1343 1290 55 -27 -632 -536 530 962 721 460 -22 -533 187 666 406 213 -555 -421 -64 78 627
2872 627 698 983 170 -767 -866 -527 -33 -91 85 126 -572 -652 -561 40 -446 126 -708 -1519 -1593 -704 -689 289 270
2895 270 -605 -1804 -1587 -1375 -453 -235 -401 -858 -995 -1482 -1183 -664 82 27 -1192 -1757 -1841 -764 -426 736
2915 736 110 -77 -1399 -1176 -840 -301 572 -195 323 -141 -566 -306 -55 1320 323 -48 -520 -1103 -485
2934 -485 608 1030 1601 356 -172 -1099 -759 376 1178 944 269 -302 -526 -94 466 1255 727 478 -304
2953 -304 -799 -13 956 1518 1661 710 -139 -321 120 519 1444 1496 1391 474 236 661 1415 1838 1841 1454 531
2974 531 -399 -2 726 2024 2403 1534 89 -769 -214 333 1235 1393 636 -342 -695 -547 444 1353 1300 267
2994 267 -1067 -1359 -1320 -349 595 728 546 -457 -1160 -1450 -785 150 447 -31 -521 -1003 -1008 115 650 911
3014 911 483 -791 -1462 -1274 -527 661 939 965 146 -1420 -2194 -876 269 1131 547 -667 -1755 -1049
3032 -1049 -526 542 806 615 -1042 -1736 -1929 -878 275 968 317 -1240 -1284 -1616 -1264 -91 385 353
3050 353 -862 -1502 -1166 -969 410 1145 617 -594 -1302 -1720 -628 586 1252 926 704 -377 -951 -111
3068 -111 809 1806 1316 410 20 -406 608 1689 2193 1431 592 -264 -636 695 1257 2010 1748 1359 -502
3087 -502 -217 38 1049 1140 1386 825 -199 -416 136 860 1194 1457 233 -467 -551 -645 349 1833 1681 591
3107 591 -470 -671 -869 449 949 864 534 -457 -485 -595 99 1788 1117 117 -621 -1393 -979 417 1178
3126 1178 652 73 -803 -773 -1613 -570 246 -432 -389 -968 -1584 -1635 -376 -319 -123 -741 -1313 -2027 -1768 -246
3146 -246 485 462 -556 -1259 -1747 -1775 -1146 -170 35 -417 -1237 -1678 -1449 -723 178 259 -324 -1660 -1879 -1468
3166 -1468 -540 -124 475 -282 -1028 -1636 -1286 -842 -560 87 -144 -1254 -1785 -1396 -1236 -367 282 -73 -1159
3185 -1159 -1780 -1357 -1025 -47 419 -118 -458 -1203 -1500 -955 292 276 -107 -464 -663 -915 143 1114 1009
3204 1009 667 201 -696 -1059 354 1124 1465 836 150 -178 8 63 1140 975 1054 1099 297 483 779 1292
3224 1292 1210 1270 736 29 -298 296 852 1030 473 509 -392 -875 -114 -14 822 264 -460 -998 -213 223 465
3245 465 776 498 -150 -972 -993 -608 259 764 617 3 125 -196 -580 143 850 289 -35 -150 -500 -220
3265 -220 502 629 -504 -136 -366 -900 -474 -161 365 269 308 -528 -768 -855 -420 -474 -261 -236 -1044 -872 -822 -122
3287 -122 -270 48 -1120 -1167 -1366 -577 -341 158 -110 -200 -538 -799 -590 -435 -126 -24 -510 -730 -347 231
3307 231 -33 789 374 -310 -489 -626 -759 216 510 390 -96 184 353 285 141 625 483 -329 139 41 480
3328 480 637 638 398 -30 50 354 199 756 769 427 614 481 585 818 725 825 645 518 280 860 1192 836
3350 836 1103 559 673 571 401 534 459 388 1140 731 536 1024 822 636 693 680 801 331 91 578 560 763
3372 763 458 528 279 334 737 601 632 257 177 129 408 444 -265 275 -450 -246 60 233 498 254 135 95
3394 95 -544 -306 -106 94 -96 415 -293 -175 -437 -69 -142 -63 -275 -671 -201 -752 -676 79 144 -27 -410 -1025
3416 -1025 -491 -1072 -864 -454 -193 -787 -909 -259 -512 133 115 -579 -964 -924 -608 -278 495 196 -189 -572
3436 -572 -885 -406 -371 -121 87 -171 -113 -26 -197 -96 592 89 218 -361 -473 -363 317 242 989 380 -86
3457 -86 308 -490 264 626 578 681 118 -263 64 301 1045 1057 -78 34 46 286 557 934 864 637 304
3478 304 -5 -141 669 1009 857 828 317 371 200 780 627 552 552 52 -331 -395 102 394 745 827 460 -233
3500 -233 11 297 625 1032 620 34 -487 -443 -169 696 715 634 -148 -267 -238 -10 552 738 342 -81 -713
3521 -713 -664 -441 305 102 -260 -313 -348 -680 -312 57 372 143 -571 -1347 -1251 -527 -133 86 155 -308 -755 -1349
3543 -1349 -859 -81 -277 179 -691 -1150 -906 -645 -70 -7 -365 -820 -1767 -1353 -1357 -403 687 101 -182 -963
3563 -963 -801 -1060 -112 -21 80 -166 -1051 -559 -48 404 870 221 -186 -536 -1055 -272 701 998 1367 549
3583 549 333 -483 -339 515 1327 1008 542 80 -21 -192 823 1258 963 275 -713 -262 -237 969 1151 1191
3603 1191 720 546 -78 368 288 1242 939 668 179 46 196 1112 1194 1502 713 -187 -68 170 909 962 1834
3624 1834 796 448 40 342 908 916 1035 522 93 -302 -155 770 945 1273 546 -18 -574 -540 222 1236
3644 1236 1195 237 -241 -365 -730 234 577 551 -28 -442 -844 -378 14 392 424 -150 -929 -1732 -839 -608 505
3665 505 264 -215 -744 -1412 -1281 -571 -177 78 -1 -1103 -1810 -1705 -375 -299 95 -14 -1085 -1605 -1576 -976
3685 -976 -41 -11 406 -792 -1025 -1147 -672 -344 -187 -474 -658 -942 -1028 -331 -7 512 -161 -1016 -1138 -1044 -1140
3706 -1140 276 262 368 -177 -765 -475 -218 -32 768 209 -1 -492 -640 -92 448 1469 454 256 -331
3725 -331 -599 -52 557 1051 932 641 -283 -603 -69 351 784 173 201 -466 -383 125 486 528 848 472 -456
3746 -456 -387 -173 812 635 930 706 190 -214 67 815 1172 972 992 -97 -152 247 618 1262 956 -56
3766 -56 -337 -612 312 639 568 887 137 67 -462 -399 386 311 260 -302 -1110 -752 -222 102 494 -75 -844 -576
3788 -576 -1006 -857 -547 407 451 74 -768 -573 -976 -835 -166 -178 -490 -668 -1055 -152 -276 239 -167 -333 -1144
3809 -1144 -1343 -762 -555 -155 -96 284 -267 -886 -749 -459 -39 -167 25 -577 -997 -453 -201 -110 124 -166
3829 -166 -639 -566 -876 -410 -201 256 414 -160 -327 -764 -561 259 401 91 62 -618 -81 35 827 391 612
3850 612 167 -238 -341 179 886 1280 846 352 -1 424 316 1079 632 619 547 452 186 685 1385 984 877
3871 877 392 -38 -246 329 435 949 577 944 121 406 198 367 184 234 -98 -19 197 456 653 534 666
3892 666 -25 -50 157 -117 139 1103 119 530 134 189 80 1 318 104 -54 -19 512 473 -59 286 -44 -181
3914 -181 -330 -847 -339 -332 -161 29 -595 -42 -638 -596 -167 -767 -236 -671 -872 -406 -617 -505 -109 -436 -267
3935 -267 -952 -1142 -839 -597 -719 -396 -319 -516 -660 -339 -13 -612 -520 -608 -401 -976 -193 66 -489 61 -439
3956 -439 -221 -368 4 -376 -29 55 -17 220 257 198 -229 -183 545 46 -210 -48 513 315 206 487 191 -94
3978 -94 -74 -317 317 164 180 -204 -124 537 83 44 363 -150 -274 89 295 570 518 624 753 455 453 704 442
4001 442 461 371 131 839 709 1209 700 854 617 467 215 502 794 508 895 300 605 370 409 152 93
4022 93 275 249 71 64 62 221 694 356 -166 -274 -652 19 164 309 152 -4 -99 -441 -410 29 -97 -153 300
4045 300 -250 -249 -287 338 -619 -98 -620 -752 -638 -775 -129 -342 -294 -304 -275 -234 -787 -495 -405 -367 -644 -105 -352
4068 -352 -360 -166 125 -168 -419 -799 -1052 -678 -369 -69 -213 240 -341 -804 -858 -474 19 383 -41 -413 -488
4089 -488 -386 -89 556 402 -96 -200 -798 -611 -142 221 -235 479 141 -535 112 28 324 464 548 -249 337
4110 337 382 308 892 368 758 224 -192 -219 149 838 1071 588 511 154 -23 497 637 720 561 60 -121 -47
4132 -47 805 1259 280 443 -199 -232 51 90 655 838 925 582 203 290 176 395 812 759 147 318 240 -93
4154 -93 563 938 579 -73 -53 -147 -290 518 594 629 250 -50 -608 -317 172 277 -340 -511 -624 -641 -129 -99
4176 -99 -43 -75 -497 -667 -796 -823 56 -173 -124 -386 -477 -802 -829 -106 -110 -203 -661 -621 -749 -515 -314 45 201 -503
4200 -503 -1228 -1061 -1074 -218 297 16 -46 -447 -1060 -527 -40 -378 -427 -653 -1098 -826 -426 71 169 -76 -281
4221 -281 -829 -718 -177 14 40 314 238 -642 -590 -510 -97 9 528 -202 -367 -802 110 342 1017 696 439
4242 439 -264 -454 -570 65 719 825 751 -81 -68 100 519 877 353 256 -105 -506 -82 787 1062 1021 708
4263 708 -132 -372 43 681 450 930 150 96 98 -154 271 255 492 293 -105 -509 -514 333 814 655 464 -30
4285 -30 -193 -155 -23 611 748 523 183 -478 -446 149 338 382 -146 -248 -341 -173 413 29 677 -311 -468 -696
4307 -696 -557 -492 221 -26 -182 -630 -622 -569 -41 -285 -460 -65 -915 -1011 -937 -647 255 -407 -260 -700 -972 -945
4329 -945 -527 -81 -1 393 -131 -994 -809 -235 -249 532 -19 -585 -422 -581 -310 132 452 408 -257 -586 -879
4350 -879 -456 -167 429 78 35 -188 -266 -362 -153 325 235 49 -195 -182 -445 311 502 167 284 -363 -88 -50
4372 -50 224 495 611 865 -131 -63 136 857 793 -54 288 88 5 147 810 1022 570 553 143 96 296 669
4394 669 1002 1081 763 352 252 520 845 701 728 296 -163 120 320 712 789 459 447 -125 -276 -147 -40
4415 -40 223 204 68 -68 -317 -379 81 62 234 -19 -457 -745 -195 243 639 67 -369 -198 -489 -54 -538
4436 -538 -116 -66 -171 -380 -467 -454 -436 -21 -53 -140 -370 -173 -598 -79 270 -81 -56 -693 -849 -963 -366 -158
4458 -158 -166 -338 -402 -842 -620 -218 -148 -558 -569 -216 -760 -593 14 -268 202 -253 -543 -1085 -226 129 -182 -200
4480 -200 -151 -251 -206 90 -95 -291 263 -33 33 -344 16 652 278 529 589 139 -327 11 211 77 421
4501 421 77 307 103 569 476 756 705 411 819 284 264 462 620 625 494 125 324 79 733 511 418 547
4523 547 342 169 549 449 324 -32 292 241 435 273 250 705 401 585 -57 237 57 346 602 183 291
4544 291 11 -196 229 240 312 93 315 -398 -517 131 299 116 259 90 -289 -411 -81 -123 -403 9 -575
4565 -575 -177 -155 153 -582 -188 60 304 -885 -774 -63 -506 -147 -377 -231 -309 -10 -715 -668 -146 -265 -390
4586 -390 -386 -370 -177 -262 -304 -510 -242 -310 -496 -832 -39 145 -227 -462 -502 -674 -416 -591 -601 -499 -746 -666 -533
4609 -533 -202 -172 -252 -305 -328 -41 -120 13 72 171 -67 236 -327 -41 151 15 112 1 319 358 476 397 156
4632 156 346 153 45 148 -1 362 51 565 389 194 257 158 397 291 114 242 -172 106 580 300 52
4653 52 594 36 42 -351 171 490 268 214 -105 326 222 87 621 -102 236 134 205 220 158 431 445 189 299
4676 299 -300 -17 -384 439 216 846 143 -358 -205 -366 -162 308 28 -85 -702 -248 -490 9 568 -391
4696 -391 -550 -390 -853 -581 -153 292 -43 -282 -25 -595 -27 -349 -480 -135 -354 -805 -590 -520 -28 -276
4716 -276 -9 -4 -455 -565 -439 114 33 -47 142 -306 -442 -272 178 181 27 -165 -483 -85 -29 -262 334 608
4738 608 -167 -466 -464 -190 -294 102 -12 -101 22 9 -349 -166 574 181 -72 -321 -301 -62 481 432 619 314
4760 314 173 -241 -440 68 710 677 384 459 -107 -64 625 383 566 -155 -103 -47 80 416 861 790 140 2
4782 2 -375 -35 474 589 762 409 -76 -108 429 163 113 431 323 496 111 -13 277 193 765 267 260 -3
4804 -3 59 -168 16 620 301 -25 -479 -425 -153 557 67 152 -744 -533 -373 -291 47 529 -41 -447 -526 -575 -611
4827 -611 76 147 -117 -250 -343 -416 -435 242 122 -94 -577 -348 -348 -146 -149 495 -1 -520 -318 -969 -138 -133 403
4850 403 20 -76 -800 -431 -428 257 -123 -206 -357 -453 -676 -175 -109 79 -137 -383 -760 -882 -418 -114 295 83
4872 83 -410 -334 -88 44 48 521 303 -382 -342 -207 -264 -38 336 264 270 -180 -231 27 -243 812 390 506 288
4895 288 -312 -27 314 111 474 -68 -225 -291 -3 660 652 733 385 117 -243 230 238 704 683 443 66 -152
4917 -152 67 135 596 247 108 87 -113 222 329 1025 530 362 229 -309 -111 266 482 770 597 -36 -233
4938 -233 0 67 178 262 108 -247 -487 129 -16 255 761 326 5 -489 -495 -222 -19 380 -32 -344 81
4959 81 8 -265 347 -92 -336 -302 -602 -298 -333 86 73 -237 -463 -380 -723 -670 -158 42 73 -128 -396 -495 -693
4982 -693 51 -71 -197 -261 -594 0 -181 -25 302 101 -468 -820 -543 -1 -498 87 27 -118 -148 -220 -22
5003 -22 -187 1 111 -332 165 -427 209 114 508 438 181 9 -612 -684 493 539 70 590 57 -133 -46 521
5025 521 221 9 -350 -30 75 453 466 517 301 269 88 63 281 373 491 190 690 462 640 508 822 711
5047 711 534 177 120 6 478 368 279 990 261 100 151 -8 168 514 206 269 12 445 126 -612 279
5068 279 -97 -166 -235 -206 -148 -389 -74 480 -353 -230 -42 -403 77 27 161 -213 -279 -185 -82 -102 -250 162 -7
5091 -7 -476 -299 63 -187 136 -355 -383 162 53 -510 -252 -404 -277 -263 -247 -261 -30 -547 -782 -200 -305 -772
5113 -772 -604 -625 69 -529 -207 190 -521 -69 -155 -591 -523 -295 -454 -353 -203 -133 -156 97 127 113 -140 -160 45
5136 45 -109 -171 39 240 -454 -165 -63 -335 -173 135 178 129 -22 483 -38 -12 178 -176 193 238 -50 32
5158 32 -30 350 355 311 224 203 292 -26 187 315 196 291 360 636 498 421 73 96 48 155 629 6 174 221 434
5183 434 268 -3 -108 -46 51 173 393 495 320 -19 25 316 220 -23 -174 -215 -17 474 -357 -68 -62 -55 -186
5206 -186 -542 -377 5 -149 -227 -395 -290 157 -356 -317 -531 -337 -717 -49 -401 80 -232 -313 70 -420 -38
5227 -38 206 -303 -411 -482 -604 -145 -97 -161 -225 -306 -405 -170 -73 -37 -459 -181 63 -596 -139 -285 -362 53 -130
5250 -130 -473 -219 -253 -358 92 86 28 -213 -65 -247 -146 -129 -64 -424 209 -251 -338 -81 65 100 -111 -662 -290
5273 -290 -310 7 729 133 110 -7 337 336 -40 350 323 434 357 484 269 150 351 268 635 259 -73 -160 596
5296 596 541 440 585 691 421 235 775 323 405 -17 57 116 82 64 -67 356 359 -361 138 337 207 322 441
5319 441 299 87 440 52 141 48 135 536 96 -192 3 100 284 582 548 -313 -269 -654 -376 -159 175 400
5341 400 -220 -390 -404 -536 -204 72 88 -198 -192 -70 -221 265 -180 -234 -603 -306 -456 -534 -33 -406 -329 -269 -720
5364 -720 -1063 -501 -312 -169 -211 -600 -450 -930 46 -510 92 3 -295 -356 -696 -359 494 -17 -24 59 -606 -709
5386 -709 -114 -222 -147 131 -106 210 -67 -129 191 447 -195 9 -146 -115 -74 51 406 -27 384 -239 -194 -120
5408 -120 142 -79 -184 3 -113 -131 397 444 213 -2 413 50 -21 -92 5 228 330 185 236 -134 153 317
5430 317 446 553 313 228 -7 4 127 259 282 301 -112 -341 -323 458 519 81 351 420 72 180 -216 190
5452 190 247 77 83 121 104 196 -81 98 272 -262 -459 -298 -214 54 -73 422 -169 -455 -6 -421 -5 96
5474 96 110 -17 -541 -367 446 223 115 47 -495 -717 -368 -25 -345 126 110 -531 -206 -459 -339 -138 189
5495 189 39 -244 -551 -650 -35 31 237 -149 -628 -552 -677 -302 -14 163 -322 -11 -722 -235 -126 59 4
5516 4 -118 272 -363 -167 135 233 542 -33 -284 -377 -436 277 137 195 292 306 -289 203 73 21 475 202 222
5539 222 413 -55 -22 468 415 183 -112 63 -218 274 176 679 637 237 344 -4 391 45 139 225 -117 128
5561 128 161 2 -15 423 794 348 311 -119 21 390 788 261 106 280 237 22 213 491 102 302 228 -196
5583 -196 195 -133 601 554 -119 -81 -178 -107 -101 -43 179 687 -627 -466 -52 -120 -218 191 146 -305 -77 42 -278
5606 -278 -38 389 -433 -26 -703 -316 314 -185 -181 -374 -318 -169 -435 -541 100 -238 -175 52 177 -273 58
5627 58 302 -197 -531 -527 -453 -899 415 131 -294 -280 -466 -152 -717 -634 -825 -44 -232 -209 43 -176 -104 -367
5649 -367 -21 -266 -80 149 -253 -349 -74 207 -29 430 -563 111 223 254 144 270 -157 8 343 38 -242
5670 -242 147 372 -152 -81 -26 -284 194 63 61 407 221 -43 235 224 393 254 558 56 64 286 192 57 291
5693 291 75 163 243 -103 231 190 460 -290 338 -203 56 151 478 9 768 283 67 -176 63 674 603 28
5715 28 -175 152 281 -129 -278 242 -87 122 -6 283 286 -243 -557 -86 156 -264 -97 -436 158 -308 -202
5736 -202 -172 -387 -228 -138 343 -244 -116 -140 -366 -366 -390 -570 -149 -345 21 -272 -154 -184 -451 -250 -31 11 -349
5759 -349 -377 29 -50 -388 -162 14 -385 -239 -274 -305 -676 -349 -123 -517 -361 -23 -121 -191 -135 -425 -123 -199 -151
5782 -151 -350 26 -200 21 -383 11 65 373 -68 -53 200 95 -64 152 217 214 248 217 -77 220 58 677
5804 677 258 281 98 -31 384 2 611 379 -145 133 76 329 692 121 71 311 184 178 295 470 318 12
5826 12 274 271 186 443 393 128 44 -387 401 115 215 217 -113 343 97 -86 -118 51 622 213 -79 -98 0 -118
5850 -118 -52 -260 -14 -51 -11 -122 -382 367 126 112 -92 -76 -264 22 -34 100 -57 -529 -384 -767 27 224
5872 224 -230 -62 -62 -492 -389 -201 196 -472 -494 -156 -248 -218 -34 49 -270 -166 -190 -274 -421 -601 229 -308 -185
5895 -185 -236 -399 -373 -229 -166 -94 32 -546 -740 -394 78 21 -31 -173 69 101 7 280 279 163 310 -379 -523
5918 -523 -373 62 173 357 -67 -249 94 -187 407 24 -154 -257 165 201 184 250 349 13 270 315 -170 7
5940 7 26 353 228 255 145 98 92 320 230 327 21 125 12 338 528 335 121 287 226 -79 -14 11 322 741
5964 741 236 187 -348 -168 -124 52 193 -16 166 -186 -338 -31 96 526 28 111 -201 -179 244 -366 223
5985 223 49 56 28 -290 -499 77 77 -379 -264 -402 -270 116 -39 -527 -108 42 -176 84 -45 330 -408 90
6007 90 -468 -388 -328 22 57 -363 189 -521 13 -133 -87 -74 -412 110 -325 -392 -571 -288 -24 -371 79 92 -314
6030 -314 -361 -425 -71 60 -80 -244 -517 -239 8 183 205 242 15 -110 -94 -182 -305 -17 291 274 -162 167
6052 167 -296 -326 -7 -68 179 325 -75 350 255 -3 363 190 356 -10 -51 -48 446 -2 146 295 59 239
6074 239 112 499 455 328 345 491 -175 -168 519 373 178 173 -1 118 415 217 589 113 264 242 -225 -5
6096 -5 531 129 -32 387 135 338 275 38 251 287 295 -96 138 38 393 130 224 -397 -521 131 -274 -42
6118 -42 50 44 -474 -256 -387 -118 244 497 -460 -639 -603 -579 -368 141 -232 68 4 -459 -582 -277 -84 -89 -542
6141 -542 -425 -659 -357 -356 43 -42 -145 94 -455 -394 -602 99 101 342 -269 -60 -301 -136 -135 -178 329 366 -620
6164 -620 -503 -405 -11 26 201 -17 -113 105 -231 13 28 -107 -284 233 202 -70 37 -99 -128 64 -144 -66
6186 -66 -144 329 172 259 70 231 56 -87 10 453 287 166 84 -67 297 -81 -91 440 270 -107 422 238
6208 238 407 316 -85 517 -13 -119 226 555 93 447 139 317 296 590 365 45 165 170 -175 -145 8 209
6230 209 21 -10 235 -86 13 -281 -288 -108 107 308 28 -348 263 -214 25 -25 314 -379 -121 -303 -226 360
6252 360 -59 -296 -480 -416 -104 -470 167 -14 -42 -534 -149 205 -550 -191 -199 -329 -174 -271 -230 -517 -563 -532 -399
6275 -399 350 -325 -329 -115 -253 -193 336 -156 -705 -446 -408 -95 -426 -561 -162 -674 -436 -211 -121 9 -157 -426
6297 -426 -462 -101 -151 232 47 27 -322 163 -322 -240 -43 -36 -314 130 -51 -71 359 -143 393 148 23 163
6319 163 -161 83 10 242 561 -202 -302 38 169 127 394 115 387 350 232 102 275 316 419 334 123 -78
6341 -78 -239 -360 270 55 150 50 364 231 342 114 -65 78 490 101 340 79 515 -109 294 62 59
6362 59 51 601 430 -198 48 140 57 -5 -352 30 -118 -81 -517 35 5 6 -70 -122 326 -454 320 108 -521 -132
6386 -132 -25 154 -239 -19 -270 168 -186 -23 -372 -216 -279 -426 -296 150 -64 -78 14 -169 -140 -309 223
6407 223 -320 -472 243 19 -114 -123 -411 -295 -231 109 -202 -512 563 11 80 132 109 -125 -79 -284 -372 -104
6429 -104 -153 -23 -336 110 52 297 -404 -240 200 -299 109 -372 108 87 121 -85 -150 98 216 -86 127 335
6451 335 475 262 235 84 -46 31 134 185 219 355 206 723 92 -111 13 295 397 125 21 6 99 202
6473 202 149 356 205 23 -2 232 175 316 473 10 266 181 -51 -161 164 -376 459 -182 -77 -71 -163 61
6495 61 417 301 115 -535 -350 -57 248 -108 72 52 -320 11 28 -343 -102 -128 41 -123 -86 -304 -44 93
6517 93 -36 -448 -55 -611 -202 -395 -254 -14 -169 -318 -145 -227 17 160 -364 -298 -346 -236 -486 -443 -541 -186
6539 -186 -291 -449 -250 -119 -631 -93 172 9 -144 -124 -286 -302 -333 -257 -292 -529 -380 -136 311 159 -160 184
6561 184 -248 -344 365 -326 167 182 -112 68 -112 96 -112 0 251 195 -339 678 14 155 449 491 165
6582 165 -39 12 27 322 -25 124 332 288 317 275 16 393 247 -27 61 -163 -122 222 -130 496 380 30
6604 30 71 -232 -11 787 -5 349 -28 -44 261 51 124 450 549 -71 -300 23 255 159 33 370 113 -799
6626 -799 131 531 262 362 19 -39 131 -334 71 150 167 24 151 -59 -271 -48 348 543 102 -481 -270
6647 -270 -439 -296 282 65 209 175 -460 75 70 -166 -243 -71 15 -257 -457 -380 -429 97 -456 -621 -289 -493
6669 -493 -50 64 -32 -258 -492 -231 -105 -234 -55 -386 131 -123 -220 -411 -549 33 212 232 167 -529 -388
6690 -388 -54 -286 113 397 12 159 -518 244 150 73 96 -45 -217 8 -208 -87 30 -214 -78 376 463
6711 463 -378 -3 26 519 74 160 -59 117 113 279 153 76 21 193 -11 375 96 69 514 45 -62 -300
6733 -300 125 463 742 373 337 180 103 103 -5 -387 122 165 304 -183 71 144 174 116 372 -117 9 -62 -91
6756 -91 72 -99 478 92 196 -369 71 -1 -55 -360 -105 -126 67 95 -105 272 -19 -249 -15 -241 -16 10
6778 10 -15 -105 -134 -388 128 -348 -217 -172 -262 -463 -89 -198 85 -107 -221 -153 -195 -173 -403 -33 368 213 -558
6801 -558 59 -309 -246 75 -48 -243 -227 -548 -236 -338 -238 -187 -222 46 -716 -137 -92 202 -81 312 -237 -291
6823 -291 224 50 -57 -131 -27 -307 -106 90 -125 479 -42 61 562 363 -46 -350 33 112 225 171 -155
6844 -155 68 36 -60 724 338 -184 264 657 240 607 402 498 375 159 76 419 211 261 335 138 192 -15
6866 -15 248 138 475 250 137 226 186 359 239 -80 67 173 -56 -59 -286 98 226 -79 196 185 312 -187
6888 -187 483 -210 -43 201 -255 -190 -194 526 89 5 -217 -274 -174 -240 -525 -234 -316 -107 -106 -386 -150 -72 -353
6911 -353 -188 -550 -285 -91 463 -135 -308 -346 -157 -65 -145 -272 85 -212 -424 110 -211 -468 85 275 -159
6932 -159 -521 -42 -34 -259 -40 -213 -145 73 173 50 -398 -137 119 -123 -105 -110 62 14 28 315 -171 107 -295
6955 -295 -177 -293 69 232 -279 -121 49 336 -163 -307 321 -13 -237 -129 251 155 188 -127 15 226 269
6976 269 -24 232 376 108 163 36 24 363 271 -166 216 287 406 162 29 91 275 92 305 192 -103 606
6998 606 -37 334 306 66 -98 69 392 206 438 -125 76 107 2 203 -196 57 172 -302 13 111 -17
7019 -17 -136 124 80 42 -384 -28 6 200 -267 -31 75 70 101 88 -241 -231 54 -227 -85 68 -355 -115 434
7042 434 -36 129 73 48 10 -392 94 78 -548 111 -114 -53 -115 -125 64 -297 -29 -126 -442 -596 318 -85 -518
7065 -518 134 -114 -54 37 -150 -117 25 37 -281 -179 -140 -213 52 -94 -395 -408 -680 -156 -95 79 -99 -41 79
7088 79 200 -237 -175 -126 149 -263 -518 67 -127 -221 344 -3 -181 57 -39 72 -111 341 -124 4 86 186
7110 186 258 -416 142 109 362 516 128 123 264 91 -79 537 128 174 86 227 217 436 427 147 94 264 -74
7133 -74 22 171 -222 286 57 456 307 114 144 -53 -281 72 59 162 -12 -143 278 -65 -21 326 195 209
7155 209 107 -22 -37 246 -269 127 -195 215 -129 13 -277 -78 -196 12 329 229 -172 -240 -137 -70 -146
7176 -146 -85 50 -253 -226 -88 -14 -198 -208 -31 -520 113 -297 159 -76 47 -578 55 -231 -205 -87 -394 -40
7198 -40 -198 -190 -463 -22 -91 85 127 -10 -218 -322 -197 -106 215 181 8 15 149 -244 180 192 -18 265 -212
7221 -212 9 -249 11 -24 202 13 -155 -300 349 -9 -110 193 339 -16 228 10 228 106 202 308 159
7242 159 73 12 -235 85 370 415 54 250 215 49 -126 309 148 448 -267 -68 569 -73 292 365 -2 378
7264 378 -24 39 324 -118 -103 132 -38 58 78 269 83 -323 198 -160 -117 -109 366 31 -202 223 161 -33 -229
7287 -229 -38 -51 -155 -50 -452 -161 154 -380 -133 222 92 -202 -179 -283 -15 -240 245 -371 -237 -36 -25
7308 -25 -214 -200 321 -441 -227 255 -228 -259 -105 -316 -305 -58 74 -235 -211 38 -58 101 -108 -192 -43 -205
7330 -205 -81 229 -42 -83 -228 13 -243 -67 199 -128 87 334 -151 -153 -177 622 -160 -232 40 -127 249 -106
7352 -106 81 -151 454 20 171 -399 306 276 38 -106 -7 694 168 -252 151 -109 -21 323 -471 -159 218
7373 218 663 -485 425 385 137 79 -28 274 407 125 355 285 192 40 90 41 -25 -93 186 25 10 60 -9
7396 -9 160 -138 -103 59 -101 261 143 -206 539 44 -112 -280 -199 -13 168 -167 -95 -575 219 58 52 -132
7418 -132 -211 -324 55 -64 -159 67 47 125 -209 -135 311 -40 189 -137 70 -306 132 -61 -83 -11 -332 188
7440 188 -141 -331 -180 216 -18 -197 -347 -8 -239 -332 -515 -105 -313 225 -521 -84 -9 -321 -106 -176 124
7461 124 7 -353 240 -543 -185 73 -278 -616 54 -356 -99 -146 -167 28 -185 -308 157 120 287 348 -25
7482 -25 -103 289 389 -240 240 440 59 -43 -228 36 41 134 -210 -125 257 492 378 28 149 200 -18 196
7504 196 81 252 83 218 664 152 319 416 143 215 95 245 312 307 355 188 142 117 -374 338 -348 -16 307
7527 307 293 -448 112 241 411 223 17 -165 -109 81 -220 241 10 -306 32 292 -173 -108 372 165 10
7548 10 143 -398 401 89 -12 38 -83 -87 -28 -186 -365 253 -464 183 147 81 -215 -576 53 145 -84 -572 -494
7571 -494 123 -95 -63 22 -410 -340 -51 -38 3 -83 -108 -42 64 28 -423 36 -193 188 -344 -262 40 -145 157
7594 157 227 -471 411 -107 141 -171 -108 98 -6 -121 -259 133 138 253 -127 -186 35 -214 41 149 -160 365
7616 365 -266 -40 -4 28 -364 -30 -375 -90 -95 86 183 437 71 24 -189 77 -18 -6 381 -211 546 70 139
7639 139 201 356 247 -15 307 89 140 -23 22 19 49 197 377 96 -183 -50 29 369 382 343 180 148 11
7662 11 -16 -20 -202 -157 -91 280 -42 446 132 -1 -376 -261 -288 -323 0 137 218 -165 682 24 -13 -264 -240 -139
7686 -139 91 50 265 -137 -329 -17 -113 242 -20 52 171 105 -296 149 37 71 6 -420 -154 -11 25 -287
7708 -287 11 -223 128 -335 -231 62 204 -30 181 -98 -156 -328 150 -175 8 -294 206 55 -202 -378
7728 -378 -353 -191 2 123 -197 -191 -584 -267 410 193 2 -154 89 488 -122 329 -398 64 -76 232 -32
7749 -32 48 -260 -146 395 371 323 247 208 -266 43 266 31 50 -481 -237 219 236 172 134 -5 145 -341 146
7772 146 109 334 167 97 364 -350 205 193 216 299 190 -83 0 -81 390 252 -152 -322 -223 233 -200 -219 -141
7795 -141 -53 356 319 183 120 -98 -171 -405 -174 46 153 -138 20 129 110 -249 161 -113 216 -39 -290 -67
7817 -67 -163 -78 -73 16 -286 -209 18 -261 27 40 -349 -257 -92 -51 -334 -280 -121 -149 -152 -361 -467 -227 -45 285 31
7842 31 -312 -413 -212 52 -397 -204 -328 -266 -359 -211 -145 -180 -222 132 291 219 -279 -123 17 90 261 -6 -54
7865 -54 -640 -115 329 413 303 47 -21 -601 -398 40 381 54 -80 28 306 376 5 -449 404 -88 39
7886 39 -30 90 136 6 313 73 -226 70 8 -15 -369 243 195 -234 182 156 243 476 -83 5 -197 496 -177
7909 -177 -226 237 136 571 43 -66 7 505 455 988 284 61 -91 -313 53 -135 -158 193 -235 84 -296
7930 -296 26 -218 20 182 -243 126 24 -91 -50 -113 -367 -37 77 -439 -74 191 -457 201 -55 234 119
7951 119 -365 -330 -38 133 -113 -162 -272 -182 -428 -164 207 -554 -230 -219 -312 -108 29 -37 -119 -104 -246 -47 -71
7974 -71 -115 290 229 -12 309 -87 67 63 -373 -451 -59 0 -90 115 29 98 -28 -22 -22 -231 -267 -290 671 -198 166
7999 166 269 -382 -214 58 -5 -152 2 -157 140 9 134 -144 521 -51 -514 55 80 1 -8 93 628 195
8021 195 -134 -185 117 76 22 348 -84 90 223 157 21 -5 -321 -151 -100 -175 -42 474 240 378 306 293 -245
8044 -245 -107 235 333 -258 -175 -261 -58 208 -225 48 -340 -44 -186 -597 97 -84 109 119 144 65 -234 -510
8066 -510 -509 -236 245 -60 -12 -253 120 -63 -422 -37 44 -63 -34 39 -143 -234 315 54 -80 -159 -399 -326 -148
8089 -148 95 474 -84 -119 232 -453 -278 -140 -333 -225 0 -29 -5 -70 9 -510 -162 -45 -15 -368 -104 -52
8111 -52 -266 4 -49 -121 -244 105 327 84 410 -91 354 597 25 429 -59 -56 -144 178 -210 -105 480 26
8133 26 52 179 -30 176 147 15 221 117 -237 90 104 -120 -159 -82 115 32 73 -55 324 54 212 195 -129
8156 -129 293 -121 223 153 51 323 -141 -271 108 100 -45 -346 75 -38 198 355 307 143 201 452 82 291
8178 291 313 366 -256 -274 217 -75 -376 76 480 -5 134 -288 -211
8191b11
$$ Imaginary data points
##PAGE= N=2
##DATA TABLE= (X++(I..I)), XYDATA
0 0 0 0 0 0 0 0 0 0 16 -16 16 -16 16 -32 32 -37 48 -52 64 -80 94 -107 125 -142 161 -187 212 -240 272 -308
30 -308 347 -389 436 -489 544 -608 673 -748 831 -922 1019 -1131 1251 -1385 1534 -1702 1893
47 1893 -2108 2358 -2647 2991 -3404 3911 -4559 5402 -6572 8297 -11103 16460 -30434 143010
61 143010 313564 28769 -80643 4403 128544 79793 43673 92723 134027 34731 -44920
72 -44920 13296 124452 95797 -7224 -25542 49760 63873 6515 -15950 38989 72522 35218
84 35218 -18600 -18398 13783 31193 25298 29851 37919 25263 -4695 -12091 17220 52174 49261 8102
98 8102 -18387 11166 52860 34111 -18878 -11138 56182 72601 -2180 -61936 -20454 54785 52969
111 52969 -5216 -15497 19935 11690 -39082 -34066 35564 59821 -4288 -61291 -39483 10693
123 10693 18241 -265 2057 8397 -21668 -59272 -40887 18886 40051 1020 -35952 -30693 -13747
136 -13747 -13252 -11608 5081 15379 -5543 -40100 -38685 3789 33091 14566 -14752 -11811 8909
149 8909 5717 -18731 -19555 20137 55299 35075 -18890 -36653 -101 38975 40023 17286 -944
162 -944 -9306 -8359 4315 24155 33148 18412 -9363 -21756 -11023 2364 7006 5732 1860 -4736
176 -4736 -8021 -9493 -13410 -13251 -1279 12158 6384 -14089 -26389 -18168 4802 26783 29945 7691
190 7691 -22583 -29475 2339 42199 40764 1558 -17244 9784 34870 20147 -4156 2562 24753
203 24753 23412 -141 -8665 7117 15836 1999 -5629 10143 17105 -10477 -37948 -27166 6730
216 6730 19845 3255 -20777 -29815 -24279 -13472 -1554 4726 -4644 -23358 -29199 -14628 -211
229 -211 1860 1415 2841 -2446 -17089 -25516 -11863 15468 28951 11508 -17518 -23033 -2857 14388
243 14388 13175 1872 -4008 -3123 -5578 -11170 -5609 13877 22218 2238 -24100 -24797 -3664 10219
257 10219 5482 -5048 -6228 -3550 -6791 -11734 -5637 4400 1872 -11024 -15150 -9327 -6010 -4338
271 -4338 -504 -254 -8365 -16556 -15103 -6957 -6855 -17245 -18504 -2485 6376 -11218 -31488 -24654 208
286 208 5474 -11524 -25710 -19927 -5428 -2729 -9127 -8096 779 -865 -12023 -16565 -8103 2776
300 2776 6455 4347 -1728 -3858 -1205 2049 2692 2979 3797 1961 -1554 -4347 -4887 2743 13166 12099
316 12099 -2424 -16133 -15513 -2068 12311 10267 -6099 -15036 -5062 7057 4131 -5552 -3706 3859
330 3859 4153 -5802 -9701 3615 17633 13334 -2511 -6007 3957 9289 4380 1218 4951 10342 9393
345 9393 3584 -670 3265 9029 8789 1866 -4519 -5844 194 8039 8016 299 -4726 -2554 -981 -2764
361 -2764 -4751 -2993 1585 3814 -1022 -7761 -5825 5572 9309 348 -10824 -10933 -312 8294 3657
376 3657 -4127 -2059 5397 1563 -9186 -10656 -1397 4263 -1584 -11757 -12482 -3664 2072 -3611 -12626
391 -12626 -13029 -9669 -9200 -11549 -13046 -10741 -4554 -1177 -7031 -15386 -15245 -8125 -2659 -2602 -6861 -9452
407 -9452 -6640 -397 -130 -2807 -883 2180 -376 -6855 -10424 -3666 9187 12674 1853 -9641 -7096
422 -7096 2428 4348 -1213 -4408 -1157 2013 -1444 -7161 -4767 5363 10092 2395 -8437 -11153 -4737
437 -4737 4835 10177 6284 493 562 2254 515 679 5302 10516 8987 1889 -4491 -227 11653 17548
453 17548 11251 616 -2862 -631 3926 5934 4784 6654 9908 6374 -4652 -8800 1354 12664
467 12664 11858 188 -8619 -4954 5740 10491 7465 4567 5132 2261 -2190 -2924 1990 9908 15092
482 15092 10125 -1181 -6023 165 7619 8225 4369 636 42 -373 -2782 -3464 3046 10249 5978 -7433
498 -7433 -16070 -12724 -1459 7819 6473 -3182 -9689 -8237 -4934 -3863 -2166 1706 1972 -2702 -10867
513 -10867 -12187 -534 12956 11157 -2200 -10739 -9367 -3233 274 1631 2493 3878 1286 -6716
527 -6716 -12588 -8781 1304 6726 758 -10439 -17514 -12057 -282 3734 709 -3549 -7011 -11691
541 -11691 -13779 -9730 1145 9661 7912 -3936 -13278 -9462 3212 10951 9027 2189 -2289 -1128
555 -1128 2461 4264 7408 14096 15632 6604 -5485 -7698 2790 15121 18071 9573 -1046 -3134
569 -3134 774 3377 4666 6484 6879 3066 -4373 -9248 -4706 7965 14858 7149 -6050 -11701 -7075
584 -7075 63 4521 5496 4756 3748 -2008 -8608 -7162 2640 11408 9543 -1019 -10153 -9310 1419
599 1419 10968 10233 4293 311 -2591 -5687 -4562 1971 11501 16098 7933 -4849 -8795 131 11149
614 11149 14536 9581 1829 -2890 -761 3169 6632 11248 14594 9445 -3559 -11765 -7235 7515
628 7515 16607 11269 -2499 -10125 -7750 -2458 221 1667 604 -3419 -10099 -14258 -12885 -3306 5238
643 5238 3270 -8288 -17384 -16702 -8837 -1584 -64 -1758 -2636 -3813 -8211 -11853 -5670 4053 7555
658 7555 1708 -8696 -12985 -6598 5007 9135 4144 -2259 -6328 -8605 -8932 -6906 -612 5613 4061
673 4061 -7745 -18453 -16681 -5870 934 -1263 -9231 -15948 -17957 -13461 -8855 -4730 -1107 -3053
687 -3053 -11588 -20045 -19009 -8621 2976 5894 -2161 -11489 -11450 -5000 85 1645 2953 3265 570
702 570 -4031 -6889 -1677 10054 16650 10248 -3121 -9311 -4653 6177 12608 10701 4961 2056 831
717 831 -1351 -112 7255 11987 9021 -487 -6520 -3307 6060 12110 9093 3544 679 -1374 -2366 -1386
733 -1386 3596 9283 11067 5815 -3793 -7434 48 9777 11461 5189 -2212 -4671 -633 4625 6326
748 6326 7875 8572 5054 -2515 -6866 -2721 6650 13857 10937 593 -4788 -1555 4615 6163 5343
763 5343 3813 1907 -1161 -4684 -4436 1979 8225 6762 -2349 -10454 -11406 -6547 -791 850 -2622 -5786
779 -5786 -6758 -10035 -12541 -9768 -2877 -186 -6046 -15249 -18240 -10785 -506 2659 -2758 -8638 -9906
794 -9906 -9439 -6679 -3145 949 3786 4399 -1465 -7215 -4832 4353 10763 7923 281 -3860 -1595 4400
810 4400 8416 9060 8492 5914 869 -2676 -431 5335 9817 8917 3737 -2229 -252 5351 7248 3484
826 3484 1907 2865 5014 3751 138 1009 7791 12938 9300 1574 -1970 925 7473 11533 10136 6800
842 6800 5027 5862 5158 5411 7319 9522 9051 4753 327 698 7174 11758 9241 2760 910 2150
858 2150 1454 335 2592 5989 8380 4553 -2923 -4980 792 7413 7118 1498 -3991 -4428 388 4942
874 4942 5065 3189 2108 260 -2602 -3898 -1471 3040 5671 2773 -2147 -5164 -1470 3113 2800 -663
890 -663 -3757 -3167 -1648 -237 -1683 -895 2302 2487 -2119 -6630 -5304 121 2830 526 -2845 -2207
906 -2207 917 1002 -2402 -3016 326 1025 -1453 -4427 -4929 -1024 2967 2705 -1367 -4553 -4172 -1861 -1142
923 -1142 -2101 -3011 -1908 361 -203 -3493 -4012 -988 2101 319 -3736 -5510 -2153 2913 3476 317
939 317 -589 770 887 -581 -1417 852 3419 3869 1378 -1109 1206 4922 4744 454 -2023 -1033 2007
956 2007 2684 1102 -689 898 3879 2039 -2602 -4408 -1414 2063 2619 -187 -2856 -1718 2063 2952
972 2952 1013 -284 -489 -243 16 -217 1503 4303 5600 1816 -2329 -1514 3123 5292 2617 -597
988 -597 -1279 2541 4485 2724 898 1027 1961 495 -1728 -2301 513 3595 4289 466 -2552 -1342 1411
1005 1411 1974 262 -1676 -1171 666 755 -410 -261 2281 3844 828 -3222 -4267 -1175 2411 3260
1021 3260 1175 -1809 -1427 -248 -764 -2738 -1865 -202 -362 -3624 -5827 -4560 188 2031 -1534 -5925
1037 -5925 -6261 -4597 -3083 -2996 -3566 -2591 -1000 -1582 -5533 -6629 -3314 239 371 -2963 -6120 -5064 -1157
1054 -1157 1091 -667 -1488 -1148 -2440 -5174 -5498 -2999 839 2613 -639 -5343 -6763 -3744 155 524
1070 524 -1691 -5056 -5140 -3437 -2384 -2488 -444 2126 -471 -5478 -8152 -5329 710 3525 1563 -2676
1086 -2676 -3572 -2088 -91 -805 343 1144 804 -755 -2946 -3184 1565 5953 5962 415 -3881 -3167 97
1103 97 2699 3225 2795 2709 1809 -778 -2711 -371 5261 6035 2823 -2245 -4043 14 5326 6631 3752
1120 3752 992 -39 -771 -1405 430 3793 6474 5221 268 -3657 -1874 2969 5070 2390 135
1135 135 -1833 -1764 -585 759 1769 3729 3830 -554 -5781 -6311 -1460 4467 5130 1621 -3644 -3970 -1507
1152 -1507 378 1719 2386 1265 -1584 -4622 -5163 -2207 3426 5912 1549 -5075 -7561 -5385 -1149
1167 -1149 2005 1301 -783 -2895 -3809 -5358 -4495 -691 1995 592 -4454 -8393 -6827 -1505 2750 2335
1183 2335 -719 -3291 -4695 -5698 -3523 105 3731 4771 795 -5600 -6020 -201 4703 5350 1797
1198 1797 -2648 -3336 -1674 1484 3208 4192 3913 831 -3323 -5227 -2689 1931 5542 4028 -1554 -4468
1214 -4468 -3744 -1037 1445 1613 1051 -1380 -3278 -4926 -3417 1419 6596 5274 -519 -5387 -4533 -383
1230 -383 4221 5069 3153 2153 1473 -888 -1490 1911 6820 7618 3623 -1988 -3527 866 6896 9125
1246 9125 6086 1583 -597 -1713 -230 2944 5627 6238 3881 -795 -3883 -1483 3511 6013 3718
1261 3718 -368 -3228 -2657 -428 1958 3266 4418 2518 -1503 -5566 -4724 -840 5031 6148 1443
1276 1443 -4505 -4897 -1424 2002 2557 1806 421 -2174 -3820 -4256 -66 5325 6793 2039 -4069 -5913
1292 -5913 -2239 1960 4542 3578 1132 -811 -1546 -1882 -185 2350 4381 2337 -2004 -5067 -3855 614
1308 614 4634 3617 -43 -3197 -4499 -4637 -2908 445 2231 2204 -1761 -5993 -6815 -2268 2822 3161
1324 3161 -1229 -6038 -6382 -3263 188 1329 1901 1001 -1110 -4720 -5168 -2004 2423 4529 2568 -1355
1340 -1355 -4424 -2527 523 2218 2209 924 -1029 -2761 -2562 -1329 2119 5666 3912 -1646 -4777 -4371
1356 -4371 -202 3428 4197 1668 -1101 -1381 -666 -680 1358 4342 4290 1145 -2400 -3509 1070 6921 7863
1373 7863 3950 17 -374 406 1783 3471 5386 5373 4337 670 -1026 1448 5276 6136 4124 487
1389 487 -1599 -1056 2157 3813 4147 3788 2300 -343 -2909 -2205 1000 4105 4262 1259 -2569 -2687 -659
1406 -659 2275 2493 949 -1343 -2401 -2181 -1774 -249 2406 4115 447 -4581 -5644 -2221 1730 2646
1422 2646 154 -2077 -2654 -1848 -2265 -1918 96 905 -1179 -3681 -5061 -3825 9 2209 819 -2517
1438 -2517 -4479 -4699 -3618 -1857 -968 -490 -1187 -2326 -5075 -5323 -2405 445 60 -2686 -5530 -6245 -2572
1455 -2572 346 191 -1342 -1849 -2512 -3770 -4519 -2973 -76 1906 -2 -2519 -3660 -632 1928 1599
1471 1599 251 -266 -492 -282 525 1108 2459 3777 3724 869 -847 -718 1603 4401 4785 2610 964
1488 964 814 2504 2175 2209 3049 2551 1082 -464 -534 1290 4713 4347 1289 -1617 -576 792 1762 1142
1506 1142 939 1091 2318 889 -701 463 2902 3325 563 -988 -633 753 2981 2424 1362 1727
1522 1727 1383 316 -124 284 743 1785 1382 551 -878 -203 1197 1953 789 -812 -1589 -1098 376
1539 376 741 -225 87 776 -208 -2349 -3091 -1539 466 259 -2279 -2897 -1686 460 83 -1737 -2667 -1614
1557 -1614 -1482 -2627 -2937 -2326 -829 -83 -1388 -3399 -2565 -1452 -1190 -1824 -2401 -2687 -1896 -771 -1190 -1778
1575 -1778 -1567 -829 -1539 -2549 -2067 -1851 -72 1022 -81 -1361 -1556 -79 172 -247 -1385 -565 -9
1592 -9 251 -921 -558 1696 2413 -262 -2541 -2639 -595 1563 1186 -217 -836 -186 638 -22 -733 -258 416
1611 416 152 -198 -873 -1029 1021 2786 1422 -85 -1196 -956 67 957 1411 1435 2052 813 -300 -820
1629 -820 1173 3507 2419 -179 -1937 -772 2226 3722 2184 521 654 116 -288 -507 418 2331
1645 2331 2545 1271 -1068 -956 622 2035 1420 856 -499 -606 -354 299 1080 1541 1963 1070 -1294 -2566
1663 -2566 -1654 390 2019 1477 206 -2183 -1482 0 -111 319 -204 -679 -1837 -1873 -2188 -302 2568
1680 2568 1806 -1647 -4032 -2889 -825 483 375 -366 -400 -542 -1970 -2549 -692 1505 1357 -703 -3225
1697 -3225 -2827 -824 1524 1424 412 -891 -2087 -3204 -2389 -696 309 743 -159 -2639 -3541 -2321
1713 -2321 204 1452 -96 -1807 -3107 -3031 -1379 217 1429 1679 145 -1635 -3963 -2779 265 2878
1729 2878 2798 -394 -2675 -1668 986 2036 1871 920 597 -387 -1377 -912 1400 3977 3918 1395 -1261
1746 -1261 -1670 -240 742 2759 2813 1619 452 -625 -972 481 2377 3538 1230 -902 -2682 -1426
1762 -1426 2512 4608 3320 611 -745 -1685 -863 614 2445 2838 2543 705 -1327 -911 1845 4168
1778 4168 3432 1026 -887 -1105 374 2104 2902 3213 3286 801 -1777 -1881 47 2974 3827 2212 -905
1795 -905 -1914 -1312 918 2221 2049 642 -1285 -2298 -2664 -1001 1443 3104 1660 -1911 -4470 -4079
1811 -4079 -1101 1420 1606 -740 -2238 -2783 -2460 -1675 -302 1624 669 -2018 -4527 -3698 -706 3156
1827 3156 3175 309 -1956 -2389 -2123 -842 1166 2152 2166 900 -1655 -2476 -213 2290 3022 1909 -956
1844 -956 -3164 -2164 -103 2078 2666 1854 201 -2663 -3905 -2019 825 2401 1885 -1113 -3165 -3405
1860 -3405 -299 1184 1730 -173 -1721 -2953 -2398 -1560 968 3171 2996 335 -2896 -2602 -440 1833
1876 1833 3229 2095 826 -159 -639 476 1704 3637 3838 1793 -569 -1747 -209 3383 5705 4657
1892 4657 1069 -467 -1102 554 2125 3100 2591 1793 -164 -1222 -611 1995 3602 2692 87 -2459
1908 -2459 -2061 77 2352 2877 2021 676 -697 -2643 -2221 96 2389 2618 1110 -1634 -2541 -1365
1924 -1365 1119 2213 1311 175 -1441 -2235 -1284 -10 1937 2933 1401 -2014 -3354 -2047 343 2395
1940 2395 2139 -299 -1715 -1788 -1036 -264 987 1235 -367 -2395 -3072 -2722 -252 1772 1530 -975 -2865
1957 -2865 -3050 -2041 -1590 -345 440 306 -964 -2550 -3251 -1217 1113 1368 -532 -2934 -3881 -3159 197
1974 197 1660 1608 -266 -1367 -2242 -2801 -1394 466 1002 668 -1075 -2536 -2044 -76 1036 800 -685
1991 -685 -1735 -2686 -2110 -685 338 1429 1302 -678 -3365 -2501 -1202 1278 1504 180 -1297 -1078 -387
2008 -387 -7 726 1804 1725 607 -876 -1399 -64 1968 3860 2225 265 -634 24 701 1905 2240
2025 2240 1651 1580 435 158 871 2462 3256 1864 284 -1393 -301 1038 2271 1852 1107 591 29
2042 29 -950 -648 143 1352 1224 70 -801 -1336 -191 1175 1138 216 -1207 -1258 -714 -271 269 641 920
2061 920 142 -1462 -2005 -1278 -151 1438 295 -892 -1651 -476 392 301 81 154 -470 -1080 -1468 -936 398
2080 398 1136 620 -751 -1557 -1398 -869 -855 -897 -827 -681 -872 -1287 -1641 -1127 -280 -344 -1376 -2532 -2784 -1638
2100 -1638 -391 -217 -177 -1057 -1687 -1641 -1808 -1032 -404 -386 -438 -864 -1853 -826 789 715 -109 -1148 -722 -974
2120 -974 279 754 337 1168 1264 515 150 185 698 1556 1555 581 464 732 1733 1909 964 544 756 952 759
2141 759 415 979 1983 2191 1680 432 411 1221 1481 1775 793 687 1411 2040 1825 1709 2024 1941 1279 61
2161 61 235 1715 1883 2266 1271 637 1061 1637 1963 1042 704 506 833 1173 1249 1064 1833 1758 618 50
2181 50 48 -38 777 852 840 37 508 569 -191 -220 -252 -453 -245 -434 -1083 -783 671 947 4 -1117 -1725 -1439
2203 -1439 -294 -119 -513 -959 -502 -854 -1459 -736 -689 -482 -1083 -2098 -1597 -1097 -34 402 -620 -813 -1024
2222 -1024 -1365 -1249 -1437 -811 -333 230 -60 -1174 -1101 -700 139 -157 -1020 -1962 -1611 -739 22 175 265 91
2242 91 -583 -1864 -1905 -851 520 715 -241 -1183 -1333 -393 664 524 39 -300 -737 -1244 -554 215 863
2261 863 1974 847 -176 -730 -231 753 1262 1515 1000 426 932 554 724 1075 1781 1242 -40 -560 -469
2280 -469 755 2431 2592 953 50 -403 -765 -105 1336 1251 1212 228 -856 -804 490 1867 1774 342 -1262
2299 -1262 -1454 -731 94 1444 1176 753 -229 -1376 -1237 -643 826 1614 1112 -151 -1372 -1054 280 991
2317 991 1311 454 -350 -1432 -1131 -94 1084 1410 1511 -273 -1941 -2799 -1099 266 1159 163 -1271
2334 -1271 -1972 -1522 -1053 183 567 -549 -1868 -2788 -3081 -1477 414 705 -704 -1872 -3002 -2990 -2208
2351 -2208 -1337 -789 -820 -1192 -2556 -2698 -1960 4 252 -174 -1463 -2306 -2708 -1395 187 1096 476 -267
2369 -267 -1140 -2228 -1528 256 1536 1238 -26 -1818 -1802 -423 1435 1792 1040 -455 -1565 -1404 -667
2386 -667 593 1884 2169 695 -1052 -2066 -1046 646 1525 1008 -349 -745 -1016 -133 323 922 1737
2403 1737 556 -1267 -1778 -1059 658 2864 2417 598 -795 -1213 -615 1007 1928 2208 1032 -245 -833
2420 -833 -375 1230 2882 2404 934 -903 -1401 -588 1236 2817 2062 931 -169 -919 -1182 105 1153
2437 1153 1722 1051 -844 -1335 -544 683 1235 1449 -142 -1293 -2394 -1653 -480 439 1765 813 -1056
2454 -1056 -2163 -2195 -617 1012 854 251 -1436 -2049 -1031 -120 136 697 106 -1560 -2682 -2428 -1077
2471 -1077 846 1395 163 -1722 -2366 -2235 -802 139 434 -520 -1297 -2130 -2164 -892 475 594 -169 -1780
2489 -1780 -2682 -2804 -1223 429 963 453 -1196 -1679 -2654 -1662 -203 666 465 -782 -2306 -2205 63
2506 63 1946 1619 911 -548 -1721 -1396 320 1398 2157 1991 825 -999 -648 76 1317 2117 1710 -129
2524 -129 -648 -33 655 1276 1888 1938 774 -693 -1388 -471 1305 2543 2334 379 -1003 -1125 -419 1147
2542 1147 1968 984 225 -512 -836 -76 1355 2233 1812 237 -522 -658 423 1489 2819 1768 511
2559 511 144 -333 -261 983 1610 2033 1163 390 -255 148 2018 1950 1321 773 -456 -1363 -380 430 1222 1781
2579 1781 788 -819 -1464 -735 416 903 1225 -162 -1199 -1635 -616 550 536 660 -449 -1393 -1628 -1093
2597 -1093 -103 558 1047 -222 -1438 -2084 -1219 -404 398 -45 -868 -944 -1277 -1032 -691 42 398 -197 -1236
2616 -1236 -1944 -1544 -193 822 831 538 -213 -986 -1133 -853 28 1030 -142 -498 -1235 -875 35 1257 996
2635 996 -115 -1231 -1080 -784 404 497 879 1227 27 -617 -579 147 716 1336 1111 572 48 584 1329
2654 1329 1810 1836 1675 376 44 281 602 1454 2525 2355 651 289 251 1229 1409 1789 1193 490 649
2673 649 646 807 1060 1749 1521 -253 -603 -451 91 1425 1864 426 339 15 145 55 817 870 416 569 59
2694 59 296 676 1271 977 986 220 137 -116 190 662 1204 934 905 329 -173 -231 258 546 768 0 -740 -695
2716 -695 112 364 129 -253 -1038 -1192 -1022 -514 -97 104 103 -587 -1360 -1323 -602 -601 -782 -1400 -1511 -1234 -1062 -1250
2738 -1250 -1431 -532 -774 -753 -1421 -1411 -1336 -955 -388 -573 -798 -804 -730 -1135 -653 -286 -910 -1074 -410 -560 68 294
2760 294 273 -266 -388 -725 -400 163 404 -21 424 -107 370 -148 447 88 -76 35 35 167 523 728 439
2781 439 168 185 169 -83 379 639 213 382 757 146 482 348 698 291 634 151 546 345 517 1633
2801 1633 861 1052 406 797 140 224 758 722 1154 827 437 94 1019 902 995 92 117 -293 141 663 832
2822 832 606 840 244 -616 101 375 -74 248 234 -141 193 221 780 700 100 -143 -253 -459 -121 -267 245
2843 245 688 487 -341 -1168 -947 -824 -238 -373 -215 -591 -727 -665 -344 153 -561 -729 -1086 -1576 -934 -318
2863 -318 309 31 -539 -1029 -1343 -980 -507 -350 -362 -464 -835 -479 -528 -6 188 161 -785 -773 -813 -691 -23 386
2885 386 302 279 -671 -1094 -782 -136 -135 43 486 -821 -697 -413 621 1105 638 -224 -773 -988 -699 370
2905 370 1068 1281 704 -32 -1053 -387 410 718 1207 453 -182 -184 675 1277 1148 1296 1098 -72 22 648
2925 648 528 1859 1732 1036 450 -677 110 922 1696 1486 1052 277 116 74 1289 2040 1448 926 160
2944 160 -1158 -615 660 1517 1728 708 195 -405 -1065 385 684 849 564 -581 -893 -593 31 488
2962 488 734 -227 -883 -1442 -1628 -682 585 933 308 -975 -1564 -1379 -1081 -212 609 217 -1047 -1545 -1727
2981 -1727 -504 418 641 -147 -1473 -2034 -1847 -1368 25 568 -143 -1350 -2097 -2214 -1492 -917 -273 -987
2999 -987 -1588 -2197 -1703 -1417 -563 7 -441 -1481 -2188 -2401 -1623 -294 216 139 -454 -945 -1328 -1229 -127 381
3019 381 563 -541 -1003 -1513 -487 760 1370 782 -316 -1450 -1688 -750 121 935 743 282 -990 -1381
3037 -1381 -847 88 785 525 -328 -1035 -955 -281 272 1449 1075 -195 -1277 -1148 -609 210 1066 1195 989
3056 989 32 -708 62 526 1529 1484 682 -80 -279 110 1334 2648 2302 804 4 -538 -172 1534 2004
3075 2004 2218 808 240 -657 -214 691 1470 1017 398 -440 -659 -543 741 1222 970 107 -1002 -1492 -844
3094 -844 -29 753 611 94 -699 -1353 -1605 -27 147 262 -88 -1269 -1356 -963 -158 478 740 -505 -1241
3113 -1241 -2196 -1342 -657 616 974 425 -728 -1792 -1031 -731 263 323 -415 -1097 -1079 -1303 -240 95 601
3132 601 -564 -1474 -1601 -1379 -1175 451 758 307 -580 -1411 -1493 -878 -35 323 145 -603 -1114 -1630 -269
3151 -269 706 997 398 -375 -1056 -1214 -411 821 1154 692 101 -607 -740 229 794 1062 532 -48 -730 -70
3171 -70 220 978 1512 1122 14 -662 -443 89 645 1763 1268 1064 -423 38 154 816 1157 1061 407 -2
3191 -2 -134 503 1438 1518 2238 654 152 -286 732 1155 1805 1797 874 -49 175 630 1251 1605 1025 257 112
3212 112 -390 298 1128 1588 801 168 -597 -1133 -183 29 481 656 652 -250 -753 -663 33 722 158 -307 -724
3233 -724 -1258 -680 108 686 259 -221 -867 -1015 -762 258 425 368 108 -645 -708 -729 -252 286 507 -252 -879
3254 -879 -442 269 264 319 256 -120 -506 -912 -541 -244 350 801 284 -86 -544 -394 50 244 177 209 -728 -510
3276 -510 -587 109 288 654 151 -765 -629 -1000 -239 434 376 13 -24 -495 -181 662 234 189 268 178 182 295 988
3299 988 1059 952 1107 341 132 352 611 490 1438 970 1081 1240 917 1161 839 1058 1114 678 448 613 724
3320 724 987 1543 1253 291 299 -60 323 650 848 628 601 181 485 373 559 541 350 -44 -24 547 695 579
3342 579 566 163 -49 142 -195 14 512 258 128 143 166 -35 379 64 187 -264 194 -457 -579 -354 599
3363 599 -146 -453 -242 -806 -347 -825 -760 -167 -433 -431 -385 -693 -299 -237 -797 -1146 -1381 -1004 -702 -331 -531 -409
3385 -409 -733 -850 -726 -893 -551 -471 -940 -825 -375 -287 109 -387 -787 -456 -647 -1126 -82 -204 295 -356
3405 -356 -184 -452 -554 -421 -325 100 182 -210 1 -59 160 823 221 759 -373 -587 -419 -55 203 590 452
3426 452 378 -577 -569 41 367 278 136 -347 -143 221 439 870 843 362 -233 -104 -69 570 760 896 535 666
3448 666 543 329 495 499 901 570 229 195 73 120 951 743 787 177 41 -339 -324 760 855 307 -6 60
3470 60 -212 130 351 464 141 311 -370 3 162 649 713 326 -505 -506 -835 -112 -351 168 7 122 -554
3491 -554 -575 -706 -88 189 -189 -414 -1012 -807 -426 -240 238 39 -549 -1076 -567 -845 -11 -57 -178 -457 -854
3512 -854 -1123 -741 -613 252 -457 -1025 -1365 -1170 -683 -348 469 -513 -966 -1305 -1367 -1273 -241 80 -371 -400 -589
3533 -589 -1172 -623 -219 264 -148 -94 -1042 -1211 -753 86 902 852 181 -581 -931 -466 493 1180 490 561 -106
3554 -106 -531 -53 537 893 954 312 -6 -214 333 1001 1220 1233 573 -196 -341 -157 712 1455 1556 797 120
3575 120 -365 -278 626 935 1279 925 -232 -358 -202 745 1485 1183 348 -331 -150 -88 189 1043 1600 680
3595 680 62 -15 23 439 1000 1009 922 29 -359 63 871 957 1005 418 -208 -615 -285 14 746 1292 477 -328
3617 -328 -787 -682 -155 422 559 183 -317 -849 -407 -345 372 892 75 -1040 -1502 -1200 -584 91 400 -54
3637 -54 -646 -1399 -1368 -880 16 115 -678 -474 -1254 -1089 -531 326 565 -129 -1002 -1283 -1243 -701 -420 258 -32
3658 -32 -854 -526 -896 -882 -77 401 -237 -784 -918 -1029 -250 373 467 70 -248 -1107 -1134 -585 135 417 412 -386
3680 -386 -638 -535 -769 589 624 275 310 -692 -430 378 1092 1495 824 232 -540 -216 85 472 1086 1355
3700 1355 708 262 187 474 446 1069 1151 516 -314 -351 178 269 1208 714 500 -89 -209 -292 475 1181 665 215
3722 215 104 -459 -491 640 886 643 355 -183 -322 -393 1004 1253 1005 312 -467 -666 -452 459 623 653
3742 653 265 -41 -349 -457 102 835 335 116 -259 -625 -396 -72 368 465 -25 -654 -1293 -1145 -352 -145
3762 -145 322 414 -618 -1183 -783 -521 -245 -143 -824 -838 -1155 -1305 -381 -282 22 38 -1411 -1498 -864 -406 -349
3783 -349 185 -365 -393 -632 -567 -742 85 325 -257 -500 -913 -638 -265 946 150 72 -189 -454 -631 -623 248
3804 248 526 745 -167 -200 -916 158 362 607 41 120 -526 -725 527 454 695 695 372 -652 -306 286 415
3825 415 766 890 266 15 406 652 645 1283 993 539 94 494 541 998 1670 1437 380 -99 15 565 795
3846 795 761 1038 452 427 102 263 712 1139 211 -254 235 290 398 470 967 532 -325 60 -270 -32 -71 324
3868 324 485 140 -353 -89 60 291 719 -77 -40 50 -190 -190 55 239 438 -87 -456 -849 -615 31 -134
3889 -134 75 -189 -649 -593 -315 -163 -29 25 -485 -849 -1057 -298 -234 -439 -240 -379 -1015 -905 -825 -919 -543 -325
3911 -325 -602 -515 -449 -271 -591 -44 -743 -690 -761 -347 -813 -487 -11 -306 -95 -233 -702 -794 61 -201 -181 255
3933 255 59 112 -130 -23 460 50 -60 -278 -270 237 164 458 777 574 403 96 276 477 480 195 29 477
3955 477 628 474 603 69 295 289 292 267 883 554 435 -31 517 370 466 -72 573 68 314 678 703 567
3977 567 303 608 425 520 235 280 331 756 650 802 658 411 281 279 352 274 264 140 12 -121 -131 138 113
4000 113 125 177 -471 -473 13 106 -321 -182 -134 -540 254 -94 -382 -2 -96 -216 -200 -196 -27 -164 79 252 -435
4023 -435 -592 -432 -744 -340 57 71 -299 -282 -582 -849 -417 -316 3 -576 -789 -660 -408 -66 -23 -535 -621
4044 -621 -614 -881 -674 -26 -318 -3 -285 -496 216 232 15 -493 -215 -655 -543 15 -44 347 421 -165 -545 -347
4066 -347 -514 71 143 324 115 81 185 58 231 206 31 393 349 -323 56 575 476 559 446 -146 -69 136
4088 136 373 567 1047 846 13 -30 185 474 356 458 619 -214 305 54 537 527 1268 792 443 -3 -218
4109 -218 -30 231 889 1065 -15 -126 78 10 409 524 749 451 -50 -418 180 429 841 713 -126 -403
4129 -403 -323 108 127 627 294 167 -479 -305 -119 317 -132 119 -497 -729 -707 93 300 66 -181 -104 -1236
4150 -1236 -1228 -5 78 108 452 -95 -607 -752 -611 -109 -129 183 -469 -898 -1015 -580 70 515 414 -507 -1119
4171 -1119 -903 -895 -402 223 -301 -382 -615 -819 -587 -575 -26 -271 -993 -461 -859 -818 10 253 214 163 -969 -913
4193 -913 -318 68 179 161 121 260 -546 -61 492 676 430 356 38 -691 60 223 1093 399 320 -247 -463
4214 -463 -607 75 702 812 275 -148 -182 59 546 356 17 168 -40 -417 511 485 789 1243 582 77 115
4235 115 70 253 311 1068 751 149 -167 -205 142 795 649 407 229 -130 -323 314 726 910 532 -132 -694
4256 -694 -363 -49 296 601 172 155 -577 -296 355 513 187 319 -400 -613 -426 -325 332 404 5 -334 -772
4277 -772 -486 -452 -327 -76 209 -365 -614 -1022 -208 -367 597 50 -695 -748 -1182 -216 -135 22 322 -721 -928
4298 -928 -875 -427 118 236 -213 -591 -484 -885 -470 -73 -266 -279 -723 -821 -766 -42 114 315 -266 -157 -458
4319 -458 -659 -524 -172 362 -284 -250 -610 -239 -105 436 562 728 -133 -481 -485 -15 606 873 772 457 -191
4340 -191 -479 -214 182 410 1017 413 208 71 481 701 862 150 428 250 -228 -114 410 957 704 534
4360 534 72 -240 -57 343 841 851 455 -169 -13 -26 94 588 421 -5 126 -142 116 -15 794 1008 226
4381 226 175 -204 -59 618 1008 558 641 -103 -551 -197 -40 248 575 226 -192 101 -357 35 453 240 173
4402 173 -192 -505 -589 -359 -388 11 272 -150 -615 -345 -355 87 -249 -384 -641 -1096 -658 -25 112 -185 127
4423 127 -567 -1062 -940 -397 -18 -282 -119 -277 -304 -246 -287 -178 42 -442 -843 -603 -317 -98 -223 144 387
4444 387 -235 -618 -320 -481 63 472 242 -152 -232 -21 -219 337 309 -106 305 -408 -865 17 206 423 229
4465 229 290 -262 -95 344 -142 651 473 152 33 165 556 373 347 525 250 440 -84 785 893 1390 704
4486 704 973 431 -24 344 615 800 872 485 587 625 65 440 589 434 384 -238 -80 -5 240 1018 228
4507 228 357 18 452 131 495 -200 81 185 -38 -130 -38 350 303 357 -47 11 -68 10 175 141 26 185 -366
4530 -366 286 -469 29 -85 -340 160 -417 -163 29 -304 -29 -340 -79 -735 -930 -168 -457 -175 -246 -73
4550 -73 -542 -570 -754 -406 -290 -471 -511 -318 -455 -274 -243 -572 -591 -851 -752 -666 -20 -401 -552 -402 -566 -286
4572 -286 -158 -301 -150 -127 -357 -298 -397 -261 167 -290 204 -133 -59 -125 -278 186 19 39 243 -132 178 139
4594 139 23 -11 167 -254 186 292 494 84 27 264 33 401 222 175 550 305 375 233 316 445 -16 364
4616 364 107 -126 3 294 204 486 561 358 758 460 419 411 80 260 768 650 245 261 731 457 139 -12
4638 -12 9 130 -92 50 291 432 148 56 -306 -342 -63 -175 533 -42 -265 -343 -327 -128 -73 -126 -55 -354 -340
4661 -340 -604 -295 147 -81 4 -504 -256 -656 -547 -465 -434 -221 -446 -151 -552 -197 -93 -301 -479 -463 -567
4682 -567 -738 -336 -73 23 -212 -399 -345 -578 -345 -161 -20 -100 -242 -581 -384 -182 -70 103 56 -292 -671
4703 -671 -350 -378 -128 606 74 16 -185 -305 -441 -291 -159 177 283 100 -1 -56 383 272 275 37 104 -259
4725 -259 439 281 504 516 743 300 -309 -136 -32 231 338 216 405 161 443 575 406 515 352 64
4745 64 -178 379 148 552 251 -114 -289 345 -123 2 581 215 683 155 -241 200 139 487 440 485 -66
4766 -66 -245 -210 -274 1007 927 1030 197 -19 -168 312 604 490 580 -141 -449 51 459 485 645 254 -93 -710
4788 -710 -414 -62 -168 -441 -313 -159 -319 -943 -773 -256 -197 247 204 -210 -501 -557 -233 459 -18 -101 -400
4809 -400 -506 -243 -453 -121 -85 -421 -367 -883 -287 -236 -73 -342 -562 -554 -159 -314 35 268 -433 -488 -1174 -709
4831 -709 -506 52 75 -239 1 -308 -526 -383 -92 303 -76 -316 -187 -129 -30 256 322 722 -68 167 -522
4852 -522 -716 6 452 237 -155 -567 -525 -122 143 656 482 649 79 -251 419 637 637 1177 155 -19 310
4873 310 145 949 474 579 311 175 -177 356 -15 625 663 175 -123 61 434 237 561 563 88 -30 -311
4894 -311 -322 287 427 513 240 -230 57 -674 -246 236 380 367 -13 -374 -115 75 90 448 -118 -121 -85 -416
4916 -416 106 110 12 124 29 -550 -769 -276 -99 -336 -134 77 -266 -507 76 177 -122 -230 -67 -930 -745
4937 -745 -569 260 -50 60 -150 -510 -372 -564 -20 -94 130 -512 -592 -264 -26 -332 -119 -263 -456 -564 -595
4958 -595 -312 373 280 117 -280 -199 -179 -375 99 -279 349 -39 -5 -120 63 640 587 -32 -110 -371 -318 174
4980 174 1 500 471 303 -36 -286 -42 147 381 382 -46 -30 176 128 137 466 512 -188 0 -330 115 182 393
5003 393 863 634 -116 135 94 575 475 368 439 551 -22 427 763 980 1272 56 358 177 400 640
5023 640 909 366 699 207 35 34 660 398 542 199 -301 -285 -142 292 255 615 -15 -441 -185 -143 -104 14
5045 14 -117 22 -90 -367 -204 -83 -227 106 -454 -187 -226 -157 101 -89 318 -484 -4 -383 -274 -58 -120
5066 -120 -81 -141 -183 -1004 -64 -449 -401 75 -171 -568 -340 81 -407 -75 -211 -424 -353 -363 -214 -804 317 -402
5088 -402 -324 12 -324 -519 -374 -271 -695 121 -156 -333 -312 226 -319 180 124 -209 -352 -248 -19 194 234
5109 234 218 111 -263 -28 139 301 166 718 241 125 82 415 127 27 34 146 91 146 279 14 312 514
5131 514 118 287 365 186 257 345 311 390 171 616 156 -8 260 470 170 -187 344 -103 32 279 268 369
5153 369 349 -111 -128 14 215 287 -36 200 515 278 220 173 -241 -440 113 219 -147 292 -87 -99 -47 103
5175 103 134 -532 -535 -257 -271 -299 78 -320 -62 -135 188 -92 -408 -336 -336 -338 -390 -170 -109 -466 -205 -194 -155 -228 -386
5200 -386 -531 -564 -389 -287 -260 -382 -356 -661 -262 -386 190 -79 -272 -370 -423 -191 -50 12 112 39 -259 -464
5222 -464 -660 -301 -135 82 -199 -536 -359 -425 -341 38 -27 -328 -263 -25 11 312 138 -15 29 269 430 322
5244 322 -218 727 427 172 250 340 138 371 257 563 285 96 408 16 553 337 440 690 61 -142 270
5265 270 534 355 506 427 262 274 85 314 321 251 482 283 296 387 224 29 284 128 -2 57 -128 -147 69
5288 69 331 525 16 322 -171 -565 -39 244 -81 84 -472 -465 57 679 387 55 78 -248 -267 -187 -65 1
5310 1 93 19 -35 -103 -85 241 -54 -64 -512 -528 -547 -225 -414 -68 -448 -678 -143 -620 -281 -3 -22 -2 -290 -629
5334 -629 -757 -263 -287 -375 86 -205 -741 -316 -380 -320 10 -77 -318 -755 -699 -299 -255 -11 -72 -46 -256 -476 -168
5357 -168 -179 101 -20 -54 61 -209 -219 -286 3 -159 5 -332 -610 149 625 818 693 492 373 -184 -98 -104
5379 -104 398 66 -105 174 -112 -23 464 521 496 -69 -113 -94 36 -112 726 550 450 372 62 269 25 254
5401 254 774 451 217 81 240 312 749 306 303 -18 -100 -233 74 551 332 34 -122 -60 -28 -237 281 646
5423 646 -69 104 -195 77 53 37 98 -150 -293 -181 -285 -22 220 461 141 -213 28 120 -317 30 -133
5444 -133 -122 -208 -234 -301 -329 -130 160 -38 -362 -505 -562 -422 -220 -252 114 -16 -952 -680 -364 -300 -184 69 -307
5467 -307 -331 -423 -546 -426 -240 -26 -309 -545 -480 -232 60 91 245 -353 -598 -446 -323 123 -89 342 -203
5488 -203 -77 118 -212 -34 -16 181 275 333 -123 -48 -3 495 577 222 88 -185 -348 405 270 442 -116 -251
5510 -251 198 406 380 293 664 299 382 32 68 369 456 511 761 427 -32 313 112 -50 466 -60 407 120
5532 120 13 382 295 89 203 131 -53 -196 75 279 430 273 175 -123 -33 -325 40 143 68 -364 59 154
5554 154 65 21 496 -143 -497 -75 -610 -129 350 47 443 -135 -109 -377 -263 -68 -69 20 -57 27 -501 -306 -318
5577 -318 -444 -52 60 -430 -115 -280 152 -175 -133 -342 -551 -316 -53 -272 -168 -682 -493 -636 -551 -381 -99
5598 -99 -210 -269 -340 -770 -298 -216 72 -153 -280 -283 -462 -497 85 -443 372 -299 -108 -319 -174 -46 273 383
5620 383 -221 -306 -394 -423 -342 354 1 481 -39 -165 -237 -393 103 75 389 -347 -286 -88 -308 322 152 545
5642 545 356 249 -435 -34 157 60 183 100 155 267 345 -131 590 289 236 -29 232 463 415 470 429 564 -12
5665 -12 -331 22 222 667 228 226 -157 397 -87 -152 286 -164 -99 155 18 347 -171 -9 -134 96 53 216
5687 216 -336 -102 42 -179 -338 -5 -85 -415 -261 -78 44 -784 -393 264 -84 293 -180 -330 -208 -153 -131
5708 -131 -642 -410 -333 -186 -101 -59 -645 -403 -333 -392 -95 91 -16 -465 143 -229 -103 -17 -339 -435 -943 -533
5730 -533 -495 -76 -345 15 -362 -215 -372 -612 -343 -565 -652 173 -97 -7 -466 -245 175 444 -437 -24 203
5751 203 -225 -144 0 114 7 -467 116 32 -67 -254 -16 -63 643 -17 -83 41 22 265 -8 -15 -18 530 302
5774 302 -157 128 150 369 589 -205 151 -171 128 644 492 165 65 364 -21 636 234 -89 125 -35
5794 -35 87 446 359 550 590 -187 125 236 -80 432 470 781 87 162 -7 247 -57 390 177 -31 261 404
5816 404 122 171 187 -123 116 61 -103 -124 -310 -165 -169 155 -286 22 213 -82 -141 -144 -132 -429 -268 -374 4
5839 4 0 332 -198 -173 -157 -743 -228 -484 -142 -21 -528 -118 -71 -234 -505 -629 -568 -666 -217 -148 -639 -315 -297 -67
5863 -67 -92 -526 -620 -609 -499 121 -363 62 -57 -221 165 -429 127 -180 306 69 -557 -401 470 -386 137
5884 137 -451 69 264 -50 -176 26 19 443 531 263 64 56 -40 116 -71 -30 79 75 70 301 642 270 367 231
5908 231 -290 27 76 288 419 219 83 71 345 301 279 -50 228 198 168 277 7 35 25 169 -101 79 20
5931 20 221 294 137 365 209 -206 48 -242 73 -28 419 -98 212 416 -166 245 47 258 257 0 321
5952 321 -218 -32 205 166 -41 -450 -325 -580 180 -49 123 -312 -353 -179 -227 -130 -41 29 -220 -152 -379 -84
5974 -84 -4 140 -153 -201 -440 -444 -243 -85 -44 -282 -450 -539 -332 -759 -136 -42 110 171 -632 -423 -409 157 -217
5997 -217 233 -214 -703 -282 -123 -174 109 212 -468 0 -356 68 67 144 213 39 -163 207 32 110 409 373
6019 373 93 428 -180 157 -149 -142 319 137 358 -397 -167 9 686 342 218 -154 111 -261 72 447 409
6040 409 51 367 -8 214 89 465 242 -5 35 -115 392 144 245 680 140 226 38 -106 508 409 483
6061 483 47 147 349 -110 -66 -37 334 292 62 151 227 270 315 23 118 87 -129 -231 -400 168 -100 29 -320
6084 -320 -142 -197 -303 128 216 -117 -508 -187 -133 271 35 -97 334 -518 -600 -583 -382 -217 -76 264 -366 -480
6106 -480 -364 -136 -482 214 -66 -123 -703 -399 -589 114 -188 36 -269 -634 -964 -446 176 -208 60 -212
6126 -212 -404 -219 -384 192 -139 -320 -148 -425 -57 -219 -196 425 21 -281 -11 -385 -401 147 232 261 66
6147 66 66 -344 -273 -13 274 409 90 -245 -49 -112 304 178 232 214 -68 94 -77 -130 367 199 351 371 84
6170 84 -99 423 699 -15 397 -145 -207 77 -73 123 644 86 -103 91 315 251 444 468 -160 495 -405
6191 -405 45 165 105 263 82 -222 170 -1 202 228 -246 286 -417 216 283 -34 267 396 -94 158 -293
6212 -293 -70 76 85 110 217 -88 -135 105 137 53 420 -306 -159 -272 -536 -364 -491 -238 -276 -217 -432 -268 -114
6235 -114 -431 -312 -260 -22 -488 -238 -261 111 -158 239 -294 -962 -344 -171 -8 -259 33 -169 -372 -20 -136
6256 -136 227 -542 232 -283 -336 -292 -402 -585 -54 -363 20 -434 -149 484 -308 -147 -313 39 2 -148 117
6277 117 199 -53 157 -283 -382 -109 -60 -140 16 374 313 37 152 24 83 223 398 -130 323 188 103 225
6299 225 415 280 62 350 260 94 518 525 20 -36 -89 419 81 62 166 453 467 49 307 234 167 58 -177
6322 -177 -96 -89 -175 -32 330 162 -127 -44 -221 232 -275 -179 141 314 211 225 163 323 151 89 160 61 180 -11
6346 -11 212 -444 -73 401 -354 -170 120 -91 -14 -535 -63 -334 -405 360 -195 -234 -303 -164 58 -19 209 -204
6368 -204 -115 -195 -196 -146 68 -141 -91 -345 -194 240 -72 -207 -353 263 138 -446 63 -587 15 -357 123 6
6390 6 -73 -431 -75 -324 -60 20 -174 110 -40 122 -180 95 -71 9 -88 -14 312 -402 -126 337 136 -5
6412 -5 126 428 23 -132 173 31 403 -101 238 468 9 170 442 273 254 381 311 -4 78 221 607 300
6434 300 -91 398 360 218 370 183 -153 256 248 461 264 312 227 249 -93 462 269 541 364 296 170 213 -192
6457 -192 1 -86 125 135 -313 143 -500 -2 16 264 90 -24 -306 86 -25 276 54 46 43 -315 -299 -39 -106
6480 -106 -86 -353 -36 -215 -84 74 -59 -375 19 -289 -206 -132 -396 -82 -37 -195 -588 -144 -452 -221 -192 -373
6502 -373 255 -399 69 306 -39 -304 -192 -127 -816 -245 -491 -200 -47 157 -99 253 -115 151 232 259 -214
6523 -214 -541 7 54 -85 294 205 207 -51 -525 -276 -296 -73 -57 140 39 42 -171 176 113 237 174 45 188
6546 188 309 398 -410 2 309 -173 32 -91 -75 252 351 96 395 332 320 -239 44 276 149 431 187 44
6568 44 24 797 441 440 373 46 -104 -23 -128 126 230 137 -58 -331 139 45 49 -40 -36 88 -4 -96 -130 163 307
6593 307 132 185 -37 -70 -383 272 -23 43 398 -500 -248 224 -422 185 148 193 31 -185 -364 237 -105 -44
6615 -44 -558 -273 -311 -270 54 181 -189 -66 -391 -203 -386 -495 -215 -422 -29 -197 -365 -183 -130 -454 -141
6636 -141 -120 -385 -557 -273 -365 63 -414 -89 -20 -546 -183 -334 -370 -106 55 -387 -7 -481 -272 95 -57
6657 -57 -2 158 -505 -466 -292 -5 30 -10 11 -130 -388 -108 -172 -340 -87 -224 -86 172 -41 341 290 247 93
6680 93 -56 -122 -267 297 160 379 -447 -329 606 251 311 285 121 312 247 -86 172 393 636 745 321 -271
6702 -271 -177 310 445 338 191 322 200 233 279 383 79 429 28 -21 393 221 16 138 114 57 -506 -156
6724 -156 13 -27 62 109 -438 -278 260 -167 -277 215 -323 -262 -19 -95 249 53 -27 -119 -151 -202 -763 -163 392
6747 392 -349 -74 -243 -191 226 26 -166 -154 -291 -613 -338 -559 -159 -131 61 -4 -192 -327 -276 -296 164 -127
6769 -127 -554 -190 -106 -390 -14 -73 28 135 -231 -7 -409 213 -234 -275 60 -126 -452 7 -317 -186 23
6790 23 -467 -350 169 189 -95 -75 346 -211 -363 -350 95 167 -234 354 210 -184 347 148 -454 -186 275 350
6812 350 154 15 -323 -259 137 196 384 179 -22 135 184 57 548 -43 560 394 30 77 0 -78 -24 159
6834 159 -113 447 53 316 126 274 -124 234 435 100 406 392 500 474 181 -334 162 -379 -259 20 262
6855 262 137 -552 -228 -146 241 -30 -55 32 110 -223 143 137 121 -77 432 -76 -456 -199 23 -188 -48 -361
6877 -361 -216 -157 -23 -40 -70 -212 -619 -149 -179 202 5 -230 -173 -590 -607 -568 -463 -487 158 -140 -403 -615 -309
6900 -309 -311 36 36 -234 -30 -525 -105 -484 -236 89 -141 -16 -45 447 -91 41 -98 -55 -146 178 -38 43 187
6923 187 -159 22 -39 29 -352 241 291 289 -307 32 83 -78 229 290 77 -119 -164 128 -103 -285 396 292 197
6946 197 117 90 586 142 168 439 -89 597 -122 458 239 48 311 -7 93 106 -189 3 139 -308 4
6967 4 -126 -168 -1 -24 -138 101 -97 295 -131 -164 -222 -203 -313 343 146 -39 284 -23 -154 20 60 -51 181
6990 181 145 30 -75 80 -134 74 -81 -24 -258 -35 -32 -314 27 -238 211 442 -62 -315 -395 -414 -225 -205
7012 -205 -162 -271 -686 -291 -322 45 -15 -373 432 70 -283 -76 -200 -268 42 -106 -454 -362 -54 -97 -380 -368
7034 -368 -85 279 -334 -187 -171 -380 -95 -319 -309 -293 190 0 268 539 34 -117 59 -633 306 35 293
7055 293 -385 -277 123 -155 152 -47 -138 -510 -12 30 101 176 41 243 297 190 -19 -196 148 103 484 97
7077 97 443 221 89 78 32 -4 -190 -12 243 274 241 291 72 445 597 321 -242 284 319 -144 254 -159 63
7100 63 128 -292 355 334 186 -157 51 87 635 32 371 148 -54 154 210 274 -384 572 201 -66 147 298
7122 298 -63 -312 251 -340 -172 -243 83 -181 -345 46 -61 -177 -181 -268 -154 147 -21 -59 -275 -296 -304 -156 -98
7145 -98 -23 -181 -416 -227 -168 -44 -313 42 -166 73 -387 -365 -25 -157 -351 7 -250 -113 -715 -97 -266
7166 -266 119 138 -1 -188 -368 -1 112 -75 -237 361 -354 202 76 -87 -250 146 66 87 -127 544 256
7187 256 -173 -34 136 234 22 -124 137 24 450 -131 156 -72 -3 34 -29 397 189 630 147 -194 90
7208 90 582 175 6 287 86 311 -109 79 117 68 405 -30 -93 -121 687 119 288 448 40 372 94 263
7230 263 -176 127 148 -63 -140 -22 232 -10 -77 -146 36 -33 182 182 401 268 -241 -46 -227 -669 -78 283
7252 283 79 227 -627 -326 -305 -28 223 -275 -262 -72 -112 -307 -128 326 10 34 -208 -349 60 -158 -253 40
7274 40 9 -644 -173 34 -180 -114 171 -68 -146 254 -353 -3 -46 -257 -1 73 -545 -54 -65 -110 -132 333 -210
7297 -210 10 -250 97 -341 -188 -113 -74 171 -364 209 -167 -140 -38 34 -58 183 -19 -158 244 -74 232 -475
7319 -475 6 -508 -317 -349 185 150 181 424 65 271 649 -42 162 -43 229 108 271 179 253 62 264 210
7341 210 314 655 683 63 235 40 284 60 14 228 -45 -105 -31 458 467 467 104 234 -231 -143 -173 -176 34 499
7365 499 -171 -98 72 -11 195 125 -355 -13 200 261 -4 153 193 110 -261 354 -508 -147 292 -51 283 -301
7387 -301 -114 -230 -317 -148 -357 -178 17 -101 2 -328 -62 454 -93 -507 -112 -356 -982 82 -113 118
7407 118 -394 -130 -354 -87 -385 103 -342 -240 95 209 220 262 -675 -184 -79 -79 303 -519 -649 -119 226
7428 226 148 251 -564 -425 168 -88 -209 174 223 -254 -59 -240 72 92 -15 -218 241 588 126 -77 49
7449 49 19 299 487 55 89 -262 -65 311 563 -10 106 93 34 -14 102 184 -111 243 -21 184 353 318 450
7472 450 -32 -133 290 70 -64 165 -259 2 32 2 9 275 233 -159 228 142 170 107 18 64 223 77 135 -27
7496 -27 323 -101 -484 170 -90 331 260 23 56 348 281 90 224 80 -265 510 -153 -204 -201 120 -152 -177 -176
7519 -176 23 -292 -276 -473 -258 105 -179 3 136 -224 -22 4 23 95 100 -169 -316 -233 -189 34 -93 -288 -499
7542 -499 -196 -402 197 -130 -112 -118 70 -782 39 -261 -483 -283 -67 175 -269 132 9 42 179 -379 -465 -328
7564 -328 -2 -204 -83 40 -189 143 -153 -10 107 -226 -100 -73 18 133 32 502 -58 -63 172 92 35 -136
7586 -136 -218 261 297 142 27 -28 -362 177 218 -14 15 304 209 331 102 293 -192 417 -25 -96 278 344 212
7609 212 382 -85 -18 436 27 55 -301 181 -59 310 302 478 188 182 -132 262 -163 164 367 51 -384 290
7631 290 145 29 -161 -410 -62 -324 157 -12 -274 99 -479 -21 238 -90 -20 -151 -220 88 -76 21 -56
7652 -56 -34 -318 -341 -82 70 40 23 213 -145 -489 -144 -232 -204 123 66 -157 -553 174 80 11 189 -87 31
7675 31 -416 -36 -72 -370 66 100 -37 -300 53 19 -190 -420 -113 101 -299 -155 15 44 11 114 -325 -482
7697 -482 -47 -80 -146 60 -3 -51 26 -285 -13 -28 23 -66 -8 308 171 168 320 -299 -17 249 159 -30 -192 175
7721 175 -114 40 1 384 118 -264 391 -72 -242 247 46 -52 -117 54 695 157 -758 4 151 -22 210
7742 210 -10 207 -16 -23 56 -60 -283 -209 -45 -60 41 -370 165 382 453 -127 497 206 359 -242 -494 0
7764 0 -367 241 -166 156 -57 228 231 -252 13 -316 -25 15 97 326 -334 105 -222 212 -294 117 -144 116
7786 116 -53 -338 -207 -59 -7 -101 -124 -86 -362 -210 -566 498 129 -282 -100 -692 -23 -30 286 138 -118 -402
7808 -402 169 -167 165 225 2 86 -291 -319 -241 51 117 -223 70 57 -495 177 -381 90 122 -100 56 372
7830 372 -30 10 -219 -26 279 -506 -308 -264 130 -114 487 -59 254 -43 287 -314 -297 15 229 -84 227
7851 227 -391 -27 263 308 310 14 1 266 467 216 221 424 377 1 -281 37 9 357 66 -286 253 -61 149
7874 149 337 291 -417 -207 160 -319 -88 175 238 270 274 316 59 226 55 376 325 97 -230 469 32 11 147
7897 147 445 -234 102 -35 171 -277 58 512 -135 -145 116 -755 -209 84 -539 -408 -252 -59 31 -46 217
7918 217 -294 -245 -312 -440 8 -290 187 -73 -83 -225 -425 -19 59 -560 -448 -280 -399 34 -285 -104 30
7939 30 143 -89 -241 -580 -426 201 202 14 -257 -334 60 -151 -214 -205 60 3 26 53 153 -143 162 -4 -150
7962 -150 20 -165 -287 166 -116 161 -146 60 108 -110 -356 173 -24 -50 -25 276 288 267 206 365 213 41
7984 41 448 150 -130 -143 -112 -169 124 -73 163 298 16 568 116 99 181 -447 101 -11 216 703 56 -169
8006 -169 512 67 -114 -143 106 389 164 116 -23 247 -244 -150 -42 186 278 -184 43 226 7 131 117 -282
8028 -282 107 115 60 225 -253 18 -27 -400 8 31 188 -213 -126 -54 -614 -17 -216 -135 -336 -351 -171 -262 142
8051 142 138 -379 -7 -565 -157 -25 -457 -255 -164 281 -483 168 31 75 51 -58 62 -174 -214 47 -837 112
8073 112 19 -94 160 -191 106 468 -140 166 99 -154 335 304 53 -329 28 204 -192 264 64 16 -96
8094 -96 26 167 219 193 -254 93 -224 -85 73 184 140 -88 -354 -36 240 -144 132 256 -8 -254 -12
8115 -12 528 -183 126 48 181 -213 -188 420 16 366 -20 9 -1 -277 187 247 501 -193 126 -34 318 153
8137 153 92 360 116 -21 -35 406 56 79 376 -161 48 -317 51 -89 -67 37 222 340 275 54 25 -182
8159 -182 341 -83 37 107 -75 476 476 -434 -31 -68 127 390 -23 -390 -321 -85 381 -72 320 -43 71 -325
8181 -325 -286 134 -186 -431 -45 669 -292 -222 -224 -199
8191a99
##END NTUPLES=NMR FID
##END=
