##TITLE=1H_Pr 4646-Van
 CDCl3, 8 sc, 
 27.1.2020
##JCAMPDX= 6.0         $$ Bruker NMR JCAMP-DX V2.0
##DATA TYPE= NMR FID
##DATA CLASS= NTUPLES
##ORIGIN= UXNMR, Bruker Analytische Messtechnik GmbH
##OWNER= root
$$ XWIN-NMR		Version 3.5
$$ Mon Jan 27 14:20:56 2020 Russian Standard Time (UT+4h)  she@DPX200
##.OBSERVE FREQUENCY= 200.1315
##.OBSERVE NUCLEUS= ^1H
##.DELAY= (6, 6)
##.ACQUISITION MODE= SIMULTANEOUS
##.ACQUISITION SCHEME= undefined
##.AVERAGES= 8
##.DIGITISER RES= 18
##SPECTROMETER/DATA SYSTEM= spect
##.PULSE SEQUENCE= zg30
##.SOLVENT NAME= CDCl3
##.SHIFT REFERENCE= (INTERNAL, CDCl3, 0, 15.7039)
##AUDIT TRAIL= $$ (NUMBER, WHEN, WHO, WHERE, WHAT)
$$ ##TITLE= Audit trail, XWIN-NMR		Version 3.5
$$ ##JCAMPDX= 5.01
$$ ##ORIGIN= Bruker BioSpin GmbH
$$ ##OWNER= she
$$ F:/spectra/data/she/nmr/H-F/1/audita.txt
$$ ##AUDIT TRAIL=  $$ (NUMBER, WHEN, WHO, WHERE, WHAT)
(   1,<2020-01-27 14:19:45.26 +0400>,<she>,<DPX200>,
      <created by zg, POWCHK disabled, PULCHK disabled
       configuration hash MD5:
       00 E9 B6 7A A2 85 ED C7 34 08 36 98 17 FE 4E 26
       data hash MD5: 16K
       71 36 FB 40 76 81 FE AC B8 F5 06 C0 31 C3 D7 C2>)
$$ ##END=
$$ 
$$ hash MD5
$$ 75 41 35 90 62 5A 16 EE 6D 79 A9 13 C3 70 AA 3F
##$RELAX= 
##$RELAX= 
##$RELAX= 
##$RELAX= 
##$RELAX= 
##$RELAX= 
$$ Bruker specific parameters
$$ --------------------------
##$DU= <F:/spectra>
##$EXPNO= 1
##$NAME= <H-F>
##$PROCNO= 1
##$TYPE= <nmr>
##$USER= <she>
##$AMP= (0..31)
100 100 100 100 100 100 100 100 100 100 100 100 100 100 100 100 100 100 
100 100 100 100 100 100 100 100 100 100 100 100 100 100 
##$AQSEQ= 0
##$AQ_mod= 1
##$AUNM= <au_zg>
##$AUTOPOS= <>
##$BF1= 200.13
##$BF2= 200.13
##$BF3= 200.13
##$BF4= 200.13
##$BF5= 200.13
##$BF6= 200.13
##$BF7= 200.13
##$BF8= 200.13
##$BYTORDA= 1
##$CFDGTYP= 0
##$CFRGTYP= 5
##$CHEMSTR= <none>
##$CNST= (0..31)
1 1 145 1 1 1 1 1 1 1 1 1 1 1 1 1 1 1 1 1 1 1 1 1 1 1 1 1 1 1 1 1 
##$CPDPRG= <>
##$CPDPRG1= <>
##$CPDPRG2= <>
##$CPDPRG3= <>
##$CPDPRG4= <mlev>
##$CPDPRG5= <mlev>
##$CPDPRG6= <mlev>
##$CPDPRG7= <mlev>
##$CPDPRG8= <mlev>
##$CPDPRGB= <>
##$CPDPRGT= <>
##$D= (0..31)
0 1.2 0 0 0 0 0 0 0 0.06 0 0.03 0 0 0 0 0.0002 0 0 0 0 0 0 0 0 0 0 0 0 
0 0 0 
##$DATE= 1580120384
##$DBL= (0..7)
120 120 120 120 120 120 120 120 
##$DBP= (0..7)
150 150 150 150 150 150 150 150 
##$DBP07= 0
##$DBPNAM0= <>
##$DBPNAM1= <>
##$DBPNAM2= <>
##$DBPNAM3= <>
##$DBPNAM4= <>
##$DBPNAM5= <>
##$DBPNAM6= <>
##$DBPNAM7= <>
##$DBPOAL= (0..7)
0.5 0.5 0.5 0.5 0.5 0.5 0.5 0.5 
##$DBPOFFS= (0..7)
0 0 0 0 0 0 0 0 
##$DE= 6
##$DECBNUC= <off>
##$DECIM= 24
##$DECNUC= <off>
##$DECSTAT= 4
##$DIGMOD= 1
##$DIGTYP= 9
##$DL= (0..7)
0 120 120 120 120 120 120 120 
##$DP= (0..7)
150 150 150 150 150 150 150 150 
##$DP07= 0
##$DPNAME0= <>
##$DPNAME1= <>
##$DPNAME2= <>
##$DPNAME3= <>
##$DPNAME4= <>
##$DPNAME5= <>
##$DPNAME6= <>
##$DPNAME7= <>
##$DPOAL= (0..7)
0.5 0.5 0.5 0.5 0.5 0.5 0.5 0.5 
##$DPOFFS= (0..7)
0 0 0 0 0 0 0 0 
##$DQDMODE= 0
##$DR= 18
##$DS= 0
##$DSLIST= <SSSSSSSSSSSSSSS>
$$ [...]
##$SUBNAM2= <"">
##$SUBNAM3= <"">
##$SUBNAM4= <"">
##$SUBNAM5= <"">
##$SUBNAM6= <"">
##$SUBNAM7= <"">
##$SUBNAM8= <"">
##$SUBNAM9= <"">
##$SW= 24.9337058887773
##$SWIBOX= (0..15)
0 0 2 0 0 0 0 0 0 0 0 0 0 0 0 0 
##$SW_h= 4990.01996007984
##$TD= 16384
##$TD0= 1
##$TE= 0
##$TE2= 300
##$TE3= 300
##$TEG= 300
##$TL= (0..7)
0 120 120 120 120 120 120 120 
##$TP= (0..7)
150 150 150 150 150 150 150 150 
##$TP07= 0
##$TPNAME0= <>
##$TPNAME1= <>
##$TPNAME2= <>
##$TPNAME3= <>
##$TPNAME4= <>
##$TPNAME5= <>
##$TPNAME6= <>
##$TPNAME7= <>
##$TPOAL= (0..7)
0.5 0.5 0.5 0.5 0.5 0.5 0.5 0.5 
##$TPOFFS= (0..7)
0 0 0 0 0 0 0 0 
##$TUNHIN= 0
##$TUNHOUT= 0
##$TUNXOUT= 0
##$USERA1= <user>
##$USERA2= <user>
##$USERA3= <user>
##$USERA4= <user>
##$USERA5= <user>
##$V9= 5
##$VALIST= <valist>
##$VCLIST= <CCCCCCCCCCCCCCC>
##$VD= 0
##$VDLIST= <DDDDDDDDDDDDDDD>
##$VPLIST= <PPPPPPPPPPPPPPP>
##$VTLIST= <TTTTTTTTTTTTTTT>
##$WBST= 1024
##$WBSW= 4
##$XGAIN= (0..3)
0 0 0 0 
##$XL= 0
##$YL= 0
##$YMAX_a= 349507
##$YMIN_a= -176576
##$ZGOPTNS= <>
##$ZL1= 120
##$ZL2= 120
##$ZL3= 120
##$ZL4= 120
##$ABSF1= 10
##$ABSF2= 0
##$ABSG= 5
##$ABSL= 3
##$ALPHA= 0
##$AQORDER= 0
##$ASSFAC= 0
##$ASSFACI= 0
##$ASSFACX= 0
##$ASSWID= 0
##$AUNMP= <proc_1d>
##$AZFE= 0.1
##$AZFW= 0.1
##$BCFW= 1
##$BC_mod= 2
##$BYTORDP= 1
##$COROFFS= 0
##$CY= 11.3945322036743
##$DATMOD= 1
##$DC= 2
##$DFILT= <>
##$DTYPP= 0
##$F1P= 16.9975609425685
##$F2P= -3.02152046262296
##$FCOR= 0.5
##$FTSIZE= 0
##$FT_mod= 4
##$GAMMA= 1
##$GB= 0.15
##$INTBC= 1
##$INTSCL= 1
##$ISEN= 128
##$LB= 0.24
##$LEV0= 0
##$LPBIN= 0
##$MAXI= 10000
##$MC2= 0
##$MEAN= 0
##$ME_mod= 0
##$MI= 1.114404
##$NCOEF= 0
##$NC_proc= 0
##$NLEV= 6
##$NOISF1= 3.799351
##$NOISF2= 2.8
##$NSP= 1
##$NTH_PI= 0
##$NZP= 0
##$OFFSET= 15.70392
##$PC= 1
##$PHC0= -9786.364
##$PHC1= 14.8008
##$PH_mod= 1
##$PKNL= yes
##$PPARMOD= 0
##$PSCAL= 0
##$PSIGN= 0
##$REVERSE= no
##$SF= 200.130013532006
##$SI= 16384
##$SIGF1= 3
##$SIGF2= 2
##$SINO= 400
##$SIOLD= 16384
##$SREGLST= <1H.CDCl3>
##$SSB= 0
##$STSI= 0
##$STSR= 0
##$SW_p= 3612.71676300578
##$SYMM= 0
##$S_DEV= 0
##$TDeff= 0
##$TDoff= 0
##$TI= <>
##$TILT= no
##$TM1= 0
##$TM2= 0
##$TOPLEV= 0
##$USERP1= <user>
##$USERP2= <user>
##$USERP3= <user>
##$USERP4= <user>
##$USERP5= <user>
##$WDW= 1
##$XDIM= 8192
##$YMAX_p= 0
##$YMIN_p= 0
$$ End of Bruker specific parameters
$$ ---------------------------------
##NTUPLES= NMR FID
##VAR_NAME=  TIME,          FID/REAL,        FID/IMAG
##SYMBOL=    X,             R,               I
##VAR_TYPE=  INDEPENDENT,   DEPENDENT,       DEPENDENT
##VAR_FORM=  AFFN,          ASDF,            ASDF
##VAR_DIM=   8192,          8192,            8192
##UNITS=     SECONDS,       ARBITRARY UNITS, ARBITRARY UNITS
##FACTOR=    0.0002004,     1,               1
##FIRST=     0,             0,               0
##LAST=      1.6414764,     0,               0
##MIN=       0,             -176576,         0
##MAX=       1.6414764,     349507,          0
$$ Real data points
##PAGE= N=1
##DATA TABLE= (X++(R..R)), XYDATA
0 0 0 0 0 0 0 0 0 8 -8 8 -8 15 -16 17 -24 29 -33 40 -48 57 -67 79 -91 105 -121 139 -158 180 -203 233 -258
31 -258 292 -328 368 -408 459 -507 564 -627 696 -771 852 -944 1045 -1158 1285 -1426 1588
48 1588 -1774 1987 -2237 2539 -2908 3368 -3962 4769 -5925 7740 -11020 18848 -79573 7323
62 7323 139999 -48005 -176576 -126352 1868 -8858 -55829 -33779 32804 8455 -54950 -59811
74 -59811 7592 45816 42737 31355 28536 13960 22559 67697 106888 89472 59979 65090 83536
87 83536 64094 42695 77401 139513 131018 45690 -17801 15007 94313 130859 93937 27440
99 27440 -5643 24311 77204 81557 31757 2996 36083 68108 33303 -20791 -6315 57970
111 57970 69789 7905 -33518 -322 44621 35374 224 -4815 14005 21361 9828 -1971 -6653
124 -6653 324 19072 25831 -5262 -48283 -43480 11557 40266 -1624 -53163 -42277 -286 -4319
137 -4319 -48191 -53911 -5251 23422 -18363 -78304 -75696 -15754 20234 -12701 -66164 -70629 -25896
150 -25896 4976 -20026 -65516 -62428 -9611 17600 -26826 -83988 -68396 4848 38214 -11903
162 -11903 -75337 -68285 -6388 26395 -1852 -33826 -22417 3287 -4691 -30186 -20018 26364
174 26364 48010 10801 -35845 -23805 32713 57105 23716 -11529 987 37050 46759 22444
186 22444 792 8800 35396 50663 34540 184 -14496 13978 57065 55553 3603 -31479
198 -31479 -1811 47004 43268 -2507 -18787 13348 36972 12924 -17930 -3784 34393 37774
210 37774 2948 -17679 3298 30925 27386 2647 -4112 17927 39715 27588 -9417 -22326
222 -22326 9036 48425 43972 -3117 -35831 -13751 30289 36341 33 -26806 -13806 9238
234 9238 4826 -19916 -25557 -1564 18942 1024 -39004 -48878 -11075 28448 18561 -26155 -46242
247 -46242 -17082 16886 9904 -17476 -13815 17493 23263 -12195 -36734 -7532 42832 48937 5089
260 5089 -31578 -17301 23907 39914 19618 -2909 -455 14411 14816 114 -3027 18576 39260
273 39260 23697 -16885 -30925 3571 46023 43235 280 -26340 -6196 28035 29250 4200
285 4200 -4736 14935 29301 11539 -14502 -11505 22108 44176 23939 -14927 -25736 1707 28459
298 28459 22121 -4011 -13885 1567 12178 -2601 -20652 -9072 18757 20039 -13828 -40858 -23842
311 -23842 16020 28162 -1800 -32256 -23544 6282 13939 -7034 -21742 -5769 17702 13734 -16720
324 -16720 -31625 -6802 27709 26214 -9446 -32066 -15919 14160 17126 -5790 -17972 -3955
336 -3955 10786 -1566 -24963 -22815 5475 21801 1664 -30989 -34047 -3466 20922 9089 -19673
349 -19673 -24915 -2995 11234 -1996 -19734 -10084 17381 23291 -5269 -29816 -14959 21618 32845
362 32845 7001 -20059 -14388 12501 22378 5206 -10439 -85 18308 14230 -11068 -21782 378
375 378 28480 24289 -9496 -28648 -9052 20702 21355 -3990 -16403 -1017 15875 7981 -11956
388 -11956 -10955 14200 29265 10446 -19293 -20784 8172 31107 20005 -9005 -16826 2995 18773
401 18773 7588 -11306 -7789 12722 16519 -6963 -27842 -16197 14544 22836 -3588 -30030 -24666
414 -24666 968 10705 -5079 -20791 -13788 3797 2366 -18567 -27141 -6714 17207 10644 -19930
427 -19930 -35114 -14036 15325 16337 -8864 -23907 -10951 7113 2395 -15096 -17345 2214 15196
440 15196 -36 -25827 -27255 88 20315 7019 -20794 -27055 -7055 9344 1448 -15143 -12662
453 -12662 4479 8564 -10780 -26130 -11962 15715 21188 -3844 -27612 -19125 9618 21030 3443
466 3443 -16129 -11151 7094 9652 -7181 -16144 136 20190 14012 -13341 -26052 -6379 19816
479 19816 19997 -3538 -18335 -7337 11333 11534 -3146 -6216 8523 18826 6017 -13513 -11116
492 -11116 15220 32568 18109 -9536 -14077 8360 25785 17944 -1236 -3214 11666 17820 4031
505 4031 -10171 -730 20549 23502 93 -21431 -13622 12496 22304 4688 -15334 -12223 5051
518 5051 8241 -5546 -13591 -945 13982 7610 -14875 -22979 -2982 20663 18316 -6833 -21888
531 -21888 -9618 10817 12658 -3366 -10925 595 10888 874 -17203 -15717 5879 17844 1849
544 1849 -23382 -26381 -4886 11559 2961 -16687 -20256 -7116 -260 -10659 -21834 -13398 5838
557 5838 7833 -12590 -29847 -18199 8960 18007 88 -19254 -14529 4649 12877 2914 -5149
570 -5149 3421 15897 11722 -4942 -9711 7462 26481 22928 -67 -12893 -237 20569 21343
583 21343 5091 -4185 4545 13720 7577 -5976 -4407 13887 23455 7583 -14788 -14654 7273 23466
597 23466 13964 -6851 -11977 2122 13631 6452 -4948 -1259 12747 14330 -2198 -14964 -4841
610 -4841 17935 23866 4340 -14858 -9553 10204 17363 5325 -6868 -1709 10934 9686 -5407
623 -5407 -11438 3666 20382 13763 -8810 -18275 -3113 16230 14837 -2987 -11935 -1610 9621
636 9621 4213 -8772 -8442 5468 13371 1336 -16603 -15774 3184 15483 5487 -13163 -16142 -1900
650 -1900 7800 337 -10699 -7166 6368 8541 -5914 -16559 -7014 12423 16576 1628 -13292
663 -13292 -8047 8911 16867 7424 -2453 2024 13133 13250 1489 -3643 8710 24291 20969 1972
677 1972 -8249 4183 22074 23111 7970 -2128 4414 14855 12892 2502 1581 13520 20504
690 20504 9294 -7588 -7333 10904 24820 16214 -3995 -8831 5927 17721 11151 -1676 -971
703 -971 11657 14577 670 -11280 -3088 16525 20529 1634 -16768 -13351 4980 12731 1149
716 1149 -12482 -10705 -1072 -1991 -13781 -18800 -7447 3276 -4573 -23888 -30696 -16356 101 -2622
730 -2622 -19246 -27397 -19207 -9514 -12514 -21083 -20260 -8539 -3677 -15019 -28970 -24759 -5715 5201
744 5201 -5184 -22798 -25853 -12409 327 -2347 -11758 -13228 -5555 -3416 -10855 -16354 -8467 4869
758 4869 7312 -6599 -19208 -13747 3835 12083 3646 -8195 -7285 2087 5862 250 -2047 6714
772 6714 15642 10750 -3489 -8355 5385 22383 22227 6302 -5469 1213 16029 19337 9967 3835
786 3835 10044 16489 10016 -1623 -888 15416 26053 14365 -5543 -8838 7495 21155 15630 416
800 416 -3712 5377 11539 4597 -3321 1933 13909 14030 -1246 -12847 -5597 11988 16771 3437
814 3437 -10067 -7515 3387 5967 -1889 -6833 -1254 4852 -1208 -13794 -15800 -2497 9288 2794
828 2794 -14556 -21565 -10939 1760 364 -11726 -16932 -8701 -1825 -7465 -17139 -15896 -3873 2476
842 2476 -6429 -19624 -19545 -7097 2850 -1880 -12192 -14579 -7692 -3055 -6589 -11253 -7829 97 760
857 760 -8726 -15663 -9414 3475 6807 -2638 -13180 -10172 1293 5698 -579 -7069 -1729 7192 6408
872 6408 -4389 -9179 661 14770 14223 136 -8797 -663 12886 15188 5389 -935 3956 11014
886 11014 8888 309 650 10975 17812 9611 -4019 -5437 7379 17404 12034 -898 -3671 5537
900 5537 11495 5241 -2219 1274 11757 11436 -462 -9189 -2300 12548 15806 3576 -7385 -4824
914 -4824 6215 9360 2138 -3534 510 7184 3859 -6405 -8771 1687 11258 6440 -8582 -14794
928 -14794 -6228 5305 5239 -4040 -9712 -5563 -785 -3301 -9004 -8164 -260 3936 -3188 -14171 -13835
943 -13835 -1659 7530 2370 -9105 -12454 -4647 1987 -816 -6071 -3734 2928 2178 -6573 -11694 -4496
958 -4496 6630 8858 -2106 -12671 -10403 1050 7561 1924 -6310 -5941 476 1899 -4527 -8129
972 -8129 -502 8439 5645 -6478 -12155 -3177 9355 9489 -562 -7172 -2904 4453 4945 -641 -728
987 -728 5634 9034 1969 -6666 -5081 7137 14913 7477 -5618 -7571 2692 10235 6678 -1464 -1923
1002 -1923 4693 6106 -655 -5768 291 10134 10292 -148 -8953 -4670 6914 11397 4005 -3716 -2548
1017 -2548 4382 5721 612 -2026 3005 8849 5217 -5084 -7529 1482 11184 8851 -1955 -7389
1031 -7389 -2803 4727 5164 -1463 -4007 822 4119 -250 -7250 -6019 3062 8297 1878 -8320 -9703
1046 -9703 -224 7237 3831 -4323 -5254 670 3610 -569 -5013 -1748 5913 7112 -1833 -8370 -3908
1061 -3908 5943 9592 1997 -5978 -4564 2836 5696 -68 -4064 337 5727 3727 -4703 -7555 -61
1076 -61 8340 6627 -3861 -8907 -2482 5360 5231 -1192 -4335 89 4821 1541 -4306 -4562 4423 9019
1092 9019 2151 -6456 -6722 2288 8224 4419 -3733 -4828 1083 4856 691 -3916 -1156 5268 5953
1107 5953 -1710 -7896 -3833 6345 8676 930 -6208 -4302 3480 6270 1009 -3243 -507 4743 3887
1122 3887 -3193 -5361 1449 8166 5952 -2823 -7387 -1812 5941 5523 -997 -4451 -2 3749 1071
1137 1071 -4173 -3869 2792 6139 792 -7805 -7137 1886 7476 3389 -4608 -6152 190 4911 1239
1152 1239 -3271 -2156 3880 4935 -1184 -6079 -1883 6387 8010 780 -6156 -3944 3975 6402 2052
1167 2052 -2514 -493 3534 3256 -1972 -4658 1074 7141 5071 -3891 -7256 -1006 6703 6022 -1407
1182 -1407 -5055 -761 3988 2364 -2146 -1896 3346 6054 1555 -4992 -4369 3260 8274 4167 -3905
1197 -3905 -4871 1378 6058 2739 -2184 -1724 2959 3768 -1377 -6037 -2665 4899 5931 -1375 -7771 -5805
1213 -5805 1863 4386 -528 -5471 -4486 422 315 -3626 -4845 -915 3768 1310 -6100 -8613 -2386
1228 -2386 4625 3502 -3191 -6739 -2690 2330 1118 -3738 -4072 780 3511 -741 -6681 -5630 1987
1243 1987 6526 1742 -6199 -7173 -611 4480 2209 -2967 -3099 785 2594 -1002 -3787 -1216 4605
1258 4605 5343 -749 -6030 -2783 4577 7071 1988 -2301 -1483 3102 4446 49 -1926 2249 6654
1273 6654 4149 -2590 -4445 1807 7979 6874 -720 -4949 -914 4911 4394 439 -1241 1686 4048
1288 4048 1126 -3791 -2709 3385 7102 2437 -4826 -4971 1609 6283 3567 -1905 -3236 237 2548
1303 2548 -674 -3208 -853 3719 3660 -2451 -7502 -4708 2945 4820 -691 -6182 -5225 -109 1461 -2068
1319 -2068 -4555 -1983 887 -977 -6608 -7426 -1856 3972 1731 -5299 -8653 -4662 1256 1203 -3475 -5624
1335 -5624 -2334 -48 -1502 -5434 -4684 943 3911 -571 -7052 -6887 -516 4340 2451 -3031 -4088
1350 -4088 -687 1962 205 -2146 24 3912 3759 -1613 -4353 -634 5852 7953 2010 -3196 -1767
1365 -1767 3741 6005 3412 230 2285 5154 3866 -407 -1301 3376 8215 6342 -700 -3739 425
1380 425 6596 6762 2191 -885 872 3863 2211 -772 29 4423 6077 1771 -3826 -2697 3212 7095
1396 7095 4094 -1718 -3530 675 3888 1930 -596 244 3048 2830 -1622 -4885 -1465 3938 4953
1411 4953 -811 -6156 -4881 231 2582 -637 -4025 -3793 -1457 -1673 -4827 -5567 -1818 1627 -398 -6465
1427 -6465 -9156 -4787 1272 1208 -4203 -6945 -4668 -1237 -1540 -3983 -3869 -198 1134 -2378 -6681 -5382
1443 -5382 249 4357 1605 -4531 -5567 -1412 2480 1253 -1620 -1635 1085 1237 -1567 -3662 -333 4546
1459 4546 4611 -639 -5005 -2748 2840 5541 2091 -1742 -962 2408 2256 -279 -807 2639 5379 3154
1475 3154 -1929 -3289 1340 6616 6091 373 -2214 -34 3681 3451 1028 1141 3161 4031 1471 -2122
1491 -2122 -917 4098 6555 2932 -2386 -2732 1648 4689 3356 179 -595 1632 1824 -378 -2205 466
1507 466 4283 3769 -837 -4658 -2495 2170 4221 877 -3412 -3088 -123 682 -1259 -2516 -480 1446
1523 1446 76 -4423 -5761 -1595 2831 1721 -3095 -5779 -3376 472 1118 -1835 -3031 -1228 499
1538 499 -1689 -4387 -3067 1440 3710 511 -4667 -4971 -162 3540 1454 -2256 -2697 -157 1352 -483
1554 -483 -2380 -841 2699 2673 -2128 -4894 -2274 3183 4142 304 -3255 -2365 713 2125 -295 -1524
1570 -1524 442 2592 843 -2586 -2732 1170 4700 3421 -1484 -3294 -492 2900 3036 517 -480 765
1586 765 2109 806 -1709 -788 2945 4289 1125 -2381 -2281 1474 4215 2623 -639 -1427 570 1487
1602 1487 362 -770 309 2677 2982 -708 -3544 -1425 2628 4467 716 -2722 -2203 642 2443
1617 2443 749 -1401 -490 1322 666 -2278 -3535 -13 3096 2269 -2227 -4341 -2091 1715 1776 -1382
1633 -1382 -2227 -842 688 -544 -2653 -1930 1563 3001 -126 -4222 -3745 617 3636 1575 -2296 -2868
1649 -2868 -456 1370 430 -1390 -429 1637 1549 -2009 -3498 -1336 2968 3249 -60 -3523 -2515 530
1665 530 1922 75 -1385 -228 997 194 -2175 -1970 1009 3486 2035 -2257 -3465 -531 2671 3168
1681 3168 141 -1745 -455 1463 587 -644 -195 2117 3138 266 -2423 -1761 1901 4132 2448 -1020
1697 -1020 -2194 265 2191 1855 52 172 2153 1842 -947 -2252 -113 3355 3706 162 -2719 -1586
1713 -1586 1710 3166 1497 -907 -609 1094 1058 -902 -1630 1001 3247 1529 -2153 -3367 -270 3044
1729 3044 2412 -887 -2887 -1087 724 884 -1205 -873 858 1713 -986 -3390 -2520 1187 3252 1073
1745 1073 -2548 -3100 -210 1940 1218 -896 -1108 444 525 -939 -1810 -249 2344 2047 -1126 -3218 -1847
1762 -1847 1469 2351 193 -1682 -1382 485 505 -1194 -1264 385 1948 477 -2412 -3243 -343 2374 2340
1779 2340 -869 -3160 -1336 964 1232 -342 -689 534 1360 -421 -2058 -1144 1768 2954 919 -1994
1795 -1994 -2137 638 2605 1657 -553 -1232 474 1164 -309 -1206 -34 2098 2080 -976 -3017 -1442 1858
1812 1858 2738 266 -2347 -1760 207 1328 28 -860 552 1220 500 -1861 -2329 167 2735 1600
1828 1600 -1297 -2920 -806 1464 1914 -195 -711 114 834 -76 -1445 -545 1698 2757 503 -2050
1844 -2050 -2046 1128 3049 1342 -511 -1184 432 1320 378 -465 304 1941 1457 -834 -2474 -771 2276
1861 2276 2500 -24 -2493 -1680 548 1087 -295 -1299 -620 252 -292 -1954 -2235 -157 1966 641 -2240
1878 -2240 -3188 -1269 956 1277 -331 -1515 -1057 476 17 -1254 -1118 1010 1456 -249 -2378 -1622 703
1895 703 2736 1118 -1601 -2008 -9 1241 498 -536 -392 1055 680 -1202 -2389 -981 1416 1719
1911 1719 -958 -2979 -2218 622 1120 -209 -1751 -1335 -208 -373 -1712 -2000 -74 1478 548 -2132
1927 -2132 -2865 -956 1370 912 -781 -2219 -1068 357 217 -531 -284 627 1528 -440 -1482 -929 1543
1944 1543 2771 966 -1093 -1407 37 1856 1436 29 -131 718 867 -262 -605 616 2387 2225 146
1961 146 -1491 -820 1262 1892 908 -510 -673 664 904 -275 -561 362 1730 534 -1331 -1687 81
1978 81 1925 1706 -773 -2029 -869 684 757 -419 -671 157 389 -495 -1639 -927 1017 1868 223 -2078
1996 -2078 -2150 -117 1123 701 -678 -986 -204 -10 -1169 -1842 -460 765 492 -1348 -2766 -1714 554
2013 554 1433 -763 -2273 -1940 -742 28 -628 -1146 -573 589 13 -1927 -2195 -177 1738 959 -1310
2030 -1310 -1885 -675 907 1296 -15 -253 396 749 -313 -848 -128 1406 2385 679 -1070 -1299 662
2047 662 2074 1462 -24 -927 481 1297 604 17 687 1760 1451 -356 -1404 -234 1821 2536 786
2064 786 -547 -461 482 1426 783 1 377 1136 766 -824 -456 943 2663 1649 -387 -1269 -108 1658
2082 1658 2022 771 -134 180 658 221 -164 40 1247 2090 312 -1388 -1121 976 2181 1050 -405
2099 -405 -951 -416 137 127 -376 -102 600 212 -893 -1916 -873 794 1086 -621 -2171 -2164 -338 547 -180
2118 -180 -1194 -972 -578 -718 -1502 -1740 -138 1014 259 -1771 -2204 -756 596 972 -469 -1370 -610 -310
2136 -310 -17 -780 -462 663 1118 -337 -1659 -1274 542 2056 1039 -436 -1227 -143 748 991 482
2153 482 570 952 352 -150 -1010 420 1991 1561 364 -807 -799 879 1712 1127 338 304 589 482 329 384
2173 384 1495 1926 1386 -433 -799 632 1915 1988 1004 -280 -12 904 502 215 721 1192 1066 11
2191 11 -743 -440 1504 2335 1232 -703 -812 57 1158 922 329 176 455 200 -540 -1061 290 1437
2209 1437 1044 -460 -1709 -1148 845 1292 706 -432 -717 -184 -442 -636 -473 230 729 -312 -1520 -1775
2227 -1775 -526 1153 1055 -178 -1435 -1531 -68 239 -136 -51 335 152 -737 -1382 -656 604 1149 210 -763
2246 -763 -1547 -249 866 595 137 -591 -254 -352 -659 -595 156 1122 887 -843 -2001 -912 635 1156 548
2265 548 -685 -895 -390 177 -285 -89 179 559 -233 -1098 -1327 95 1674 1094 -624 -1618 -886 245
2283 245 861 298 166 -193 299 -412 -891 -190 1302 1517 93 -1384 -1454 -202 1010 941 52 -440 -483
2302 -483 -9 -127 -448 286 837 155 -473 -1191 -661 1206 1412 335 -644 -768 -387 300 245 236 186 310 -282
2323 -282 -849 -1036 137 1067 1059 -553 -1124 -763 282 1026 461 -298 -358 -150 -597 -537 -164 374 885 -41
2343 -41 -1010 -1162 74 745 675 -235 -1246 -470 -256 79 -181 85 570 -141 -762 -1302 -737 581 894 -258
2363 -258 -1398 -1331 -537 55 81 -278 -401 -455 -531 -898 -1064 -45 519 239 -1058 -1380 -600 465 508 -93
2383 -93 -538 -682 -83 -77 -426 -193 347 538 -167 -1083 -505 289 1099 747 37 -474 -385 294 271 -109 282 365
2405 365 172 -429 -494 -184 1000 796 -266 -1023 -951 177 680 221 -171 -269 -196 -163 -679 -273 370 1025 314
2426 314 -622 -1180 -344 528 851 31 -639 -617 108 138 197 -106 441 733 -95 -397 -127 450 928 892 -231
2447 -231 -261 361 507 592 476 388 462 243 -21 -128 369 972 1305 37 -857 -529 263 766 555 -428 -362
2468 -362 -38 -264 -593 -23 198 528 -95 -702 -1229 -224 539 543 40 -476 -399 -333 224 110 79 370 137
2489 137 -99 -614 -366 862 1263 479 -449 -902 -395 582 267 62 -50 63 -210 -86 -217 178 691 443
2509 443 -459 -760 -716 449 756 491 15 -313 71 15 410 54 273 670 176 -150 -336 72 826 774 79
2530 79 -358 -209 450 633 561 637 370 523 -2 -64 396 801 995 784 -572 -618 333 666 581 543 -224 -75
2552 -75 -36 43 -44 3 586 402 -462 -640 -567 360 864 107 -427 -434 -141 -76 438 220 499 194 -167 -302 -532
2575 -532 180 1302 546 -88 -531 -344 577 661 213 -53 -114 145 -15 30 483 996 755 -25 -387 -424 81
2596 81 664 400 -81 -232 -230 -203 -149 -47 12 118 -84 -668 -1026 -579 140 264 -11 -395 -710 -139 -29 18
2618 18 -66 -121 -264 -118 -618 -250 -77 597 506 -330 -1041 -208 565 651 303 -35 -16 84 67 -19 -142 296 505
2641 505 -27 -272 -497 306 908 524 -133 -451 -225 -85 321 226 350 410 58 -530 -374 166 352 589 -415
2662 -415 -638 -300 220 585 237 90 -274 -149 22 193 -41 413 695 72 -471 -427 -121 328 496 159
2682 159 -366 -658 -257 -9 199 85 319 164 -414 -472 -338 623 538 333 -229 -817 -291 262 176 283 -201
2703 -201 -52 -116 -165 -281 442 294 315 -124 -632 -555 146 328 256 100 -417 -263 -220 -98 176 637 297 285
2725 285 -660 -201 132 824 451 195 -322 -499 41 244 578 227 149 -9 -300 -560 -37 368 259 -110
2745 -110 -763 -983 -24 146 129 -256 -359 -664 -313 -382 -498 38 -53 241 -314 -716 -391 124 492 170 -459
2766 -459 -554 -335 203 45 178 116 131 -522 -478 -369 223 397 370 -145 -607 -540 107 213 22 100 -135 -225 -452
2789 -452 -536 -427 266 -44 -169 -676 -600 -710 177 199 -113 -282 -276 -430 -95 158 296 -81 -279 -411 -607 -239
2811 -239 358 643 111 -453 -385 -125 176 -131 -21 -287 -87 -110 -708 -179 269 366 214 -506 -570 -283 306
2832 306 547 274 57 -79 -221 -211 -171 144 450 468 125 -219 -149 104 488 157 -236 -329 -261 -8 211 332
2854 332 117 -102 -99 -294 -179 -201 327 158 183 -400 -399 214 304 296 124 238 -325 -453 -293 -164 469 463 -59 -362
2878 -362 -353 133 255 372 171 -90 -318 -161 -12 -56 378 376 321 -191 -321 -335 109 627 357 58 -188 -189 120
2901 120 478 293 235 -96 -184 -178 -84 308 423 248 14 -407 -342 291 518 257 367 243 -106 -290 -9 149
2923 149 41 58 -103 -353 -461 -32 357 472 99 -109 -277 -231 241 306 410 557 311 158 -58 -37 725
2944 725 756 400 169 -281 83 315 618 478 346 131 -149 -262 -135 38 290 174 94 -399 63 -39 231
2965 231 451 -47 -500 -582 -370 1 113 156 162 -367 -550 -138 -79 90 415 -165 -226 -450 -131 292 353 274 -81
2988 -81 -134 -376 -484 101 349 289 124 -29 -542 -514 -47 44 -58 94 -256 -380 -348 164 231 326 -1 -247 -672
3011 -672 -288 289 452 104 -225 -80 -228 -169 105 188 3 17 -319 -552 -267 32 407 246 11 -376 -365
3032 -365 -248 -197 250 302 -78 -109 -59 136 -46 458 24 -28 -349 -394 279 211 216 288 -137 -563 -345 -27 -74 -117
3056 -117 -151 -51 -355 -518 -318 -29 157 210 -65 -328 -168 -192 76 183 150 201 182 -26 62 308 431 581
3078 581 74 -93 -37 99 345 271 294 35 -27 -14 -104 207 128 434 -31 -265 -643 -107 189 287 225 -248 -204
3101 -204 -123 252 74 127 -50 -71 -327 -137 32 -190 224 312 -137 -316 -319 271 292 136 -9 -91 -215 -99 -52
3124 -52 327 512 245 35 -184 -104 159 404 315 90 100 -59 -82 39 306 412 404 -112 -300 -13 207 70
3146 70 271 33 -179 -229 67 110 36 39 342 -317 -353 -359 3 238 299 -185 -473 -442 -178 91 120 45 -29 -544 -496
3171 -496 -116 329 85 60 -43 -204 -177 -209 210 103 -10 -78 -158 -184 126 215 355 308 -258 -96 -61 112 -111
3194 -111 21 -36 188 -261 -294 -393 142 97 144 -156 -429 -55 3 -6 192 356 113 -340 -241 230 325 208 116 -87
3218 -87 -310 143 193 564 295 132 -499 -355 28 77 215 496 224 -101 -301 -149 239 131 2 -16 -223
3239 -223 -119 -228 169 -82 160 -171 -186 -252 -364 48 -67 332 -48 -187 -127 -202 113 118 -91 110 -245 -169
3261 -169 -208 39 442 202 -22 -192 -2 -66 178 346 149 218 -29 -82 -192 180 227 165 -167 -276 -147 28
3283 28 2 276 -191 4 -441 -60 -524 44 -28 131 -31 -486 -330 -351 -97 -36 -187 -450 -169 -175 -193 -138 86
3306 86 -72 158 -99 -129 -9 -20 178 173 -204 92 -180 -163 232 455 208 -294 -479 130 278 285 273 82 45
3329 45 -423 -145 -51 161 292 63 -115 2 77 -87 -5 403 340 15 -156 -36 25 115 617 47 106 -291 6
3352 6 199 441 86 69 222 39 108 133 168 169 299 108 -264 -199 130 215 339 115 136 177 -293 126 51 328
3376 328 434 86 -31 -202 312 497 82 -28 106 -96 150 93 293 45 -186 -10 -17 -97 156 49 250
3397 250 -98 -77 -225 -222 330 74 -52 78 -250 -348 -34 -163 200 -44 -167 -221 -459 140 409 119 51 -176
3419 -176 -342 -420 184 -80 160 212 214 -217 -535 -190 -230 288 142 -226 -107 -93 92 -131 -98 337 -142 -224 4
3442 4 160 212 -68 -45 -308 -152 9 -78 -16 57 129 -44 -329 247 141 174 397 30 88 -31 -123 -72 301 104
3466 104 292 -129 208 -141 44 252 500 244 -37 -6 47 235 526 506 494 16 138 84 122 541 234 -7
3488 -7 -155 -48 344 66 494 331 68 88 182 103 269 105 91 -221 73 -128 -159 26 288 258 -23 28 -13
3511 -13 -88 117 101 -5 -30 -358 -171 -130 66 289 26 -442 -437 -392 11 -152 -89 222 -210 -352 -20 -257 -132
3534 -132 85 -24 -48 -221 -275 -15 -59 281 212 -214 -172 -468 -55 -153 119 7 -279 -167 -330 -173 -208 85
3556 85 70 -396 -420 -396 -123 -94 272 183 -170 -275 -397 -76 258 48 -144 -213 -190 -48 -132 136 193 45 -1 -56
3580 -56 -240 35 211 273 166 -201 -315 -110 98 50 120 59 -167 -348 262 252 250 33 150 -58 -506 -144 195
3603 195 389 134 326 39 34 -89 116 464 111 116 303 -38 4 140 529 -191 332 -168 -76 -385 20 176
3625 176 193 48 -230 -136 -165 228 120 56 112 -54 -101 56 183 86 37 71 -66 -376 -210 -210 85 38 -372 -215
3649 -215 -277 -327 -239 21 -191 -237 -388 -356 -147 -48 27 -78 -219 -437 -229 -318 47 218 0 -170 -458 -242 -118
3672 -118 -312 234 -178 -153 -481 -302 -236 -110 -39 -74 -108 -359 -135 109 -90 162 -20 -320 -334 -208 97 382
3694 382 72 -7 -122 -281 -123 173 202 81 36 -224 -244 -197 274 377 130 -8 76 -59 -261 464 178 277
3716 277 -16 93 -37 -74 112 231 104 -119 201 126 -230 159 550 254 307 442 -111 21 198 122 589
3737 589 541 46 97 -50 524 315 372 331 -82 -154 176 -103 58 501 280 219 -152 -34 156 112 98 123 -143
3760 -143 -208 -136 131 217 214 140 17 -184 0 19 328 25 -210 -93 -48 64 124 -34 38 -59 -277 -260 -254 -4 -215
3785 -215 -126 -252 -253 -319 -222 -258 -97 64 -26 -500 -429 -203 -360 -140 82 2 -335 -51 -196 113 -91 82 46
3808 46 -269 5 60 65 166 -120 52 -247 239 87 220 222 -59 -51 -274 -351 4 432 135 190 222 108 -97 -67
3832 -67 363 290 51 81 -183 72 344 -128 197 271 103 -19 -92 139 224 371 521 201 -160 203 258 179 211
3855 211 257 -136 327 -21 256 426 417 379 -186 141 152 445 200 227 177 -2 57 222 373 225 -34 271 -308
3878 -308 -115 -185 185 105 -88 259 -114 -251 278 -152 182 210 37 14 -105 -107 -14 299 -95 -34 -287 -441 -83
3901 -83 32 -130 143 -279 -433 -319 -36 346 189 -17 -4 -105 -281 -365 50 113 166 -165 -229 -404 -22 -196
3923 -196 -100 -365 40 -103 -213 -118 -32 132 170 13 -585 -255 -356 -89 64 -149 -446 -168 -185 -99 33 251
3945 251 118 -259 -64 -177 39 348 307 231 5 -860 -386 -47 216 1107 32 -242 132 -736 132 856
3965 856 598 184 123 229 203 -198 225 338 158 30 -19 137 220 379 125 -32 22 58 101 -215 420 140
3987 140 95 72 -35 79 37 320 171 148 -95 168 -197 8 148 411 335 165 -15 -162 222 381 -62 185
4009 185 -23 -244 -35 119 45 84 -176 -212 -119 -102 24 293 56 -249 -68 -198 59 -45 212 111 228 -101
4031 -101 96 -23 4 -204 326 -305 -206 -171 -159 215 -70 51 -162 -126 -128 -135 192 10 54 -28 -126 -28 43 258 37
4056 37 -281 -173 310 -277 -316 146 167 96 -80 -433 -59 -45 -36 -252 -203 -169 -6 -104 -1 329 26 231 4
4079 4 186 -200 58 -8 92 105 -40 -49 -317 365 -205 69 -106 5 3 122 21 229 411 -63 119 -284 -120
4102 -120 -441 222 147 -29 131 214 -81 371 269 -68 92 -49 -251 39 155 -19 241 205 -156 -125 -268
4123 -268 2 25 49 135 -233 -180 43 391 417 -52 -17 -253 84 169 129 86 84 -182 34 95 81 237 -18 302
4147 302 -161 -217 109 -155 329 63 -82 96 -268 -207 315 119 -19 238 -423 -186 -246 138 192 48 175
4168 175 -114 -69 -58 -118 -35 158 35 -242 79 -221 -142 286 73 -82 -278 -214 -305 186 -24 336 -126 -48 -220
4191 -220 -94 84 -48 9 26 -396 -38 -193 171 98 -117 -262 50 -273 -64 247 -13 -77 -26 -122 -111 -37 -128
4214 -128 296 -305 -113 -134 118 -288 -131 108 -13 -283 -336 -22 -93 120 6 7 -212 -102 -86 117 -159 124
4236 124 311 -193 -159 -161 -27 -34 -113 46 -409 119 -197 80 -30 248 168 81 -183 -135 33 -41 225 -12 34 -70
4260 -70 16 102 176 258 -27 71 139 -96 -39 128 110 72 133 52 -74 319 -296 278 -97 -4 213 -114 189 -18
4284 -18 271 234 -103 -244 -188 -63 21 262 -62 209 -197 -6 -178 -107 -162 -258 28 -224 241 319 98 -143 72
4307 72 -395 -64 -67 45 -45 83 60 -13 -150 -146 -45 114 50 257 -109 -194 -437 -88 23 204 -190 -199 -27 173
4331 173 17 -48 -111 63 41 -17 -91 102 176 54 -299 -173 -306 -378 -80 118 -3 -170 -172 -248 -229 -87 -105 -147
4355 -147 194 -196 -212 70 -73 191 147 -55 -94 -163 -238 120 122 72 -59 -257 38 -141 -19 289 163 -28 -75
4378 -75 -266 50 207 143 -5 119 -11 52 27 117 31 271 -99 -82 -187 -48 326 33 159 -105 31 -200
4400 -200 -31 211 360 107 103 361 49 109 185 345 82 -166 -368 23 132 190 112 281 266 228 -156 -65 551
4423 551 263 285 -108 -229 216 56 207 27 7 -46 177 -251 -126 324 32 132 60 -259 -158 181 -17
4444 -17 -393 109 -5 -140 -68 -119 116 30 13 110 56 -20 2 294 98 121 -188 -234 -41 -104 -36 -70 81 -295 14
4469 14 -103 -21 -53 20 17 -274 -401 -183 -172 127 -183 101 401 141 -694 234 -369 -51 -537 166 219 -422 -208
4492 -208 153 463 109 -308 -155 25 -75 -226 227 -185 -47 64 24 -61 -121 264 256 167 -9 140 -251 -94
4514 -94 -275 -94 -41 23 4 95 67 263 -161 -32 -116 -416 334 104 102 -87 -336 78 82 244 24 177 -29 270
4538 270 79 -20 -37 293 116 155 -25 102 -58 120 324 -349 72 -84 193 36 33 -20 3 -109 32 47 -160
4561 -160 13 103 -99 -257 -72 16 242 140 -45 -175 136 -197 -69 -16 -284 -121 -52 -53 -297 -196 -378 40
4583 40 175 21 -98 -112 -508 -72 -91 230 18 -197 -285 -183 -209 -153 54 73 -93 -127 -7 13 -45 -60 -35 -77
4607 -77 86 -27 -88 -105 -97 45 58 -21 -316 -73 164 -13 182 -111 121 -26 48 104 -129 346 -316 -305 -71
4630 -71 70 155 -70 177 -37 -18 -89 254 172 264 -74 -152 13 168 -163 342 9 -297 103 71 255 237 368
4653 368 324 -241 -13 172 63 -105 88 214 29 -224 -169 274 494 -1 245 -161 48 -82 82 221 -46
4674 -46 -230 -20 -271 -323 -182 242 62 102 88 -134 35 -39 9 161 14 28 4 -148 -21 -4 24 -75 -289 -457
4698 -457 -32 -338 14 84 236 -92 -505 -144 -255 -240 -113 -68 -288 -370 -36 118 235 -274 -135 -141 -77 -200
4720 -200 -208 -94 -203 188 -116 -465 145 -254 -129 122 -21 -169 -68 -184 -98 76 -15 10 -151 -43 78 48
4742 48 18 8 -252 -237 167 -11 7 -130 399 37 -134 -20 -190 55 367 -104 152 -75 -34 194 84 312
4764 312 122 -259 80 -8 212 181 419 -48 1 22 -335 -63 24 316 66 -22 -30 378 105 -2 -98 83 -263
4787 -263 109 123 44 88 102 51 -179 -65 -215 -279 -156 -97 194 -120 107 -198 6 117 161 113 -210 19 -82
4810 -82 8 19 52 193 64 -375 -191 53 -125 10 -21 -83 -142 -144 -258 -225 83 -20 -112 -169 -355 -154 19 -74
4834 -74 -110 -82 -173 -49 -66 -66 51 -166 34 -286 -17 -86 -348 -83 -33 -55 218 33 113 -229 68 4 310 -184
4858 -184 -68 94 -156 775 -191 47 -190 -77 -102 -373 60 436 961 3 -722 -144 -149 -540 -612 -109 -370
4879 -370 844 -449 1003 4 -75 221 281 431 -18 444 -231 132 121 -109 -91 570 -156 -265 108 -45
4899 -45 178 429 191 328 135 -160 -131 32 -268 -49 -115 145 118 158 -556 143 -107 479 231 -207 141 -177
4921 -177 -397 -490 143 -81 -2 -8 80 239 150 83 -294 -20 653 364 324 1221 -268 646 -576 -539 -481 -337 211
4944 211 -152 66 43 -167 -193 16 55 -93 -161 -431 -287 -244 -57 -28 60 -91 18 100 -73 -33 132 168 -79
4967 -79 -17 101 -37 -316 -185 -118 58 -145 -339 93 284 164 2 -20 -299 -188 -132 140 22 289 -109 50
4989 50 143 61 152 -41 106 16 49 -129 61 20 323 -60 40 -159 -88 178 56 -2 -57 65 40 -133 223 286
5013 286 30 142 44 326 236 -85 -90 141 151 -71 252 204 17 24 425 394 108 -141 -200 -46 142 -145 -12
5036 -12 145 43 19 103 71 -168 -159 14 43 -81 -35 46 82 123 -103 -83 -130 -95 129 11 -26 6 -214 -185 142 103
5062 103 20 105 -41 -252 -175 -124 185 -258 -323 -65 -230 -427 -187 185 26 -192 231 -200 -120 219 204 175 -269
5085 -269 -28 -58 -56 -324 -109 262 53 168 25 -301 -155 -21 59 76 -280 -363 77 -47 194 10 -53 44 -137
5108 -137 48 -202 277 268 106 -39 -99 -246 315 16 55 92 -245 -77 -118 270 7 -11 -4 -49 -60 82 117 135
5132 135 64 -154 127 17 5 125 6 252 42 1 -290 -81 177 -33 7 52 208 108 384 49 380 96
5154 96 33 30 -250 -83 14 -65 19 -239 43 -135 -34 -78 18 83 -93 142 75 146 -101 -71 19 -95 -78 -142 -50 -43
5180 -43 125 55 22 -20 -84 5 256 396 -5 241 -199 24 52 55 74 162 128 -25 136 10 21 -59 67 18 -81
5205 -81 -115 -213 130 -96 -329 9 199 171 -47 -123 -32 -58 -195 -75 -104 -205 401 20 -178 151 -51 -89 -132
5228 -132 -146 46 91 50 -213 -406 39 41 132 -186 -118 170 -20 -5 -107 353 136 37 -59 -184 197 7 221
5251 221 -54 -19 -150 -22 267 0 407 94 99 -54 -193 -31 20 250 71 258 183 63 126 -24 152 -272
5273 -272 18 75 432 332 168 197 2 -5 269 543 94 183 383 276 130 -142 -202 161 263 237 -257 -117
5295 -117 13 -55 264 225 325 168 -148 -37 25 -24 176 11 24 41 -76 -192 137 -1 -323 -40 272 -124
5317 -124 -173 250 253 229 -133 -202 53 43 -162 235 -314 -122 -232 107 116 -255 111 -145 -405 77 -39 -118 -233
5340 -233 284 19 56 154 -159 46 -211 82 -21 -260 -174 155 123 142 116 139 75 -165 140 -56 -276 300 -135
5363 -135 93 -117 -138 106 -141 244 66 -96 21 -183 9 -115 103 -339 35 -217 -405 -43 -51 129 171
5384 171 15 -124 -125 -65 -204 -52 -17 -230 86 -99 -194 -12 151 357 74 -58 -106 -80 -179 305 -206 -214 -41
5407 -41 -5 91 129 -20 -130 -81 -92 -188 57 179 -111 124 -92 -429 -208 -62 44 203 114 -204 139 -38 153
5430 153 208 -145 65 -219 -161 6 134 116 -33 20 67 -60 164 -161 -100 172 -3 100 -92 120 178 148 134
5453 134 86 253 13 -195 259 -99 -19 -151 -1 208 135 63 170 24 88 -5 -177 -97 -105 149 -118 -301 -48
5476 -48 -182 -505 -492 41 131 9 -56 2 138 -41 -35 138 -96 89 160 -108 67 -92 -8 85 -130 -175 -62 -102
5500 -102 -45 -263 -250 -368 -47 -8 -142 40 79 118 4 29 190 143 -109 49 -354 -261 291 -123 203 107 -202
5523 -202 103 50 17 -203 261 64 6 -176 -243 -21 28 143 -6 -40 -41 -128 -40 105 198 215 -10 85 6 4 377
5548 377 -45 122 124 76 -162 78 -15 -16 -81 -16 -36 225 152 119 65 -67 0 54 -134 16 159 -153 -54 -132 -99 274
5574 274 254 368 204 -130 165 -195 143 328 13 75 289 -182 -83 -145 142 211 41 -6 -315 81 -80 45
5596 45 128 -15 299 32 -76 11 -272 -146 -40 -87 -326 -209 152 -8 -151 -129 -386 -64 110 -123 -255 115
5618 115 -35 -143 -41 -185 -103 150 -221 37 73 -168 54 -292 41 -216 240 10 -10 118 -107 -232 -123
5639 -123 -8 -58 -294 -121 -72 42 -118 132 -207 -149 115 14 -39 207 207 -335 -140 -147 96 303 12 -201 305
5662 305 289 217 -290 -260 -40 75 171 -143 -211 -34 258 74 -154 123 200 327 52 120 -62 -94 -169 -187 40
5685 40 45 53 183 86 220 146 -87 55 248 306 -36 -11 89 244 18 -54 363 106 -115 17 -119 -205 399 272
5709 272 244 -69 -145 -266 -92 -278 199 -104 -118 -117 87 69 141 -126 -162 -168 -20 60 -82 -47 149 193 -278 89
5733 89 5 -71 -21 -190 126 91 112 -154 171 7 -92 1 -222 -61 -265 98 -110 -316 -9 225 -211 -54 -114
5756 -114 -210 -260 13 -166 -222 99 93 -317 -510 533 283 36 -117 -690 456 10 217 -198 198 327 -140
5777 -140 664 -375 -610 -778 -265 -141 226 660 -474 -528 -180 -371 336 4 -4 49 -203 -168 186 475 -733
5798 -733 469 -709 -385 318 -154 283 153 -203 281 335 167 129 17 77 94 -23 -134 129 -50 -136 -126
5819 -126 289 -113 154 -133 -41 42 317 178 173 174 74 -185 -87 -56 74 -103 -202 -110 376 117 106 6 -149 -11
5843 -11 128 -84 -26 -183 -184 -134 -107 -152 -308 -80 -61 -26 25 30 -180 78 -430 -122 -17 51 -304 -117 -144 -138 217
5868 217 93 -180 -393 -191 108 -5 -43 -212 -114 38 -222 -146 -159 -27 42 97 44 -175 215 -5 20 109 -77
5891 -77 -259 -102 123 -103 -129 98 -232 131 -87 -1 22 8 -20 4 -206 27 182 135 -145 -85 -25 85 -47
5914 -47 -35 55 24 167 -169 29 -146 -44 111 85 -82 89 -104 20 -93 -84 -6 -227 46 73 -91 -180 154
5937 154 200 132 211 75 152 -176 58 -220 279 -76 -170 -77 83 12 -206 96 3 -18 -224 218 115 50 -85
5960 -85 -118 299 -31 -29 93 86 -13 -359 -188 -85 79 -120 -355 12 80 -21 -47 -97 115 15 -67 -407 99 -94
5984 -94 90 154 -62 262 160 36 -91 -68 26 5 84 104 -107 -129 -149 160 94 -237 -173 -175 77 -8 472 68 55
6009 55 -391 -50 -134 -22 268 66 132 -389 -85 -156 -27 -295 -164 -179 -36 -78 76 -297 -202 -67 161 116 1
6032 1 66 -34 355 47 70 62 69 305 213 36 -3 131 225 -150 194 21 -57 106 -244 56 -150 65 132 76 200
6057 200 50 179 -95 223 123 -14 -316 223 -47 159 -20 273 -62 135 22 115 219 -170 182 -130
6077 -130 16 -59 107 32 185 325 -22 8 -83 262 200 72 86 62 19 303 -4 339 214 -198 -92 2 96
6100 96 -101 -190 77 152 -148 -51 -167 -7 49 -43 -315 -83 -7 -146 120 5 -99 -272 -125 -124 26 -177 252
6123 252 -145 128 38 26 179 -237 -116 -47 -11 -36 -189 -146 -146 -1 -1 205 -168 -325 74 19 -22 -81 -117 283 -388
6148 -388 -297 -5 57 -34 -81 32 124 -140 255 6 47 -103 267 -149 72 -156 -132 187 171 265 243 -74 -169 275
6172 275 27 252 183 115 83 378 66 -51 145 -273 -341 -1 189 -39 -95 297 -359 4 -23 -172 -103 108
6194 108 -45 -146 -103 -132 198 17 76 110 -66 38 -55 5 197 61 -65 17 181 74 -79 -314 282 -183
6216 -183 3 210 59 -3 -70 12 193 25 -12 113 -20 -38 115 78 7 137 -191 53 79 198 -8 -143 -125
6239 -125 -114 -40 89 170 -99 125 20 126 154 133 -58 148 210 19 -233 -135 15 -322 -257 -3 -231 -152 -75
6262 -75 -184 -117 35 -61 -199 -21 -10 30 140 -58 -261 -137 24 60 -115 47 133 106 -42 -266 3 -71 -227
6285 -227 -149 126 0 264 279 209 -100 -67 167 7 221 -26 -36 16 163 -277 246 75 26 -5 65 145 33
6308 33 10 190 237 -281 311 -177 -70 -274 -33 209 86 289 -231 176 -49 195 258 -168 164 13 -143
6329 -143 -118 -113 -9 -236 -62 177 -89 1 27 326 37 -42 -157 304 -245 143 -9 20 -135 121 -48 -144 -94
6352 -94 182 -55 -33 -147 139 218 -114 -190 71 181 70 -129 221 60 288 -171 280 103 38 23 234 -230
6374 -230 4 -119 -117 67 -59 178 52 -108 -60 205 -83 269 -8 -85 117 158 -97 -124 -140 -121 -21 95 12
6397 12 45 52 -42 109 106 213 -83 224 -292 -195 -175 45 -89 30 38 26 -151 -59 -151 347 26 230 39 -39 213
6422 213 127 -116 33 200 94 -81 -175 -58 166 -130 -184 -64 -44 30 67 119 55 1 -49 -23 -45 63 -151 73
6446 73 210 -23 -199 152 -36 -23 314 -24 -268 8 -5 -319 188 1 225 -117 -16 -37 137 171 -145 149
6468 149 -87 -120 -28 182 -131 136 53 103 34 -56 -8 94 -159 45 207 205 155 -34 43 -135 90 -66 -141 114
6492 114 -167 -143 -88 -197 -83 -26 150 404 41 20 97 -237 -27 -291 89 -24 -97 -123 135 -162 -254 94 115
6515 115 -227 -203 18 -150 52 12 200 -152 -151 -20 -44 -226 -219 195 175 -188 -99 -155 77 31 101 18 -227 -32
6539 -32 1 -123 20 423 113 213 80 124 -96 125 17 -280 32 -205 123 0 -207 166 42 132 -247
6560 -247 -10 195 11 139 -112 -85 66 -83 36 -135 264 -109 120 -48 31 -215 -310 -307 -270 -176 -162 17 -12
6583 -12 6 21 122 -193 66 -67 -115 -119 -302 234 87 -227 -60 41 306 20 -57 -248 83 -261 355 -18
6605 -18 -219 175 -247 -192 -176 32 -122 -8 -18 119 -218 66 5 -47 -2 -158 -172 68 -100 -99 -116 -312 52 -49
6629 -49 147 208 14 57 -229 -99 -166 -56 174 227 -331 -309 -142 54 137 -17 18 307 -48 62 -66 -17 -81
6652 -81 18 78 -108 217 64 178 -4 58 -11 95 87 189 -145 -80 -66 133 -57 141 178 -101 136 136 200 93
6676 93 -126 -5 -185 7 -158 99 172 96 -7 189 60 72 16 220 61 -181 -216 -61 -42 172 -314 -34
6698 -34 -147 72 127 -246 67 -13 13 -165 36 40 -70 -187 91 135 87 -316 182 190 132 -120 -203 -94 57 234
6722 234 -235 -330 -238 -87 -24 -248 -79 -86 -113 209 39 257 -117 109 -99 147 -106 267 96 -80 79 -169
6744 -169 -216 159 -67 9 -64 -86 186 -138 -85 -149 -149 70 18 -164 -84 -235 -9 -224 -439 -3 289 12 -83 -154
6768 -154 34 -23 137 279 26 -246 41 -93 -176 -134 -187 197 -30 -393 45 1 1 179 -92 48 -70 -63 -20
6791 -20 -69 -108 -31 -9 -39 232 140 65 29 -474 -82 105 0 126 220 118 68 -27 -171 130 -119 114 68 -316
6815 -316 128 -129 163 213 -50 -45 -138 -286 -41 22 -202 120 116 31 -26 -71 -235 235 223 172 108 -196 138 25
6839 25 210 -189 -136 -169 128 125 -133 142 -4 -267 405 -158 22 223 227 207 -293 183 -42 197 -187 147 -97
6862 -97 -345 111 -273 -18 -51 188 46 282 -122 -512 742 47 -182 -242 -137 46 201 -296 134 498 -62
6883 -62 -101 -356 252 289 287 133 -32 12 306 209 -155 11 -28 -15 174 -172 -25 188 135 17 55 88 106 -449
6907 -449 -314 376 -1 117 -308 60 276 -80 41 542 156 374 -395 117 -185 128 32 -14 256 -43 -310
6928 -310 317 -295 8 284 -133 215 -118 173 52 465 152 -292 -95 8 -194 -194 54 118 109 -311 -160 86
6950 86 219 -227 -61 181 -28 -53 135 31 -37 -264 677 -59 183 236 303 -163 -304 -65 110 232 168 97
6972 97 -170 -141 54 -77 227 357 90 324 203 -93 -66 34 199 31 124 -24 -216 201 119 -175 102 -40
6994 -40 202 91 35 -18 128 180 139 219 -71 163 -172 -115 36 -237 315 -52 -170 406 173 109 -54 -3 -46
7017 -46 -37 92 267 245 -219 108 -123 12 -139 107 96 37 25 -171 -330 74 154 -206 1 -5 -215 -40 -35 20
7041 20 -59 43 76 55 -51 -184 -330 74 163 -75 -79 -55 212 -103 16 -197 -239 48 -10 228 41 50 176 131
7065 131 179 281 -14 198 83 -95 -273 35 -131 122 131 -67 124 -129 -252 -65 -2 110 86 129 -137 -130 214
7088 214 42 98 -78 -18 104 336 127 -68 -85 282 -38 -179 -209 -71 -17 -55 466 37 146 25 -12 25 -104
7111 -104 -141 188 89 -124 5 -167 -59 -260 17 142 111 -17 184 -51 -45 -284 48 -77 14 -6 -21 32 -135
7134 -135 64 -108 190 43 -222 22 106 -41 617 226 -307 131 -430 -291 44 78 -154 44 1 -383 -225
7155 -225 -2 -130 -143 -33 33 -255 214 -79 -175 -34 -407 184 -34 -80 -52 -54 186 197 -86 -139 -125 -53 -128 58
7179 58 127 -181 20 -15 -153 152 -52 43 -341 197 -187 -7 18 -5 135 -138 49 57 29 233 109 122 55 -230
7203 -230 -89 14 -286 208 -148 -41 -22 -69 185 -130 115 18 180 -200 -305 266 123 -9 -18 -220 79 -44
7225 -44 -172 -81 274 188 381 -1 -304 -1178 -970 -221 651 119 249 172 -46 -250 -192 132 -92 138 212 17
7247 17 -155 91 -95 202 -141 32 192 66 388 -251 78 -37 -100 416 169 326 -175 98 42 226 230 52
7269 52 122 -138 -81 120 231 46 6 253 275 -194 186 -112 -177 168 119 -314 43 144 -235 -49 -27 -79 109
7292 109 -89 -84 185 -16 56 70 163 -88 -146 -246 84 -156 66 112 -30 66 -36 -241 -127 -247 -111 -141 -224
7315 -224 87 -389 -136 -97 137 -2 -365 -10 -82 -26 -123 -109 73 159 -94 -23 -131 -151 5 10 71 -218 79 -151
7339 -151 147 -36 33 -37 6 -121 -311 421 -36 219 -218 -95 196 243 -110 23 137 123 167 125 137 -152 80
7362 80 170 199 124 -95 130 338 105 141 311 -13 262 79 -179 70 58 238 45 80 -165 265 339 -30 -248
7385 -248 95 -41 214 -61 -216 -98 47 237 -215 -47 -197 -159 -202 133 -61 -26 293 76 -105 -192 -117 -282
7407 -282 103 -73 43 -34 224 38 -191 116 -199 305 62 -211 -65 -75 -285 -66 -100 78 -259 -88 -38
7428 -38 -363 2 -252 -15 64 -306 -115 -158 231 78 -295 30 21 219 -255 -272 -24 -114 216 54 -124 -102 59
7451 59 55 124 87 -123 -173 97 75 148 276 22 13 -3 128 321 155 218 237 104 -133 -21 -12 -2 151 71 -85 211
7477 211 54 183 -3 -37 25 -215 -145 298 64 329 67 162 404 -38 -113 -58 183 -112 104 4 38 69 139
7500 139 -105 87 120 -27 -88 35 -21 -73 -395 169 -7 -6 -30 -12 -94 -7 -38 -84 -23 277 -235 -76 -37 20 -88
7525 -88 -63 -265 -24 -139 -71 -215 -29 150 -412 88 -29 -305 -81 -148 -80 -19 179 130 -160 -9 123 134 5
7548 5 -111 -256 -133 -182 -241 -2 149 -21 -157 -128 351 -24 -64 -149 -272 108 -103 -254 -229 -168 -27 -6 85 -118
7572 -118 221 85 96 -118 -21 -121 -207 96 358 78 -119 112 23 -171 -35 156 -122 -102 -92 -29 158 -13
7594 -13 87 -104 80 46 -285 -75 -46 103 67 265 153 -68 90 143 45 -48 -174 155 30 -29 -187 -41 206
7617 206 35 -244 92 -164 -140 -109 59 -74 5 -225 -112 27 -363 -141 78 190 163 49 110 44 -201 -98
7639 -98 270 -240 -310 -111 150 -57 325 -56 -281 -260 -23 -7 301 -102 -90 78 107 -72 -58 57 -51 -59 -10
7662 -10 251 7 -80 403 -266 -60 285 -302 66 64 -216 -9 57 -50 41 79 -111 -144 -8 -159 52 -212 148
7685 148 -91 -35 -214 61 173 80 63 -130 -112 297 -259 -219 -263 -775 147 61 112 -4 170 -67 95 80 -79
7708 -79 186 -87 8 -49 -217 60 -153 48 6 18 -64 24 -42 12 35 -52 -170 -315 124 -27 -76 -96 -5 94 55
7733 55 -54 -7 19 38 -204 -89 76 -106 -54 -137 -169 130 -1 -118 334 -109 158 -340 48 168 -139 4
7755 4 208 -60 186 91 51 56 -67 186 339 -232 -224 -110 -457 93 223 149 196 292 49 168 11 65 250 89
7779 89 326 -168 70 29 182 -55 230 -34 39 3 -77 -163 -57 -128 122 -31 -58 79 69 60 -129 -109 -114 -81 33
7804 33 -441 74 -426 -172 210 -134 -244 -246 -205 158 -80 69 22 43 259 -89 223 -124 115 -92 -191 -5
7826 -5 60 -25 137 68 -23 9 57 -36 8 79 -140 -63 -315 169 -70 -61 184 156 -205 84 163 -94 213 -39 -59 -180
7852 -180 -148 142 -45 19 -94 -104 228 -135 91 -392 -64 -92 6 34 -11 256 2 90 -256 46 -223 -71 25
7875 25 250 -142 330 523 -101 71 -335 27 -11 -41 44 -205 141 -167 126 -119 45 -79 127 53 210 84
7897 84 105 5 57 -125 276 237 -57 -71 -267 -22 60 172 96 -85 -11 -64 -258 -120 24 -11 -113 80 -42
7920 -42 189 94 154 -8 87 20 8 -74 -194 215 -259 -116 -171 -126 -24 239 76 208 -174 -64 154 196 -49
7943 -49 -75 -176 -214 -399 -45 -27 -25 41 -120 -50 166 -128 -2 194 -79 -117 235 -95 104 -122 55 17 50 278
7967 278 -19 -290 98 -322 -53 117 58 89 -77 155 295 -113 217 -20 -219 -136 -249 321 -39 -20 108
7988 108 -153 -191 381 123 -131 -20 389 94 -245 -28 -22 99 -31 -197 138 69 209 -148 73 86 87 61 -6
8011 -6 -68 -34 72 45 46 64 -126 -440 155 62 -53 -22 26 210 138 -196 17 102 146 -220 -57 5 -24 43 18 -42
8037 -42 -322 -162 1 -64 -30 306 -12 154 -68 -156 82 84 -139 -32 -186 -42 -285 -126 35 -73 -308 -225
8059 -225 278 -125 -120 149 -443 -187 79 25 218 32 -210 -60 -216 -185 284 -83 -190 18 179 101 -241 -1
8081 -1 -53 -153 -174 -50 -153 65 -67 62 160 -164 63 110 96 -173 166 -28 194 233 -60 66 96 -209 146
8104 146 -212 -28 228 199 -44 146 -166 -275 13 78 2 249 -49 147 71 151 142 -194 -9 91 -251 35
8126 35 197 -93 423 -26 80 -3 -5 -36 -128 107 -168 85 25 -46 109 -76 -23 -20 -170 -57 109 181 248 -63
8150 -63 100 -119 146 18 -140 148 -129 -79 54 -171 144 -64 -97 -18 174 -269 -206 30 -288 63 367 63
8172 63 42 -158 131 23 184 129 -16 23 -241 95 -170 -207 -66 37 -40 -39 109 78 -14
8191a4
$$ Imaginary data points
##PAGE= N=2
##DATA TABLE= (X++(I..I)), XYDATA
0 0 0 0 0 0 0 0 8 -8 8 -8 16 -16 24 -26 33 -40 49 -58 72 -81 97 -113 130 -150 173 -197 224 -256 288 -327
30 -327 369 -413 462 -517 578 -643 715 -794 883 -977 1082 -1199 1326 -1468 1628 -1805 2008
47 2008 -2238 2500 -2810 3172 -3611 4150 -4833 5731 -6969 8796 -11770 17457 -32307 152836
61 152836 349507 74243 -37106 49577 199225 160830 84893 83570 137670 97489 32106
72 32106 34441 105926 123823 89106 53471 51062 45773 56962 88061 103620 64608 24127 27428
85 27428 49940 37703 22957 51400 90946 59932 -21527 -51423 14603 92172 93617 25508
97 25508 -36376 -40510 9759 55016 40943 -16516 -41001 -5895 19060 -20089 -66401 -43136
109 -43136 15072 9913 -58332 -88844 -42055 1642 -20837 -64139 -65319 -40008 -33831 -48489 -57397
122 -57397 -52915 -41437 -29533 -32733 -60182 -84634 -61604 -7461 7022 -42893 -84964 -57123
134 -57123 -6710 -10765 -50515 -47976 -28 16900 -30233 -73491 -45596 22129 43574 -2868
146 -2868 -49513 -33974 19899 41680 8662 -28101 -10874 41847 55204 6025 -35161 -1545
158 -1545 67054 75742 9717 -42909 -12921 55079 71157 24874 -11548 3904 30691 20239
170 20239 -3567 5875 41458 44354 -1847 -37782 -11100 43702 50749 3761 -29076 -7179 30449
183 30449 30412 728 -14570 3659 30227 34093 10565 -15954 -14614 20301 50384 33009 -18221
196 -18221 -36456 6251 50319 32384 -19334 -29925 6704 24763 -4944 -33326 -15518 18411
208 18411 10289 -30122 -44651 -17487 6555 -6469 -33742 -36009 -12209 1910 -16325 -45196
220 -45196 -43539 -5591 22555 2937 -43422 -57238 -18236 25344 19516 -21680 -39303 -13923
232 -13923 12841 5358 -17397 -17823 7163 20108 -2751 -33526 -26797 15802 41913 15564 -30786
245 -30786 -37491 1865 32135 16521 -13519 -8597 20527 20676 -12599 -25640 10750 50054 37399
258 37399 -12513 -35318 -3534 40591 43815 11498 -11271 -2392 15910 15110 1172 -178 17291
271 17291 26447 3680 -29719 -28858 11140 39400 17268 -31174 -46634 -14211 18854 10556 -20400
284 -20400 -27221 -6018 4200 -15007 -34372 -21860 10941 20818 -7724 -39841 -33977 2808 24607
297 24607 7960 -20306 -23562 -2719 8308 -5217 -17912 -3861 18789 11098 -22712 -37744
309 -37744 -10584 25153 21607 -16722 -39882 -20493 10912 11718 -14105 -26046 -8130 10695 -865
322 -865 -27826 -30829 114 27058 13123 -23846 -35343 -7311 22166 17102 -9261 -17574 845
335 845 15391 2523 -15599 -6776 20025 25685 -1357 -27859 -18642 15991 31432 9277 -19696
348 -19696 -18087 7493 17964 313 -16103 -4118 18620 16512 -12792 -27548 -2927 30261
360 30261 28659 -5216 -26002 -9916 19909 24003 2674 -10788 2897 19575 11537 -10942 -13605
373 -13605 10697 30060 14336 -19757 -28230 -294 25600 15316 -14744 -24194 -5316 8492
385 8492 -3251 -21897 -17398 5919 12192 -12222 -35291 -25272 6225 19793 -2102 -29646 -27881
398 -27881 -1432 12882 -1442 -18264 -10573 8968 8781 -14265 -26121 -6141 21466 19490 -11127
411 -11127 -30072 -13754 13993 17086 -4918 -19530 -9272 6869 2578 -15984 -18803 3252 19549
424 19549 3988 -25750 -30267 -2207 22433 12545 -15858 -24613 -4214 13544 5589 -11332 -9934
437 -9934 9149 16079 -2155 -21448 -12474 16905 28799 7292 -18685 -16168 8844 21847 8432
450 8432 -8394 -3530 13445 14007 -4313 -12647 5754 27880 22698 -5875 -20973 -2920 26675
463 26675 30058 5617 -10953 -399 18800 18179 586 -4804 11588 25962 13523 -12156 -15075
476 -15075 10023 30025 18722 -9072 -19040 -2115 15407 10382 -6715 -8712 5054 10540 -4795
489 -4795 -20072 -10969 13588 21066 -1115 -24612 -18557 8664 21932 7307 -11786 -9266 7452
502 7452 12041 -1410 -10405 2403 20982 16854 -8050 -20941 -4201 20528 20954 -3251 -20738
515 -20738 -11565 7100 7542 -8778 -15783 -3609 5387 -6145 -26234 -27337 -4469 12197 -169
528 -169 -26834 -33733 -13617 6182 1932 -16236 -21001 -6924 2695 -6403 -18705 -10152 11856 17375
542 17375 -1944 -21112 -13166 13095 25357 10938 -7886 -5705 11235 17546 6583 -2186 7474
555 7474 21731 17368 -3883 -13789 4122 27701 26491 1549 -14700 -3631 15935 18823 4043
568 4043 -4762 4141 14249 7266 -7477 -6777 11449 23620 11116 -11735 -16634 2644 21699
581 21699 16175 -3051 -9885 1740 11151 3420 -7939 -3385 12588 15370 -3034 -19593 -10666
594 -10666 13554 21966 4768 -15759 -14310 3969 13636 3556 -7612 -2307 10726 8589 -7236
607 -7236 -14303 334 19408 16511 -6614 -19892 -6743 14224 16330 -647 -11847 -4586 7524
620 7524 3552 -10140 -12105 3964 14917 2745 -18201 -20431 -416 15257 6740 -13304 -17287
633 -17287 -2745 8747 1724 -9578 -5909 7937 11581 -2102 -14101 -6275 14166 21524 6629
646 6629 -9732 -5835 11901 19116 8808 -1797 3815 16206 15263 948 -5308 8003 23653
659 23653 20042 1026 -9856 191 17611 19571 5494 -4097 2202 12569 9973 -1150 -3755
672 -3755 8729 18444 9686 -9502 -12733 4750 19767 13778 -4387 -11519 -1337 9203 4675
685 4675 -5667 -5618 4912 8145 -5172 -18003 -11997 6205 12921 -2982 -22262 -21019 -2943 6270
699 6270 -4242 -17525 -14547 -2622 -2518 -16107 -23660 -11498 5424 2687 -18233 -30204 -18022
712 -18022 1904 4556 -10940 -22989 -16861 -5142 -5865 -16287 -17069 -5082 1984 -8747 -24724
725 -24724 -23961 -5457 7379 -1084 -18807 -21668 -8048 2025 -1935 -10478 -7807 2545 4671 -6161
739 -6161 -14111 -3954 15245 20142 5303 -9520 -5253 12805 23355 16243 5253 5707 14812 17184
753 17184 10720 7733 16506 26045 21607 6374 -1790 8875 24752 26334 11618 -310 3223 12715
767 12715 14403 6924 3260 9420 13770 5583 -7080 -6276 8655 19601 11655 -6934 -14137 -2407
781 -2407 12185 11390 -531 -6032 1186 6462 -3 -8846 -4616 9830 13822 -1971 -18932 -14204
795 -14204 5539 14273 2524 -13687 -14697 -3299 1652 -6270 -13543 -7759 1763 -2372 -17157 -23180
809 -23180 -11582 3808 1587 -15176 -25408 -17665 -4134 -3442 -12564 -16132 -9894 -4926 -11362 -20585
823 -20585 -17145 -2904 4172 -5933 -21538 -21414 -5919 5620 266 -12728 -14919 -4388 2275
836 2275 -3466 -10645 -6167 5947 8355 -2260 -12133 -7055 7643 14207 5939 -4220 -3275 5868
850 5868 10589 6056 2132 5922 11806 9941 1101 -2611 6908 17714 16079 3659 -3963 2232 13427
865 13427 14898 5198 -1035 4737 12483 9091 -969 -3013 8222 17549 11349 -3832 -8388 3631
879 3631 15791 13586 1632 -3547 3558 10006 6790 -1106 354 10016 12968 2068 -8381 -4605
893 -4605 9346 15285 4891 -8151 -7834 2950 7308 -240 -7747 -3014 4866 2093 -9922 -14956
907 -14956 -4990 7088 4886 -9953 -18054 -10237 1767 2463 -6585 -11788 -6151 -112 -3892 -11992
921 -11992 -10581 1248 7459 -981 -13823 -14023 -1399 8357 4308 -6850 -10309 -3047 2803 93
935 93 -4577 -3047 3612 5099 -3121 -11193 -6494 6331 11589 2387 -8730 -7998 1981 7637 3119
950 3119 -2599 43 5325 4058 -3415 -4881 4410 13144 10134 -1713 -8888 -1814 10674 13532 4117
965 4117 -3479 -953 6239 7044 820 -1596 5257 10896 4908 -6531 -7770 4258 13862 9590 -2767
980 -2767 -7210 -516 7559 5754 -567 -327 5296 6917 -343 -6456 -1138 10420 13454 2198 -9092
995 -9092 -6268 6337 12277 5039 -3583 -2300 4540 4906 -1701 -5015 1509 8791 5324 -6280 -10928
1010 -10928 -2901 7716 7776 -2581 -10168 -6238 1915 2138 -3524 -5425 -177 3758 -1505 -9670 -8867
1025 -8867 1947 8562 2403 -8428 -10616 -1981 5687 3613 -3479 -5198 -260 2995 -1815 -6918
1039 -6918 -3183 4971 7064 -1061 -9706 -7233 3682 8202 1721 -6580 -5712 1724 4290 -815 -4173
1054 -4173 -284 5871 4310 -4235 -8337 -1090 8562 8181 -1606 -7641 -3203 5013 5976 -688 -4165
1069 -4165 161 4997 1730 -5475 -5051 3021 8854 2975 -7127 -9093 -469 6664 3503 -4313 -5336
1084 -5336 -134 3497 -707 -5290 -3381 4210 5829 -1797 -8010 -5261 5117 9020 2089 -5248 -4253
1099 -4253 3104 5896 948 -3060 257 6026 4606 -2817 -6133 -90 8308 7578 -2376 -8015 -3256
1114 -3256 5058 5481 -1068 -4698 -1425 3406 1059 -5226 -5469 1304 5991 1567 -7041 -8249 -166
1129 -166 5966 3247 -4236 -6470 -867 3165 -116 -4255 -2359 3639 5149 -1559 -7567 -4505 4806
1144 4806 8102 1191 -6324 -5030 2626 6198 1555 -3207 -842 3791 3695 -2761 -4958 790 7743
1159 7743 6230 -2243 -6839 -1966 5502 5902 -314 -4216 -650 3407 2072 -3468 -3452 2086 5839 1092
1175 1092 -7518 -7933 181 6380 2887 -5327 -7321 -1769 2672 405 -4520 -3904 1244 2349 -3144
1190 -3144 -7414 -4108 3699 6004 -603 -7506 -5659 1777 5318 887 -3981 -2325 2405 2900 -2385
1205 -2385 -5076 -278 5656 3993 -4136 -7903 -3178 4425 4629 -1967 -6839 -4090 730 215 -3873
1220 -3873 -5047 -321 2380 -1303 -7276 -7190 208 5202 1665 -5704 -6590 -642 4273 2249 -2315 -1918
1236 -1918 2927 4953 387 -3757 -447 7432 9325 2621 -3794 -2155 5729 9811 5226 -751 37
1251 37 4356 5277 1464 -621 2641 6932 4987 -1717 -4854 -226 6255 5838 -895 -4967 -2048 3107
1267 3107 2836 -1586 -3217 861 3396 -51 -5553 -5205 1758 6562 2914 -4971 -6746 -730 4960
1282 4960 2722 -2337 -3435 276 2522 -617 -3908 -1774 3896 4957 -1542 -6982 -4378 2830 5539
1297 5539 1964 -4321 -4518 666 1568 -1720 -3784 -1082 2362 676 -4913 -7241 -2134 3458 2988 -2822
1313 -2822 -8242 -4852 933 1430 -2557 -4401 -1815 1171 -1497 -5412 -4413 1874 5132 1025 -5192
1328 -5192 -5581 624 6413 4334 -816 -1850 1806 4589 2459 -334 1875 6750 7697 2410 -2148
1343 -2148 102 6867 9697 5079 -623 -428 4185 6516 3995 1612 2841 5452 4048 -645 -2544
1358 -2544 2420 7406 5750 -701 -4588 -1256 4565 5214 531 -2290 -124 2393 1287 -2120 -1748
1373 -1748 2795 5585 1852 -4804 -5237 602 5790 3777 -2019 -3788 -446 2009 635 -2493 -1349
1388 -1349 2002 1975 -3545 -6954 -4077 2143 3854 -1538 -7161 -6627 -1533 704 -2451 -5016 -3853 -1700
1404 -1700 -2105 -5906 -7130 -2753 1814 317 -6031 -9189 -5189 297 1586 -2478 -5681 -3966 -639
1419 -639 -1374 -3862 -3660 206 2676 -831 -5549 -5244 717 5440 2763 -2643 -4296 -632 3274 2251
1435 2251 -216 138 3014 3669 211 -2782 157 5937 7030 2057 -3026 -2026 3915 6470 4061
1450 4061 353 507 3309 3025 312 -338 2887 6636 4558 -1061 -3565 376 5931 5861 829 -2259
1466 -2259 -806 2547 2696 222 -125 2601 4067 883 -3691 -2828 2995 6414 3360 -2529 -3712 171
1482 171 3728 2468 -394 -1126 1203 1292 -1615 -3362 -882 3544 3699 -1196 -5552 -4208 698 2834
1498 2834 55 -3734 -3300 -1050 -486 -2545 -3301 -1187 1407 -431 -5127 -6468 -2385 2191 2337 -2583
1514 -2583 -5432 -3942 81 638 -1619 -2671 -644 1250 -616 -3858 -3587 1075 4266 1521 -3495
1529 -3495 -4910 -960 3025 2447 -989 -2285 227 1854 -122 -2611 -214 3676 4333 -317 -4117
1544 -4117 -2002 3324 5288 2031 -1952 -1424 1740 2770 425 -742 1411 4095 2640 -1685 -3327
1559 -3327 820 4949 4591 -44 -3079 -796 3092 3259 222 -587 1127 2700 255 -2171 -1522 2560
1575 2560 4860 1846 -2948 -3463 777 4057 2700 -466 -1417 155 1655 110 -1356 -248 3052
1590 3052 2839 -1057 -3956 -1835 1867 3790 713 -2907 -2450 2 1276 -441 -1686 -551 1444
1605 1444 394 -2706 -4088 -834 2846 2727 -1819 -4883 -3140 723 1913 -494 -2303 -1248 797
1620 797 23 -2585 -2321 895 2893 576 -3602 -4239 -359 2935 2262 -2020 -2974 -761 859 -444
1636 -444 -2098 -671 2156 2428 -1178 -4123 -2214 2578 3944 811 -2674 -2563 1022 2531 1536 -574
1652 -574 85 2122 1332 -1460 -2034 572 4154 3065 -1037 -3316 -1059 2712 2959 398 -1246 -380
1668 -380 1111 81 -1585 -640 2080 3537 539 -2851 -3296 650 3490 2169 -1291 -2106 104 1813
1684 1813 861 -544 331 1881 1508 -989 -2442 -884 2925 3692 1071 -2624 -2354 794 2504 1124
1700 1124 -1109 -573 902 695 -1248 -2273 476 2826 1587 -2071 -3980 -1713 1660 2412 -648 -2700
1716 -2700 -1807 372 -137 -1945 -1877 222 1416 -759 -3538 -3401 424 3049 1175 -2670 -3361 -732
1732 -732 1229 606 -1089 -806 762 1305 -1192 -2465 -838 2369 2782 -121 -3413 -2331 1221 2651
1748 2651 1014 -1278 -1307 509 619 -789 -1440 550 2212 1189 -2147 -2936 -695 2472 2447 -502 -2195
1765 -2195 -1319 817 956 -447 -776 966 1490 -556 -2608 -2170 1291 3451 1070 -1867 -2690 -204
1781 -204 2296 1502 -308 -1002 833 928 -558 -1100 218 2396 2361 -446 -2578 -1618 1562 2933 839
1798 839 -1342 -1346 778 1065 -206 -708 230 1355 805 -1934 -2762 -294 2462 2046 -839 -2901 -1781
1815 -1781 656 965 -561 -1184 -227 655 -312 -1709 -1439 1372 2486 529 -1920 -2445 208 2450 1927
1832 1927 -494 -995 335 960 28 -928 217 2055 2141 -582 -2522 -1306 1826 2735 428 -2056 -1990
1849 -1990 -9 1007 -63 -1082 -658 834 -25 -2172 -2561 -699 1615 1059 -1955 -3217 -1743 836
1865 836 963 -670 -1863 -1049 25 -509 -1760 -1280 909 2050 66 -2448 -2327 583 2408 1504 -695
1882 -695 -1708 -10 1054 607 -607 -88 1367 1504 -686 -2185 -875 1815 2483 642 -1714 -2011
1898 -2011 406 1304 565 -866 -339 582 358 -1229 -1703 59 1797 950 -1990 -2838 -1234 1234 1574
1915 1574 -256 -1733 -1068 605 120 -746 -609 920 1834 334 -1667 -1295 1205 2884 1854 -835
1931 -835 -1419 451 1898 1478 321 528 1495 1425 22 -1160 237 2045 2414 307 -1283 -1111 1353
1948 1353 2123 923 -559 -405 461 257 -702 -895 556 1291 803 -1562 -2243 -707 1658 1766 -363
1965 -363 -1660 -1487 297 109 -411 -543 333 945 -495 -1849 -1664 665 1561 683 -1778 -1974 -414 783
1983 783 803 -602 -963 -260 -21 -677 -1461 -606 1423 1376 -591 -2412 -1266 557 1765 54 -1497 -1253
2001 -1253 -295 430 -545 -686 390 1329 271 -1542 -1721 -75 1862 2086 -274 -1553 -716 1347 1512
2018 1512 430 -86 651 1367 618 -633 -259 1747 2879 1703 -443 -820 885 2246 1970 497 -46
2035 -46 946 1306 683 151 876 2295 2108 136 -1426 -370 1778 2397 960 -965 -288 856 848 408
2053 408 -299 318 1385 785 -866 -1217 177 1983 1640 -423 -1701 -942 1007 1137 183 -378 271 465
2071 465 -397 -942 -350 932 1785 343 -1336 -1727 287 1254 1389 -783 -1123 -589 355 -164 -1082 -139
2089 -139 809 322 -1512 -2207 -1496 715 1135 -60 -2144 -2131 -593 104 -641 -630 -738 -333 -908 -1613 -1819
2108 -1819 -232 1439 1304 -1144 -2273 -1293 872 925 46 -612 -498 294 9 -385 -149 1191 1635 18
2126 18 -1344 -936 747 2334 1567 202 -634 24 797 664 481 888 1478 1035 -262 -885 43 1676
2144 1676 2277 633 -895 -772 866 1957 1304 612 288 619 837 -479 -528 1019 1724 1325 -591 -1818
2162 -1818 -182 1355 1419 483 -436 -458 223 234 -232 88 989 1230 4 -1529 -912 431 1438 975 -912
2181 -912 -1673 -792 306 559 -77 -273 148 -20 -1146 -1606 -888 689 867 -799 -2286 -1778 -283 421
2199 421 377 -929 -1521 -547 -966 -1127 -931 -55 806 -36 -1728 -1960 -1060 583 811 -609 -1257 -1111 -236
2218 -236 -220 -717 -355 95 230 -701 -1434 -1402 403 1385 392 -974 -1649 -720 462 662 13 -278 248 -151
2238 -151 -510 -814 -41 1209 1307 21 -1615 -829 229 1453 850 -198 -429 -167 318 70 -208 554
2256 554 1008 419 -851 -1265 53 1534 1402 170 -1155 -985 -57 343 167 -182 155 622 -446 -877
2274 -877 -642 809 1459 688 -1046 -1277 -65 907 1103 461 -568 -319 -17 -210 -305 224 1275 715 -164
2293 -164 -1354 -761 527 1754 565 -824 -947 -102 188 24 -187 327 605 -192 -962 -1157 70 1278
2311 1278 1113 -296 -1175 -754 140 723 364 -124 159 -43 -291 -569 -189 1087 1274 116 -896 -1303
2329 -1303 -39 903 798 123 -690 17 -75 -257 -53 303 517 -113 -660 -1036 -629 403 738 242 -588
2348 -588 -1045 -658 -149 249 -166 69 -89 -483 -878 -922 109 1066 735 -416 -1463 -1061 421 840 416
2367 416 -620 136 26 -89 -578 141 914 1256 342 -769 -556 493 1609 1247 204 -205 -103 74
2385 74 833 469 485 1009 840 -133 -660 -114 960 1054 428 -691 -962 -91 509 413 -75 -53 250 -284 -807
2406 -807 -610 161 1154 524 -651 -1246 -262 469 780 589 -220 -113 -101 156 376 244 764 823 407 -805
2426 -805 -517 373 1313 983 126 -255 -150 568 288 495 392 493 164 -383 -444 -10 981 750 130 -964
2446 -964 -1190 -26 546 345 34 -393 73 -452 -548 -492 -138 842 390 -705 -1342 -319 426 525 436 -1134
2466 -1134 -532 -332 481 -110 414 267 220 117 -809 -689 325 938 444 -692 -960 -144 222 631 48
2485 48 24 87 -49 -280 -571 -58 994 607 122 -490 -553 224 687 622 -102 -332 9 305 -96 67 703
2506 703 756 128 -424 -711 -105 723 830 276 -461 -164 135 545 494 329 540 263 121 -271 -54 742 717
2527 717 440 -259 -392 -295 22 252 81 -524 -162 36 -193 -302 -111 429 343 -471 -934 -826 49 520 53
2548 53 -498 -683 -388 -430 -191 -62 151 106 -277 -558 -672 -195 607 647 -12 -801 -727 551 186 139 309 18
2570 18 214 -332 -253 -180 338 849 176 -406 -657 -106 653 584 231 -541 -528 -141 -293 -387 -186 228 -120 -331
2592 -331 -595 -820 116 469 179 -692 -912 -422 -192 189 -101 -40 -6 -152 -554 -603 -80 540 251 -217 -606
2613 -606 -375 195 280 9 -195 -113 -149 -111 -203 123 413 661 -40 -371 -664 5 687 557 270 -326 -327 -156
2635 -156 279 206 231 425 22 -410 -697 -92 455 727 321 -378 -759 -246 342 221 206 -204 -448 -305 -335
2656 -335 -286 54 531 379 -568 -627 -331 75 369 224 -254 -324 -314 -72 -63 77 467 155 -230 -554 -174 362
2678 362 775 391 -310 -706 -339 36 167 257 -174 -100 -128 -838 -521 -315 395 192 -51 -839 -541 -235 225
2699 225 380 -40 -310 -223 54 12 -4 -46 193 46 -239 -574 -274 320 652 323 -194 -503 -333 165 128 60
2721 60 -142 -44 -611 -762 -297 208 636 27 -428 -767 -507 -57 73 -172 43 -581 -534 -469 -391 279 63 259
2743 259 -361 -689 -500 124 387 242 -245 -333 -384 -175 -7 -255 33 -34 -380 -435 -440 75 541 664 -194 -314
2765 -314 -243 149 119 198 278 201 -232 -94 -226 146 448 516 117 -393 -352 -143 708 703 160 272 -113 -246 -40
2788 -40 105 427 191 178 -345 -444 -295 233 546 415 -474 -266 -456 -322 245 111 128 96 -164 -341 87 276
2810 276 538 639 -223 -383 -11 299 691 429 289 120 -39 -170 111 499 210 425 154 -562 -324 130
2830 130 432 614 109 -61 188 -195 17 316 502 144 272 -342 -307 -140 532 438 359 -7 -595 -184 139
2851 139 167 303 42 -261 -202 -331 -137 454 442 94 55 -467 -89 30 404 -27 71 -71 -3 175 80 430
2873 430 450 555 248 7 -365 314 819 691 -21 -284 -249 -213 227 125 244 534 -17 -443 -148 244 704
2894 704 333 250 -411 -541 210 242 520 130 -113 -111 149 0 350 662 684 490 167 -94 -94 806 802 554 -144
2917 -144 -220 1 153 591 559 437 183 -76 110 -91 340 683 465 -157 -49 -214 -157 394 220 88 329
2938 329 91 -296 -200 402 271 621 37 -268 -519 292 493 92 207 -100 14 189 191 -10 347 274 121
2959 121 -437 -23 -128 244 404 271 -243 -99 -211 99 86 100 124 103 43 -484 -103 314 399 190 -235 -464
2981 -464 -374 -191 32 337 152 -77 28 -168 26 251 597 9 -69 -167 -452 -269 649 436 -103 -48 -256
3002 -256 -202 -241 -104 319 317 -93 -362 -465 8 650 518 -7 -325 -318 -43 51 206 244 30 -186 -213 -339 -61
3025 -61 108 96 137 -553 -530 -196 -7 60 -229 -326 -470 -443 -98 -194 -166 179 15 -339 -567 -435 -18 36 150
3048 150 138 -312 -342 -155 68 63 378 145 42 -443 -211 18 264 597 -134 -499 -141 -240 -94 276 14 -149
3070 -149 -236 -383 -230 -169 429 -55 -161 -285 -269 -310 90 274 412 -71 -296 -374 -162 -211 -301 108 -255 -178 -407
3093 -407 -436 -130 308 -212 -240 -668 -423 -187 340 -142 39 -118 -349 -405 -577 -117 116 171 -227 -337 -57
3114 -57 -70 167 302 -89 -109 -350 -222 12 -6 328 68 -4 -300 -352 -308 326 5 88 -392 -328 -248 -84 -71 306
3138 306 -189 -22 -286 -534 -384 -169 -79 -33 -533 -681 -580 -67 -117 -24 -129 -382 -206 -224 125 154 103 -209
3160 -209 -82 -119 -248 113 131 367 334 -124 -16 -156 214 9 384 -108 200 -155 -112 123 352 252 161 -492
3182 -492 -633 -48 6 426 44 -186 -270 -235 -192 80 0 34 151 -267 -439 78 -66 5 258 -201 36 52 -140
3205 -140 224 378 56 283 -187 -144 -98 253 403 285 -198 -239 -79 -59 376 391 496 12 -52 -168 -209 357
3227 357 73 -35 -158 -464 -336 -136 14 228 349 -103 -240 -204 95 344 204 -21 -121 -501 -136 -69 -25
3248 -25 238 143 -63 -62 -79 158 75 287 204 103 -42 45 -170 21 493 64 -280 -209 -265 40 485 98 -289
3271 -289 -251 -196 -306 191 139 168 58 -530 -240 -457 -281 297 -385 -91 -123 9 -75 -187 58 70 -100 75
3293 75 -300 -351 82 -112 -108 -24 -294 -192 140 163 579 252 277 22 203 -116 203 -117 282 112 57 -207 -35
3316 -35 225 93 171 266 -13 227 159 228 217 206 -43 19 -187 -265 435 435 266 -7 -96 -513 370 5 268 180
3340 180 331 -141 87 -146 -5 335 269 100 -90 -169 131 219 26 -214 -207 -155 -178 124 164 207 211 -199 -342 -87
3364 -87 -28 111 248 127 -349 39 -60 -62 4 265 -361 -236 -279 -215 -115 187 47 47 -200 -421 -326 75 30 47
3388 47 -369 -327 -52 -180 -73 279 264 326 -334 -428 -132 288 257 -39 -137 -86 -90 -260 -126 -128 277 -254 -196 -65
3412 -65 -23 138 212 155 -355 -225 -327 -120 81 14 112 28 162 -259 -37 166 225 -20 -42 -68 68 82 334 425
3436 425 123 71 57 114 177 142 78 173 228 -122 -332 34 527 288 28 -110 -40 41 159 107 205 52 207 -113
3460 -113 -189 148 115 324 202 -276 -27 -9 96 238 140 70 54 -313 113 191 212 366 76 -440 -166 -354 -160
3483 -160 238 129 129 -308 -76 -212 16 66 385 3 -240 -201 -102 -445 281 -42 -180 -398 -275 32 -247 -109
3505 -109 325 48 -239 -264 -145 -131 -66 -135 -58 -194 -491 -304 -158 24 25 -397 -36 -174 -293 -84 162 123 140
3528 140 -333 -175 -248 71 165 -203 -154 -198 -131 145 73 96 321 4 -109 95 -94 251 371 536 49 11 -26
3551 -26 335 400 405 126 236 111 45 12 321 138 -20 359 -50 -47 252 200 204 253 -10 163 118 157 431 615 487
3576 487 -151 -109 102 143 389 339 278 113 123 -37 98 328 81 -22 -35 45 83 -7 343 265 50 -173 -7
3599 -7 119 34 370 197 30 108 81 71 140 383 102 58 -92 -295 -200 24 388 55 213 -319 97 -331 87
3622 87 -13 189 -120 -490 -452 -230 -243 5 -92 390 -483 -593 -506 -191 -115 10 -124 -212 -231 -437 -174 -33 -64
3645 -64 -339 -365 -230 -57 -87 97 -12 -82 -283 -204 -186 -58 47 237 96 -73 -332 -40 235 27 339 -37
3667 -37 -57 7 -131 155 193 57 76 -276 -432 -3 181 242 251 211 20 -19 -43 19 161 145 -46 -234 15 -67 77
3692 77 209 259 234 -148 -280 292 179 416 452 -156 139 120 229 294 521 90 -99 -43 -138 201 313 360 306
3715 306 98 -82 221 57 620 183 45 -242 -79 -252 158 -36 -242 176 -86 174 -386 -82 217 355
3735 355 -69 -412 -335 -330 117 244 221 -294 -245 -13 -305 -475 22 321 -181 -153 -285 -286 -171 42 -160 -149 -241
3758 -241 -696 -130 -41 48 -100 -40 -300 -256 -378 -346 243 53 -256 -86 -458 -576 -104 -291 132 -52 -9 -212
3780 -212 -383 -114 -238 -9 -54 -510 -339 1 129 288 -67 -233 106 -302 118 24 -35 510 175 45 48 -119
3802 -119 105 204 45 226 136 119 408 278 412 130 107 16 -215 418 111 220 278 317 103 78 230 213 336
3825 336 -7 264 -71 -52 122 558 119 45 167 37 -68 26 25 269 204 158 302 19 250 236 -7 524 224
3848 224 80 -4 60 120 337 165 -119 44 -401 -8 -205 233 130 -9 -178 -170 -9 -131 -51 18 -130 -330
3870 -330 -114 -93 47 -99 -161 -211 -273 -87 3 101 111 -44 -151 -300 -438 28 0 -78 128 -88 -200 -256 -58
3893 -58 -68 -93 143 -89 -304 -100 -297 60 130 41 -359 -316 -432 65 131 135 -353 -198 -145 -188 44 130 86 18 -133
3918 -133 -113 -87 110 109 195 267 192 -44 -200 269 54 70 100 29 59 -121 90 -261 120 93 -186 27 -48 30 396
3943 396 81 17 -90 -295 -49 -21 160 327 110 -76 460 -863 -227 -410 -888 265 -3 133 -361 197
3963 197 247 396 108 43 89 329 227 45 -71 -156 -311 -9 -151 344 140 -189 -91 -78 -206 -76 118 -67
3985 -67 104 -363 -243 -67 -216 145 61 -92 -153 31 -206 32 64 -226 -145 -272 -292 -103 -200 -132 78 4 15
4008 15 -154 68 239 239 -24 64 78 -539 10 14 100 201 -233 -297 -278 -359 -141 -286 55 71 128 -109 -265 -115
4032 -115 321 -60 150 29 -348 96 -13 224 172 -84 -120 -180 -86 -143 208 174 88 -55 -102 3 229 227 284 38
4056 38 -190 247 364 158 36 461 32 49 76 44 263 190 -187 -141 42 -22 -72 362 368 274 42 -140 45 211
4080 211 168 -78 27 135 30 -51 94 -108 201 -2 -94 -115 -45 10 179 313 16 66 -5 33 100 119 282 59
4104 59 -229 -166 181 154 66 54 -12 117 312 -75 -89 193 29 418 74 115 254 -134 120 -92 -225 -181 -15
4127 -15 -73 59 50 23 196 -111 -342 -44 -25 -99 -52 -107 -160 81 -114 -87 109 -119 142 -171 57 -3 216 185
4151 185 -33 -93 -247 -308 36 -183 256 218 -97 -422 -194 -299 150 163 132 -126 -12 -349 80 -80 24 19
4173 19 -178 -296 -424 -102 -113 54 -142 -76 -199 -98 -28 128 -212 125 35 -50 -276 -345 227 -113 76 40 -22
4196 -22 217 -144 237 231 60 86 105 -378 109 111 277 239 -71 0 -86 -76 200 200 -1 -125 -444 -133 77 333
4220 333 49 -12 -29 -322 -74 112 -82 -207 23 -160 -121 -156 20 14 308 200 23 -123 -9 -54 189 292
4242 292 -84 -38 9 232 228 290 -265 153 -77 -30 -257 -31 277 133 74 -25 154 75 220 383 230 -264 -332
4265 -332 -191 41 251 8 -14 -130 -87 -14 -117 92 156 88 92 -144 -248 121 -88 246 -24 155 17 -201
4287 -201 -138 -212 221 160 67 -253 -340 -74 -16 -25 148 75 -225 313 -159 151 270 145 -15 -57 -171 -2 40 451
4311 451 -258 77 -71 -30 379 118 66 61 -80 -96 -301 -131 -134 -6 -57 -26 -101 9 -122 -170 216 -21 -46 -303
4335 -303 -257 73 55 291 -66 173 157 6 110 158 -91 -178 -311 -155 -44 -177 125 59 36 -29 -222 -130 220
4358 220 74 164 -73 -128 -161 100 -141 8 354 -200 39 -32 153 -30 251 163 -81 149 -77 -94 76 -75
4380 -75 140 -55 -146 10 101 210 258 151 220 228 -74 -197 274 129 -15 -70 155 164 -24 10 40 -46 -29 -177 -298
4405 -298 170 11 232 -4 -13 -296 -142 -186 -41 -25 101 -231 -143 -116 -193 5 63 -66 -180 -61 -32 114 113 150
4429 150 -10 -177 21 -170 -206 -159 89 188 -36 -123 -398 -275 56 -191 92 -198 -203 -151 10 114 146 71 0
4452 0 -314 -15 -547 -26 101 440 93 -241 -227 -200 104 -233 -110 -26 -286 343 20 134 274 -82 91 -112
4474 -112 -159 165 -31 -39 -98 133 -443 -52 158 88 180 -29 -39 -336 304 416 -62 529 8 -109 -20 295 -42
4497 -42 45 366 136 -264 219 40 -173 56 -325 -254 116 -62 12 303 -124 1 -130 -70 483 174 102 33
4519 33 14 -214 -213 53 136 36 -19 -132 -7 -336 -150 33 -119 204 -29 -91 -428 -8 -120 -152 145 77 -7
4542 -7 -172 -69 -176 -243 156 134 -2 -12 -399 111 -80 206 -41 9 -3 -302 -58 -116 433 -11 -71 -347 -366
4565 -366 -36 -187 246 124 -18 95 -145 30 -4 -168 -59 -73 -52 -19 137 21 185 -78 45 -135 -173 -127
4587 -127 -100 -284 30 -21 89 7 82 403 -21 230 63 -274 -111 34 19 176 271 -305 3 -1 -272 -277 219
4610 219 67 -223 -41 316 -88 -126 231 15 -217 196 110 139 121 69 170 127 -25 -34 187 66 -6 171 198
4633 198 -242 -74 278 166 -114 174 -33 74 -147 -56 360 225 -44 -155 -276 225 96 72 -194 0 -52
4654 -52 -65 -167 -278 141 283 -135 224 181 -51 -12 -151 -157 -159 60 -202 -88 -332 -215 100 -63 -38 -26 161
4677 161 -322 28 -107 -189 -288 -90 -197 -214 -61 -252 32 -214 351 122 -47 59 -292 -19 -106 -267 -16
4698 -16 -7 -50 -18 27 217 22 -356 -69 -39 -111 58 55 -145 -18 -234 -66 121 113 79 -134 172 237 -19 17 219
4723 219 -16 -107 22 268 35 91 414 28 80 -39 317 150 -148 333 -3 -1 21 72 -102 166 -76 -74 -2
4746 -2 250 -69 310 313 -44 30 -181 -35 73 318 118 -167 194 -100 169 268 112 260 163 -131 -28 -44 -216
4769 -216 240 -168 73 -54 -34 -31 100 -53 37 -294 -30 -334 -225 137 7 -134 -113 -152 -63 -186 152 206 46
4792 46 15 100 67 -235 45 -121 -64 200 -127 -89 153 139 251 -180 -472 169 -132 381 -51 -82 -107 -190 98
4815 98 -58 -13 -67 229 43 -114 44 52 -10 59 126 105 -294 41 1 74 90 63 -49 116 33 64 87 170 49 244
4841 244 163 81 191 267 303 -50 300 -148 179 101 163 140 -63 -12 385 -57 162 399 769 -618 -293 -23
4863 -23 -76 402 -212 709 332 -112 133 490 853 -75 559 -570 -224 349 623 252 547 6 142 11
4883 11 15 -209 -208 139 -360 -38 -40 21 -486 -41 252 298 -24 24 -315 339 110 103 -199 28 -222 -339 -8 128
4907 128 226 -23 63 -238 157 -12 17 -662 2 294 -271 56 -710 23 -350 -77 192 -272 117 -512 351
4928 351 590 -195 176 -477 -670 289 100 -266 -130 312 45 -325 340 451 -221 797 -316 -33 -93 -92
4948 -92 56 -104 -203 -102 26 86 -209 32 119 -95 -228 273 -264 -228 -178 -40 208 -65 -92 16 37 28 114 -4
4972 -4 -133 77 -12 199 75 121 -79 -243 280 -82 312 -101 163 403 123 328 -138 125 65 10 -56 242
4994 242 -301 -233 378 28 340 -118 -193 110 -50 194 87 24 62 147 -94 41 30 231 -93 105 -303 -66
5016 -66 218 -330 -15 103 -51 -352 -59 -156 -39 -54 36 -45 20 -54 -509 33 3 110 -27 -212 195 220 -13
5039 -13 -12 355 -158 76 -116 47 7 8 -242 101 -11 -159 -6 -140 -204 -211 -219 -15 -481 -34 -9 -51 -235 55
5063 55 67 -128 -254 217 -122 -440 87 -98 -210 79 -85 56 132 185 -320 -51 108 -70 -32 -15 -11 41 -210
5086 -210 -119 -191 67 45 1 13 212 195 142 72 -112 -70 168 -8 -82 107 284 198 -26 -75 -392 24 345 233
5110 233 152 42 49 189 269 -27 -212 74 114 -81 27 228 199 124 66 177 19 55 -116 -95 36 -48 -110 -22
5134 -22 -103 -75 42 101 48 103 -27 106 220 -31 -2 95 -111 -53 -175 189 172 -99 189 -11 -44 111 87 -10
5158 -10 2 197 -200 -130 -169 -72 120 137 61 82 34 46 41 154 116 -28 -211 -425 -119 22 135 -88 20 -109
5182 -109 -366 26 67 -16 -48 -16 -81 -220 -221 44 164 54 -56 -296 -128 -88 238 -85 -68 -39 -290 -256 -177 40
5206 40 237 -136 83 -39 -124 165 301 -329 -119 -92 38 182 31 441 134 -271 -175 -66 -87 8 58 13 -45
5229 -45 257 -195 -11 225 -39 121 -148 12 -145 5 -280 -11 -6 164 56 86 -255 -115 -106 77 167 -91
5251 -91 40 163 -215 291 -7 70 311 30 61 132 -33 71 119 -38 -59 184 354 -169 -27 201 -91 83
5273 83 202 18 -150 20 -184 238 -135 59 117 57 -188 -11 -119 30 8 111 -31 -269 -156 -119 71 36
5295 36 221 50 153 -5 42 128 -43 154 -11 -36 13 -85 -33 -199 -6 245 175 -189 194 -17 -220 106 237
5318 237 -189 133 73 -94 -102 19 141 -88 -315 -403 80 344 74 13 19 -81 -9 266 102 -201 48 250 -77
5341 -77 -51 54 -92 34 -64 -51 -356 50 -168 22 335 50 73 5 -47 -45 -138 -65 -29 20 26 58 -1 -115 -36 74
5367 74 -118 68 111 128 -83 164 123 -53 -136 391 -27 173 -134 -4 173 -44 -68 176 -131 -150 59 93 440
5390 440 -3 -35 -13 312 -56 64 204 75 -145 -187 -316 -44 190 27 -371 -88 -158 130 -296 136 80 -142
5412 -142 -208 -15 10 28 -121 -113 -224 -420 161 -65 62 119 148 49 -117 -195 -106 99 92 -43 147 141 241 -17 210
5437 210 -187 -190 -191 55 23 192 164 50 -58 -61 -106 163 243 -133 284 108 -72 -299 -166 117 -75 13 -147 101
5461 101 -265 -5 -48 73 -6 49 138 -48 28 20 -172 145 -318 -51 -121 364 6 -106 -241 31 4 -225 379
5484 379 -98 -111 127 71 14 -16 85 -29 384 61 -95 -142 -76 114 201 345 21 -154 -104 -54 -268 222 193
5507 193 -42 33 -385 170 155 86 -85 -336 215 -77 51 255 229 66 180 19 -163 100 -121 100 33 130
5529 130 -67 -63 -10 235 239 -11 185 98 -330 319 -46 133 -61 100 -37 125 22 155 41 173 183 75
5551 75 -180 194 -42 -165 -11 -99 192 50 149 -191 -2 25 -6 -184 21 81 162 144 24 -209 144 155 189
5574 189 -10 46 12 232 164 -95 -126 -7 113 -39 164 -174 36 -52 53 61 -45 32 -158 41 1 -75 86
5597 86 -17 -177 -187 -510 97 -74 73 -46 -262 308 108 395 -129 -201 -111 -51 305 -92 54 44 131 -110
5619 -110 -132 -290 84 117 11 -5 -261 -150 150 57 184 387 104 -204 229 41 32 134 163 278 172 -57
5641 -57 -34 192 -102 4 125 -33 17 94 123 172 108 -307 -194 -190 -116 16 136 -118 15 101 182 25 -44 140
5665 140 136 179 -62 131 258 190 122 -7 65 50 -189 -257 -101 -62 -27 10 -89 -67 164 53 -118 -20 227 -143 -2
5690 -2 63 -12 -10 -186 -50 201 -13 -7 -65 -207 -186 -169 138 -80 -99 44 -73 -10 83 63 -231 -253 19 77 39 -196
5716 -196 98 -149 -281 79 20 -2 -314 232 -133 -291 61 104 82 69 -34 57 -79 140 288 56 -30 177
5738 177 62 48 -138 141 -67 -5 -82 -72 113 -37 166 80 15 38 96 -90 101 -158 11 133 -148 178 38
5761 38 -85 174 1089 329 -100 -228 92 514 -84 150 -520 -254 -678 -6 93 160 -287 70 -183 -12 -267
5782 -267 -184 -654 -370 -97 -92 -483 356 24 -47 383 189 270 286 -5 -137 -2 -386 -67 -132 -249 -142 31
5804 31 -93 -25 88 131 20 -7 243 -341 31 -245 -138 -297 145 -202 -86 191 -120 -28 -42 -68 -12 38 -38
5827 -38 -4 -71 -257 -129 59 65 80 69 54 66 76 -288 -45 -219 172 -32 200 96 -8 28 -218 -454 -180 -185
5851 -185 129 -38 -213 -70 -36 -145 183 155 159 251 2 -48 -40 -131 287 -134 191 -75 -123 -220 -317 220 26 158
5875 158 -209 58 -193 -113 -206 67 -132 70 -66 -218 -189 -69 -215 -48 -52 -40 184 -127 196 -108 -27 -35 -77
5898 -77 -182 -83 137 167 272 5 -67 145 147 -391 -96 -4 -171 46 187 167 267 90 -222 -107 -138 -180 287
5921 287 131 -31 -48 -380 -257 31 120 -160 288 26 -11 4 40 -354 198 366 -356 67 -118 -34 52 83 363
5944 363 -182 -224 10 53 -300 -66 -296 -398 76 72 260 189 25 9 -49 -112 361 31 12 -82 90 -339 -374 -261
5968 -261 177 -43 19 -165 -26 -53 -52 -109 -180 95 -84 69 160 -437 83 -35 -249 1 -112 -371 91 41 288
5991 288 -107 -21 83 71 -146 -97 -54 -85 -215 -216 -260 -107 164 100 98 58 -22 24 155 -268 -17 170 13 -33 17
6016 17 -111 -95 21 246 42 -296 -172 -119 -178 43 115 23 46 -71 -181 2 -173 -77 -137 83 -2 127 -216
6039 -216 239 178 43 191 316 -4 51 49 102 73 -314 7 74 66 -42 185 188 302 -73 134 319 -107 -100 -106 -156
6064 -156 -95 -167 -144 276 149 53 -125 135 38 11 110 130 14 42 184 -60 311 149 179 -227 266 116 -98
6087 -98 81 57 -95 -163 -46 236 34 171 -85 -21 -55 -33 -131 -77 -23 7 160 -57 -20 -206 410 35 -209 62
6111 62 215 -174 -155 244 -166 155 203 56 -67 49 -67 384 145 -222 41 294 19 82 93 214 57 -31
6133 -31 195 128 190 257 21 118 -284 -62 0 -68 157 -183 -87 103 -77 315 -148 187 -197 99 49 -7 200
6156 200 139 -62 -4 -34 8 -314 -25 202 10 187 -71 -280 -121 192 267 -39 11 258 -105 -49 43 -107 163
6179 163 23 -95 37 -194 -205 -124 -19 -73 109 -138 66 28 -20 -102 256 -246 -186 -113 -278 -117 40 283 -155
6202 -155 -230 -67 -222 4 -258 -111 -25 82 124 121 -394 111 54 66 -111 198 96 -78 119 -258 254 -52
6224 -52 -429 -264 -85 -94 167 106 171 -29 73 66 89 -244 -10 1 -225 47 19 -220 -261 236 10 -61 -91 144
6248 144 -76 215 161 10 79 55 49 9 -25 -211 -56 398 -114 6 245 -125 -8 82 -41 10 -30 120 -112
6271 -112 -114 -7 143 194 7 -195 49 -95 -103 -116 191 167 -12 -51 -129 -154 -115 -34 102 107 20 -178 282 -98 -224
6296 -224 -182 -9 -11 -71 -281 -117 -52 224 1 -130 -119 -68 238 -89 278 19 316 57 29 -39 -74 170 33
6319 33 246 54 -70 -117 -101 -191 117 -89 -234 72 225 39 152 -93 -16 95 256 -93 -140 161 -68 -284
6341 -284 -69 -246 71 0 -17 -294 150 17 17 -200 -9 295 -158 -134 -115 132 -13 105 -105 91 -105 -430
6363 -430 56 -112 -87 120 3 148 -95 61 100 41 -214 74 234 2 116 -42 99 165 -12 -55 -293 -104
6385 -104 4 70 -92 -95 -46 77 82 14 39 -277 20 -65 -127 -80 -115 -106 27 -147 95 51 50 -47 31 -148 -166 -74 -68 -185
6413 -185 -14 -33 153 -89 -176 44 15 320 -15 247 -90 50 -128 213 11 177 210 110 18 135 -38 -37
6435 -37 45 -45 -6 -196 161 342 -184 222 -16 -83 -165 -183 174 345 -222 318 -121 -66 25 64 5 56 -162 154
6459 154 70 109 15 -185 103 279 -310 -182 -146 -112 26 -158 129 -212 112 98 -255 -105 -18 118 -160 70
6481 70 -124 -99 -172 -215 -324 24 -294 144 46 -11 -10 -57 102 -81 75 72 184 288 -304 -302 -174 -241 -114 -420 -268
6506 -268 92 -175 52 63 -32 58 -97 57 -141 126 4 35 4 82 -222 -273 -249 -256 -30 -88 -134 -384 -19 19
6530 19 -28 -70 209 263 201 -83 -201 76 -178 200 -51 -36 164 -33 -196 -54 -36 21 -82 -77 -179 305 -16
6553 -16 223 -30 27 -184 119 -5 170 -225 -236 31 -218 122 -143 -195 133 -215 -182 -67 -125 55 -13 170
6575 170 422 -52 300 21 52 143 287 -57 17 179 31 71 147 -22 -41 -241 -145 -195 -133 259 -32 83 87 -16
6599 -16 -87 142 -53 -30 138 -24 24 -8 -214 -95 50 4 -39 273 56 -161 -229 -4 22 67 -88 -222 -218 140
6623 140 215 -291 -182 -58 64 35 -128 312 166 -17 -262 -8 137 170 185 -73 -302 -252 -50 -87 -27 -190
6645 -190 -178 -78 -128 -124 58 -81 291 178 -79 137 -167 72 31 -44 -124 107 55 41 -159 158 101 -216 -116
6668 -116 70 -170 237 -166 45 -227 -168 -48 -134 245 -106 67 -140 147 -155 165 -181 180 82 75 52 75
6690 75 -66 -38 -109 13 30 31 -431 155 321 -13 139 181 -88 -303 48 -57 163 78 122 -171 -97 169 -131
6713 -131 42 -137 15 110 20 28 292 114 -161 59 -80 -14 -67 26 -46 106 -40 192 -8 100 485 -150 -166
6736 -166 13 -54 16 190 42 -199 -39 164 -143 -146 -110 -21 -72 233 -30 4 9 -17 90 -156 7 54 73 -204
6760 -204 -32 253 -61 56 65 174 108 -48 24 -126 194 -64 -113 -29 -171 -1 214 -44 100 97 -29 -139 -143
6783 -143 29 -189 26 -153 -53 -181 27 -199 5 -232 -205 -48 16 -52 83 146 192 177 19 28 253 -25 19
6806 19 43 -220 176 -250 -98 91 -357 13 -57 -112 24 -1 6 173 196 -235 -12 93 65 -21 255 -39 -35 185
6830 185 41 122 171 -49 200 498 -58 -79 213 53 -16 -60 -286 135 107 -17 41 -88 -68 -291 442 -3 -615
6853 -615 -1130 236 363 -72 -136 -555 105 -137 298 271 41 -306 220 -394 578 -257 436 645 -134 -527
6873 -527 269 -23 56 112 60 105 186 124 -112 42 16 186 -214 154 -49 -119 -29 -222 -167 -62 66 76 -88 -283
6897 -283 -373 -138 -6 272 -311 -305 111 176 -66 -435 286 314 -251 -234 -269 117 245 -500 500 -253 496 310
6919 310 -178 278 18 -350 -286 253 -250 284 -67 -522 22 179 -286 -323 48 -115 295 -103 -184 485 -142
6940 -142 -336 -138 350 121 -65 -239 82 218 -197 192 -16 44 16 107 237 125 200 18 113 39 94 200
6962 200 -118 287 64 -189 59 300 -120 80 -160 198 -109 17 -66 0 -101 43 -70 54 55 -63 -3 195
6984 195 89 114 -85 281 161 -142 293 -233 -86 -130 -179 -190 -159 -112 91 -4 -51 -337 71 104 53 139 8 -19
7008 -19 174 -269 49 -227 4 -119 -251 -94 103 -94 -171 133 -60 -181 -138 9 31 76 407 127 -102 -66
7030 -66 5 49 100 -280 45 -35 -132 -52 103 93 67 176 9 179 -249 168 365 -55 -34 26 -39 125 30 166
7054 166 -167 -133 206 -104 12 96 152 -206 -153 218 13 -333 -7 -20 6 148 210 448 106 129 -113 235 -157
7077 -157 -126 -114 -362 27 103 -10 -198 -197 27 -260 86 72 261 52 -61 -49 -115 -103 95 245 -67 -30 -161
7100 -161 -38 147 -333 -313 -317 145 -16 -41 -44 -102 -255 19 -93 -187 -81 53 -146 -455 382 -56 65 -20 21
7123 21 92 -63 -9 72 11 -101 87 -157 -149 -230 -102 -129 27 128 -442 -420 352 -149 -1 564 -465 75 -174
7146 -174 -296 78 -121 124 175 -63 -19 -250 134 -63 77 103 -77 -179 -260 125 12 0 -45 -126 -103 80 -93
7169 -93 -64 311 50 -208 126 209 74 -36 378 -189 -35 -21 -141 -33 47 -94 191 -99 -219 -93 77 57
7191 57 128 -32 -365 20 96 36 2 -147 -221 -290 -43 -59 6 42 723 -199 285 302 -144 185 88 201 -146 72
7215 72 79 -47 105 -138 58 57 -128 99 -74 -224 -143 -192 383 -95 88 258 -253 -80 279 102 49 256 -74
7238 -74 268 -84 477 59 226 227 -235 -359 -11 20 58 -306 -189 -135 -37 13 63 -364 -179 171 60 -271 -130
7261 -130 16 -189 -176 -353 66 -176 5 -11 -192 -85 160 300 54 -75 -66 187 -212 -21 -4 -2 -20 226 106
7284 106 -90 -20 -74 -174 139 0 -15 -282 -116 -22 23 -165 -247 -70 -146 -150 -72 -3 32 -186 144 -342 44 -134
7308 -134 -111 -32 4 23 42 -77 -240 -257 120 -217 51 50 -105 -395 84 -73 -180 -8 137 30 -2 -191 396
7331 396 14 -7 108 -128 273 188 51 -44 -3 78 238 -152 -21 -181 250 102 -205 109 -30 126 -76 10
7353 10 -140 -100 62 -23 -109 -73 191 85 -311 100 5 -348 119 296 -35 54 -248 -124 231 205 38 -129 158
7376 158 97 -36 -38 -105 25 -260 -97 -51 38 -306 40 564 -257 -41 -26 15 -91 -62 -164 -131 -114 -124 -252 -170
7400 -170 51 291 38 24 -165 193 -3 -30 -93 244 221 35 119 -100 -4 32 115 -111 -12 -11 64 -13 -73 -59 -99
7425 -99 74 126 38 38 -101 -31 44 -113 -94 -198 17 32 159 10 120 -110 -94 -445 -270 -320 246 55 146 -22
7449 -22 102 9 -109 156 153 15 171 -42 99 -35 -34 304 197 -164 174 147 -107 379 84 62 -98 -133 -85
7472 -85 207 42 107 4 -76 -142 -24 -189 -199 -54 107 -273 10 -199 -103 -21 -38 169 -26 -49 48 -95 69
7495 69 48 -246 154 -3 -11 44 57 125 -23 -87 301 -190 -281 -168 -144 135 -228 -159 -181 -174 -44 -94 -79 12 64 -272
7521 -272 -22 -19 -124 84 -24 165 -189 -156 -155 -58 176 248 -54 -17 256 61 -127 1 -61 -73 72 234 221 99
7545 99 -115 -50 -110 -350 136 -37 293 219 -6 -18 16 -28 99 68 208 35 -76 -45 -30 389 23 -7 -94 113
7569 113 116 28 -232 -32 -118 41 -69 65 -23 -81 -155 17 -60 208 -50 -290 -130 -103 -2 -28 8 85 101 193 -164
7594 -164 -171 -215 -106 -175 225 302 101 -8 -75 23 -138 109 267 -19 -123 227 27 -192 -226 263 -104 -147 64
7617 64 161 -369 -182 48 115 -122 299 -146 170 31 -178 -55 -117 105 78 -115 -133 -37 174 130 76 -28 -143
7640 -143 -162 21 46 -8 68 -29 47 -116 -128 56 398 123 -154 -174 92 -82 -129 224 49 63 78 -246 -156 601
7664 601 454 -339 88 -131 -218 -82 -150 205 113 -11 -18 29 163 -2 39 41 100 99 -259 -117 59 117 127 92 -171
7689 -171 -118 243 121 104 -214 156 383 -448 -31 -28 -28 -52 109 39 -217 236 -119 128 38 -152 55 -197 17
7712 17 322 184 -119 16 153 60 116 -95 18 -156 -96 75 -85 -15 -120 -348 71 -262 -301 -8 -33 137
7734 137 -140 -57 210 -196 -48 189 97 -27 -47 279 71 -43 -5 -211 45 102 194 30 156 -21 176 248
7756 248 -278 126 33 3 200 190 75 -79 33 317 -50 313 -52 -128 -44 121 17 61 186 -173 -98 -290
7778 -290 -247 -160 -243 220 89 13 61 -222 -205 44 -208 -63 -117 -15 -71 -42 -150 -274 -166 -143 -131 -161 -22 -264
7802 -264 -97 -92 98 -55 97 58 -75 218 173 32 -102 -416 140 -155 51 175 108 -114 467 -9 124 -355
7824 -355 -5 325 -280 -64 52 202 78 143 86 -251 170 189 -128 -72 67 276 31 -176 -37 161 -39
7845 -39 -35 281 239 -134 197 146 121 114 77 -110 -49 277 28 -195 -82 76 -108 150 34 -21 -240 -131 -6 563
7869 563 108 134 314 188 122 28 23 237 -238 96 364 -307 -49 118 23 73 21 177 -27 -257 169 -48 73
7892 73 -111 -354 309 143 11 250 -227 -84 226 51 -33 -80 -167 -334 -308 -9 11 -110 59 183 20 -97
7914 -97 -149 56 -189 93 -160 157 -16 -158 245 -37 143 -117 282 60 -218 -77 136 -41 17 155 -99
7935 -99 183 89 -369 -56 193 -8 -26 -336 267 61 185 107 -89 -159 -61 -84 -86 -109 -140 125 266 127 331 127
7959 127 -115 -158 30 15 89 292 -124 -194 -119 71 60 -21 -72 -210 -10 -211 19 27 -28 59 -86 -55 254 57
7983 57 31 -232 -11 44 183 130 110 -105 -24 106 139 77 -79 58 202 -79 148 38 -172 109 -143 294 -30
8006 -30 -76 -159 179 -292 -10 -52 -96 145 -241 49 -237 -77 16 -49 -165 262 11 -52 -5 -195 -178 -107 -150 -107
8030 -107 160 101 -346 -174 -287 60 104 17 -62 56 -24 -123 -41 -75 -13 182 -101 99 8 -122 -197 81 -121 9
8054 9 12 230 58 266 -121 87 -247 -161 -183 -210 -216 173 537 164 -58 111 263 60 176 -137 88 4 19 -314
8078 -314 7 -141 69 14 -135 61 -167 74 232 -127 -61 -142 56 19 88 -397 -366 328 -121 166 -112 78
8100 78 21 109 32 52 -87 -94 51 139 226 225 29 98 43 -307 -243 -188 -57 -87 -151 -468 18 150 166 22 -62 52
8126 52 85 -32 -211 210 45 -39 -120 -61 -109 242 388 275 128 -236 16 21 -22 -188 116 -2 -89 -104 94 17
8150 17 -18 -136 -316 -102 174 -131 38 -177 -74 -115 354 -35 -95 176 -235 56 26 -153 -130 144 29 -250
8172 -250 -120 101 33 -205 251 -358 -130 -23 -22 28 -214 161 -98 -121 -261 -317 2 -20 -63
8191f3
##END NTUPLES=NMR FID
##END=
