##TITLE=1H_Pr 4631
 CDCl3
 8 sc, 
 11.05.2022
##JCAMPDX= 6.0         $$ Bruker NMR JCAMP-DX V2.0
##DATA TYPE= NMR FID
##DATA CLASS= NTUPLES
##ORIGIN= UXNMR, Bruker Analytische Messtechnik GmbH
##OWNER= root
$$ XWIN-NMR		Version 3.5
$$ Wed May 11 13:54:19 2022 Russian Standard Time (UT+4h)  she@DPX200
##.OBSERVE FREQUENCY= 200.1313499996
##.OBSERVE NUCLEUS= ^1H
##.DELAY= (6, 6)
##.ACQUISITION MODE= SIMULTANEOUS
##.ACQUISITION SCHEME= undefined
##.AVERAGES= 8
##.DIGITISER RES= 18
##SPECTROMETER/DATA SYSTEM= spect
##.PULSE SEQUENCE= zg30
##.SOLVENT NAME= CDCl3
##.SHIFT REFERENCE= (INTERNAL, CDCl3, 0, 15.7039)
##AUDIT TRAIL= $$ (NUMBER, WHEN, WHO, WHERE, WHAT)
$$ ##TITLE= Audit trail, XWIN-NMR		Version 3.5
$$ ##JCAMPDX= 5.01
$$ ##ORIGIN= Bruker BioSpin GmbH
$$ ##OWNER= she
$$ F:/spectra/data/she/nmr/H-F/1/audita.txt
$$ ##AUDIT TRAIL=  $$ (NUMBER, WHEN, WHO, WHERE, WHAT)
(   1,<2022-05-11 13:53:15.56 +0400>,<she>,<DPX200>,
      <created by zg, POWCHK disabled, PULCHK disabled
       configuration hash MD5:
       00 E9 B6 7A A2 85 ED C7 34 08 36 98 17 FE 4E 26
       data hash MD5: 16K
       8E 29 5F D2 CD CB EA 4C 0C 06 6B 6E 65 00 00 70>)
$$ ##END=
$$ 
$$ hash MD5
$$ 13 B0 B2 94 3A 0C A0 D3 F4 3A 2C A2 AA FB 15 90
##$RELAX= 
##$RELAX= 
##$RELAX= 
##$RELAX= 
##$RELAX= 
##$RELAX= 
$$ Bruker specific parameters
$$ --------------------------
##$DU= <F:/spectra>
##$EXPNO= 1
##$NAME= <H-F>
##$PROCNO= 1
##$TYPE= <nmr>
##$USER= <she>
##$AMP= (0..31)
100 100 100 100 100 100 100 100 100 100 100 100 100 100 100 100 100 100 
100 100 100 100 100 100 100 100 100 100 100 100 100 100 
##$AQSEQ= 0
##$AQ_mod= 1
##$AUNM= <au_zg>
##$AUTOPOS= <>
##$BF1= 200.13
##$BF2= 200.13
##$BF3= 200.13
##$BF4= 200.13
##$BF5= 200.13
##$BF6= 200.13
##$BF7= 200.13
##$BF8= 200.13
##$BYTORDA= 1
##$CFDGTYP= 0
##$CFRGTYP= 5
##$CHEMSTR= <none>
##$CNST= (0..31)
1 1 145 1 1 1 1 1 1 1 1 1 1 1 1 1 1 1 1 1 1 1 1 1 1 1 1 1 1 1 1 1 
##$CPDPRG= <>
##$CPDPRG1= <>
##$CPDPRG2= <>
##$CPDPRG3= <>
##$CPDPRG4= <mlev>
##$CPDPRG5= <mlev>
##$CPDPRG6= <mlev>
##$CPDPRG7= <mlev>
##$CPDPRG8= <mlev>
##$CPDPRGB= <>
##$CPDPRGT= <>
##$D= (0..31)
0 1.2 0 0 0 0 0 0 0 0.06 0 0.03 0 0 0 0 0.0002 0 0 0 0 0 0 0 0 0 0 0 0 
0 0 0 
##$DATE= 1652262794
##$DBL= (0..7)
120 120 120 120 120 120 120 120 
##$DBP= (0..7)
150 150 150 150 150 150 150 150 
##$DBP07= 0
##$DBPNAM0= <>
##$DBPNAM1= <>
##$DBPNAM2= <>
##$DBPNAM3= <>
##$DBPNAM4= <>
##$DBPNAM5= <>
##$DBPNAM6= <>
##$DBPNAM7= <>
##$DBPOAL= (0..7)
0.5 0.5 0.5 0.5 0.5 0.5 0.5 0.5 
##$DBPOFFS= (0..7)
0 0 0 0 0 0 0 0 
##$DE= 6
##$DECBNUC= <off>
##$DECIM= 32
##$DECNUC= <off>
##$DECSTAT= 4
##$DIGMOD= 1
##$DIGTYP= 9
##$DL= (0..7)
0 120 120 120 120 120 120 120 
##$DP= (0..7)
150 150 150 150 150 150 150 150 
##$DP07= 0
##$DPNAME0= <>
##$DPNAME1= <>
##$DPNAME2= <>
##$DPNAME3= <>
##$DPNAME4= <>
##$DPNAME5= <>
##$DPNAME6= <>
##$DPNAME7= <>
##$DPOAL= (0..7)
0.5 0.5 0.5 0.5 0.5 0.5 0.5 0.5 
##$DPOFFS= (0..7)
0 0 0 0 0 0 0 0 
##$DQDMODE= 0
##$DR= 18
##$DS= 0
##$DSLIST= <SSSSSSSSSSSSSSS>
$$ [...]
##$SUBNAM2= <"">
##$SUBNAM3= <"">
##$SUBNAM4= <"">
##$SUBNAM5= <"">
##$SUBNAM6= <"">
##$SUBNAM7= <"">
##$SUBNAM8= <"">
##$SUBNAM9= <"">
##$SW= 18.0517283424761
##$SWIBOX= (0..15)
0 0 2 0 0 0 0 0 0 0 0 0 0 0 0 0 
##$SW_h= 3612.71676300578
##$TD= 16384
##$TD0= 1
##$TE= 0
##$TE2= 300
##$TE3= 300
##$TEG= 300
##$TL= (0..7)
0 120 120 120 120 120 120 120 
##$TP= (0..7)
150 150 150 150 150 150 150 150 
##$TP07= 0
##$TPNAME0= <>
##$TPNAME1= <>
##$TPNAME2= <>
##$TPNAME3= <>
##$TPNAME4= <>
##$TPNAME5= <>
##$TPNAME6= <>
##$TPNAME7= <>
##$TPOAL= (0..7)
0.5 0.5 0.5 0.5 0.5 0.5 0.5 0.5 
##$TPOFFS= (0..7)
0 0 0 0 0 0 0 0 
##$TUNHIN= 0
##$TUNHOUT= 0
##$TUNXOUT= 0
##$USERA1= <user>
##$USERA2= <user>
##$USERA3= <user>
##$USERA4= <user>
##$USERA5= <user>
##$V9= 5
##$VALIST= <valist>
##$VCLIST= <CCCCCCCCCCCCCCC>
##$VD= 0
##$VDLIST= <DDDDDDDDDDDDDDD>
##$VPLIST= <PPPPPPPPPPPPPPP>
##$VTLIST= <TTTTTTTTTTTTTTT>
##$WBST= 1024
##$WBSW= 4
##$XGAIN= (0..3)
0 0 0 0 
##$XL= 0
##$YL= 0
##$YMAX_a= 161773
##$YMIN_a= -245871
##$ZGOPTNS= <>
##$ZL1= 120
##$ZL2= 120
##$ZL3= 120
##$ZL4= 120
##$ABSF1= 10
##$ABSF2= 0
##$ABSG= 5
##$ABSL= 3
##$ALPHA= 0
##$AQORDER= 0
##$ASSFAC= 0
##$ASSFACI= 0
##$ASSFACX= 0
##$ASSWID= 0
##$AUNMP= <proc_1d>
##$AZFE= 0.1
##$AZFW= 0.1
##$BCFW= 1
##$BC_mod= 2
##$BYTORDP= 1
##$COROFFS= 0
##$CY= 11.3945322036743
##$DATMOD= 1
##$DC= 2
##$DFILT= <>
##$DTYPP= 0
##$F1P= 2.36226072786647
##$F2P= -0.459571619588291
##$FCOR= 0.5
##$FTSIZE= 0
##$FT_mod= 4
##$GAMMA= 1
##$GB= 0.15
##$INTBC= 1
##$INTSCL= 1
##$ISEN= 128
##$LB= 0.24
##$LEV0= 0
##$LPBIN= 0
##$MAXI= 10000
##$MC2= 0
##$MEAN= 0
##$ME_mod= 0
##$MI= 1.114404
##$NCOEF= 0
##$NC_proc= 0
##$NLEV= 6
##$NOISF1= 3.799351
##$NOISF2= 2.8
##$NSP= 1
##$NTH_PI= 0
##$NZP= 0
##$OFFSET= 15.70392
##$PC= 1
##$PHC0= -18032.62
##$PHC1= 15.60075
##$PH_mod= 1
##$PKNL= yes
##$PPARMOD= 0
##$PSCAL= 0
##$PSIGN= 0
##$REVERSE= no
##$SF= 200.130013532006
##$SI= 16384
##$SIGF1= 3
##$SIGF2= 2
##$SINO= 400
##$SIOLD= 16384
##$SREGLST= <1H.CDCl3>
##$SSB= 0
##$STSI= 0
##$STSR= 0
##$SW_p= 3612.71676300578
##$SYMM= 0
##$S_DEV= 0
##$TDeff= 0
##$TDoff= 0
##$TI= <>
##$TILT= no
##$TM1= 0
##$TM2= 0
##$TOPLEV= 0
##$USERP1= <user>
##$USERP2= <user>
##$USERP3= <user>
##$USERP4= <user>
##$USERP5= <user>
##$WDW= 1
##$XDIM= 8192
##$YMAX_p= 0
##$YMIN_p= 0
$$ End of Bruker specific parameters
$$ ---------------------------------
##NTUPLES= NMR FID
##VAR_NAME=  TIME,          FID/REAL,        FID/IMAG
##SYMBOL=    X,             R,               I
##VAR_TYPE=  INDEPENDENT,   DEPENDENT,       DEPENDENT
##VAR_FORM=  AFFN,          ASDF,            ASDF
##VAR_DIM=   8192,          8192,            8192
##UNITS=     SECONDS,       ARBITRARY UNITS, ARBITRARY UNITS
##FACTOR=    0.0002768,     1,               1
##FIRST=     0,             0,               0
##LAST=      2.2672688,     0,               0
##MIN=       0,             -245871,         0
##MAX=       2.2672688,     161773,          0
$$ Real data points
##PAGE= N=1
##DATA TABLE= (X++(R..R)), XYDATA
$$ [...]
2173A068j691K020j482J9R59k017J654N0j983J937j431J17J217j849J544q9j536
$$ 1068 -623 1397 -85 -66 893 -1124 530 580 -1403 534 -897 -780 437 -1412 132 43 -1493
2190a493J944o74n56J793k263J333Q83k028K265p82o89J628k017J310P11k391
$$ -1493 451 -223 -779 1014 -1249 84 967 -1061 1204 422 -267 1361 -656 654 1365 -1026
2206a026K056m66j231K042k286O23J062k039J561k49j094J892j760K50J315k131
$$ -1026 1030 564 -667 1375 -911 -288 774 -1265 296 47 -1047 845 -915 -665 650 -1481
2222a481J379L18j684K281j567J20J744k123J450M61j510J584j090Q0J628k498
$$ -1481 -102 216 -1468 813 -754 -634 1110 -1013 437 898 -612 972 -118 -38 1590 -908
2238i08J402P19j718J441q77o03J715k099Q63O48k118J680m56r05J783j897M35
$$ -908 494 1213 -505 936 59 -544 1171 -928 -65 583 -1535 145 -311 -1216 567 -1330 -895
2255h95J497k131J818J77j417K171j690N27J439k346J642Lr27J547j574K7J724
$$ -895 602 -1529 289 466 -951 1220 -470 57 1496 -850 792 795 -132 1415 -159 -132 1592
2272A592k275J012N49j367J274j012o76J869j993O49P18j892J811n04j017K134
$$ 1592 -683 329 878 -489 785 -227 -903 966 -1027 -378 340 -1552 259 -245 -1262 872
2288H72j988P86O63j454J519l27o94J984j842L47J566j773J093j52j156K367j782
$$ 872 -1116 -330 333 -1121 398 71 -623 1361 -481 -134 1432 -341 752 600 -556 1811 29
2305B9k55J587j828Q06k01r12J502j445n49J819j806Q37M39j272J761r96o21K144
$$ 29 -226 1361 -467 339 138 -774 728 -717 -1266 553 -1253 -416 23 -1249 512 -484 -1105 1039
2323A039j821P86N26j317J726r11o27K018j336J76J290k135J736p04j085K252
$$ 1039 -782 4 530 -787 939 28 -599 1419 83 259 1549 -586 1150 446 -639 1613
2339A613k032Q3J043j684J636r55q56J773j216k28J555k014J520M1j818K337j032
$$ 1613 -419 -336 707 -977 659 -296 -1152 621 -595 -823 732 -1282 238 279 -1539 798 -234
2356b34p40J674j399J076N55j587J790o31o73J638j372K44P19j672J722p18j237
$$ -234 -974 700 -699 377 932 -655 1135 504 -169 1469 97 341 1060 -612 1110 392 -845
2373h45J571j159K30M14j635J683k20j510J852j356L70Q73j651J486K74j496K043
$$ -845 726 -433 -203 211 -1424 259 39 -1471 381 -975 -605 268 -1383 103 377 -1119 924
2390I24r76l76J464j853J484L29j661J802p04p90J863k149J209L39k043K073n67
$$ 924 -52 -428 1036 -817 667 996 -665 1137 433 -357 1506 -643 566 905 -1138 935 368
2407C68j093J435j473O45P82k341K035m34r23J421j268O40J076j848J304rj003
$$ 368 -725 710 -763 -118 664 -1677 358 -76 -999 422 -846 -206 870 -978 326 317 -686
2424f86J603j121N48R27j922J416L29j624J591r98M02R57k245J140K04j552J312
$$ -686 917 -204 344 1271 -651 765 1094 -530 1061 63 465 1422 -823 317 521 -1031 281
2441B81p88k90J411j926J076N68j703J700n56m84J411j585P61Q62j759J684k16
$$ 281 -507 -797 614 -1312 -236 332 -1371 329 -227 -711 700 -885 -124 738 -1021 663 447
2458D47p68J344j254L37J251j926J058P9r97J425j182O6J186j889R94P9j395J486
$$ 447 -321 1023 -231 106 1357 -569 489 568 -429 996 -186 -120 1066 -823 171 250 -1145 341
2476C41j131M22R65j898R33P13j248J230j076K19J405j587O88Q51j373J233n66
$$ 341 -790 -368 597 -1301 -368 345 -903 327 -749 -530 875 -712 -24 827 -546 687 121
2493A21l85J757j692K91R90j603J300o43o33J679j828K18J130j566J209l57r37
$$ 121 -264 1493 -199 92 1082 -521 779 136 -497 1182 -646 -428 702 -864 345 -12 -949
2510i49J329j423L61J272j474Q86N1q70J660j269J09J556j608M65L80p94J350
$$ -949 380 -1043 -682 590 -884 2 53 -817 843 -426 -317 1239 -369 96 476 -318 1032
2527A032j105k48J401j388L30J127j646Q73m87n94J510j355K5P55j486J467o06
$$ 1032 -73 -321 1080 -308 22 1149 -497 376 -111 -705 805 -550 -525 230 -1256 211 -395
2544c95r03K085j494L06Q69j248J194j20r35J492j035j33J306j434J339k21j191
$$ -395 -1298 787 -707 -401 468 -780 414 294 -641 851 -184 -317 989 -445 894 673 -518
2561e18J885j278k78J157j520Q96l5j352J633p93l75J270j526N13M59j415J613
$$ -518 1367 89 -189 968 -552 344 309 -1043 590 -203 -578 692 -834 -321 138 -1277 336
2578C36n87r24J858j111M78N39j464J700k02j031J573q62q1P38j418J378k97j563
$$ 336 -251 -1175 683 -428 50 589 -875 825 623 -408 1165 303 222 960 -458 920 623 -940
2596i40K080j120l12R86j546J200o8j337J594q41m91R36q55L60Q78j799J686m84
$$ -940 1140 20 -292 694 -852 348 280 -1057 537 -304 -795 141 -714 -354 524 -1275 411 -73
2614g3p80J309q67K86P18j104J271k78o26J204j154N25M98j329R50P7j370J587
$$ -73 -853 456 -411 -125 593 -511 760 482 -144 1060 -94 431 929 -400 550 627 -743 844
2632H44j238K3O10j262J171k12j130J407p00j8P65j078J140J73j549J457n35j38
$$ 844 -394 -371 239 -1023 148 -64 -1194 213 -487 -505 260 -818 322 495 -1054 403 -132 -270
2650b70J145j469J040M88j433J285q67j38J065j512O88R10j752J041oq57J293
$$ -270 875 -594 446 934 -499 786 -81 -219 846 -666 22 932 -820 221 215 -642 651
2667F51j326O87M84j568J223m2j155J293o86J62Q71j424J021n5p01J147p40K57
$$ 651 -675 12 496 -1072 151 109 -1046 247 -439 -277 594 -830 191 136 -565 582 -158 99
2685I9Q52j386R97M8j073J421q98j64J031j511N75O53j091O58n78k74J209j258
$$ 99 951 -435 562 610 -463 958 60 -104 927 -584 -9 644 -447 211 -367 -641 568 -690
2703f90L01P40j344J187n55k80J207j178L86J036j546J086R4o20J225j324N8J218
$$ -690 -389 351 -993 194 -361 -641 566 -612 -226 810 -736 350 444 -176 1049 -275 -217 1001
2721A001j663R12M73j150J214q85O2Q96j431L85M11p77Q92q55j88J416j599N32
$$ 1001 -662 250 723 -427 787 -98 -36 860 -571 -186 225 -552 340 -515 -703 713 -886 -354
2739c54P06j209J120k86o66J315j336O02P13j046Q96k20l98J364j226O5R21j246
$$ -354 352 -857 263 -23 -689 626 -710 -108 605 -441 455 235 -163 1201 -25 40 961 -285
2757b85Q47l68k46Q17j256J9J037j209O77J83j346J574q86m62J478j247O82J26
$$ -285 562 194 -52 765 -491 -472 565 -644 33 216 -1130 444 -442 -904 574 -673 9 135
2775A35r30J491o78m36J237j082L84P03j364J398m76r25J544r06p9M26q91R82
$$ 135 -795 696 18 -418 819 -263 121 824 -540 858 382 -543 1001 95 16 442 -449 533
2793E33n82o27J398j224J50P00j242J145l71r72J565q62k70J230j210Q78N3j043
$$ 533 -49 -676 722 -502 -352 348 -894 251 -120 -1092 473 -389 -659 571 -639 239 292 -751
2811g51J612q73j69J019q98L84M01q05J016n71n53J036j164O52J91j230J271n57
$$ -751 861 -12 -181 838 -60 324 725 -80 936 365 -188 848 -316 336 527 -703 568 11
2829A1p72J112q52J01Q24j384J075k55p08J332r05J25P92j099O24N26j268J520
$$ 11 -761 351 -501 -400 424 -960 115 -140 -848 484 -421 -296 496 -603 21 547 -721 799
2847G99p31k13P28j078J306J70j423J208n77n79Q23r99O92L28j409J281n12p97
$$ 799 68 -145 583 -495 811 981 -442 766 189 -390 433 -566 126 454 -955 326 -186 -983
2865i83J308j064N37K74q40J158n39n12J064p12L10N97j241J236k6r08J339r97
$$ -983 325 -739 -202 72 -768 390 -149 -661 403 -309 1 598 -643 593 567 -341 998 1
2883AM6Q05j420Q91L92j410J210p89J90O80j382P98L65j420J377o74l76Q12o69
$$ 1 47 852 -568 323 715 -695 515 -274 -84 596 -786 12 377 -1043 334 -340 -716 96 -573
2902e73L52M68j164R85m9m51R90r67M00P76j221P49r2n90J476j314K87O83j185
$$ -573 -221 247 -917 68 19 -432 558 -409 -9 767 -454 295 203 -387 1089 -225 62 745 -440
2921d40Q50j5q62R16r43P5R68j285L93M68q55Q63p80L08P07j201N32O97q10J194
$$ -440 410 395 -467 449 -494 -419 549 -736 -343 125 -730 133 -647 -339 368 -833 -301 396 -414 780
2941G80r44j78J214j213P54N80j174Q38m16m10J081j120J32P08j188Q76m76n80
$$ 780 -164 -342 872 -341 413 993 -181 657 241 -169 912 -208 -76 632 -556 320 -156 -736
2959g36J311j245K44R76j208O10k15m17J194r96N1Q48o65J87K95o85J420q72j10
$$ -736 575 -670 -426 550 -658 -48 -263 -680 514 -482 -431 417 -248 -61 234 -451 969 97 -13
2978a3J034j103M76K65q50O76l18n57J261j086L06K48r82R26l89n86J457j354
$$ -13 1021 -82 394 659 -191 485 167 -390 871 -215 91 339 -643 283 -106 -692 765 -589
2996e89L83L42r95R97m12m36J574r73k31R87q95N85j24n63J012p08N1Q43j071
$$ -589 -206 136 -859 138 -274 -710 864 -109 -340 647 -248 337 213 -350 662 -46 5 848 -223
3015b23O94j56r26J406q79m14J286j047M28k11j116J320l64m52J151j431N42O89
$$ -223 471 315 -611 795 -84 -498 788 -259 169 -42 -1158 162 -202 -654 497 -934 -392 297
3033B97j229J368m17o73J334q88R4P65r12N32O4q19J253o92k07Q93j235Q86j6
$$ 297 -932 436 19 -654 680 -208 -114 651 -261 271 335 -484 769 77 -130 763 -472 414 398
3052C98j026J251p72l28P95j093Q91p8r90J463q70l48R29o70N34L03j189J265
$$ 398 -628 623 -149 -477 318 -775 116 38 -952 511 -359 -707 222 -448 86 389 -800 465
3070D65k63m07Q09r59O51L49q80J261n37q31J159o82P4J82r35N81L71j170J149
$$ 465 202 -205 604 -355 296 645 -235 1026 489 -342 817 135 209 391 -544 37 408 -762 387
3089C87o07k3M52j255Q57K48o72J116n00l31J012j444J128J05j147J096l74k00
$$ 387 -220 -243 209 -1046 -189 59 -613 503 3 -328 684 -760 368 473 -674 422 48 -152
3107a52J096j221N40N77j423J005j07p10Q16o10K42M59j049N03j05m04N95q02
$$ -152 944 -277 263 840 -583 422 315 -395 421 -189 53 512 -537 -34 -139 -543 52 -750
3125g50M96M14r54R22K1p89J041q71J26R94j088O31O44j168P98k46k76Q67j160
$$ -750 -254 160 -794 128 149 -640 401 -470 -344 650 -438 193 837 -331 467 221 -55 812 -348
3144c48M03M41j040J019o12k06Q71j025K81N47j015P36j34n71J016r21K73P97
$$ -348 55 496 -544 475 -137 -343 528 -497 -216 331 -684 52 -82 -653 363 -558 -285 512
3162E12j338R31rn45J179r62K80Q75j197M92L62q97J311j145r7J230j175L49K13
$$ 512 -826 105 96 -449 730 -232 48 923 -274 218 580 -317 994 -151 -248 982 -193 156 369
3181C69p28Q17n22l72Q11j025K79N65q55O95k02n89J312j054M56M42r24Q78m01
$$ 369 -359 458 -64 -436 375 -650 -371 194 -661 34 -168 -757 555 -499 -43 399 -525 353 -48
3200d8j7R94j359L85O69q46O49j98o33J119p86K6Q63j087K35lo93J140p58k26
$$ -48 -65 929 -430 -45 624 -222 427 229 -404 715 -71 -45 818 -269 -34 -37 -730 410 -348 -574
3220e74Q93n81J70J35r58J296p74k96J398j256O56L10o97R38o37j23P54p21q3
$$ -574 319 -262 -92 43 -915 381 -393 -689 709 -547 109 419 -278 660 23 -100 654 -67 -150
3239a50R30r67R36m65o60J120q10l7N65r59Q65k47q17J332j095m7O20n84O40j4
$$ -150 780 -187 749 284 -376 744 -66 -103 462 -497 368 121 -696 636 -459 -506 114 -470 170 156
3259A56j103J525o88m19J014o98L04R9o86J270n97m46J055j265P71K83j151J127
$$ 156 -947 578 -110 -529 485 -213 91 190 -496 774 177 -269 786 -479 292 575 -576 551
3277E51l28j043J451q45J6M57j086J295n04n40P23m89N5M51q95O82J74q70J145
$$ 551 223 -820 631 -214 -198 259 -827 468 -36 -576 147 -342 -287 164 -731 -49 125 -745 400
3296D00m66l57R56q98Q33m4q54J080n15l90J113j221N20K67j082J224r10r7R78
$$ 400 -66 -423 533 -365 468 424 -430 650 135 -255 858 -363 157 424 -658 566 -344 -441 537
3315E37j158N45N20j007O42m55p3O86r56N67M03j173J329j58n73J174r35J47P99
$$ 537 -621 -76 444 -563 79 -376 -449 237 -719 -152 251 -922 407 249 -324 850 -85 62 861
3334H61j133O75K14q09Q16r59N43L68r82N79J25r38J061p25l40J132j098N32K97
$$ 861 -272 403 617 -192 624 -335 208 576 -406 173 298 -640 421 -304 -644 488 -610 -78 219
3353B19j134R78k37m19J019q89L57P31j211J096l53m61R92r28L50O52j079P14
$$ 219 -915 63 -174 -593 426 -463 -106 625 -586 510 157 -304 688 -240 110 762 -317 397
3371C97j84n61Q45n74K0N90j055N27L38j064R77o04r2O30r18P99rp31J031n01
$$ 397 213 -348 497 -77 -57 533 -522 5 343 -721 256 -348 -440 190 -728 71 62 -669 362 -139
3391a39k59J034q86J69N70m40J11l43r5J404j393M16M03q44J033o87l8N39q55
$$ -139 -398 636 -250 -81 489 49 160 -183 -278 1126 -267 149 552 -292 741 54 16 555 -300
3410c00r6Q38j054Q13l01o54J035p61Q4P35q64O61j34o96J158o46MJ036j209N22
$$ -300 -396 442 -612 201 -100 -754 281 -480 -396 339 -525 136 2 -694 464 -182 -178 858 -351 171
3430A71R8o78J042m07l75R29r80L13K98r72Q71m48k65R27p54l14N96p56R33l09
$$ 171 269 -409 633 226 -149 780 -200 113 411 -561 310 -138 -403 524 -230 -544 52 -704 229 -80
3450h0o58J070r25M4P40q64Q89j09p26J150n74k52P93m60K65l9o67J102p47j34
$$ -80 -738 332 -593 -549 191 -673 216 107 -619 531 -43 -295 498 38 303 264 -403 699 -48 -182
3470a82P27o30K23J82j153J449r03k98P65p02O76k90m54Q15k36o62R41m24NL97
$$ -182 545 -85 138 320 -833 616 -287 -585 180 -522 154 -136 -590 225 -11 -673 268 -156 -151 246
3490B46o17P34J48p25Q01n39j54Q87j114P87k24m39J002j013K5O23p77N32L6q77
$$ 246 -371 363 511 -214 587 48 -106 781 -333 454 230 -209 793 -220 -195 428 -349 183 219 -658
3510f58R02j88m35M49o19L49O19j014O75k68o6P22p78L79J16m82P63P0q88J000
$$ -658 244 56 -379 70 -549 -200 419 -595 80 -188 -254 468 -310 69 185 -297 466 536 -352 648
3530F48p60K98M24j083R71j60p52P60l46m09N88p24P15j57p04Q05l17k9N66j054
$$ 648 -112 186 610 -473 498 338 -414 346 0 -409 179 -545 170 13 -691 114 -203 -232 334 -720
3550g20O82M10r02R33m27J04N78q92L24N23q90O31m1m97Q00r25K53O03r47Q58
$$ -720 -38 372 -530 403 -24 80 658 -234 90 613 -277 354 313 -184 616 -309 -56 547 -400 458
3570D58q1o52P90p51N4L63p70O90j15m26O20o19K35P43j090P02L8l76P02o50k3
$$ 458 377 -275 515 -236 -182 181 -589 101 -14 -440 180 -439 -204 539 -551 151 189 -187 515 -135 -158
3591a58R72j018K90K30n44O90o24J35P03j118K69N36p42M79k65J45O24r02J54
$$ -158 814 -204 86 316 -228 462 -162 -27 676 -442 -173 363 -379 100 -165 -20 604 -298 -144
3610a44L79p16N78k74l99J017r14J93O55o07OM94k99R04j100J62N58m91M18k82
$$ -144 235 -481 97 -177 -576 441 -473 -280 375 -232 -226 268 -31 873 -227 -65 493 2 420 138
3630A38j26K83l96K3M30n69J67M18q49N40l83l66J215j252K52N55o82J075o99
$$ 138 12 295 -101 -78 352 -217 -50 368 -481 59 -324 -690 525 -727 -475 80 -602 473 -226
3649b26j64P57n74J48N34p60N20j55m08J091j198L80L80m76N50k45o83J027p26
$$ -226 -390 367 -207 -59 475 -285 235 80 -328 763 -435 -55 325 -151 399 154 -529 498 -228
3668b28l79R05n24J31J13p34R18l94k61P65p03O22k76l64O34k88l36Q07m73K14
$$ -228 -607 298 -226 -95 18 -716 202 -192 -453 312 -391 231 -45 -409 225 -63 -399 408 -65 149
3688A49J13n88Q54m28l39N94m68l1N11q92P33l17l70J048r31K24K92p71Q36j83
$$ 149 262 -326 528 100 -239 355 -113 -144 367 -525 208 -109 -479 569 -362 -138 154 -617 219 36
3708C6r49J319p82k0Q64r43R04q26p9R31m19M0J86l30j45lm67O51J11k78J467
$$ 36 -913 406 -376 -396 468 -475 429 -397 -476 455 36 76 262 -68 -213 -216 -683 -32 79 -199 1268
3729A268p00l88J58j329J119j57k81O25o33J53J29l97L63j7l93P10o10J55N57
$$ 1268 568 180 338 -991 128 -29 -310 315 -318 -165 -36 -433 -70 -87 -480 230 -380 -225 332
3748C32o36L21R0n43P31j69l29Q73p76N05q9n58O48n49J19L07p01M28L96j038
$$ 332 -304 17 107 -436 295 126 -203 670 -106 399 310 -248 400 -149 -30 277 -424 4 400 -638
3768f38P75j27l54N49n10r5M86p80P07J39q57R30l97J55K91p13P20J56p15R18
$$ -638 137 10 -344 205 -305 -400 86 -694 13 152 -705 225 -172 -17 274 -439 281 437 -278 640
3788F40r08K45O89q27L44j30k86L62j05l38Q58j119P27J68p26N31r4k96M76n63
$$ 640 -268 -23 666 -161 183 53 -233 129 24 -314 544 -575 152 320 -406 125 31 -265 211 -352
3808c52M83K95p34O95m37j26R17j084L49M97o71O27j24n12O82k28n32Q09q88M39
$$ -352 131 426 -308 387 -50 -176 741 -343 6 503 -168 459 335 -177 505 277 -255 554 -334 105
3828A05K15m63M22n26q1K72m47L75R2j58L12o36J49Q59q21K34O7j46O17l95j20
$$ 105 320 -143 279 -247 -328 -56 -503 -128 -36 -194 118 -518 -369 490 -331 -97 -30 -176 441 46 -74
3849g4P01m72JL42n01K90j69k26O32l36m27O42n29L66k59k74O87o58k19O84o25
$$ -74 627 155 156 498 -3 287 118 -108 524 188 -239 403 -126 240 -19 -293 394 -264 -483 201 -424
3870d24L58J44m06M14k86M5O75r27O33j97k03O05o38K20L72m08L1M75q34P00p4
$$ -424 -66 78 -328 86 -200 -155 520 -407 226 29 -174 431 -207 13 385 -23 8 483 -351 349 275
3891B75k89M72q35L68M50n18N03k26o47O74o02L60n5k73J21k6J10N64n75j58P05
$$ 275 -14 458 -377 -9 441 -77 426 200 -447 227 -375 -15 -70 -343 -222 -248 -138 426 -149 -307 398
3912C98n89N20j62l14N07k22qJ68o46N36K07p27M93m1l72M87l61n7J64m87P12
$$ 398 -191 329 167 -147 360 138 130 298 -348 188 395 -332 161 120 -252 235 -126 -183 -19 -506 206
3933B06m97j04M33k22k7L33o84N51Kl47P33n41K06K38l46L66k61j97L82l54K19
$$ 206 -291 -395 38 -184 -211 122 -562 -11 -9 -356 377 -164 42 280 -66 300 39 -158 224 -130 89
3954H9K61n71L88K3p02P54l38j29N29q27L56L05q06P47m37k3N55m11J71L90p59
$$ 89 350 -221 167 190 -512 242 -96 -225 304 -523 -167 138 -668 79 -358 -381 174 -237 -66 324 -435
3975d35N62J79m73O26l57J29K17p14M17j24k72O29r4l67L11j06q6L35r37P29l69
$$ -435 127 306 -167 459 102 231 448 -266 151 27 -245 384 290 -77 234 128 42 377 -560 169 -200
3996b00j76Q25q22J59M94p09M42k2pJ83m33L63K95o01L67k06k07P34o61M31Q5
$$ -200 -376 449 -373 -214 280 -429 13 -9 -16 167 -266 97 392 -209 158 -48 -255 479 -182 249 334
4017C34n46N68j18j58L54q01Q3O31m95K88k85k32M61l58J09L44p25M40J82m88
$$ 334 -212 356 238 80 434 -367 -284 347 -148 140 -145 -377 84 -274 -165 179 -546 -106 76 -412
4037d12O60m77K31N95o96J42P4p7M14m21J62O76r06KK39o67P07l37J6M88o25O9
$$ -412 248 -229 2 597 -99 43 117 40 454 33 195 871 -35 -33 206 -461 246 -91 -75 413 -212 -143
4059a43M45q45J044n39l35M60m32O6L51m47K44J16k02N62o40K88N39p20J88p3
$$ -143 302 -543 501 -38 -373 87 -345 -279 72 -375 -131 -15 -217 345 -295 -7 532 -188 0 -73
4079g3m4O07l63k02N73p66J89Q9k37N79p75l9R68n26l37M10q71J315n35m00R86
$$ -73 -117 490 127 -75 498 -268 -79 10 -227 352 -423 -462 506 -20 -357 53 -818 497 -38 -438 548
4100E48j103N02M26q66O73l33K45O4l62O38L10n02K98l93K9K03k72K35L73j179
$$ 548 -555 -53 373 -493 180 -153 92 156 -206 432 742 240 538 145 174 377 105 340 713 -466
4120d66O99J3n46M47p00k57J548j498m26P84o71J520N19k32n95j45n50J26O76
$$ -466 233 246 -300 147 -553 -810 738 -760 -1186 -402 -1073 447 966 734 139 -6 -556 -430 246
4139B46j01m92O65k2L91r34L7J07j3N81m72J38j01j3k1m67K53K01n85R29l63j35
$$ 246 145 -347 318 296 687 -247 -210 -103 -116 465 -7 131 30 17 -4 -471 -218 -17 -602 327 -36 -171
4161a71M46p09L38J29l85P10m23J24L29o61M88K4m17M57n9l63P62q21K72P6l32
$$ -171 275 -434 -96 33 -352 358 -65 59 388 -273 215 239 -178 279 220 -143 619 -202 70 146 -186
4182a86Q24m26n90N61q9k16L45p11Q98m30n31M97m2j77O93r25P20K4m94M70j23
$$ -186 638 212 -378 183 94 -122 223 -488 410 -20 -551 -54 -96 -273 420 -505 215 239 -255 215 92
4203I2o7M65n24L06K31n93K17L1j89M75p79N74O4o19L16m8k61L58m52L65L11p33
$$ 92 25 490 -34 272 503 -90 127 158 -31 444 -335 239 303 -316 0 -48 -309 49 -403 -38 273 -460
4225d60M01o8m8M12l33k23K82k83M54j14j3P7n9j76N69o79K29P6k71L70m5l61
$$ -460 -59 -127 -175 237 -96 -319 -37 -320 134 20 7 84 25 -151 418 -261 -32 44 -227 143 98 -263
4247b63N20q46N73J50k78K55m02K19M78p34N2K72j67L60k28r9L26k34J30J35l24
$$ -263 257 -589 -16 134 -144 111 -291 -72 406 -328 -276 -4 -171 189 -39 -138 188 -46 84 219 -105
4268a05K5L13l76N58n00J88L28o25L83l5k85N37o29J34M03o16L23j65j84L32l20
$$ -105 -80 233 -143 415 -85 103 431 -194 189 154 -131 406 -223 -89 314 -302 21 -144 -328 4 -316
4289c16j55R24q44N1M20l14M11l94k03R33q41K77J47k24N74m00j55M01k08l89
$$ -316 -471 453 -391 -340 80 -234 177 -217 -420 513 -328 -51 96 -128 446 46 -109 292 84 -305
4309c05N39l49M00k44r6L75o82N8Q22q56L34j85l01P85n51Q2O82p18L31n5n20
$$ -305 234 -115 285 41 -55 320 -362 -304 518 -338 -4 -189 -490 295 -256 -174 508 -210 121 66 -454
4330d54P61l65j87P59l92OJ1k23K67k01k15P99o64J97J87n80N67k04m88O55k80
$$ -454 307 -58 -245 514 122 128 139 -84 183 -18 -233 566 -98 99 286 -294 273 69 -419 236 -44
4351d4k18L05m17L06j92k27O22m08m2K90l87P60j71l05K91Qm81Q86m52J97r1n20
$$ -44 -262 43 -374 -68 -260 -487 135 -273 -315 -25 -412 348 177 -128 163 171 -310 576 124 321 230 -290
4373b90N55P1l42J26r3N7l66J13L15k83n6K78l56J41J40n84M58n2k44O45m84K69
$$ -290 265 336 -6 120 27 84 -282 -169 146 -137 -193 85 -271 -130 10 -574 -116 -168 -412 233 -251 18
4395A8J91l73M27p8l85O01m92J55K20l28K76k43l14M73Nk36L02m80M83k45j12
$$ 18 209 -164 263 185 -200 401 -91 64 284 -44 232 -11 -325 148 153 -83 219 -261 222 -23 -135
4416a35K97k16Q3K74n14N8J63l85O83l20n6J77l12M29O1l84K76j08q3L75l16O5
$$ -135 162 -54 29 303 -211 -153 10 -375 308 -12 -68 109 -203 226 287 -97 179 71 -12 363 47 112
4438A12M38r04M22K4l86O39o22M6M10m54M64j0n66N54j46l06K95n20P17qo79O22
$$ 112 550 -354 68 92 -294 345 -277 -231 179 -275 189 179 -387 167 21 -285 10 -510 207 199 -480 142
4460A42j21k64N67l57K17K07m34M78l50j94J69l10K90J52l25J03L0k31N66n79
$$ 142 21 -243 324 -33 184 391 -43 435 85 -109 60 -250 40 192 -133 -30 0 -231 335 -244
4480b44J84M17q58N38o9l20N01k51Q9L22m79L17j35k78M54l33N4N09k15k13O7
$$ -244 -60 357 -501 37 -32 -352 149 -102 -13 309 -170 147 12 -266 188 -145 -91 418 203 -10 57
4501E7n1N72n36P4L68n61K47k7k97L45n48J45M10m78K11K22l79K92p6n1N90n43
$$ 57 6 578 42 116 484 -77 170 143 -154 191 -357 -212 198 -280 -69 153 -226 66 -10 -61 529 -14
4523a4j6K35j87K02j76j4N12m75j07M44o90M50Rn64Q64m53j99M56l95M2J85l73
$$ -14 -30 205 18 220 44 30 542 67 -40 404 -286 164 173 -391 473 20 -179 277 -118 -76 109 -264
4545b64L54j75l18M93k81p0J65j63K18l12J61M53k12OL9l18M07r3k76O62n21J92
$$ -264 90 -85 -403 90 -191 -261 -96 -259 -41 -353 -192 261 49 55 94 -224 183 90 -186 476 -45 147
4567A47p0k32M06P0m21K68l4j40M89p06o1K76l33K52r2j94N26l11m6J07j01N29
$$ 147 77 -155 251 321 -100 168 134 -6 483 -223 -284 -8 -341 -89 -181 -375 151 -160 -206 -99 -200 329
4589C29l64j02L66l89J89J21n33O51j60k29L38k9p5K79n03L36p0l91K14k6JK63
$$ 329 -35 -137 229 -160 29 150 -383 268 108 -121 217 188 113 392 -111 225 155 -236 -22 -48 -47 216
4611B16o24L60J16j49J18k37M7J85k66L09K31m98M63j31l3K00j89j68M52o98M02
$$ 216 -408 -48 68 -81 37 -200 -153 32 -234 75 306 -192 271 140 107 307 118 -50 402 -296 106
4632A06K72m61K83m83M08M6r08O98P5l14K40j74N8L22l42k3K90k77N7j06j5L35
$$ 106 378 -83 200 -283 125 171 -737 -39 36 -278 -38 -212 -154 168 -174 -197 93 -184 -127 -233 -248 87
4654H7l19J42R6j29L75j61j10K43m18J49J84k56K40L7l85L32l52K30J15m97N28
$$ 87 -232 -90 6 -123 252 91 -19 224 -194 -45 139 -117 123 160 -225 107 -245 -15 100 -397 131
4675A31k34k8J3j92K35J27k92M60m9k30L20l21K1L99m28M21m93o7R0Q5K76K77
$$ 131 -103 -131 -118 -310 -75 52 -240 220 171 -59 261 -60 -39 360 -68 353 -140 -207 -117 -32 244 521
4697E21o75J74J99l9q4k78k08N85k85k02L49l02J80R7k85L92j43k22O57n34K02
$$ 521 -154 20 219 180 96 -182 -390 195 -90 -292 57 -245 -65 32 -253 139 -4 -226 431 -103 99
4718I9k1j15K79j65n4J88l00J90J49j44J57l06R0K84n23K45J36j88K72l00jJ43
$$ 99 78 -37 242 77 23 211 -89 101 250 106 263 -43 47 331 -192 53 189 1 273 -27 -28 115
4740A15n03N50k26j09M68m37k12M16K3k60L46k98K2J59k51O83m77Q3J15j64J40
$$ 115 -388 162 -64 -173 295 -142 -354 62 85 -175 171 -127 -105 54 -197 486 9 92 207 43 183
4761A83n7m18O10l16l22K85l71M26L0l51N47j07l43O74n53J58l0k44J46O3j3K69
$$ 183 126 -292 318 2 -320 -35 -406 20 50 -301 246 139 -204 470 -83 75 45 -199 -53 10 -3 266
4783B66k39j22K24l16L38j13j99N84l81j21m1n8L99j40J1o8q6j87L35l63N41l6
$$ 266 27 -95 129 -187 151 38 -161 423 42 -79 -120 -178 221 81 92 24 -62 -249 86 -277 264 228
4805B28n06K75k88J57K86l10K11L6l71L99j84oJ63l63L56Ll21L09P9m18K94jQ1
$$ 228 -278 -3 -291 -134 152 -158 53 89 -282 117 -67 -73 90 -273 83 86 -235 74 153 -265 29 28 109
4828A09l6l89L76l20J84K10k75J22k1m1P9K44n00O01l67o6K72o81O18J18l77K66
$$ 109 73 -316 60 -260 -76 134 -141 -19 -40 -81 -2 242 -258 343 -24 -90 182 -499 119 237 -140 126
4850A26j51M4J02j43J16K65m46K47j44L8k1j62J72o0L1K92j66m80K19j91M82O5
$$ 126 -25 19 121 -22 94 359 -87 160 16 54 33 -129 43 -17 14 306 140 -340 -121 -312 170 235
4872B35o23O52j71k47K44j5J94l41k6R8J83k13O9KNJ41j69J12j36K6J47m33K17
$$ 235 -388 264 93 -154 90 75 269 -72 -98 0 183 -30 39 41 46 187 18 130 -6 20 167 -266 -49
4895d9K74l07PL30k32K44k04j29L29j55j54J43k53J78k56k00M78k93o2N18k80
$$ -49 225 -82 -75 255 23 267 63 -66 263 108 -46 97 -156 22 -234 -434 44 -249 -311 207 -73
4916g3J30r4j68M80l37K03L07l38J49j92K0o6J45Q9m62N3K67p6k45L06j72l8J15
$$ -73 57 -37 -205 275 -62 141 448 110 259 67 87 21 166 255 -207 -154 113 37 -208 98 -74 -112 3
4939Cj90J65k63K20J85j84l02O15k74K8K45m37N85l82o2N42p74L07pk1K12k93
$$ 3 -187 -22 -285 -65 120 -64 -366 249 -25 3 248 -189 396 14 -48 494 -280 27 20 -1 211 -82
4961h2K87j7k15k92M60l67J6J48l67O15m55L34K02k30mo3J0K62m70M81Ml59J29
$$ -82 205 188 -27 -319 141 -226 -210 -62 -429 186 -269 65 267 37 33 -30 -20 242 -228 253 257 -102 27
4984B7k6l8L08l24R8J48l03J85J72k28O9k46J22J99k59J36M1m08M19j30j07J73
$$ 27 1 -37 271 -53 45 193 -110 75 247 19 88 -158 -36 163 -96 40 81 -327 92 -38 -145 28
5006B8j12K54J37l71j7J25j56K21N5k55K38Op0o9j35J76J36l29K58j83P1j63j09
$$ 28 -84 170 307 -64 -81 44 -112 109 164 -91 147 153 83 14 -121 55 191 -138 120 -63 8 -155 -264
5029b64L29k53j45K62j71L12J36l59N8Q8m3K07J46n06L87k34J66J69n54M76j35
$$ -264 65 -188 -333 -71 -242 70 206 -153 -95 -7 -50 157 303 -203 184 -50 116 285 -269 207 72
5050G2P2j21K05m1r7k91K52j78K22k51l2M75m51k0J67j98J54j31k28L95o4jL71
$$ 72 144 23 228 187 90 -201 51 -127 95 -156 -188 287 -164 -184 -17 -215 -61 -192 -420 -25 -89 -90 281
5073B81k58N1K31m58L53qk86J95k3j04L84j99J41k65l57K63J92k85M01n34L00
$$ 281 23 74 305 -153 200 192 -94 101 78 -26 358 159 300 35 -322 -59 133 -152 249 -285 15
5094A5Ok29L2k4MK11j39QK30l97M07N9l10L95j76j46J21k59K28o2j09K68r6J5
$$ 15 21 -208 -176 -200 -196 15 -124 -116 114 -283 124 183 -127 268 92 -54 67 -192 36 -26 -135 133 37 52
5118E2J51l91O6K34k73J11J49m04L12j67J59m3k27K15q4j34L73m16L89Q8j64L24
$$ 52 203 -188 -122 112 -161 -50 99 -305 7 -160 -1 -44 -271 -56 -140 -274 99 -317 72 160 -4 320
5140C20k39q7K81k63j14K07l8j34L20m36M10j43q4J86p5k7J84m60J2K07j21J4
$$ 320 81 -6 275 12 -102 105 67 -67 253 -183 227 84 0 186 111 84 268 -192 -180 27 -94 -80
5162h0J02r3j38j6L03j57k80O50m14N9K34k47K14j35l82O29k04Q3J54m55L00K4
$$ -80 22 -71 -209 -225 78 -79 -359 291 -123 -64 170 -77 137 2 -380 249 45 128 282 -173 127 151
5184A51l50K82j11j73L04m54L90J28n02M09k56O5M84l83q1K45l89N51k50k44L41
$$ 151 -199 83 -28 -201 103 -351 39 167 -335 74 -182 -117 367 -16 -97 148 -241 310 60 -184 157
5205A57l45k76P43m93N07k44k60N21k86j33K11k9Lk79J23J75j02j01L38l34n9
$$ 157 -188 -464 279 -214 293 49 -211 310 24 -109 102 73 76 -203 -80 95 -7 -108 230 -104 -163
5226a63K13m07N18j61j39K67j37n2K00n26N68l5k26K98k56p3J74j06K55N6m39
$$ -163 50 -357 161 0 -139 128 -9 -61 139 -387 181 146 -80 218 -38 -111 63 -43 212 268 -171
5247a71L43k16K36Lr3J46l31N0K12l31j98L75m01P25l07r6J92j62j19K01j82j9
$$ -171 172 -44 192 195 102 248 -83 -33 179 -152 -350 25 -376 349 42 -54 138 -24 -143 58 -124 -143
5269a43M75m01K65j89l15L20O4J3j44m2K35j47l6J80n78M00j50J3O9Jj0L38n88
$$ -143 332 -69 196 7 -308 12 76 89 -55 -97 138 -9 -45 135 -443 -43 -193 -180 -111 -110 -120 218 -370
5292c70M16o4j94J40K24l64J98j29j4K89l04L84J57n99M11j57r3J6K15K16m98
$$ -370 46 -18 -212 -72 152 -212 -14 -143 -157 132 -172 212 369 -230 181 24 -69 -53 162 378 -120
5313a20J59K11k51K7l5k3J47J45k82J7r1l2L72m49M1K84j21K7M4j37J73k98K7
$$ -120 39 250 -1 26 -9 -32 115 260 -22 -5 -96 -128 244 -205 -164 120 -1 26 70 -67 106 -192 -165
5336a65K96l10K59j01RK44l66%K51j3k73L26k48J04l9m7J61l23L59p7j30J64j01
$$ -165 131 -179 80 -21 -12 232 -134 -134 117 104 -169 157 -91 13 -26 -73 88 -235 124 47 -83 81 -20
5359b0j59N15m65L8R4j18O7k00N04Rl14L11O8n80L81j78K42J29m04K99j98M1J12
$$ -20 -179 336 -129 -91 3 -115 -48 -248 256 265 -49 262 330 -250 131 -47 195 324 -80 219 21 62 174
5382A74j34l17N08l57m1J68k79K02J79k36K64l78M21M9l69j5L68m39L33j90J6
$$ 174 40 -277 231 -126 -167 1 -278 -76 103 -133 131 -247 174 223 -146 -161 207 -232 101 -89 -73
5403g3K67j80J05j96o5K16J53j59N7l80K19m4PK45j33j96J74j14j13J72k62M52
$$ -73 194 14 119 -77 -142 74 227 68 125 -255 -36 -80 -73 172 39 -157 17 -97 -210 -38 -300 152
5425A52k67L7K71p9k77L00j80J81N0l0J27k79M8k86L39J42j53l85L69j17J13p3
$$ 152 -115 -78 193 114 -163 137 -43 138 188 158 285 6 54 -232 107 249 96 -289 80 -37 76 3
5447Ck97M38k05k09J94K45k81J5J16j75J58k24M45m02N3P6Ko0N8k26L41j60J34
$$ 3 -294 144 -61 -270 -76 169 -112 -97 19 -156 2 -222 223 -179 -126 -50 -48 -108 -50 -276 65 -95 39
5470C9K98l49L3mj44J39K71o50O27m22O9J59k76J32J50m24N01m8j84K50J2j01
$$ 39 337 -12 21 17 -127 12 283 -367 260 -162 -93 66 -210 -78 72 -352 149 101 -83 167 179 78
5492G8J19j59Q0o6J48M4k32J02l1O1k56K39j52K73j19J16j28l40L37r3j99M19
$$ 78 197 38 118 52 200 244 12 114 83 144 -112 127 -25 248 129 245 117 -223 114 21 -178 241
5514B41k58J8J74k02R1k64J9R6k91K89L53l04P4L06l22K12n3k91J08j31l3N46
$$ 241 -17 1 175 -27 64 -200 -181 -85 -376 -87 266 -38 36 342 20 232 179 -112 -4 -135 -168 378
5536C78l71j0N5m1K42l46q6K91k80M45j79j07j23j52L45J09n40J57N5J78O4j19
$$ 378 7 -3 52 11 253 -93 -179 112 -168 277 98 -9 -132 -284 61 170 -370 -213 -158 20 84 -35
5558c5J80J6j97P6n6l46M00l34K08N13n98r2L06j71r2K14k93M96j69Q8q4j91J74
$$ -35 145 161 -36 40 -16 -362 38 -296 -88 425 -173 -265 41 -130 -222 -8 -301 195 26 114 30 -161 13
5581A3q0j31L76j66J51k36r0L94l02j46M19m73L53lm5r0K28k08J95k34R9J32r0
$$ 13 -67 -198 178 12 163 -73 -163 231 -71 -217 202 -271 82 79 34 -56 172 -36 159 -75 24 156 66
5604F6l8q8q5P1J08l2K11m37L08j31k30K78J03l70M31o2j36j86OM73l48Q5J80
$$ 66 28 -60 -145 -74 34 2 213 -224 84 -47 -277 1 104 -266 165 103 -33 -219 -213 260 -88 -3 177
5627A77j19R2kJ8pk4l68J89J09o6K90n88M12l3k14K84j20l00K64k22J77Q1j4J37
$$ 177 58 150 148 166 159 135 -233 -44 65 -1 289 -299 113 80 -134 150 30 -270 -6 -228 -51 30 16 153
5651A53j26k6J83m31N2K16Q5j22P8op7R0j58K57l79L19k9J4J44k54l20L01o8k2
$$ 153 27 1 184 -247 -195 21 106 -16 62 56 -21 69 -89 168 -211 108 79 93 237 -17 -337 -36 -104 -126
5675a26O4L5J6j76P1J88k43K42j92J41m4j84J5K93l0k41J12L5N9Nj39K25m03L90
$$ -126 -62 -27 -11 -187 -116 72 -171 71 -121 20 -24 -208 -193 100 70 -171 -59 -24 35 40 -99 126 -277 113
5699A13N9k33J37k0p1N8RR1k30k07M3Q8k05N54j35p0J89k70J84j21N4J18M2j56
$$ 113 172 -61 76 56 -15 43 52 143 -87 -294 -251 -163 -368 186 51 -19 170 -100 84 -37 17 135 177 21
5723B1J76j11m0p8o5J60l2o4L31m62K45Kj12j63K60j70K89m04L34j01k31M04l03
$$ 21 197 86 46 -32 -97 63 31 -33 298 -164 81 83 -29 -192 68 -102 187 -217 117 16 -215 189 -114
5746a14J10J02j98K17j12j48K39N9m10M47k94j34K43J08Q0l08J3J73k06J2J25
$$ -114 -4 98 -100 117 5 -143 96 155 -255 192 -102 -236 7 115 195 -113 -100 73 -133 -121 4
5767DJ9J45LJ18j44K2k83L0r4J68R3k86M41l22M0J45j64qL04k41l2r5L4L9K55
$$ 4 23 168 171 289 145 167 -116 -86 -180 -12 81 -205 236 -86 -46 99 -65 -73 231 -10 -42 -137 -103 -64 191
5792A91jl45M8J49l41K69O9n5O5J29j90N4J19o27P61k03l6j27l4j1J28j07J58
$$ 191 190 -155 -107 42 -299 -30 39 -16 49 178 -12 42 161 -466 295 92 56 -71 -105 -116 12 -95 63
5815F3j05j28K59k11N2O1O3j71J42J10k2j05Q3k35J73j9j1j76L16m44J31L15n19
$$ 63 -42 -170 89 -122 -70 -9 54 -117 25 135 113 8 91 -144 29 10 -1 -177 139 -305 -174 141 -378
5838c78L12j6j53M34j60N8J32l26j56R2o1M56j66q0K7j36j24J09J3J40j74J18
$$ -378 -66 -82 -235 199 39 97 229 -97 -253 -161 -222 234 68 -12 15 -121 -245 -136 -123 17 -157 -39
5860c9K29Rk04J19j95j52J69j80J16r3o5OM20l6j93K23l0j66O9J15k06J11l92
$$ -39 190 199 -5 114 -81 -233 -64 -244 -128 -221 -286 -280 140 104 -89 134 104 -62 7 122 -84 27 -365
5883c65J57M43k41q1K34k77OM6O9K10l40J66K2k34J63J56k29L67m19J7j3P5n4
$$ -365 -208 235 -6 -87 147 -130 -124 -78 -9 201 -139 27 49 -185 -22 134 -95 272 -147 -130 -143 -68 -122
5906a22O7J10JJ75l09L82m55R6M1J25o6q3R8k86KK41M3P4K8q8k10J51j34K97Q9
$$ -122 -55 55 56 231 -78 304 -151 -55 -14 111 45 -38 60 -226 -224 17 60 134 162 74 -136 15 -119 178 267
5931B67l38K98q6l82L58j98Q9M0j00r2J87P6j89J12k72L6K31KJ03k98K61k55j51
$$ 267 -71 227 141 -241 117 -81 8 48 -52 -144 43 119 -70 42 -230 -194 37 39 142 -156 105 -150 -301
5954c01N39l42j5K18k13K60k38O4Jj23J58k1j50L92j48l41K18m0j51K11m22N17
$$ -301 238 -104 -119 99 -114 146 -92 -28 -27 -150 8 -13 -163 229 81 -260 -42 -82 -233 -22 -444 73
5976G3l0j34K61Nk11K73n21L24n3j47NL16J8k4r6j38%m9K57j4j24j3q1N5j8l8
$$ 73 43 -91 170 175 -36 237 -284 40 -13 -160 -155 161 179 155 59 -79 -79 -128 129 115 -9 -22 -103 -48 -66 -104
6002a04j8J97n6Q6rj14O6j26L64j99K4K13k76n7K34l63M52j53r4k51L45j28k62
$$ -104 -122 75 19 105 96 -18 48 -78 286 87 111 324 48 -9 225 -138 314 161 67 -184 161 33 -229
6025b29K80j7K07l0k11j83J83J86j1k44j17K65J10k56J43K43n59K40j97O3l7J8
$$ -229 51 34 241 211 0 -183 0 186 175 -69 -186 79 189 -67 76 319 -240 0 -197 -134 -171 -153
6047a53qL98j99j28O0J26j36M0l94M67l44J87N9P7J32N3k21j99J89J2l4k75K59
$$ -153 -161 237 38 -90 -30 96 -40 0 -394 73 -271 -84 -25 52 184 237 16 -183 6 18 -16 -291 -32
6070c2j72K94r2K29l13L01k83nOJ1J94k70K64l22J15K46j52j25N0j31K39L17l18
$$ -32 -204 90 -2 227 -86 215 -68 -73 -67 -56 138 -132 132 -190 -75 171 19 -106 -56 -187 52 369 51
6093E1j77K36j88J09O0k41r6K86MJ85n40L07M0j30R3k3r6K71j37o9M3K95O0l01
$$ 51 -126 110 -78 31 91 -150 -246 40 44 229 -311 -4 36 -94 -1 -24 -120 151 14 -55 -12 283 343 42
6117D2M0J27k37j4K14K20j89j65j25J11k38L48j34j78K17j69o9L08k52J98k38
$$ 42 82 209 -28 -42 172 392 203 38 -87 24 -214 134 0 -178 39 -130 -199 109 -143 55 -183
6138a83q4K76L1j59R1K06j92J51j26p2L46k34j7O4l84O89l89J17k46m8k2L52n7
$$ -183 -267 9 40 -119 -28 178 -14 137 11 -61 285 51 34 98 -286 403 14 131 -115 -163 -185 167 110
6161A10Ok45q2K44k62P3J04k6K38k58M6J40j34rl1L25k25K8j0o1k14L66k57N1
$$ 110 116 -129 -211 33 -229 -156 -52 -78 160 -98 -52 88 -46 -55 -86 239 14 42 32 -29 -243 123 -134 -83
6185h3K77m7q1j05J33k93L92l31J50j81l4L68k74L58l88k17L16q6J25Pl7J30j17
$$ -83 194 147 66 -39 94 -199 193 -138 12 -169 -203 165 -109 249 -139 -356 -40 -126 -1 6 -31 99 -18
6208a8K52o5M8j08m4K01l79J50j64J44K89k84J94j90j99K04np1N2N2N2j34o7K87
$$ -18 234 169 217 109 65 266 -113 37 -127 17 306 22 216 26 -173 31 26 -45 7 59 111 -23 -90 197
6232A97k52j67J12J85j01O9L7M1k31p2K44k48J82j9K1n0l24K69n9L2K94r7j4J18
$$ 197 -55 -222 -110 75 -26 43 80 121 -110 -182 62 -186 -4 -23 -2 -52 -376 -107 -166 -134 160 63 49 167
6256A67k69O1q0J02j06L41l12J39Q8k29m0N2J82R5k24L06m61K46q3p4O1j27P3
$$ 167 -102 -41 -121 -19 -125 216 -96 43 131 -98 -138 -86 96 191 -33 273 -188 58 -25 -99 -38 -165 -92
6279i2K87j26m5J67q2p9k00j1K87Mn4J1k77J63R7j37O7O8k87L46p2J99j38j00
$$ -92 195 69 24 191 109 30 -170 -181 106 110 56 67 -210 -47 50 -87 -20 48 -239 107 35 234 96 -4
6303dj04K6L73k89J33P2j60m2p6k28J35L38j42J52p4l27K17K6k80K15j02J4M00
$$ -4 -108 -82 291 2 135 207 47 5 -71 -299 -164 174 32 184 110 -217 0 26 -254 -39 -141 -127 273
6326B73n10L25j95J17K92k07l5k17J56k4j55l6K67q9j45q0K85p7K30l25K09k2
$$ 273 -237 88 -107 10 302 95 60 -157 -1 -25 -180 -216 51 -38 -183 -263 22 -55 175 -150 59 37
6348C7k65L87l17J58Q2k85J14K95l11J48J6k34J16K01q4O8j51k55M4N1Q1pp0J64
$$ 37 -228 159 -158 0 82 -203 -89 206 -105 43 59 -175 -59 142 58 126 -25 -280 -236 -185 -104 -111 -181 -17
6372a7o7L70l20N6L03k25k94K88k18J42L4j73O7m9K29j37K4J38k19rL2l9J00p9
$$ -17 -84 286 -34 22 325 100 -194 94 -124 18 52 -121 -54 -103 126 -11 13 151 -68 -77 -45 -84 16 -63
6396f3k74M50m7j38L40k89n06O52P8l82K29k27L08p3k61L51l04N2K55j43r5j71
$$ -63 -337 113 66 -72 268 -21 -527 125 203 -179 50 -177 131 58 -203 148 -156 -104 151 8 -87 -258
6418b58J29M25o17P9K18N4k79M67j70j48PM5j8j15K42N7j17r5J88Q6j65M9r4j17
$$ -258 -129 296 -321 -242 -24 30 -249 218 48 -100 -93 -48 -66 -181 61 118 1 -94 94 180 15 64 -30 -147
6442a47k0M17k88J60j60j45M74k24j18J81o6lJ47q9k79M02k78p3j4n4J3K7J56
$$ -147 -167 250 -38 122 -38 -183 291 67 -51 130 64 61 208 119 -160 242 -36 -109 -123 -177 -164 -137 19
6465A9lj45m6L94k20N3r9j23k7K38l7l0m5P9J2L4J10j86P0j0j7j04q8P9J24M7
$$ 19 16 -129 -175 219 -1 52 -47 -170 -197 41 4 -26 -71 8 20 54 164 -22 48 38 21 -83 -171 -92 32 79
6491G9j01J60j58k4j16M9n5J01j14L12j13M5qj23k2K14k93M03J40m22R9l2L52
$$ 79 -22 138 -20 -44 -160 -111 -166 -65 -179 133 20 65 57 -66 -88 126 -167 236 376 -46 53 21 373
6514C73l79J49R4l95J68M0j62lj83K27j5J0N0L12l09J12p8N8p7p3K24n3k05K51
$$ 373 -6 143 237 -158 10 50 -112 -115 -298 -71 -86 -76 -26 286 -23 89 11 69 -8 -81 143 90 -115 136
6538A36k17K30k65J82k64J06j6K6j27J85j04NN09j40l01O7J75j10K16Ko24L74
$$ 136 -81 149 -116 66 -198 -92 -108 -82 -209 -24 -128 -123 386 246 -55 12 187 77 293 295 -329 45
6560D5k47K12P8j72K91k04j15J73J84o3l31K6J36k01P4J30k0N0j18j25J96l6p6
$$ 45 -202 10 88 -84 207 3 -112 61 245 182 -149 -123 13 -188 -114 16 -4 46 -72 -197 -1 -37 -113
6583a13K04m20J53K95k92p1L55j19Q9j28n4P8K18k0j38l7J25m45N04O5k09j35
$$ -113 91 -329 -176 119 -173 -244 111 -8 81 -47 -101 -23 195 175 37 0 125 -320 184 249 40 -95
6605i5M7J31O9o0j67J82m1o6K7p6J28j59J24l14K00K8l6l9J43k89L36j11kJ45
$$ -95 -48 83 152 92 -75 107 66 0 27 -49 79 -80 44 -270 -70 -42 -78 -117 26 -263 73 -38 -40 105
6629A05pk3P4k54j06J43K41J45k13j02L0J59k32P7r1j4K7K86j19j34j20K05k28
$$ 105 98 75 149 -105 -211 -68 173 318 105 3 33 192 -40 37 -54 -68 -41 245 126 -8 -128 77 -151
6652a51KJ78k98K92m3J61l0j9p9q4K8J73P2R3O3k78q6J23r9j52K78m97M92q5R0
$$ -151 -149 29 -269 23 -20 141 111 92 13 -71 -43 130 202 295 358 80 -6 117 18 -134 144 -353 139 54 144
6677A44l5j80J37M0l70N39m10J05K19j08m60L19j72j82M09J2M8l07L52q5j13n8
$$ 144 109 -71 66 106 -264 275 -135 -30 189 81 -379 -60 -232 -414 -5 7 55 -252 100 15 -98 -156
6699a56J31J23j90P1K9k7k26L16K47m84L55k03k2K12j43r7J76l53K42M6J09j34
$$ -156 -25 98 -92 -21 8 -19 -245 71 318 -166 189 -14 -36 176 33 -64 112 -241 1 47 156 22
6721B2j34J43J11j63J25j21l7K02j84J9P3J37j34K51l45L7k01J74J15j68J03j4
$$ 22 -112 31 142 -21 104 -17 -54 148 -36 -17 56 193 59 310 -35 2 -199 -25 90 -78 25 11
6743A1j51L45l28K05K1N2k69K9J87K3r3L8J84l22P9j63O2L7L87l52K8r1R0J88
$$ 11 -140 205 -123 82 103 155 -114 -85 102 125 32 70 254 -68 11 -152 -90 -53 334 -18 10 -81 9 197
6767A97r9k47R7J43k65J78J61j92kO2j53J08P5q0j53L56p2j04j8Q1K35m16M50
$$ 197 98 -149 -52 91 -174 4 165 -27 -29 33 -120 -12 63 -17 -170 186 114 10 -8 73 308 -108 342
6790C42k19k83J89L8j3j58J9l4L87l10P5K10l23r7K28j04N2L36l97J26j37j27
$$ 342 123 -160 29 67 54 -104 -85 -119 268 -42 33 243 -80 -177 51 -53 -1 335 -62 64 -73 -200
6812b00J62k5O4J56P6j35k57J66J7j10M4J3k7J90M5m89M99Qj09j58r5L62j93l0
$$ -200 -38 -63 1 157 233 98 -159 7 24 -86 -42 -29 -56 134 179 -310 189 197 88 -70 -165 197 4 -26
6836b6M08o26Q8N4j2J11L8J49j11j41m2J59j31j87K29r2K84k26l0O1J44R7j95
$$ -26 382 -244 -156 -102 -114 -3 35 184 73 -68 -110 49 -82 -269 -40 -132 152 -74 -104 -43 101 198 3
6859CK59j96k92L50j55j51L64k56m4M43m94K5L18l30K79k84m9L38k16J35J5j64
$$ 3 262 66 -226 124 -31 -182 182 -74 -118 325 -169 -144 174 -156 123 -161 -210 128 -88 47 62 -102
6881a02L49k55q5J44Pr8K6M5J01Q1j61P1k73M15m75J57K43k17R0k56M73m11L45
$$ -102 247 -8 -93 51 58 -40 -14 31 132 213 52 123 -150 265 -210 -53 190 -27 63 -193 280 -131 214
6904B14k02k42L38j86K80j17l58L44j20L31l2k38O1j46J17j96J30k8J60K4j35
$$ 214 12 -230 108 -78 202 85 -273 71 -49 282 250 12 73 -73 44 -152 -22 -50 110 134 -1
6925aj69N4K56k60K13n8j66K27j9k46J81j00Q0j56L5K59j30J70j25J33j87J1K1
$$ -1 -170 -116 140 -120 93 35 -131 96 77 -169 12 -88 -8 -164 -129 130 0 170 45 178 -9 2 23
6948B3J86l07J62j58K08k22K21k41J22O2j31KJ04K7J93j95J05r3k58M78l04J84
$$ 23 209 -98 64 -94 114 -108 113 -128 -6 56 -75 -73 31 58 251 56 161 68 -190 288 -16 168
6970A68j66K5J31k01p4J10K30l06l5K20m50M26l20K53R7j05K17l56K61j11K3j6
$$ 168 2 27 158 -43 -117 -7 223 -83 -118 102 -348 78 -242 11 108 3 220 -136 125 14 37 21
6992B1o8q5J0J89k91K82R5j87q1J98k72J24O7j00j57L29L0q4j7O6k46P6j85K73
$$ 21 -47 -132 -122 67 -224 58 153 -34 -115 83 -189 -65 2 -98 -255 74 104 20 3 69 -177 -101 -286 -13
7016a3J05m91K27n8K04K92l32J28m5l2l8L41k53k38n6K93L5m4j43K3n7J11L1r4
$$ -13 92 -399 -172 -230 -26 266 -66 62 17 -15 -53 288 35 -203 -259 34 69 25 -118 -95 -152 -41 -10 -104
7040a04J92j30O4j25J75k77J43P5o0n5J74J97k64p5R7k96M20k02Q9j94R1Mj19
$$ -104 88 -42 22 -103 72 -205 -62 13 -47 -102 72 269 5 -70 27 -269 151 -51 38 -156 -65 -61 -180
7063a80K81N9k43o2K23l2N6j97R0J9l7NL71l49j17j95K06J16l3K2L58k62j30m4
$$ -180 101 160 -83 -145 78 46 102 -95 -5 14 -23 -18 353 4 -113 -308 -102 14 -19 3 361 99 -31 -75
7087g5Q9N7j66J85j27Q0j11M1Mj23L20k54n4J02R5Q6l96K2L38j65J68r1j1L7O1
$$ -75 14 71 -95 90 -37 43 -68 -27 -23 -146 174 -80 -134 -32 63 149 -247 -225 113 -52 116 25 14 51 112
7112A12N0k17j20N1K79n08N17k48OK23l54K06M4j82K32j32O7r1p8K55O1j96J38
$$ 112 162 -55 -175 -124 155 -353 164 -84 -78 145 -209 -3 41 -141 91 -41 26 -65 -143 112 173 -23 115
7135A15l04N1p0pK54l28L54k78M68P2k54L8j11L02m42k19L73r3k1pJ76O1k10L10
$$ 115 -189 -138 -208 -215 39 -289 65 -213 255 327 73 111 0 302 -140 -359 14 -79 -100 -107 69 130 -80 230
7159B30j52l23J37J17K38n56J27K30o3K5R7l29M25l96P7J98p8q7O8L7J38j55j9
$$ 230 78 -245 -108 9 247 -309 -182 48 -15 10 107 -222 203 -193 -116 82 4 -83 -15 22 160 5 -14
7182a4N6o5P1J19J44m36L07j69P3o6M6q9P4j16L01k41J73P5o6q5j15j47J16m9
$$ -14 42 -23 48 167 311 -125 182 13 86 20 66 -23 51 -65 236 -5 168 243 177 92 -23 -170 -54 -103
7206a03J97j21J4j27L57j37L5K4p4J6k38L95k89n6J00j00M05m04o4K02m4j8J35
$$ -103 94 -27 -13 -140 217 80 115 139 65 81 -157 238 -51 -107 -7 -107 298 -106 -170 32 -12 -30 105
7229A05L2l06J9R5j76K32k83K74j86K3J72k90J89k7K3N6J07j54L24j65n9n3J23
$$ 105 137 -169 -150 -55 -231 1 -282 -8 -194 -171 1 -289 -100 -127 -104 -48 59 -95 229 64 5 -48 75
7252G5jj48j10K79l97K02J62k13J59j98j5J54J24j72O4m5J87k37j5R3K88q2j81
$$ 75 74 -74 -184 95 -302 -100 62 -151 8 -190 -205 -51 73 -99 -35 -80 107 -130 -145 -52 236 154 -27
7275b7P8J42k66P1j64J6p7K86l26K45K46n29M04l02K78r7k16J61J29nJ1J99k79
$$ -27 51 193 -73 -2 -166 -150 -227 59 -267 -22 224 -305 99 -203 75 -22 -238 -77 52 47 58 257 -22
7298b2J37j25k33L10k11M18m34j5mL13n07J41J69J58J12k39k2J50L04j90l07J82
$$ -22 115 -10 -243 67 -144 274 -160 -175 -179 134 -373 -232 -63 95 207 -32 -54 96 400 210 -97 85
7320H5k10J79K3Q3m37K90P8j39l3j6J82j50j92J85K5N7M2j63K93l07l7K22l45
$$ 85 -125 54 77 160 -277 13 91 -48 -81 -97 85 -65 -257 -72 -47 10 52 -111 182 -125 -162 60 -285
7343b85K50J86O3K3j07n8p0M8J29j90q9M78l86k87L78l96J01L28k26j1K26j36
$$ -285 -35 151 214 237 130 72 2 50 179 -11 -100 378 -8 -295 83 -313 -212 116 -110 -121 105 -31
7365c1k85M03k34J48q1J73j46M2k45L88j37M34l74jL9j07P2j3q9J50J73l38J59
$$ -31 -316 87 -147 1 -80 93 -53 -11 -256 132 -5 429 55 54 93 -14 58 45 -44 106 279 -59 100
7388A00l85N95n11L15OK34m67P6O6j33K67j48j92M1j8m4L49k67L52m75J25K14
$$ 100 -285 310 -201 114 120 354 -113 -37 29 -104 163 15 -177 -136 -154 -198 151 -116 236 -239 -114 100
7410A00k62J72K40k67m7L3J08q8L25j23k11o8K22j77K85m36K49j91N3jJ98K5j42
$$ 100 -162 10 250 -17 -64 -31 77 -11 314 191 -20 -88 134 -43 242 -194 55 -136 -83 -84 114 139 -3
7433ck0m05N12n4j72K38k01L03l5q5l5j15j4K23l97J73R2J18J94l23j5Jj46J85
$$ -3 -23 -428 84 30 -142 96 -105 198 163 78 43 -72 -86 137 -260 -87 5 123 317 -6 -21 -20 -166 19
7457A9M1k5r4J24j3N8j87K9o8L72k01J43k38j9r4P8M5K08k34J21k57K09J39Mj09
$$ 19 60 35 -59 65 52 110 -77 -48 -116 256 55 198 -40 -59 -153 -75 -30 178 -56 65 -192 17 156 160 51
7482E1lk04J57k79L72j91O2J11k02m6J12N8p0Q8k60L53l14K90J54j04mp9j09R5
$$ 51 48 -156 1 -278 94 -97 -35 76 -126 -172 -60 -2 -72 16 -244 109 -205 85 239 135 131 52 -57 38
7506C8Lk16L53k33P3ko4M9J07o7P3o3j87K99k26K07q4j2J07j43k1J92m77K56R9
$$ 38 41 -175 178 -55 18 16 -48 1 108 41 114 51 -136 163 -63 144 60 48 155 12 -9 183 -294 -38 61
7531F1n22L19L79o0k33J07Q5k24M4J57j37P8k7l07L14l8n7J50k17J15n3K62k70
$$ 61 -461 -142 237 177 -56 51 136 -88 -44 113 -24 54 27 -280 34 -4 -61 89 -128 -13 -66 196 -74
7554g4L89n65M23k72K01P8k43nJ60m5o1J10Q4R3j70K0J06l8j56Qj7Ok75M18N3
$$ -74 315 -250 173 -99 102 180 -63 -68 92 47 -14 96 180 273 103 123 229 191 35 43 26 32 -243 175 228
7579B28m09L60n5j53J43j03K8o6J49j67L8k25L89K3j45J48j21k35K52J18j45j36
$$ 228 -181 179 124 -29 114 11 39 -27 122 -45 -7 -232 157 180 35 183 62 -173 79 197 52 -84
7601h4K18J18k07J43j54j08l2J5r1J74N5Q9k90J72l1J24k06K36jl04J28J76J91
$$ -84 134 252 45 188 34 -74 -106 -91 -182 -8 47 136 -154 18 -13 111 -95 141 140 -164 -36 140 331
7624C31k97m4k10N6J42M41k90j04r3k0K49p1r7j21m2o2K08J62R4o16M31K5k95
$$ 331 34 -10 -220 -164 -22 419 129 25 -68 -88 161 90 -7 -128 -170 -232 -24 138 232 -384 47 72 -223
7647b23M00p4k07K68l38k1K38j4j03K53k27J59j52L10l39j35J83K9k24L1M7j09
$$ -223 177 103 -104 164 -174 -195 43 29 -74 179 -48 111 -41 269 -70 -205 -22 7 -217 -186 -139 -248
7669b48L21K8N8j18k35l6J02K8j06J96JJ20rP2K5l70N5J54q3J02n2J20O7l85J76
$$ -248 73 101 159 41 -194 -230 -128 -100 -206 -10 -9 111 102 174 199 -171 -116 38 -45 57 5 125 192 -193 -17
7694a7q0L2j29M21k73J86J55m40J9K25Pl95J80j50J98K6o4o3K62j12Q7K0q5P8
$$ -17 -97 -65 -194 227 -46 140 295 -145 -126 99 106 -289 -109 -259 -61 -35 -99 -162 100 -12 75 95 10 88
7718H8l34L0J26L60n26K52K26l1k19j00J60K4L57j05q2j88j03J46%l23Q9J70j30
$$ 88 -246 -216 -90 270 -256 -4 222 191 -28 -128 32 56 413 308 226 38 -65 81 81 -242 -153 17 -113
7741a13J25J2N2o6kl01M00j42Oj24R6r4J8K86j71M3k3j36N1P7K39m04J92j98L34
$$ -113 12 24 76 10 8 -293 107 -35 -29 -153 -57 -151 -133 153 -18 25 2 -134 -83 -6 233 -171 21 -177 157
7766A57j53j7r6J95Qj92P3j46M5J39q0J45j32q5R6J40j21K57j98k03J80L2r0M7
$$ 157 4 -13 -109 86 94 -98 -25 -171 -126 13 -67 78 -54 -139 -43 97 -24 233 35 -168 12 44 -46 1
7790AK10p3p4j41q8J56l8j43J67J5J45k32L7M5K90k83J42j32J37j6k67P0J36k12
$$ 1 211 138 64 -77 -165 -9 -47 -190 -23 -8 137 -95 -58 -13 277 -6 136 4 141 125 -142 -72 64 -148
7814a48O5K85j43o9j8R9j3m1J45j76r2L15n8q5J34k87Q5J34n9k3k34K69p9R6j51
$$ -148 -83 202 59 -10 -28 71 58 17 162 -14 -106 209 151 66 200 -87 -2 132 73 50 -184 85 6 102 -49
7839d9q2J47j04r1K53M8k57J99j33K8J19pj78M9K61m24L81k07O2n9k1N5r4L80
$$ -49 -131 16 -88 -179 74 122 -135 64 -69 -41 78 71 -107 -58 203 -221 160 -47 15 -44 -65 -10 -104 276
7863B76m7m32K28J19j97M6q2K62j57pj58N9j23N17k95O2j44L3j61J36j44J10k9
$$ 276 229 -203 25 144 -53 -7 -89 173 16 9 -149 -90 -213 304 9 71 -73 -40 -201 -65 -209 -99 -128
7886a28J78J50l85M9K73j97j2P8QR3o1J79j8j29j37k2M2K88n7o3ol20L09j25j36
$$ -128 50 200 -185 -136 137 -60 -72 6 14 107 46 225 207 78 -59 -81 -39 249 192 129 123 -197 112 -13 -149
7911a49M0N1J27j6K5j31P6r2L7l3J41K5m02N42j29Jj71L1r4P2lr1J67j27MN7J21
$$ -149 -109 -58 69 53 78 -53 23 -69 -32 -65 76 101 -301 241 112 113 -58 -27 -121 -49 -52 -143 24 -103 -99 -42 79
7938G9q0l7jp8MR6J06l73K74LM0n7J98%m33J78m2J01j05J30PO0%qL02j30k67L67
$$ 79 -1 -38 -39 -117 -113 -17 89 -284 -10 -7 33 -24 174 174 -259 -81 -123 -22 -127 3 10 70 70 62 364 234 -33 334
7966C34k08j5Q2j87p9K92l47n1M34j75p2n6N6j64K84j45j60L36j34j45J66J08
$$ 334 126 111 193 6 -73 219 -128 -179 255 80 8 -48 8 -156 128 -17 -177 159 25 -120 46 154
7988A54P1k03k9J45M7k31Q3O0l1l8Q6j45J00M0k25O4j46K62l19R3k6M58j81r8
$$ 154 225 22 -7 138 185 -46 37 97 66 28 114 -31 69 109 -116 -52 -198 64 -255 -162 -188 270 89 -9
8012ij77L68p5O0k48j14M10k97K72k48k9L49J9l72K4j04J34m4Q5J11q8j11l1J66
$$ -9 -186 182 107 167 -81 -195 215 -82 190 -58 -87 262 281 -91 -67 -171 -37 -81 4 115 27 -84 -115 51
8036E1k50K1Q2Q7J80m84L10p2P6P9q0k7m1J55j62J20J21j26m5Pn3J74R0j29j35
$$ 51 -199 -178 -96 -9 171 -313 -3 -75 1 80 0 -27 -68 87 -75 45 166 40 -5 2 -51 123 213 84 -51
8061e1J76j41O0l6M9j72Q0m8k9M10j62j37J34%j54J01K9m32J66J55q9J98p3j66
$$ -51 125 -16 44 8 57 -115 -35 -83 -112 298 136 -1 133 133 -21 80 109 -323 -157 -2 -91 107 34 -132
8085a32K87K26q5j80n0r4j06Q5q8J42j33m8K76j70R1r5K84m15M74l14j05N3J46
$$ -132 155 381 296 116 66 -28 -134 -49 -137 5 -128 -176 100 -70 21 -74 210 -205 269 -45 -150 -97 49
8108D9Q1k55K50j36Ql9l34L47J0L53n36N8J98j73L8p7L15mkJ48j15k28P6j83j8
$$ 49 130 -125 125 -11 -3 -42 -376 -29 -19 334 -202 -144 54 -119 -81 -158 157 153 151 299 184 -44 32 -151 -169
8133a69P6O2j10L20l35rJ53J12j19P0j06q8J08j33K13K34l21j97O4K30j16mK22
$$ -169 -93 -31 -141 179 -156 -165 -12 100 -19 51 -55 -143 -35 -168 45 279 -42 -239 -175 55 -61 -65 157
8156A57j9j52J78j06J6j47K83K2l28J86p0ok66M78j2j93Q7J04k21j6j59K67o8
$$ 157 138 -14 164 58 74 -73 210 232 -96 90 20 14 -252 226 214 21 108 212 -9 -25 -184 83 15
8179A5k2NK9PN9j85J80n4j2J10J23k23
$$ 15 -7 -2 27 34 93 -92 88 34 22 132 255 32
8191C2
$$ Imaginary data points
##PAGE= N=2
##DATA TABLE= (X++(I..I)), XYDATA
0@%%%%%%%%%%%%%%Qj6J6j6J6k3L1l2L9m7N4o2P1q4R5j06J21j41J61j80K03k29
$$ 0 0 0 0 0 0 0 0 0 0 0 0 0 0 0 8 -8 8 -8 8 -15 16 -16 23 -24 30 -32 39 -45 50 -56 65 -76 85 -95 108 -121
36a21K56k86L21l58L98m41M88n41N96o57P25p98Q80r71J069j178J299j433J586
$$ -121 135 -151 170 -188 210 -231 257 -284 312 -345 380 -418 462 -509 560 -618 681 -752 834
55H34j758J952k176K439k753L134l605M201m990O083p693J0298j5188K7302j07852
$$ 834 -924 1028 -1148 1291 -1462 1672 -1933 2268 -2722 3361 -4332 5966 -9222 18080 -89772
70h9772j56099L17732Q9912j50263l4038P8025j1238n7065O3075J6832j40556
$$ -89772 -245871 71861 161773 11510 -22528 55497 44259 -12806 50269 67101 -73455
81g3455L8006J01620o6626m6911L6221M2559r221o8028M0586M5373n5115j4606
$$ -73455 -35449 66171 -455 -47366 -11145 31414 22193 -45835 -5249 40124 -14991 -29597
93b9597r1J0898K8627m6806Q816M8378l2144K139L0489J3610K43n0343J3280L0544
$$ -29597 -29688 -18790 9837 -36969 -28153 20225 -11919 -9780 20709 34319 34562 -15781 -2501 28043
107B8043l5881K4262l834o7878K8780N7086J0566m7700m6697Q0967M1793o8839
$$ 28043 -7838 16424 12590 -55288 -26508 30578 41144 -6556 -53253 27714 69507 668
119F68o986M960k342J1618k8534L162M42k1051L6522m336j9780L1590l89Q103
$$ 668 -6318 -1358 -3700 7918 -20616 -17454 -17012 -38063 -1541 -5877 -25657 5933 5544 13647
133A3647q740k8734N3851P432o0413O573K5446J4356k1036k3413N1890j1553m7020
$$ 13647 4907 -23827 30024 37456 -22957 -16384 9062 23418 2382 -21031 30859 19306 -27714
146b7714N2123J1682m3436r990P235K1785k3392j7771L4971l3444r552O4202j1329
$$ -27714 24409 36091 -7345 -17335 -10100 11685 -11707 -29478 5493 -27951 -37503 26699 15370
159A5370l3807M956K4855K7580l9135j8243L4825j6057k657N917k1410K0878K368
$$ 15370 -18437 -13481 11374 38954 -181 -18424 16401 344 -2313 3604 -17806 3072 5440
172E440j1909J3416j5620J5579J9905l3012K14O780M557J5517l7945l086L3756
$$ 5440 -6469 6947 -8673 6906 26811 -6201 -5987 793 5350 20867 -17078 -20164 13592
185A3592j5784J131J997r241J5087j3414O821J7093l3316O233J5432j5702J1468
$$ 13592 -2192 -1061 936 -8305 6782 -6632 189 17282 -16034 -9801 5631 -10071 1397
198A397p486k973J3534j6482J9725J1283l0350J4106J0066l553L270k4133J4337
$$ 1397 -6089 -9062 4472 -12010 7715 18998 -11352 2754 12820 9267 12537 -11596 2741
211B741J5970k8845O235L064l042J4401k1147K415J7572j6225J2412j735j9824
$$ 2741 18711 -10134 -3899 -835 -3877 10524 -10623 -8208 9364 -6861 5551 3816 -16008
224a6008J6522J2J284j571k3590K5588J0447k5142J3468R9k708J1623j3005R870
$$ -16008 514 526 1810 239 -23351 2237 12684 -12458 1010 1109 -1599 10024 -2981 6889
238F889K1j6021K1494q065j1280J8588j3839J359Q017j1805J2889r295q216K0408
$$ 6889 6910 -9111 12383 4318 -6962 11626 -2213 -854 7163 -4642 8247 -1048 -9264 11144
252A1144j5093k703Q120j2493J5091p026j3924K1795p343m036J0249j2236J1864
$$ 11144 -3949 -6652 1468 -11025 4066 -2960 -16884 4911 -2432 -6468 3781 -8455 3409
265C409%q450J7356j5742k040K2162j5237j112K814m544J5723j5395o494J9205
$$ 3409 3409 -5041 12315 -3427 -5467 16695 1458 346 3160 -1384 14339 -1056 -7550 11655
279A1655j4871J908O028j2423J1322p036m612J5396j6498K474J0813j3760J0374
$$ 11655 -3216 -1308 4720 -7703 3619 -3417 -8029 7367 -9131 -6657 4156 -9604 770
292G70l202o229J5926j2490J976J1172j4118J0976J63q859J5262j1392j319J3372
$$ 770 -2432 -8661 7265 -5225 -3249 7923 -6195 4781 4944 -3915 11347 -45 -1364 12008
306A2008j4387O351N57j0066J4795r989l981J1109j3694Q765K883j6226J4297
$$ 12008 -2379 3972 4529 -5537 9258 -731 -4712 6397 -7297 1468 4351 -11875 2422
319B422l235o777J0180j1192O488M284j2988J4956m410p793J6024r636J804P447
$$ 2422 -813 -7590 2590 -8602 -2114 2170 -10818 4138 -272 -8065 7959 -1677 127 7574
333G574j2145J2084j934r878J3128q857O18O982j3606J1206l18j2333J3647o463
$$ 7574 -4571 7513 5579 -4299 8829 -28 590 7572 -6034 5172 4854 -7479 6168 -295
347b95l462P394j0929Q653j3j3227J3755m976m629J0280j0826P852M282j2094
$$ -295 -3757 3637 -7292 1361 1348 -11879 1876 -3100 -7729 2551 -8275 -423 3859 -8235
361h235J3962l282o036J1876r627M024M439j2699J2581k953q317J2357r367K405
$$ -8235 5727 2445 -3591 8285 -1342 2682 7121 -5578 7003 4050 -4267 8090 -1277 1128
375A128P052j3930R847m07r671R972r206R8P681j3628R149J170r838J3257o029
$$ 1128 8180 -5750 4097 3690 -5981 3991 -5215 -5117 2564 -11064 -1915 -745 -10583 2674 -3355
390c355n12J0131j1669P287M377j0142J0000n300k390J0066j2510N703O417j2746
$$ -3355 -3867 6264 -5405 1882 6259 -3883 6117 817 -1573 8493 -4017 1686 8103 -4643
404d643R252j153m211Q064j1806M456O234j3746P283q76o849R799r242K996Q882
$$ -4643 4609 3456 -755 7309 -4497 -41 6193 -7553 -270 -1146 -7995 1804 -7438 -4442 4440
419D440j2820Q565K750p327J0197p468K43P998j3244Q276K871j0134R675m992
$$ 4440 -8380 185 2935 -4392 5805 -1663 -1420 6578 -6666 1610 4481 -5653 4022 -970
433i70K28J0298j1694N602M478j0201R130n953m109Q507j2392L499O028j0689
$$ -970 -742 9556 -2138 3464 7942 -2259 6871 918 -3191 5316 -7076 -3577 2451 -8238
447h238Q581l046l871J1755q646J754N124r819Q785k207o434J1278q810P65R111
$$ -8238 343 -2703 -6574 5181 -3465 -1711 3413 -6406 2379 172 -6262 5016 -3794 -3029 6082
462F082q828O989N83o303J0170p756n87Q399j2522L366J920p461R880p628l080
$$ 6082 -2746 4243 4826 -1477 8693 937 350 8749 -3773 -407 1513 -5948 3932 -3696 -6776
477f776J1169q252M215K538p965R963o097m313J1213j0340P21M765q112R146k864
$$ -6776 4393 -3859 356 2894 -5071 4892 -1205 -5518 5695 -4645 -3924 841 -7271 1875 -989
492i89m414J1192q196K539P427q926O835k474n916J1090q322j687P289q948O021
$$ -989 -5403 5789 -2407 132 7559 -1367 5468 2994 -2922 8168 -154 -1841 5448 -3500 2521
507B521M4o402J0571p828l867Q489p572L827k407q748J2453m901m233R954p049
$$ 2521 2565 -3837 6734 -1094 -4961 3528 -4044 -217 -2624 -11372 1081 -3820 -8053 1901 -5148
522e148L931M894n419R497n073l574J0546r560J388M499r588O825k575m464J0176
$$ -5148 -1217 3677 -1742 7755 2682 -892 9654 94 1482 5981 -3607 3218 643 -3821 6355
537F355p852L67N348q551Q147j807q880R381o094j311O230q922O992L17q043J1364
$$ 6355 -1497 -1130 4218 -4333 3814 2007 -6873 2508 -3586 -4897 1333 -7589 -597 -280 -8323 3041
553C041k833k051N722q463P309K918r650Q309m097k781R506p339K959K463p649
$$ 3041 208 -1843 3879 -4584 2725 5643 -4007 4302 205 -2576 6930 -409 2550 5013 -2636
568b636R961k924o431P883p508N62K835r765P673k031p343Q456m277K454N480
$$ -2636 7325 4401 -2030 5853 -1655 -1093 1742 -8023 -350 -2381 -9724 -1268 -5545 -3091 2389
583B389r592P771K424n697Q044n799K84O509r273O434K338q431P471l334r33O488
$$ 2389 -7203 568 2992 -2705 5339 -460 -176 6333 -2940 3494 5832 -2599 4872 1538 605 7093
599G093r144M345J392r694Q680k354n626N244o628N464L546r925P911k10l448
$$ 7093 -2051 2294 3686 -6008 2672 318 -5308 -64 -6692 -1228 2318 -7607 304 94 -3354
614c354P119p535L187N113j0407O314J372m774P261o755J819P021q392O495L64
$$ -3354 3765 -3770 -583 4530 -5877 437 1809 -2965 4296 -2459 -640 6381 -2011 4484 4848
629D848p776Q295l516j630M687r970N634K432q237O227l483j531O457q311M824
$$ 4848 -2928 5367 1851 221 4908 -5062 572 3004 -5233 994 -2489 -4020 2437 -5874 -1050
644a050L537r086O944j533k128P256q124K338N375o025O485k532l184Q717p044
$$ -1050 2487 -6599 345 -1188 -3316 3940 -4184 -1846 3529 -2496 3989 1457 -1727 6990 -54
659e4N43N954q063N038j433n245P834o230l20O019r238M702K199n582O179o159
$$ -54 489 6443 -1620 3418 1985 -3260 4574 -1656 -1976 4043 -5195 -493 1706 -3876 2303 -3856
675c856M7Q059q942K810K638n549P211l897j964Q431p560K700L764o089P155l442
$$ -3856 -3809 4250 -4692 -1882 756 -4793 2418 -1479 -3443 4988 -2572 128 3892 -2197 4958 1516
691A516m083Q871o153K69M114o918N201j447m665P920p371k81O268q012M452n32
$$ 1516 -2567 6304 151 420 4534 -2384 2817 1370 -3295 4625 -2746 -3027 3241 -4771 -319 -851
707h51m028P445o152o32P452o894L026O90m324Q827m746k800P880o261L257K237
$$ -851 -4879 2566 -3586 -4218 3234 -3660 -634 56 -4268 4559 -187 -2987 4893 -1368 1889 4126
723D126o230O969l358k571P212p719K289L280p747O105k029m132P073o581J222
$$ 4126 -2104 4865 1507 -1064 6148 -1571 718 3998 -3749 2356 327 -3805 3268 -3313 -2091
738b091L926p393O345j612n308Q540m944o68N146n977O117l07n672R198l763j936
$$ -2091 1835 -5558 787 -825 -6133 2407 -2537 -3205 1941 -4036 2081 1774 -3898 5300 1537 -399
754c99N082o080N335J88p346P495k797k869N268o554L267J552o696P309l287m442
$$ -399 4683 -1397 3938 4126 -3220 4275 1478 -1391 3877 -2677 590 2142 -4554 2755 -532 -4974
770d974P029n179J655J712o160P727k021m702P604m080P47L783o543O681q26n076
$$ -4974 2055 -3124 -1469 243 -5917 1810 -211 -4913 2691 -1389 -642 3141 -3402 3279 2453 -2623
786b623P191m484L38M137p215N243Q00o386O769l561j469M961p160L858R86o443
$$ -2623 4568 84 422 4559 -2656 2587 3387 -2999 3770 209 -1260 3701 -3459 399 1385 -5058
802e058O770l813k022N889o867M090K569o702Q074k265l079N870o002L626K891
$$ -5058 1712 -2101 -4123 1766 -5101 -1011 1558 -5144 2930 665 -2414 3456 -2546 1080 3971
817C971p322N861l41l291N060m415J664L666p523N517j60n366N509m873L18M359
$$ 3971 -3351 2510 2169 -1122 3938 -477 1187 4853 -2670 2847 2687 -2679 2830 -2043 -1725 2634
833B634p780M453J411n797N982l009n48N024o785M153K680o573O251k103j955
$$ 2634 -5146 -693 718 -5079 903 -2106 -2654 2370 -4415 -262 2418 -4155 2096 -7 -1962
848a962N954o441L420L785p025N480j233k700N699o859K385M020p571M400n04
$$ -1962 3992 -2449 971 4756 -2269 3211 1978 -722 4977 -1882 503 4523 -3048 1352 848
863H48l758N529n706R18M535p278M387P23m590N936m302O7N845p093L825J910
$$ 848 -2910 2619 -3087 -2169 2366 -4912 -525 198 -4392 1544 -2758 -2691 3154 -3939 -114 1796
879A796m825O347l306p95N980o264K777K170n066N068l096k092O064o647J251
$$ 1796 -3029 3318 12 -783 5197 -1067 1710 3880 -1186 3882 786 -1306 4758 -1889 -638
894f38L287o109M767k176k777O203n882Q12L952n585M597j161l355P231n439P9
$$ -638 2649 -3460 1307 -869 -3646 2557 -3325 -2513 1439 -4146 451 -710 -4065 3166 -2273 -2194
910b194O012o202L855J71l041O351n190K6N477o516K565J244m843N627l566j901
$$ -2194 3818 -2384 1471 1642 -1399 4952 -238 -212 5265 -1251 1314 2558 -2285 3342 -224 -2125
926b125N715o033J907J769m995N614l429k665O822n449P70L229m879N041j786
$$ -2125 3590 -2443 -536 1233 -3762 1852 -1577 -4242 2580 -2869 -2099 1130 -3749 1292 -494
941d94k698O556m910O43M286n594N051n99m187O368l982o04L821n216M063q26
$$ -494 -3192 3364 -1546 -903 3383 -2211 2840 2241 -1946 4422 440 -164 3657 -1559 2504 1678
957A678m865O791l891k390M784n047K575N81m886O246l369k181O060n226K204
$$ 1678 -3187 3604 -287 -2677 2107 -2940 -365 216 -4670 1576 -1793 -3974 2086 -3140 -936
972i36K064n006O463k052k458N692m618J704K443n372N571j567m270O455m184
$$ -936 1128 -3878 2585 533 -1925 3767 -851 853 3296 -2076 3495 1928 -2342 4113 -71
987g1K51K856n946N019r52m688O308l957j103L945n229L590M19n032N805k876
$$ -71 180 3036 -2910 2109 1157 -3531 2777 -1180 -2283 1662 -3567 23 442 -4590 1215 -1661
1003a661q05M284n385L688J623n232O380j649k732M872m243K641J838n697N333
$$ -1661 -2466 1818 -3567 121 1744 -3488 2892 1243 -1489 3383 -860 1781 3619 -2078 3255
1018C255j623l404N647m693J065K827o482M578n70l727M431m550J298L596o378
$$ 3255 1632 -1772 3875 -818 247 3074 -3408 1170 600 -3127 1304 -3246 -1948 1648 -4730
1033d730M073J334m549N321k753N50L700n975M291J715n408N464k103j258M068
$$ -4730 -657 677 -3872 1449 -1304 -754 2946 -3029 1262 2977 -2431 3033 930 -328 3740
1048C740n526L926J816o571M694j242j868L936n764K522K615o484M666o23k965
$$ 3740 -1786 2140 3956 -2615 2079 837 -1031 2905 -2859 -337 2278 -4206 460 -163 -3128
1063c128M247m397K182L008o290M754J00l591N478l556P18L127n042M520O47m591
$$ -3128 1119 -3278 -1096 1912 -4378 376 476 -3115 2363 -1193 -475 2652 -2390 2130 2777 -1814
1079a814N286l166k73M293n915K729J382n018M768k938j184M525n932K234K030
$$ -1814 3472 306 33 4326 -1589 1140 2522 -2496 2272 -666 -1850 2675 -3257 -1023 1007
1094A007m363M479k383k165N735m663J062K665m276M698k035j788N848n029O99
$$ 1007 -3356 1123 -1260 -3425 2310 -2353 -1291 1374 -2902 1796 -239 -2027 3821 -1208 -509
1109e09M172m620K700k52k505M998m968L79M890o174K031P49k990M728m491r57
$$ -509 3663 -957 1743 1491 -1014 3984 -984 -605 4285 -1889 142 891 -2099 2629 -1862 -2819
1125b819N266n799K370J299l647M491l164p71N462n247J895K409l811M058j789
$$ -2819 2447 -3352 -982 317 -3330 1161 -2003 -2774 2688 -2559 -664 1745 -2066 1992 203
1140B03j035M950n464J911L161n096L623j307k117M898n080M46L579n324L186
$$ 203 -832 4118 -1346 565 3726 -1370 2253 946 -1171 3727 -1353 -907 2672 -2652 534
1155E34m57l037M835l606p46L707m335L148J4l784N134k088j257M243m593K693
$$ 534 77 -2960 1875 -1731 -2477 1230 -3105 43 57 -3727 1407 -681 -1938 2305 -2288 405
1171D05J532m226N243k182j762M442m286K255J366m438M701k191l021M929l405
$$ 405 1937 -2289 2954 772 -990 3452 -834 1421 2787 -1651 3050 859 -2162 2767 -638
1186f38k0J394m037M857j738m167N739k815q38K738l745M142n72l745N925k901
$$ -638 -658 736 -3301 1556 -182 -4349 1390 -1425 -2263 475 -3270 872 300 -3445 2480 -421
1202d21n13L783m236L102M76l744N126k810j578M227l833J563N07l828M811k237
$$ -421 -934 2849 -1387 1715 2191 -1553 3573 763 -815 3412 -421 1142 1649 -2179 2632 395
1218C95l304M819l735J085J215m139M693j365k708M748l965J245K784m781L945
$$ 395 -2909 1910 -1825 -740 475 -3664 1029 -336 -3044 1704 -2261 -1016 1768 -3013 932
1233I32k29k577M549l626J127L323n386L683N04l573M114k477n36L051m605L161
$$ 932 703 -1874 2675 -951 176 3499 -1887 1796 2300 -1273 2841 364 -172 2879 -1726 1435
1249A435K23m576M476j805j783L085m218K743J516m848L992q68j255L176l765
$$ 1435 1658 -2918 1558 -247 -2030 1055 -3163 -420 1096 -3752 240 -628 -1883 1293 -2472
1264b472K247K551m992M112j35k420L824l112J414J927m637L644K24l657L696
$$ -2472 -225 2326 -2666 1446 1311 -1109 2715 -397 1017 2944 -1693 1951 2175 -1482 2214
1279B214k598RK540m594L009L40l910M067k497m78L268m637K502J855m035L899
$$ 2214 -384 -375 2165 -2429 580 920 -2990 1077 -1420 -1898 1370 -3267 -765 1090 -2945 954
1295I54k028p26M182m570K196K152l697L639j351j474M419m519J439K361m471
$$ 954 -1074 -1800 2382 -2188 8 2160 -1537 2102 751 -723 3696 -823 616 2977 -1494
1310a494L345r22k446L988l840O09L004m780K541j5k607L722l203K57L537m463
$$ -1494 1851 929 -1517 2471 -1369 -760 2244 -2536 5 -10 -2617 1105 -2098 -1841 1696 -2767
1326b767K711O43k959M189k789j94M271m462K090J482l192L647k014j067L926
$$ -2767 -56 587 -2372 1817 -972 -1166 3105 -1357 733 2215 -977 2670 656 -411 3515
1341C515m347J064K100l762L139j804j440M014m534Q38K610m055K924r45j705
$$ 3515 -832 232 2332 -1430 1709 -95 -1535 2479 -2055 -1217 1393 -2662 262 -683 -2388
1356b388M151l516J55K905l516K900o49j867M335k999l66L644l660K111J65k276
$$ -2388 1763 -1753 -1598 1307 -2209 691 42 -1825 2510 -489 -855 2789 -871 1240 1405 -871
1372h71L816l038n51L479l779R85J187l090L309k131j335L814l709R83J455l372
$$ -871 2945 -93 -644 2835 -944 41 1228 -1862 1447 -684 -2019 1795 -1914 -931 524 -2848
1388b848L452j459j558M372l346L24K453l117L331j155j998M605k962k32K566
$$ -2848 604 -855 -2413 1959 -1387 -1063 1390 -1727 1604 449 -1549 3056 94 -138 2428
1403B428k945K140l30k776M427k897j055L043l584K274j46l109M052k284j415
$$ 2428 -517 1623 1293 -1483 2944 47 -1008 2035 -1549 725 579 -2530 1522 -762 -2177
1418b177L345l449J697R46l331L936j666j049L221k810J395J705l525L869j066
$$ -2177 1168 -2281 -584 362 -2969 967 -699 -1748 1473 -1337 58 1763 -1762 2107 1041
1433A041k078L918l017Q44J735m029L272l47k870L663k531j04J719l407K806j22
$$ 1041 -1037 2881 -136 708 2443 -1586 1686 1339 -1531 2132 -399 -503 1216 -2191 615 493
1449D93l552L795j786j002K735l242K569N47l348M051j372p76K707k887K306P42
$$ 493 -3059 736 -1050 -2052 683 -2559 10 557 -2791 1260 -112 -888 1819 -1068 1238 1980
1465A980l357L543j192j770L112k663J218J273m017L468p18k692L348k601L97
$$ 1980 -1377 2166 974 -796 2316 -347 871 2144 -1873 1595 877 -1815 1533 -1068 -671
1480f71J738l945L385l50k872L511j933K8J976l332L024K25k945L750j746j98
$$ -671 1067 -2878 507 157 -2715 796 -1137 -1109 867 -2465 559 784 -2161 1589 -157 -355
1496c55K812l381K050J108l139K989j491j018K614l321J782J047l367K763r34
$$ -355 2457 -924 1126 2234 -905 2084 593 -425 2189 -1132 650 1697 -1670 1093 159
1511A59j969K952l036R45J958l737K648l28j402L057k978P32K511l291K186L78
$$ 159 -1810 1142 -1894 -949 1009 -2728 -80 -408 -1810 1247 -1731 -999 1512 -1779 407 785
1527G85j403K714k706O62K795l869J827R70k298K643k186j69K530l569J207J085
$$ 785 -618 2096 -610 52 2847 -1022 805 1775 -523 2120 -66 -235 2295 -1274 -67 1018
1543A018k892K876j962m44K547l565J374J848l098K414o76q38L320l509J153K264
$$ 1018 -1874 1002 -960 -1404 1143 -2422 -1048 800 -2298 116 -560 -1398 1922 -1587 -434 1830
1559A830l209K387j01j173K992l197M76K495l393K074J83k448K910j982q18K635
$$ 1830 -1379 1008 907 -266 2726 -471 5 2500 -893 1181 1364 -1084 1826 -156 -974 1661
1575A661l259J360K58k117K999k018q04K824l203J623J352k640K864j436o23L354
$$ 1661 -1598 -238 20 -2097 902 -1116 -1920 904 -2299 -676 676 -1964 900 -536 -1159 2195
1591B195k832O48J327k249K899j340j709L473k584J48J807k681K472j224k193
$$ 2195 -637 11 1338 -911 1988 648 -1061 2412 -172 -24 1783 -898 1574 350 -1843
1606a843L466k146r34K343k844J853k79j800L466k678m03L139k674J405N02k224
$$ -1843 1623 -523 -1457 886 -1958 -105 -384 -2184 1282 -1396 -1799 1340 -1334 71 573 -1651
1622a651L269j648r75L153k511J334N42k242K998j799j519L084k479P67P72k546
$$ -1651 1618 -30 -1005 2148 -363 971 1513 -729 2269 470 -1049 2035 -444 323 1095 -1451
1638a451K327q66j722K905k458K53J544k649J989m73j246K619j822L73K011l013
$$ -1451 876 10 -1712 1193 -1265 -1012 532 -2117 -128 -601 -1847 772 -1050 -677 1334 -1679
1654a679K573j18k269L409j278q60K003k333K022J73k748L071j347j055J810k206
$$ -1679 894 776 -1493 1916 638 -222 1781 -552 1470 1643 -1105 1966 619 -436 1374 -832
1670h32J073O50l007K898r64j581K327k286R43J199k725K742j58k164K842j726
$$ -832 241 891 -2116 782 -182 -1763 564 -1722 -779 420 -2305 437 279 -1885 957 -769
1686g69L86J684k800K846j27k410L198j713M6J362k628K099J13k712K487j051
$$ -769 -383 1301 -1499 1347 1220 -1190 2008 295 341 1703 -925 1174 1287 -1425 1062 11
1702A1o54J865l000K062J63k604L131j507r81K314k510J401N54k280K569n82j254
$$ 11 -643 1222 -1778 284 447 -2157 974 -533 -1514 800 -1710 -309 245 -2035 534 -48 -1302
1719a302K487k172J229J275k632K377M1j824K298k012O31J695l288J703K93j776
$$ -1302 1185 -987 242 1517 -1115 1262 1303 -521 1777 -235 396 2091 -1197 506 799 -977
1735i77K090j989K12K009l602J910P66k291J848j135j28K203l162J937J316k519
$$ -977 1113 -876 -664 1345 -2257 -347 419 -1872 -24 -1159 -1287 916 -2246 -309 1007 -1512
1751a512K433m42r31K338k650J015J882k924J853p25m94K170k624Q49J502l127
$$ -1512 921 479 -452 1886 -764 251 2133 -791 1062 337 -157 2013 -611 238 1740 -1387
1767a387J856Lj730K388k482K93J863k628J311K96j761K776j817j82K516k625
$$ -1387 469 472 -1258 1130 -1352 -1059 804 -1824 -513 -217 -1978 798 -1019 -1201 1315 -1310
1783a310J706L70j824K598j678j92K405k482R80J112k109K202j433r47K925k894
$$ -1310 396 766 -1058 1540 -138 -330 2075 -407 573 1685 -424 1778 345 -602 2323 -571
1799e71L99R71j982J515p43j230K226k096K26J728k138J866n20j063K725j916
$$ -571 -172 799 -1183 332 -411 -1641 585 -1511 -1285 443 -1695 171 -349 -1412 1313 -603
1815f03l03K246j994J367p8j649K853j995j93K569k094M31N09j780K431j900r11
$$ -603 -906 1340 -654 713 635 -1014 1839 -156 -349 2220 126 557 1066 -714 1717 -183 -1094
1832a094K243k336P72P14j886K251j291j076K716k191N40J072k236K396n51j583
$$ -1094 1149 -1187 -415 299 -1587 664 -627 -1703 1013 -1178 -638 434 -1802 594 43 -1540
1848a540K842j921K84J970k379J926j31j724K667j848j37J605k365J526J75k384
$$ -1540 1302 -619 -335 1635 -744 1182 1051 -673 1994 146 9 1614 -751 775 950 -1434
1864a434K331j121q23J665k241J329N44k572K580o95j266K417k104J276Q80k125
$$ -1434 897 -224 -1047 618 -1623 -294 250 -2322 258 -437 -1703 714 -1390 -114 766 -1359
1880a359K616n51j683K577j615M69J158k336K043k11k295K801j561k16J572k821
$$ -1359 1257 706 -977 1600 -15 454 1612 -724 1319 1108 -1187 1614 53 -163 1409 -1412
1896a412K303n97k028K599j298o87J524k174J755n2k105K599r78p49J913j687
$$ -1412 891 294 -1734 865 -433 -1120 404 -1770 -15 -67 -2172 427 -551 -1300 613 -1074
1912a074J260Q85k196K459q19q25K272k269R98Q45k337K095o70j393K210j979
$$ -1074 186 1071 -1125 1334 515 -310 1962 -307 691 1536 -801 1294 624 -769 1441 -538
1928e38M66R29k404J994m09j628K098j991M04J562k312J778L30j836J850p35l1
$$ -538 -72 857 -1547 447 38 -1590 508 -1483 -1079 483 -1829 -51 279 -1557 293 -442 -473
1945d73J971k553J324R65j777J976j169l08J835k399J471O78k534J995r25p37
$$ -473 1498 -1055 269 1234 -543 1433 264 -44 1791 -608 863 1541 -993 1002 77 -660
1961f60J888k633J060R73k202J623m83j031K124j998N79J905k740J476L71j165
$$ -660 1228 -1405 -345 628 -1574 49 -434 -1465 659 -1339 -760 1145 -1595 -119 252 -913
1977i13J922j625N20J943k825J543N94j420J947j763J53J916k891J324R35k393
$$ -913 1009 -616 -96 1847 -978 565 1159 -261 1686 -77 76 1992 -899 425 1360 -1033
1993a033J933j520q8J840k669J106Q25j843J827j044o50K454k577J095J400k107
$$ -1033 900 -620 -708 1132 -1537 -431 394 -1449 378 -666 -1316 1138 -1439 -344 1056 -1051
2009a051J651k69j118K671k340L73J822k244J501L7j626K442j874q3J727k592
$$ -1051 600 331 -787 1884 -456 -83 1739 -505 996 1033 -593 1849 -25 -108 1619 -973
2025i73J354K47j759K277k015k38J991k017P47P23k005K152j163n84K424j992
$$ -973 381 628 -1131 1146 -869 -1107 884 -1133 -386 337 -1668 484 -679 -1263 1161 -831
2041h31P22Q80j560J886q31p45K076k084N46J592k115J746n99j502K554j837n22
$$ -831 -109 771 -789 1097 266 -479 1597 -487 59 1651 -464 1282 683 -819 1735 -102 -624
2058f24J672k257J648n96j505K612j757m36J574k096J949m3j682K361j314m61
$$ -624 1048 -1209 439 -157 -1662 950 -807 -1243 331 -1765 184 141 -1541 820 -494 -955
2074i55K064j782J151L02k053K892j211r02K302j981O46P42k215K230r55j412
$$ -955 1109 -673 478 780 -1273 1619 408 -494 1808 -173 473 1215 -1000 1230 275 -1137
2090a137K354j516j50R82j966K018j043j306K243j141k65J427k279K001Kj857
$$ -1137 1217 -299 -449 533 -1433 585 -458 -1764 479 -662 -927 500 -1779 222 224 -1633
2106a633K822j331m75J915j785J249L53j806K287j258l19J629k043Q97L73k002
$$ -1633 1189 -142 -617 1298 -487 762 1115 -691 1596 338 19 1648 -395 502 875 -1127
2122a127K074p77j390J975j931P63P32k176K078n04j005J953j400L96J238k345
$$ -1127 947 170 -1220 755 -1176 -413 319 -1857 221 -283 -1288 665 -735 -339 899 -1446
2138a446K012n9j280K074j124J95J196k440J688M14k087K059j110n32J339k118
$$ -1446 566 507 -773 1301 177 372 1568 -872 816 1230 -857 1202 92 -440 899 -1219
2154a219J341P30k337K264r59o20J737k502J305Q26k202J992o43j061J922j729
$$ -1219 122 852 -1485 779 -180 -800 937 -1565 -260 566 -1636 356 -287 -1348 574 -1155
2170a155R95Q44j830J918r2j206J844j475K98J553k451J649l0j495J537r47k18
$$ -1155 -160 684 -1146 772 680 -526 1318 -157 141 1694 -757 892 862 -633 904 -43 -261
2187b61J320k320J205M57j947J948j081l37J896k508J363R24j961J707o69l19
$$ -261 1059 -1261 -56 401 -1546 402 -679 -1016 880 -1628 -265 659 -1302 405 -264 -583
2203e83J789j917Q04J418k217J638o96q88K089k016O22J188k095J663k68j234
$$ -583 1206 -711 93 1511 -706 932 236 -652 1437 -579 43 1231 -864 799 531 -703
2219g03K172j895J20J427k048J282k89j326J995j514j32J719k008J060M21j245
$$ -703 1469 -426 -306 1121 -927 355 66 -1260 735 -779 -911 808 -1200 -140 281 -964
2235i64J799j158m20J985j819Q46R57j781J840r88p54K270k091L01J116k114J886
$$ -964 835 -323 -743 1242 -577 269 1226 -555 1285 297 -457 1813 -278 23 1139 -975 911
2252I11j054r47K031k157K32J496k022J269l7j151J991j488L40J375j904J342
$$ 911 -143 -1090 941 -1216 -984 512 -1510 -241 -278 -1429 562 -926 -586 789 -1115 227
2268B27J24r80J914j337n35K040j949J134L21j594K183j103r19J718j798O40O14
$$ 227 351 -629 1285 -52 -587 1453 -496 638 959 -635 1548 445 -474 1244 -554 86 700
2285G00j900J814r44r27K086k006P03P85j619J675m84j388K065j031N4J218j772
$$ 700 -1200 614 -330 -1257 829 -1177 -474 311 -1308 367 -117 -1505 560 -471 -417 801 -971
2302i71J740k60j392K255j125l13J199j418J206q0j488K013j481m06J176j591
$$ -971 769 509 -883 1372 247 -66 1133 -285 921 841 -647 1366 -115 -521 655 -936
2318i36J066K25j790K134j297n53J847j762Q29N58j789K267q80r17J748j255Q42
$$ -936 130 355 -1435 699 -598 -1151 696 -1066 -237 321 -1468 799 -81 -998 750 -505 337
2335C37L89j466J598k77j128J877j416L43O03j544J577l45j541J983j061l86J222
$$ 337 726 -740 858 581 -547 1330 -86 257 860 -684 893 548 -993 990 -71 -457 765
2352G65k018J258J88j516J304m37j42J026j643Q52P71j980K442p77m60J174j328
$$ 765 -1253 5 193 -1323 -19 -456 -598 428 -1215 -363 408 -1572 870 93 -367 807 -521
2369e21J059O45j883J603j24j221J586j358M76R63k217J708l33j124J425j278
$$ -521 538 1183 -700 903 779 -442 1144 -214 262 1225 -992 716 383 -741 684 -594
2385e94J07R51j786J423k34j303J813r92L42P86j607J108N59j438J658q74q3J466
$$ -594 -487 464 -1322 101 -133 -1436 377 -615 -273 513 -1094 14 573 -865 793 -81 -164 1302
2403A302j835R31O17j538J472p46n09J608k018P45P66j705J416n07j127J660j493
$$ 1302 -533 398 1015 -523 949 203 -306 1302 -716 29 795 -910 506 -1 -1128 532 -961
2420i61L23J154j915J490j95q67J733j490N31J427k210J293L61j150J553j402
$$ -961 -638 516 -1399 91 -104 -971 762 -728 -197 1230 -980 313 674 -476 1077 -325
2436c25K75J467j834Q66L83j122R30o83l34J519k204R02P87j673J425p50m25J614
$$ -325 -50 1417 -417 449 832 -290 640 -43 -377 1142 -1062 -160 627 -1046 379 -371 -796 818
2454H18j962M61J110j520J248l52o04J650j098k06J486j742J239J78j127J664
$$ 818 -1144 -683 427 -1093 155 -197 -801 849 -249 -455 1031 -711 528 706 -421 1243
2470A243j233j03J203j492P19J92j418J916j305l52J473j749Q40L79j383J643
$$ 1243 10 -93 1110 -382 337 529 -889 1027 -278 -630 843 -906 -66 313 -1070 573
2486E73j201k89J379j264O62L13j208J779j034j66J382j147K39R64j265J382p38
$$ 573 -628 -917 462 -802 -140 173 -1035 744 -290 -456 926 -221 18 982 -283 1099 361
2503C61r43J928j517P8J064j260P55p1j521J827j002m22Q97j135P83J49j156J704
$$ 361 -582 1346 -171 -93 971 -289 466 395 -1126 701 -301 -723 174 -961 -178 -29 -1185 519
2521E19p91p48J533j083O71L6r11J587p14p02J725j226N04N42j333J322n81p90
$$ 519 -272 -1020 513 -570 101 137 -774 813 99 -603 1122 -104 400 942 -391 931 350 -440
2539d40J221j037L27O32j688J326l88r67J200r68M32O31j562J429k58j081J852
$$ -440 781 -256 71 703 -985 341 -47 -1014 186 -782 -350 281 -1281 148 -110 -1191 661
2556F61j079J3N41q62J011K24j516K020q63k46J040j257Q18O38j808J459n29p81
$$ 661 -418 -405 136 -726 285 509 -1007 1013 150 -96 944 -313 505 1143 -665 794 265 -516
2574e16J447j270K90M60j330J027r2j181J389q55K04O64j484J506j93j027J750
$$ -516 931 -339 -49 411 -919 108 16 -1165 224 -631 -427 237 -1247 259 66 -961 789
2591G89j099M02R58j817J420j0j128J400p00K87N74j656R78K15j289J300o56k67
$$ 789 -310 92 1050 -767 653 643 -485 915 215 502 1076 -580 398 613 -676 624 -32 -299
2609b99J032j623P28L14j261J413n98l47Q35q61L27Q86j537J263j37n16J266j222
$$ -299 733 -890 -162 152 -1109 304 -294 -641 194 -667 -340 546 -991 272 135 -381 885 -337
2627c37M26Q87j495R93J70p75J175j099J99Q79j722J135j38j096J268r98J06R48
$$ -337 89 976 -519 474 644 -131 1044 -55 144 1023 -699 436 298 -798 470 -528 -422 526
2645E26j573O11R18j355J133r07J85J141j645Q02O94j053J200o30l39J481j498
$$ 526 -1047 -436 482 -873 260 -647 -462 679 -966 -164 530 -523 677 47 -292 1189 -309
2662c09M90Q22j387Q54k49o36J334j458M44O96j067Q97k12p39J139j083l01J339
$$ -309 181 1003 -384 470 221 -415 919 -539 -95 601 -466 431 219 -520 619 -464 -765 574
2680E74j452O50L70q88J199r65j46J313j391P37L51q09J415p81m26J225j293L96
$$ 574 -878 -228 142 -746 453 -512 -658 655 -736 1 352 -457 958 177 -249 976 -317 79
2698G9N92j082J168p76p93J820j365J22Q62j530J300n99p22J398j528M74Q46j426
$$ 79 671 -411 757 -19 -812 1008 -357 -235 627 -903 397 -202 -924 474 -1054 -580 266 -1160
2716a160J429k04q92J571j011j71R93j093Q41J25r22J446q86l88J187j047M95
$$ -1160 269 65 -827 744 -267 -438 555 -538 303 428 -494 952 66 -322 865 -182 313
2733C13j31p35J275p69n97J434j291J59P51j037J067m33j102J433j066L49M77
$$ 313 182 -553 722 -47 -644 790 -501 -342 409 -628 439 6 -1096 337 -729 -380 97
2750I7r91J320l95q93J531q55K58J005j410J076m05n87J327r41l12J139j381M59
$$ 97 -894 426 31 -862 669 -186 72 1077 -333 743 338 -249 1078 137 -175 964 -417 42
2768D2K84r46J034m38n93J129j098N61J31r92J195n39m97J145q73n4Q77j328J596
$$ 42 326 -620 414 -24 -617 512 -586 -25 106 -886 309 -230 -727 418 -455 -509 368 -960 636
2787F36m98l32J114j077L09Q17j598J156j58p97J047p43R2N17j079R19J99j230
$$ 636 138 -194 920 -157 152 969 -629 527 369 -428 619 -124 -32 485 -594 325 524 -706
2805g06Q37m68PN63j365R13L58j244J289k62l53P02q21O80M69j212J348k86l98
$$ -706 131 -337 -330 233 -1132 -219 139 -1105 184 -78 -431 271 -550 130 599 -613 735 449 51
2824E1Q81j107P17M43j479J029k30m57R89j125L59N91j308Q35m1p77J093r20L02
$$ 51 932 -175 542 985 -494 535 305 -152 837 -288 71 662 -646 189 148 -629 464 -456 -154
2843a54N43j094P51Oq34J219n57k58J304j403M33O12j156J474p22k05J023j449
$$ -154 389 -705 46 52 -782 437 -120 -378 926 -477 -44 568 -588 886 164 -41 982 -467
2861d67N97R10j311Q48o12k97Q19j113L94O28j022N85n31k67J222r21j10J292
$$ -467 130 1040 -271 577 -35 -332 487 -626 -232 396 -626 -41 -572 -839 383 -538 -648 644
2879F44j566R49M3l94R60j071L49J061j290O60L58j047R80p62k03J032j059N67
$$ 644 -922 27 70 -324 636 -435 -86 975 -315 345 703 -344 636 -126 -329 703 -356 211
2897B11K61r10R62n40l11R70j292L14O52j095Q88l53m65J233j020J30P56j091
$$ 211 472 -438 524 -16 -327 643 -649 -335 317 -778 110 -243 -708 525 -495 -365 391 -700
2915g00R77k1n63J300j077J84R54j294Q71j82q50J352q87j54R51j603P95J16q20
$$ -700 277 256 -307 993 -84 100 1054 -240 631 449 -401 951 64 -90 861 -742 53 169 -651
2934f51J325j077p5R16j306P20K45j023J066m13n15J630j484M34M56o58J042k66
$$ -651 674 -403 -478 438 -868 -148 97 -926 140 -273 -788 842 -642 -208 248 -410 632 366
2952C66r18J601j172K59N23q15Q88m46p05J174p27j62O02j138N91l30l59J664
$$ 366 -552 1049 -123 136 659 -156 732 286 -419 755 28 -134 468 -670 -79 -409 -768 896
2970H96j439j00R77r91M33K99r21J344p03l65J099r02P42Qj078J631o06o27J288
$$ 896 -543 -643 334 -657 -224 75 -846 498 -205 -570 529 -373 369 377 -701 930 324 -303 985
2989I85j052L39K95r48J021l91q31J176r15K74L85j140Q15q1q99J370o18k45Q60
$$ 985 -67 272 567 -381 640 249 -582 594 -321 -47 338 -802 13 -68 -967 403 -215 -460 400
3008D00j413J026J79p86Q85k18k83Q81j207R14K79j125J204n65k37M44o47P73
$$ 400 -1013 13 192 -594 291 73 -210 671 -536 378 657 -468 736 171 -66 378 -269 504
3026E04j7j259J530n18o86O74r51L64M78j407J409r3r85J176q25L97N42j135J181
$$ 504 487 -772 758 240 -446 228 -723 -359 119 -1288 121 28 -957 219 -606 -209 333 -802 379
3045C79K01r74R44o15J40Q52j243Q28O2r45R88k86m15O94r89K65J33o39R57m90
$$ 379 580 -394 550 -65 75 927 -316 512 574 -371 617 331 -84 610 -379 -114 19 -620 337 -153
3065a53l87J089j466M88O22j052J278m56n43Q29n43K20P47j150P93K02r60J240
$$ -153 -540 549 -917 -429 193 -859 419 -37 -580 249 -294 -74 673 -477 316 518 -442 798
3083G98r76J97J052j280Q00k13p35R24r89L30N11j112R37K8q05Q36q70l4R54j331
$$ 798 -178 19 1071 -209 591 378 -357 567 -422 -92 419 -693 244 272 -533 303 -567 -601 353 -978
3103i78Q07J52p90R50l38l20J038p41K98O50r91P22l84k74J055r20J33Q77j549
$$ -978 -171 -19 -809 141 -197 -517 521 -220 78 728 -263 459 75 -199 856 -64 69 946 -603
3122f03J034l48l74R07j341J76R56r61L78J21o29R50q12L26N61q92J93M83o35
$$ -603 431 83 -291 616 -725 -549 407 -554 -176 -55 -684 266 -546 -220 341 -551 -358 125 -510
3141e10J024p67N4P94j200N32O60q48R82n41k40J087j328K92L35j061J270p50
$$ -510 514 -253 -199 595 -605 -73 587 -261 721 180 -60 1027 -301 -9 326 -735 535 -215
3159b15k83Q43r06K85O74j203R43j19j027J590j287J80R75j146O56K30o39J260
$$ -215 -498 345 -561 -276 398 -805 138 19 -1008 582 -705 -525 450 -696 -40 190 -449 811
3177H11q58m33J371j145M60K18j116J529o76o41J023r55K60O05j121J015m94o85
$$ 811 -47 -480 891 -254 206 424 -692 837 161 -480 543 -412 -152 453 -668 347 -147 -832
3195h32J127j019N37M48j087J387o78p66J078p71M27P85j217J073l69n81J281
$$ -832 295 -724 -187 261 -826 561 -117 -883 195 -576 -149 636 -581 492 123 -458 823
3212H23q66k00Q98j086J156k99p24R76q18o1M44r99O72Q3q55J069m97j78P74r35
$$ 823 -43 -243 655 -431 725 426 -298 678 -140 -201 243 -756 -84 -1 -856 213 -284 -462 312 -623
3232f23N85K96j123J187o45J2P89o68J78M06p73R81l65k78O14l39k59O77p83L53
$$ -623 -38 258 -865 322 -323 -311 478 -190 -12 394 -379 602 237 -41 573 234 -25 652 -131 222
3252B22J64r58J265j037L93L23r86N65J49j159J155n24j65R62j026O87L10j036
$$ 222 386 -572 693 -344 49 372 -614 -49 100 -1059 96 -428 -593 369 -657 30 340 -696
3270f96J116k57m62P38p18N99L56r01R07j84p41Q02p84N53K27j266J165m85n28
$$ -696 420 163 -299 439 -279 320 676 -225 682 498 -243 559 -225 328 555 -711 454 -31 -559
3289e59J179j169L26P44j443P63K93q17Q70o66J61P49j065P46N04j215J004l54
$$ -559 620 -549 -223 521 -922 -159 134 -683 187 -479 -318 431 -634 112 616 -599 405 51
3307E1j46Q02p27M81Q9j007R86o60k26J109j178M08L10j055J079n05j83O41o55
$$ 51 -95 707 -20 461 550 -457 529 -131 -357 752 -426 -18 292 -763 316 -189 -372 269 -386
3326c86L6Q82j167L50L64o07R35n91k37J099j110N96K27o06M47j35k56Q87p71
$$ -386 -350 532 -635 -285 79 -528 407 -184 -421 678 -432 164 391 -215 232 97 -159 728 -43
3345d3J53K25o98J027p39l05R83q80O0L60r15J127p02j25O40j067N16N34p68N89
$$ -43 110 335 -363 664 -75 -380 603 -277 -217 143 -772 355 -347 -472 168 -899 -383 151 -617 -28
3365b8Q3l35R81j132J52O50o77N93m3n26J199q46j62R43r18P44m53o52Q57m58
$$ -28 55 -280 701 -431 -279 371 -306 287 244 -282 917 71 -91 852 -66 678 225 -427 430 -28
3385b8o11J172r43J89J19o81J038o15k88J073j057L86N44q64R30m80l56J161r27
$$ -28 -639 533 -410 -221 -102 -783 255 -360 -648 425 -632 -246 298 -566 364 -116 -472 689 -238
3404b38L56L13o29O29k83o67J190n26j13K26o30O20l85m11Q96o40L5O50q84O07
$$ -238 118 431 -198 431 148 -519 671 145 32 258 -372 248 -137 -548 348 -292 -257 393 -491 116
3424A16j00n61R06m45j55P72j131N14J55n72Q20j95k96O48p18K33O18o67O84m69
$$ 116 16 -545 361 -84 -239 533 -598 -84 71 -501 319 124 -172 476 -242 -9 609 -58 626 157
3444A57k52P40o09mK68o79M99R8j023J042n38k98Q28r29N01K97o77R19n29n9N47
$$ 157 -95 645 36 32 300 -379 120 218 -805 237 -301 -599 229 -700 -199 98 -579 340 -189 -248 299
3465B99q45R47J17p93R71n82p6M09o45M59K39r57J046m92l91N02m96N46l9q08
$$ 299 -546 401 518 -275 696 114 38 447 -198 261 500 -457 589 97 -294 208 -288 258 219 -589
3485e89N57J1n66P39n97P6L86o07Q69n25k59Q01n46M87K46r14O27N11q94M72n28
$$ -589 -32 -21 -587 152 -445 -369 17 -590 279 -246 -505 296 -250 237 483 -431 196 707 -187 285 -243
3506b43K54O61j011L17M37q66Q76o60m1J046j325M25L05r83J078n98n0P44j175
$$ -243 11 672 -339 -22 415 -451 425 -235 -276 770 -555 -130 175 -808 270 -328 -378 366 -809
3525h09O77P24j122R91k72l81Q67r36J52O14p33N18n0m68Q88o91R6M58j085O35
$$ -809 -132 592 -530 461 189 -192 675 -261 -109 505 -228 290 240 -228 660 -31 65 523 -562 73
3545G3J04p32J185q81l0M36l74rL71o02P70p42k85J002o45L99L92q02M03Kk05
$$ 73 177 -555 630 -251 -281 155 -219 -228 143 -459 311 -431 -716 286 -359 40 432 -370 33 35 -170
3566a70R27q52L47K66m34M27l95k41R18r50J71N21q82N19k01o34J090p39j15Q31
$$ -170 757 -95 252 518 84 511 116 -125 793 -157 14 535 -347 172 -29 -663 427 -312 -427 404
3586D04p14L08r9n45R18k65n25Q52n64M43J98n32P36l19n09J008j070O40Ol04
$$ 404 -310 -2 -101 -646 272 7 -518 334 -230 213 411 -121 615 296 -213 795 -275 365 371 67
3606F7M21m37l72N24m24K03L56q88Q45k76o56P78m64k09N05k98N44j76k35M73
$$ 67 488 51 -321 203 -221 -18 338 -550 295 19 -637 141 -323 -532 -27 -325 219 43 -192 281
3626B81m66PP28j050Q41J82q39N92k10k32O08o37N12r2n10O73l28n31Q92o73l4
$$ 281 -185 -178 550 -500 341 523 -316 276 66 -166 442 -195 317 225 -285 388 60 -471 421 -252 -286
3647b86M48o59O37k09m63P67q17K58K75k98P15n4p56J015p58L5M28n73P45l11
$$ -286 162 -497 140 -69 -532 235 -582 -324 -49 -347 368 314 -442 573 -185 -150 278 -295 450 139
3667A39m53J056o90K43J59o86M80q1o92Q46m64k57N70p55L58K40o07O23k16k36
$$ 139 -314 742 52 295 454 -232 248 167 -525 321 -143 -400 170 -585 -227 13 -594 29 -187 -423
3687d23O91q69N68J46n19O50j86l04O82k95r0M64j013R16j03q24P68l62O9L73
$$ -423 268 -601 -33 113 -406 244 58 -246 436 141 51 515 -498 418 315 -509 259 -103 -34 339
3707C39j155J300l1j091R23q46Q91K78p99K41r6o93O45l9j50O93o87J1N87n23
$$ 339 -816 484 453 -638 285 -561 330 608 -191 50 -46 -739 -94 -133 -283 410 -277 -266 321 -202
3727b02J087r1q90J158j278J42J192j524M76J29p90O13o3j80M05p14N78j53n85
$$ -202 885 794 -96 1062 -216 -74 1118 -406 70 199 -591 22 -41 -221 184 -530 48 -105 -690
3746f90N84l00L23L53o33J99L24q90Q59j52j02N05o92J76N69n58L79m12J74O17
$$ -690 -106 -406 -83 270 -363 -164 160 -730 129 -23 -125 380 -312 -136 433 -125 254 -158 16 633
3766F33q40O0O52r57Q33n02k21P10p89L11K52m19L23n2o63J097j036M61N54q94
$$ 633 -207 -147 505 -452 381 -121 -342 368 -421 -110 142 -277 46 -6 -669 428 -608 -147 407 -487
3786d87M98l4l96P00n53J43P19q00L21K0m21R06o29j35O56o43J95K32o32O64l74
$$ -487 11 -23 -419 281 -272 -129 590 -210 111 131 -290 616 -13 -148 508 -135 60 292 -340 324 -50
3807e0k90N75p60L74L70p48N39J1k96P06n40nN34m33J63j07j59P18k78n48O48
$$ -50 -340 235 -525 -151 219 -529 10 21 -275 431 -109 -114 420 -13 150 43 -116 602 324 -224 424
3828D24n77M38j04l49P25o83k34P78o48M15k96m21Q08m92q8N97n59o8M64n83O35
$$ 424 -153 285 181 -168 557 -126 -360 418 -230 185 -111 -532 276 -216 -304 293 -266 -334 130 -453 182
3849A82l28m23P82l03l59P17n33N91j15l23O49n43O1J01l72L72q8l59M69K3m27
$$ 182 -146 -569 213 -90 -449 268 -265 326 211 -112 537 -6 55 156 -216 156 68 -291 178 201 -226
3870b26N20n92K32L51q20O45k67k45M09k17J50L0n10O89L1p65Q35l98M77j46l58
$$ -226 294 -298 -66 285 -535 110 -157 -402 7 -210 -60 -30 -540 149 180 -585 250 -148 329 183 -175
3891a75O36m20k93O83n47J67M51p64Q49m14o76P49m16K8K73o51N59j14k18N03
$$ -175 461 41 -252 431 -116 51 502 -262 587 173 -503 246 -170 -142 131 -520 39 -75 -293 210
3911B10l42J77p4l52N77l16k78Q31l63j09L78m50L02M37j105J073n60j45M79l86
$$ 210 -132 45 -29 -381 196 -120 -398 433 70 -39 339 -111 191 628 -477 596 36 -109 370 -16
3931a6k9K68l79K41J0k07L81n71J68K21o63M75j79l26R18m97p7J38k73P11j15
$$ -16 -45 223 -156 85 95 -112 269 -302 -134 87 -576 -101 -280 -606 312 -185 -262 -124 -397 314 199
3952A99q37Q61j86J81N63q11M85j62l88M38l00k07N28n48K81j49l50N20k21k31
$$ 199 -638 223 37 218 781 -30 455 293 -95 343 43 -164 364 -184 97 -52 -402 118 -103 -334
3972c34N16o91J34L60m64M03j28k37O11l64K00N37p98N98k91j62N50m95K54L64
$$ -334 182 -509 -375 -15 -479 -76 -204 -441 170 -194 6 543 -255 343 52 -110 440 -55 199 563
3992E63n13O3lk23L99m83J15L30p13L86J4k48J16m1k6N12o26N17K1m53P04n29
$$ 563 50 113 110 -113 286 -197 -82 248 -465 -79 -65 -313 -197 -238 -264 248 -378 139 160 -293 411 -118
4014a18M8L01n98L96K34n01L49K15m66L97l90NM34l27N8R8n79Q77o80l1P50j085
$$ -118 -70 231 -367 29 263 -238 111 326 -140 257 -133 -128 306 -21 37 135 -444 433 -247 -278 472 -613
4036f13O34P5o24P98o43L9N81o05L91j3k13O77n26k69N50k58K89J72o99O35J7
$$ -613 21 96 -528 270 -373 -334 247 -358 33 20 -193 484 -42 -311 239 -19 270 442 -257 378 395
4057C95l55K41n61L07K22n42M90k12r2M16n22N9K90m36M50j05m61N17m72K42L58
$$ 395 40 281 -280 27 249 -293 197 -15 -107 309 -213 -154 136 -300 150 45 -416 101 -371 -129 229
4078B29m81K98jl11M90l11R7M36n85J97M31q83O99l2k94K60n54L49m5m82P77k49
$$ 229 -252 46 45 -266 224 -87 10 446 -139 58 489 -394 305 273 -21 239 -315 34 -11 -493 284 35
4100C5m04L67m62L13m1n0O61o7q43L85j16L25L96j112M18R63l76l39j9n5O02j425
$$ 35 -369 -2 -464 -151 -192 -242 419 352 -491 -106 -222 103 499 -613 -195 768 392 53 34 -21 581 -844
4122h44P50L41j9l4L91j600J623j013k77O33r1R1M73n69j38k29R2K09Q5j92j27
$$ -844 -94 247 228 194 585 -1015 608 -405 -682 -49 -140 -49 424 -145 -283 -512 -420 -211 -126 -318 -445
4143d45K41L47n7L93N89j076L55l40q7K66l3L4L36j025N15L21o75K25j5J80Pl02
$$ -445 -204 143 86 479 1068 -8 347 7 -80 186 153 187 523 -502 13 334 -341 -116 -131 49 56 -246
4165b46L32P5n77N14k91j0M59o24M92k37j62K92M8K5L18m73mN81q88N23L01l90
$$ -246 86 161 -416 98 -193 -203 256 -368 124 -113 -275 17 65 90 408 -65 -69 512 -376 147 448 58
4187E8K61m48L44o3k62K89J4m30M76m23j62M75o27N69Ml10M45k24j46L65n20O08
$$ 58 319 -129 215 152 -110 179 193 -237 239 -184 -346 129 -498 71 75 -235 210 -14 -160 205 -315 293
4209B93k65j4M17k51k98P58o87K06J12o20L72q6J7L97m47O9L22l38J90k33l5J94
$$ 293 28 14 431 180 -118 640 -47 159 271 -349 23 -63 -46 351 -96 -27 295 -43 147 -86 -121 73
4231G3m51J97K25l74M19j53j52M36m20J9N91m33K78j17m34P77o59J55N92p01P8
$$ 73 -378 -181 44 -330 89 -64 -216 220 -200 -181 410 -23 255 138 -296 481 -178 -23 569 -132 -54
4252e4M28o34M91m05J2M30m58N0K70n23N30j96l75P30n24K3O09n64L39l32k68
$$ -54 374 -260 231 -174 -162 268 -190 -140 130 -393 137 -59 -434 296 -228 -205 404 -160 179 -153 -421
4273d21R42n66Q6P6q5L00M7o56N09l02j62P41q36O90l31k32M79k37k87K61m27
$$ -421 521 -45 41 117 32 332 379 -277 232 -70 -232 509 -327 363 32 -200 279 42 -245 16 -411
4294d11M32j1m73M27q8m1K37m57K47L84m48M38j52j42N70n43M3M20n93O94k77
$$ -411 21 10 -463 -36 -124 -165 72 -385 -138 246 -202 236 84 -58 512 -31 12 432 -161 533 256
4315B56l47N30l94mK5k51L92j67l96O57n58J47m5l39N79M9l84K18Ql09M07j15
$$ 256 -91 439 45 41 66 -185 207 40 -356 301 -257 -110 -155 -494 85 134 -250 -32 -24 -333 74 -41
4337d1L15q7p54R58jn27O12o43K87j36k48J99L61k66J72l63K77P1n24M21j56j97
$$ -41 274 187 -567 391 390 -137 475 -168 119 -17 -265 -66 295 29 201 -162 115 186 -338 83 -73 -270
4359b70L92k85m6L51n35O06k25l28O82l93P7L89q73N46Nn05P18j50k00L18m98
$$ -270 122 -163 -209 142 -393 213 -12 -340 342 -51 26 415 -458 88 93 -412 306 156 -44 274 -224
4380b24K62L39p99N30n0qL66l58k36K47l57J40J61o41P44l16K6K27l85L09j7j32
$$ -224 38 377 -422 108 58 50 416 58 -178 69 -288 -148 13 -628 116 -200 -174 53 -332 -23 -40 -172
4402a72L78l46K0Q05r70N93j44n9K80l52N3N56r16L61j0k34L36j5j94K22l22J0
$$ -172 206 -140 -120 685 -285 308 164 105 385 33 86 642 -274 87 77 -157 179 164 -30 192 -130 -120
4424a20K70n02L58j78k92O50k81K0K74l88K87K2j73L43m16J11L73n16M73j71l28
$$ -120 150 -352 6 -172 -464 186 -95 -75 199 -189 98 120 -53 290 -126 -15 358 -158 315 144 -184
4445a84M20l91P4N54n99J88l7j58M02n57k01M51j97j8L56l64L00k66PM81m82L72
$$ -184 236 -155 -81 473 -126 62 25 -133 269 -288 -489 -38 -235 -253 103 -261 39 -227 -220 261 -221 151
4467A51K36p16L72J68l56M41q8l86M10m38M21r9k85K67r3k14N28n11L77l07j76
$$ 151 387 -329 43 211 -145 296 208 -178 232 -206 215 116 -169 98 5 -209 319 -192 185 -122 -298
4488b98L78m31M8M38l18R7K8n9M11m38J79J80k83Q2J28l31M73j60j35K35k94o6
$$ -298 80 -351 -303 135 -183 -86 -58 -117 294 -144 35 215 -68 14 142 -189 284 124 -11 224 -70 -136
4510a36M45n30N27l88r8M01m54R9j86J58L05k73k30O27o12J29L57o21M92J96m12
$$ -136 309 -221 306 -82 -180 221 -233 -134 -320 -162 143 -130 -360 267 -345 -216 141 -480 12 208 -204
4531b04K81k42O1L16j73J43j38k42K17j3k21N07m86K43n9m10P46j39m72N99n40
$$ -204 77 -165 -104 212 39 182 44 -198 19 6 -215 292 -194 49 -10 -420 326 187 -285 314 -226
4552b26NL3n55Q52j60l21N89m01J31K84m89K27o1j54N60m35K60Q3m24M31Q7m50
$$ -226 -221 -188 -743 109 -51 -372 217 -184 -53 231 -258 -31 -92 -246 314 -121 139 222 -202 229 316 -134
4574a34L61j99j50N4j46L75n6n80N23K23p02N79m56K46Q4l12M23k41j64J83l96
$$ -134 227 28 -122 -68 -214 161 105 -475 48 271 -431 148 -308 -62 22 -290 133 -108 -272 -89 -485
4595d85N05K28n55N76m8l40K99m95M73J66n13K67Q1n35N57m69M06M5l19K13P8
$$ -485 20 248 -307 269 221 -119 180 -315 158 324 -189 78 159 -376 181 -288 118 163 -156 57 135
4616A35n00N07j66j31M61m28Q2J42n24M44k5M2J91m33L26K1l37M12j52k79M73
$$ 135 -365 142 -24 -155 306 -122 -40 102 -422 22 -3 39 230 -203 123 144 -193 219 67 -212 261
4637B61n29Q2L25j60J16N4m82N37m45J76K33l74L07J14n71L65k63J18M66m95K29
$$ 261 -268 -186 139 -21 95 149 -333 204 -241 -65 168 -206 101 215 -356 9 -254 -136 330 -165 64
4658F4j03k25M43n14kN60k68J20K66o87N87j33p4M01p51L79R9l63K29J40k83K93
$$ 64 -39 -264 179 -335 -337 223 -45 75 341 -346 241 108 34 435 -316 63 162 -201 28 168 -115 178
4680A78l72L23j93j78O4K58m08M63j60j51K39m46O69R2m82L18m14J41J62j47L12
$$ 178 -194 129 -64 -242 -178 80 -328 135 -25 -176 63 -383 286 378 -104 214 -200 -59 103 -44 268
4701B68o0k59K91j36m08M27k05J08q4J0J04k74r2N84l17M9J97o58N80j4k64L80
$$ 268 208 -51 240 104 -304 123 -82 26 -58 -48 56 -218 -310 274 -43 6 203 -455 125 111 -153 227
4723B27n49J64K05j85K6M1o2J24L18l55J89k41J52n0k49O59o72j9N29m71J5N3
$$ 227 -322 -158 47 -138 -112 -71 -133 -9 309 -46 143 -98 54 4 -245 414 -258 -277 252 -219 -204 -151
4745a51m4L45k47j13J95j0k44L05m59N84r3k67K93m22L34k31J20M73l8o58M09
$$ -151 -195 150 -97 -210 -15 -25 -269 36 -423 161 68 -199 94 -328 6 -225 -105 368 330 -328 81
4766H1q2r5J52j56L96k26k10K06j22j95M55m99L22Mm96N05k7Ro5l59O01o6j68
$$ 81 -1 -96 56 -100 296 70 -140 66 -56 -251 204 -295 27 31 -465 40 13 22 -43 -402 199 133 -35
4789c5J34q3j46L41j31Jj35n1L74l08r7L22l86K61J20n76O98k94k10K37k20q8
$$ -35 99 16 -130 211 80 81 -54 -105 269 -39 -136 186 -200 61 181 -395 303 9 -201 36 -184 -272
4811b72J90r4M41n29p9M25j54N4K42m96L20P1m28N96l41R7L19l91J29L49n44K66
$$ -272 -82 -176 265 -264 -343 82 -72 -18 224 -272 48 119 -309 287 -54 43 362 -29 100 449 -95 171
4833A71k9l84M45k64O8l2k04M08K1l06J81k34jJ25l56J95M13m13J39p4l0L40j70
$$ 171 142 -242 203 -61 7 -25 -229 179 200 -106 75 -159 -160 -35 -391 -196 217 -196 -57 -131 -161 179 9
4856IJ06o6K9J15k81K50J83n23J98K36l73K44L7l68O88n59J78J33k78J54k50k34
$$ 9 115 49 78 193 -88 162 345 -178 20 256 -117 127 164 -204 484 -75 103 236 -42 112 -138 -372
4878c72N19o55M12K42m80M23q0k11K26k69j94N19k48K25K10m15L16q9rK00k63
$$ -372 147 -508 -96 146 -334 89 9 -202 24 -245 -439 80 -168 57 267 -148 168 79 70 270 7
4899GJ24J77j78J06n39J36J10j13J03K3k07L01j73l15P19o68M51p6r8K05p8k62
$$ 7 131 308 130 236 -303 -167 -57 -170 -67 -44 -251 50 -123 -438 281 -387 64 -12 -110 95 17 -245
4921b45L72k87K14K80j84j55N7r0L21l12M7K37l65K12k41k38J75L36k80L38k81
$$ -245 127 -160 54 334 150 -5 52 -38 283 -29 18 255 -110 102 -139 -377 -202 134 -146 192 -89
4942h9J10j11l22M50k40K2K85q1o3J24r6L7j11m8K24m58L26N4l24M08J14j12J63
$$ -89 21 -90 -412 38 -202 -180 105 24 -39 85 -11 26 -85 -133 91 -367 -41 13 -311 97 211 99 262
4965B62m3j6j52m0r2J77k87R5J83j91K52l15J11J7j89J99J33l60L91j32J81j08
$$ 262 219 203 51 11 -81 96 -191 -96 87 -104 148 -167 -56 -39 -228 -29 104 -256 135 3 184 76
4987G6n1O2l50K44N2K6J24l1k48J75k19J77J19k81J57o6n37N37Q1q8Nk47Q7K60
$$ 76 25 87 -263 -19 33 59 183 152 -96 79 -140 37 156 -125 32 -34 -571 -34 47 -41 -36 -283 -196 64
5011F4j60J15j34J08J52j30j27J8J63m6R3l09K41j81l8L73m6j85K35m89K55k1
$$ 64 -96 19 -115 -7 145 15 -112 -94 69 23 116 -193 48 -133 -171 202 156 -29 206 -283 -28 -49
5033d9o6K35l05M1K1J3J1Q5j98L39o2K81l49j67K49N4k46J50M0J31o5k20K68M3
$$ -49 -115 120 -185 -144 -123 -110 -99 -14 -212 127 65 346 -3 -170 79 133 -113 37 77 208 143 -77 191 234
5057B34m38M07j77n5L8l36M76J3k56K27j99j70K16j20M4Oj30L90l25J54n5j53
$$ 234 -204 203 26 -29 9 -327 149 162 -94 133 -66 -236 -20 -140 -96 -90 -220 170 -155 -1 -56 -209
5079b09R9M5k42J43J59J02J00l17M3J57l11M0K91k48J29o5ML39l67J16n6r4N10
$$ -209 -110 -65 -307 -164 -5 97 197 -120 -77 80 -231 -191 100 -148 -19 -84 -80 259 -108 8 -48 -142 368
5102C68n21R9K24l48l0L13m8K0j9j26M19m31L0L13l31Q1j0k4K65l94Q8J37K7K09
$$ 368 -153 -54 170 -178 -208 105 57 77 58 -68 351 -80 -50 263 -68 13 3 -21 244 -150 -62 75 102 311
5126C11l51L5p8Q7P4k18p5Q5k9m6J28o5J02R3k91K56o5j81N12k81k52L90l50K21
$$ 311 -40 -5 -83 4 78 -140 -215 -130 -159 -205 -77 -142 -40 53 -238 18 -47 -228 284 3 -249 141 -209 12
5150A2j22j02L56j35l4K78k76j52K26N9J01k43l17O42k72J38K49o57L34j50j24
$$ 12 -110 -212 144 9 -25 253 -23 -175 51 110 211 -32 -349 293 21 159 408 -249 85 -65 -189
5171a89M27l28K27N1r2j10K08k15N6k33m7M04l00K66K5p5L01n02R6M48o87L73
$$ -189 238 -90 137 188 96 -14 194 -21 35 -198 -245 159 -141 125 150 75 376 -126 -30 418 -269 104
5193A04nl67M34j63P4q0n6K08k71k4J97M6k89R6N5J74m8l21N81k92j08K49j58
$$ 104 99 -268 166 3 77 -3 -59 149 -122 -146 51 97 -192 -96 -41 133 85 -236 345 53 -55 194 36
$$ [...]
8191a64
##END NTUPLES=NMR FID
##END=
