##TITLE=1H_Pr 4631-Q
 D2O,8 sc, 
 1.10.2021
##JCAMPDX= 6.0         $$ Bruker NMR JCAMP-DX V2.0
##DATA TYPE= NMR FID
##DATA CLASS= NTUPLES
##ORIGIN= UXNMR, Bruker Analytische Messtechnik GmbH
##OWNER= root
$$ XWIN-NMR		Version 3.5
$$ Fri Oct  1 12:45:22 2021 Russian Standard Time (UT+4h)  she@DPX200
##.OBSERVE FREQUENCY= 200.1313468511
##.OBSERVE NUCLEUS= ^1H
##.DELAY= (6, 6)
##.ACQUISITION MODE= SIMULTANEOUS
##.ACQUISITION SCHEME= undefined
##.AVERAGES= 8
##.DIGITISER RES= 18
##SPECTROMETER/DATA SYSTEM= spect
##.PULSE SEQUENCE= zg30
##.SOLVENT NAME= D2O
##.SHIFT REFERENCE= (INTERNAL, D2O, 0, 15.7039)
##AUDIT TRAIL= $$ (NUMBER, WHEN, WHO, WHERE, WHAT)
$$ ##TITLE= Audit trail, XWIN-NMR		Version 3.5
$$ ##JCAMPDX= 5.01
$$ ##ORIGIN= Bruker BioSpin GmbH
$$ ##OWNER= she
$$ F:/spectra/data/she/nmr/H-F/1/audita.txt
$$ ##AUDIT TRAIL=  $$ (NUMBER, WHEN, WHO, WHERE, WHAT)
(   1,<2021-10-01 12:43:50.93 +0400>,<she>,<DPX200>,
      <created by zg, POWCHK disabled, PULCHK disabled
       configuration hash MD5:
       00 E9 B6 7A A2 85 ED C7 34 08 36 98 17 FE 4E 26
       data hash MD5: 16K
       BB 17 AA 31 28 6A BB 46 57 5B DA 14 C9 35 AB 77>)
$$ ##END=
$$ 
$$ hash MD5
$$ C9 47 05 05 17 92 71 A9 05 D3 90 AA B5 24 96 AF
##$RELAX= 
##$RELAX= 
##$RELAX= 
##$RELAX= 
##$RELAX= 
##$RELAX= 
$$ Bruker specific parameters
$$ --------------------------
##$DU= <F:/spectra>
##$EXPNO= 1
##$NAME= <H-F>
##$PROCNO= 1
##$TYPE= <nmr>
##$USER= <she>
##$AMP= (0..31)
100 100 100 100 100 100 100 100 100 100 100 100 100 100 100 100 100 100 
100 100 100 100 100 100 100 100 100 100 100 100 100 100 
##$AQSEQ= 0
##$AQ_mod= 1
##$AUNM= <au_zg>
##$AUTOPOS= <>
##$BF1= 200.13
##$BF2= 200.13
##$BF3= 200.13
##$BF4= 200.13
##$BF5= 200.13
##$BF6= 200.13
##$BF7= 200.13
##$BF8= 200.13
##$BYTORDA= 1
##$CFDGTYP= 0
##$CFRGTYP= 5
##$CHEMSTR= <none>
##$CNST= (0..31)
1 1 145 1 1 1 1 1 1 1 1 1 1 1 1 1 1 1 1 1 1 1 1 1 1 1 1 1 1 1 1 1 
##$CPDPRG= <>
##$CPDPRG1= <>
##$CPDPRG2= <>
##$CPDPRG3= <>
##$CPDPRG4= <mlev>
##$CPDPRG5= <mlev>
##$CPDPRG6= <mlev>
##$CPDPRG7= <mlev>
##$CPDPRG8= <mlev>
##$CPDPRGB= <>
##$CPDPRGT= <>
##$D= (0..31)
0 1.2 0 0 0 0 0 0 0 0.06 0 0.03 0 0 0 0 0.0002 0 0 0 0 0 0 0 0 0 0 0 0 
0 0 0 
##$DATE= 1633077830
##$DBL= (0..7)
120 120 120 120 120 120 120 120 
##$DBP= (0..7)
150 150 150 150 150 150 150 150 
##$DBP07= 0
##$DBPNAM0= <>
##$DBPNAM1= <>
##$DBPNAM2= <>
##$DBPNAM3= <>
##$DBPNAM4= <>
##$DBPNAM5= <>
##$DBPNAM6= <>
##$DBPNAM7= <>
##$DBPOAL= (0..7)
0.5 0.5 0.5 0.5 0.5 0.5 0.5 0.5 
##$DBPOFFS= (0..7)
0 0 0 0 0 0 0 0 
##$DE= 6
##$DECBNUC= <off>
##$DECIM= 32
##$DECNUC= <off>
##$DECSTAT= 4
##$DIGMOD= 1
##$DIGTYP= 9
##$DL= (0..7)
0 120 120 120 120 120 120 120 
##$DP= (0..7)
150 150 150 150 150 150 150 150 
##$DP07= 0
##$DPNAME0= <>
##$DPNAME1= <>
##$DPNAME2= <>
##$DPNAME3= <>
##$DPNAME4= <>
##$DPNAME5= <>
##$DPNAME6= <>
##$DPNAME7= <>
##$DPOAL= (0..7)
0.5 0.5 0.5 0.5 0.5 0.5 0.5 0.5 
##$DPOFFS= (0..7)
0 0 0 0 0 0 0 0 
##$DQDMODE= 0
##$DR= 18
##$DS= 0
##$DSLIST= <SSSSSSSSSSSSSSS>
$$ [...]
##$SUBNAM2= <"">
##$SUBNAM3= <"">
##$SUBNAM4= <"">
##$SUBNAM5= <"">
##$SUBNAM6= <"">
##$SUBNAM7= <"">
##$SUBNAM8= <"">
##$SUBNAM9= <"">
##$SW= 18.0517286264689
##$SWIBOX= (0..15)
0 0 2 0 0 0 0 0 0 0 0 0 0 0 0 0 
##$SW_h= 3612.71676300578
##$TD= 16384
##$TD0= 1
##$TE= 0
##$TE2= 300
##$TE3= 300
##$TEG= 300
##$TL= (0..7)
0 120 120 120 120 120 120 120 
##$TP= (0..7)
150 150 150 150 150 150 150 150 
##$TP07= 0
##$TPNAME0= <>
##$TPNAME1= <>
##$TPNAME2= <>
##$TPNAME3= <>
##$TPNAME4= <>
##$TPNAME5= <>
##$TPNAME6= <>
##$TPNAME7= <>
##$TPOAL= (0..7)
0.5 0.5 0.5 0.5 0.5 0.5 0.5 0.5 
##$TPOFFS= (0..7)
0 0 0 0 0 0 0 0 
##$TUNHIN= 0
##$TUNHOUT= 0
##$TUNXOUT= 0
##$USERA1= <user>
##$USERA2= <user>
##$USERA3= <user>
##$USERA4= <user>
##$USERA5= <user>
##$V9= 5
##$VALIST= <valist>
##$VCLIST= <CCCCCCCCCCCCCCC>
##$VD= 0
##$VDLIST= <DDDDDDDDDDDDDDD>
##$VPLIST= <PPPPPPPPPPPPPPP>
##$VTLIST= <TTTTTTTTTTTTTTT>
##$WBST= 1024
##$WBSW= 4
##$XGAIN= (0..3)
0 0 0 0 
##$XL= 0
##$YL= 0
##$YMAX_a= 75324
##$YMIN_a= -72066
##$ZGOPTNS= <>
##$ZL1= 120
##$ZL2= 120
##$ZL3= 120
##$ZL4= 120
##$ABSF1= 10
##$ABSF2= 0
##$ABSG= 5
##$ABSL= 3
##$ALPHA= 0
##$AQORDER= 0
##$ASSFAC= 0
##$ASSFACI= 0
##$ASSFACX= 0
##$ASSWID= 0
##$AUNMP= <proc_1d>
##$AZFE= 0.1
##$AZFW= 0.1
##$BCFW= 1
##$BC_mod= 2
##$BYTORDP= 1
##$COROFFS= 0
##$CY= 11.3945322036743
##$DATMOD= 1
##$DC= 2
##$DFILT= <>
##$DTYPP= 0
##$F1P= 2.36226072786647
##$F2P= -0.459571619588291
##$FCOR= 0.5
##$FTSIZE= 0
##$FT_mod= 4
##$GAMMA= 1
##$GB= 0.15
##$INTBC= 1
##$INTSCL= 1
##$ISEN= 128
##$LB= 0.24
##$LEV0= 0
##$LPBIN= 0
##$MAXI= 10000
##$MC2= 0
##$MEAN= 0
##$ME_mod= 0
##$MI= 1.114404
##$NCOEF= 0
##$NC_proc= 0
##$NLEV= 6
##$NOISF1= 3.799351
##$NOISF2= 2.8
##$NSP= 1
##$NTH_PI= 0
##$NZP= 0
##$OFFSET= 15.70392
##$PC= 1
##$PHC0= -14867.33
##$PHC1= -11.79918
##$PH_mod= 1
##$PKNL= yes
##$PPARMOD= 0
##$PSCAL= 0
##$PSIGN= 0
##$REVERSE= no
##$SF= 200.130013532006
##$SI= 16384
##$SIGF1= 3
##$SIGF2= 2
##$SINO= 400
##$SIOLD= 16384
##$SREGLST= <1H.CDCl3>
##$SSB= 0
##$STSI= 0
##$STSR= 0
##$SW_p= 3612.71676300578
##$SYMM= 0
##$S_DEV= 0
##$TDeff= 0
##$TDoff= 0
##$TI= <>
##$TILT= no
##$TM1= 0
##$TM2= 0
##$TOPLEV= 0
##$USERP1= <user>
##$USERP2= <user>
##$USERP3= <user>
##$USERP4= <user>
##$USERP5= <user>
##$WDW= 1
##$XDIM= 8192
##$YMAX_p= 0
##$YMIN_p= 0
$$ End of Bruker specific parameters
$$ ---------------------------------
##NTUPLES= NMR FID
##VAR_NAME=  TIME,          FID/REAL,        FID/IMAG
##SYMBOL=    X,             R,               I
##VAR_TYPE=  INDEPENDENT,   DEPENDENT,       DEPENDENT
##VAR_FORM=  AFFN,          ASDF,            ASDF
##VAR_DIM=   8192,          8192,            8192
##UNITS=     SECONDS,       ARBITRARY UNITS, ARBITRARY UNITS
##FACTOR=    0.0002768,     1,               1
##FIRST=     0,             0,               0
##LAST=      2.2672688,     0,               0
##MIN=       0,             -72066,          0
##MAX=       2.2672688,     75324,           0
$$ Real data points
##PAGE= N=1
##DATA TABLE= (X++(R..R)), XYDATA
$$ [...]
1536F42J003K44o41j234j238o35K25J003J295R80K03o55j220j197o18K43J002
1553e98J265R56J75o55j214j173n73K60R97J250R19J48o66j196j136n49K92R88
1571e10J234Q82J27o83j186j105n19L05R91J218Q45Q8o82j173j068m94L32R83
1589d15J192Q11O3o98j161j045m51L47R75J165P82L6p00j143j024m12L60R71J146
1608G99P58Op08j136r82l94L79R88J113P20j4p11j116r53l76M09R74J092O84k8
1628A504p32j100r24l38M12R59J082O45m7p52j064q97l07M14R71J040O19p0p45
1647F70j064q66k73M40R41J022N92r6p44j025q48k38M57R41R90N51j19p39j024
1666d32q00k30M65R48R58N30j57p33j009p69j83M58R41R24N03j72p54r73p53j60
$$ plain form
1536 642 1645 1889 1248 14 -1224 -1859 -1634 -631 664 1644 1847 1192 -28 -1225 -1843 -1600 -598
1553 -598 667 1623 1798 1143 -71 -1244 -1817 -1557 -560 690 1609 1757 1091 -105 -1241 -1790 -1498 -510
1571 -510 724 1606 1733 1050 -136 -1241 -1760 -1455 -464 754 1599 1687 1005 -168 -1236 -1730 -1398 -415
1589 -415 777 1588 1651 953 -208 -1253 -1704 -1357 -382 783 1565 1601 901 -242 -1266 -1678 -1318 -347 799
1608 799 1557 1563 855 -281 -1263 -1657 -1278 -290 823 1543 1529 818 -298 -1251 -1627 -1218 -244 848 1532 1504
1628 1504 772 -328 -1252 -1590 -1178 -219 863 1508 1461 709 -355 -1252 -1559 -1145 -174 866 1485 1415 670
1647 670 -394 -1260 -1533 -1093 -152 870 1462 1366 622 -403 -1251 -1489 -1032 -91 899 1450 1331 592 -432
1666 -432 -1232 -1462 -997 -49 909 1439 1282 549 -460 -1229 -1412 -954 -13 911 1414 1242 488 -485 -1238 -1398
1686a398M86R25R02M73j93p44r67p17j31N01R12Q71M38j94p51r42o82j19N22Q92
1706H4Q57M08k20p49r25o57p8M99R03Q31L64k37p51r00o23o0N18Q66Q20L42k50
1727A042p43q96o06k0N35Q61P73L28k78p38q81n63j3N46Q50P66K93k86p44q51
1747f25n36ON59Q28P35K66l15p33q25n27N0N57Q22P04K40l22p40p99n02O6N64
1768e27Q16O62K24l37p32p88m48O8N73Q11O37J96l51p33p69m27R4N76Q05O16J71
1789A137l67p32p35m05J15N76P83N93J48l71p34p16l86J31N87P62N77J20l98p04
1809a9p05l58J48N87P49N42R7l96p01o84l29J65O02P38N15P8m05p04o66k89J85
1830h50N88P01N10N5m06p03o31k87J98N82P06M79K7m24o79o15k58K09N92O83M44
$$ plain form
1686 -1398 -912 13 915 1388 1195 451 -516 -1233 -1364 -863 49 920 1358 1164 413 -529 -1211 -1330 -808 84
1706 84 941 1349 1129 380 -545 -1202 -1280 -781 122 953 1317 1080 329 -571 -1194 -1254 -736 130 950 1292 1042
1727 1042 299 -597 -1203 -1223 -688 173 946 1274 996 258 -623 -1186 -1199 -653 197 963 1256 970 226 -625
1747 -625 -1161 -1155 -596 232 967 1233 918 185 -640 -1167 -1117 -560 262 966 1206 884 144 -655 -1157 -1091 -527
1768 -527 289 951 1175 838 106 -682 -1130 -1062 -489 322 959 1155 804 71 -698 -1125 -1031 -455 350 966 1137
1789 1137 770 38 -697 -1102 -987 -411 372 965 1113 742 8 -708 -1094 -963 -376 386 963 1083 685 -19
1809 -19 -724 -1082 -934 -347 402 944 1041 645 -56 -740 -1069 -904 -302 436 951 1029 624 -80 -746 -1035 -850
1830 -850 -262 439 949 1004 598 -105 -736 -1023 -825 -243 463 942 969 545 -134 -749 -1007 -798 -206 477 921
1851I21J2m33o69n81k43K28N96O64M11Jm32o59n68k19K60N67O48M06k4m47o42
1872b03n46j90K60N74O39L67m1m45o33n38j69K71N75O01L63n7m52o26n05j47K81
1893f21N54O00L36p9m46o19m79j36K85N56N92L20r5m54n93m71j06K87N56N51L08
1914H46j07m45n87m39r2K95N57N35K77j24m55n81m20p5L12N39N27K40j14m55n74
1935c40l90o9L27N34N04K22j32m60n51l67n2L30N36M85K10j53m59n42l56k0L35
1956d08N28M74J82j69m60n17l38qL37N26M37J77j86m51n22l16J6L38N14M41J45
1977G40j95m55m94l14K7L46N14M24J25j98m54m90k82N3L52M98M03J19k15m51m79
1998d26k74O5L62M88L95J10k28m58m70k43N7L74M72L67J12k51m56m52k33Q9L60
$$ plain form
1851 921 933 500 -169 -750 -993 -765 -169 495 906 907 475 -184 -752 -971 -711 -144 504 910 886 439 -203
1872 -203 -749 -939 -679 -105 534 901 860 415 -218 -756 -925 -654 -79 522 885 828 376 -250 -755 -902 -621
1893 -621 -67 533 869 790 344 -275 -754 -890 -605 -49 543 863 768 314 -279 -750 -856 -569 -13 538 846
1914 846 739 294 -293 -732 -824 -529 28 563 840 716 261 -320 -740 -815 -503 36 563 803 689 234 -340
1935 -340 -730 -799 -472 62 566 788 656 196 -355 -722 -774 -444 92 577 787 634 175 -367 -723 -743 -408
1956 -408 120 594 776 607 147 -370 -708 -716 -379 147 584 761 575 124 -398 -714 -698 -360 154 595 740
1977 740 545 90 -404 -718 -691 -345 169 593 718 520 66 -424 -706 -653 -301 197 600 719 504 53 -426
1998 -426 -700 -635 -273 215 610 720 492 34 -436 -679 -622 -248 224 591 703 452 -4 -456 -689 -600 -240
2019b40M90L55Q5k48m62m38k40J10L84M73L42O7k72m55m23k12J22L87M63L32L9
2040F59k68m62m14j85J28L91M52L18L1k81m47m03j82J40L87M33L14J7k94m41m00
2061e07j61J68L88M20K98mk84m45l76j48J58L96M40K68k5k85m41l63j32J76L89
2082g0M34K48l1k98m35l50j24J81L89M22K36l2l26m06l54j03J80M01M09K34n8
2103E47l22m21l22r6J92M02L94K15n9l18m06l20q3J97M02L90J97o1l22m15l08
2124e17n9K11L92L82J87r0l22m03l08m2K16L88L71J69r7l27m06k73m0K32L85L51
2146D00J65j03l33l83k72k3K38L84L38J62j23l45l74k51j9K40L91L43J33j28l34
2167A06l88k30rK57L74L19J25j37l41l67k31J4K56L75L17R2j31l52l55k25L1K64
$$ plain form
2019 -240 250 605 690 442 -20 -458 -698 -588 -204 269 611 678 406 -49 -472 -684 -562 -175 288 620 659
2040 659 391 -71 -485 -670 -542 -151 301 619 650 369 -78 -481 -663 -523 -136 297 611 628 334 -107 -507
2061 -507 -668 -500 -112 308 606 602 318 -127 -503 -651 -493 -97 343 611 586 301 -140 -503 -635 -459 -70
2082 -70 364 612 581 283 -152 -502 -626 -445 -56 366 602 570 244 -162 -516 -619 -439 -38 371 605 547
2103 547 225 -196 -518 -614 -422 -20 374 589 530 212 -194 -514 -597 -400 2 392 589 528 206 -209 -517
2124 -517 -576 -365 27 409 596 506 184 -219 -527 -569 -353 35 406 575 478 151 -255 -528 -568 -336 49 400
2146 400 565 462 129 -254 -526 -549 -311 73 411 573 450 105 -269 -520 -539 -299 92 435 568 440 106
2167 106 -282 -512 -521 -264 110 429 554 417 76 -291 -522 -508 -252 123 440 532 401 49 -306 -531 -500 -236
2189b36L58L08R1j49l30l62k10M3K73L60K92Q4j64l34l41j94M4K81L63K71P4j70
2211C52l33l38j87N7K72L73K52O7j84l47l30j64O2K90L50K60M7k04l37l31j50
2232e23Q9K97L36K51L5j91l53l01j37R5K95L35K46Pk13l27l08j37J19K90L39K14
2254D58J6k16l31k93j35J23K94L28K08Pk31l21k91j05J16L02L14J94%k30l22k76
2276c91r2J33K85L32J84j9k34l30k49q8J37L00L06J74k3k32l11k58p6J45K94K91
2298B78J67l8k35l14k48n4J44K95K83J61n2k29l07k35n3J43K88K86J47m1k52l00
2320a66k21n0J58L03K59J56o4k44k94k15m0J51K96K76J30p7k42k96k00m2J77K87
2342D2K57J17n5k65k82k09k6J78K88K53J20q9k47k78j96k3J91K78K45J08r8k47
$$ plain form
2189 -236 122 430 521 372 42 -320 -530 -487 -214 146 438 522 358 24 -317 -511 -467 -186 177 448 522 352
2211 352 19 -319 -506 -449 -177 196 448 515 331 -16 -346 -510 -448 -158 192 452 499 295 -42 -373 -523
2232 -523 -434 -137 199 450 485 294 -59 -360 -497 -402 -107 228 474 481 268 -59 -367 -504 -385 -95 244 458
2254 458 474 258 -73 -366 -501 -378 -84 244 452 459 228 -93 -384 -489 -373 -71 243 437 437 207 -115 -391
2276 -391 -483 -350 -65 267 451 432 198 -132 -381 -469 -332 -32 274 448 425 193 -118 -376 -452 -307 -13 278
2298 278 445 407 172 -142 -390 -444 -300 -5 278 439 387 158 -149 -384 -437 -294 -6 280 427 386 134 -166
2320 -166 -387 -437 -279 24 283 439 375 131 -163 -378 -418 -267 29 305 435 358 116 -180 -380 -422 -245 42
2342 42 299 416 361 96 -186 -395 -421 -243 45 298 418 329 82 -196 -392 -415 -224 54 299 407 309 62
2364F2k63j92QJ74K83K52R2r6k56k57j91QJ81K79K37R4j13k43k69j76QJ87K88
2387I7K27P3j09k55k58j64NJ99K80K31P3j16k52k64j54J5K00K73K36N7j20k50
2409B4k69j39K6K07K83K15N3j34k50k66j37M5K02K66K14N9j45k40k69j29M3K01
2431a40K73J94N4j40k60k43j38N8K06K75J96M7j50k60k46j14N9K10K72J97L0j52
2453B28k60k35j07O0K08K73J71L7j54k71k36j02O6K26K58J88J5j50k58k40j11
2474c94P1K24K69J75Qj56k53k32j04Q9K17K60J70J2j66k56k23j04P8K31K69J69
2496C54%j62k56k23r0Q9K22K56J68Lj68k63k28p2Q3K24K54J50nj76k49k10q6J01
2520b84K17K59J55j0j85k33k11p8R6K26K46J42kj84k47k01p9J09K33K36J52k0
$$ plain form
2364 62 -201 -393 -385 -211 72 324 416 320 64 -193 -384 -376 -195 84 321 415 302 59 -210 -386 -378 -191 97
2387 97 324 397 288 33 -225 -389 -384 -185 95 326 399 283 31 -233 -387 -372 -172 101 337 394 274 24
2409 24 -245 -384 -358 -151 132 347 400 266 16 -250 -387 -342 -140 126 340 399 254 14 -255 -384 -341 -140
2431 -140 133 327 381 241 -19 -262 -400 -342 -136 139 335 382 232 -28 -274 -388 -329 -119 153 350 380 228
2453 228 -32 -267 -374 -314 -106 167 338 375 221 -50 -286 -388 -322 -96 162 350 365 215 -43 -283 -394
2474 -394 -323 -99 170 345 353 197 -56 -288 -392 -303 -86 174 344 356 190 -66 -289 -393 -315 -84 185 354
2496 354 354 192 -64 -287 -377 -288 -66 190 358 361 193 -70 -298 -370 -287 -63 191 341 336 160 -89 -299 -385 -284
2520 -284 -67 192 347 337 152 -81 -292 -370 -274 -48 198 340 338 154 -93 -294 -373 -264 -31 205 357 337
2542C37j76k54k03o9J11K36K33J43l6j67k58j90n7R5K36K34J31l0j81k51j89n3
2564c58J18K18K38J45m3j89k37j94m7J18K35K30J19l7j84k50j85l9J21K32K22
2585B33J15n0j84k32j87l8J34K23K20J14n0j98k33j76k5J18K29K18J04n2k08k22
2607a47j60l0J35K27K14R6n3j98k28j65k4J41K37J98J06p4j88k26j60qJ46K22
2629F1J97P5o6j98k34j45j1J41K25K04P8p4k05k20j43%J44K18J96P5o9k17k14
2652a82j34KJ67K18J85P2p9k04k22j30J5J45K27J77O8r4j94k15j21J7J53K16J60
2675B47O8r2j94k14j23J9J57K09J77N6r8k04k10j19K2J67K08J77N6j09j94k05
2697a99j12L7J57K22J76K9j03k06j94j09K9J75K08J65L0r8j98k04j08L8J62K13
$$ plain form
2542 337 161 -93 -296 -365 -254 -18 215 358 322 155 -103 -293 -350 -255 -19 215 346 316 135 -116 -305 -358
2564 -358 -240 -22 216 361 318 129 -108 -302 -349 -231 4 234 353 316 132 -118 -303 -342 -221 11 233
2585 233 348 298 114 -118 -305 -343 -209 14 234 348 298 100 -133 -309 -334 -216 13 231 335 283 75 -147
2607 -147 -307 -337 -202 25 239 335 282 84 -144 -309 -333 -192 45 243 349 275 87 -139 -299 -307 -161 61
2629 61 258 333 267 69 -165 -310 -321 -180 45 249 327 253 48 -172 -315 -315 -171 47 243 318 249 32 -182
2652 -182 -316 -314 -147 71 256 328 249 45 -177 -307 -292 -147 80 257 325 231 37 -178 -299 -282 -129 87 247
2675 247 315 223 29 -185 -308 -289 -132 77 254 310 212 8 -202 -321 -299 -132 76 253 309 200 6 -199
2697 -199 -311 -274 -117 105 281 310 207 1 -193 -302 -273 -98 110 275 305 207 9 -195 -303 -265 -103 110
2719A10J52M4j04k15j98r5L9J76K05J49K2r9k08j95q2L5J59K15J49K9j12k02j73
2742a99j10O0J66K19J47K1j30j87j94r5N8J66K19J43J0j22j99j95p4N7J62K16
2764A39J26Jj10j96j80r0O9J60K09J40J6j32k05j70q7P1J74J96J42jj13k01j91
2787b33o7P5J80J88J37Lj30j96j83o7Q1J67K09J17j6j28j94j72p0Q5J60K05J16
2810B67j5j19k07j64m8O3J81J99J09lj45j91j70m0P1J78K03J12j4j49j94j67l8
2833b81R1J80J82J06j6j46k07j49m1P7J94J83R9k6j52j95j47m7R4J79J78J06k7
2856B35j32j86j76l9J11J77J84J05l3j50j97j48l1R8J91J81R9m1j46k02j38l7
2878b75J03J83J82Q3l3j55j94j46j7J05J73J77R2n0j55j88j41k6J09J76J89P8
$$ plain form
2719 110 262 306 202 -13 -211 -306 -267 -91 114 263 285 186 -22 -217 -299 -264 -105 110 259 288 176 -26 -199
2742 -199 -309 -249 -83 136 283 304 174 -13 -207 -302 -244 -78 141 284 294 172 -27 -222 -296 -239 -77 139
2764 139 265 266 156 -40 -220 -310 -241 -81 128 268 284 152 -53 -223 -310 -239 -65 131 273 272 159 -42 -233
2787 -233 -300 -225 -45 143 280 283 153 -43 -226 -293 -212 -45 164 281 265 137 -57 -229 -299 -214 -54 151 267
2810 267 252 133 -74 -238 -286 -223 -42 157 266 263 118 -73 -243 -283 -212 -34 169 281 267 118 -76 -243 -281
2833 -281 -190 -10 172 278 262 116 -91 -240 -281 -204 -10 173 272 246 94 -101 -248 -295 -201 -22 156 262 235
2856 235 103 -83 -259 -298 -187 -10 174 279 246 96 -101 -249 -280 -182 9 190 289 248 102 -100 -238 -275
2878 -275 -172 11 193 276 243 88 -106 -252 -269 -164 9 186 278 228 73 -115 -256 -282 -173 3 192 270
2900B70n1j50j97j35k2J20J82J88O8m0j62j98j31qJ10J88J72Q7o6j59j94j33r
2923b70J33J69J77P6o9j68j92j20LJ10J97J78M8n8j77j85j36J2J26J88J78N8o8
2946B10j64k00j17QJ24J89J79O4q7j66j84j34K0J34J96J60O3q6j73j96j10J2J30
2969a28J98J64N4q4j85j91j11K1J31K00J69M6r1j85j87j13L6J39K01J52M7p9j88
2992A6j85j19L6J46K03J57L4r8j82j95r3L7J51J98J45M1j13j79j97q8L5J46K04
3015A00J45L0j03j94j80r8N1J59J96J34L5j24j76j80q8N3J62K12J28J7j08k00
3037b9j87o7N3J65J97J40Pj23j87j67q6M4J75K00J35mj25j84j76q2P5J64J96J25
3061B59qj09j87j69p8O8J69J92J24kj21j93j72o9Q7J68J87J29Kj38j98j58o5Q1
$$ plain form
2900 270 219 69 -128 -263 -285 -165 17 205 273 233 71 -127 -258 -266 -156 32 204 291 225 66 -128 -261 -270
2923 -270 -137 32 209 285 216 48 -144 -264 -261 -151 46 224 272 214 37 -148 -284 -272 -146 42 220 278 210
2946 210 46 -154 -271 -263 -139 50 229 293 206 40 -144 -278 -258 -124 72 232 295 209 36 -160 -270 -258 -128
2969 -128 70 234 288 204 19 -172 -283 -262 -131 69 238 284 193 8 -179 -292 -256 -117 84 236 283 204 16
2992 16 -169 -288 -252 -106 97 254 288 190 8 -187 -280 -243 -92 106 251 292 179 0 -197 -285 -250 -104 100
3015 100 245 275 172 -22 -202 -300 -249 -90 106 240 275 151 -25 -205 -293 -240 -78 134 262 279 171 -29
3037 -29 -216 -283 -230 -65 132 272 279 156 -31 -198 -284 -240 -65 135 270 266 141 -43 -219 -301 -226 -62 134 259
3061 259 251 142 -45 -214 -292 -224 -55 137 261 259 138 -55 -227 -296 -209 -41 146 275 277 139 -59 -217 -282 -201
3085b01J68J87J20j0j36k04j57n4P7J78J86J23k4j36j94j69n3R9J72J88J20l2
3107B48j46j92j60m1R8J79J94R5k0j44j97j53l9R6J76J89R3j9j57j98j41m2J08
3130a73J85J81Q3l3j48k01j50l2J08J87J82R3m5j45k12j37k8J09J81J78R9n0j51
3153H1k02j40l5J24J96J68R1m2j64k03j35j3J12K03J67R2n8j77j93j37j8J21K02
3176D0J62Q7o3j72j94j33j7J28J96J82P4o5j79j95j27oJ24J98J81P3p8j79j86
3199a49j33J1J32K05J58P3p6j73j95j25nJ45K04J71N9q7j86j98j16K1J29K11J59
3222B35M8p9j87j93j12J6J38K15J59M8r5j83j96r9J6J50K06J59M8j03j87j88r4
3245b78K3J53J94J65M7j00j96j92j14L2J66K03J64K5j10j97j86r9M0J56K04J51
$$ plain form
3085 -201 -33 154 274 264 128 -76 -233 -287 -210 -32 154 277 253 117 -77 -246 -299 -200 -28 160 280 248
3107 248 102 -90 -250 -291 -193 -14 180 275 255 111 -86 -239 -278 -182 -6 183 276 257 100 -98 -239 -281 -173
3130 -173 12 193 276 243 95 -106 -256 -288 -180 7 189 282 237 92 -120 -257 -285 -176 5 183 282 232 81
3153 81 -121 -261 -296 -172 24 192 283 241 77 -126 -261 -274 -162 41 208 300 242 65 -128 -265 -283 -162 40
3176 40 202 289 226 54 -140 -273 -290 -162 34 216 290 225 46 -149 -276 -282 -158 40 221 294 216 37 -149
3199 -149 -282 -271 -139 66 224 297 221 48 -147 -272 -277 -132 72 243 302 215 29 -169 -285 -264 -135 76 235
3222 235 283 204 17 -176 -288 -272 -134 81 240 288 193 10 -186 -285 -269 -119 87 246 294 191 4 -184 -278
3245 -278 -255 -102 92 257 304 204 8 -184 -298 -266 -100 103 267 292 182 -15 -201 -300 -260 -104 100 251
3267B51K9j04k01j89q0K8J68K07J55J3j10j90j87r5M9J66K10J43K2j16j98j80
3289b09q8O5J67K03J36J3j08k18j78r2P0J77J88J50J0j31j95j91p5O1J82J99J42
3312B78Lj40j95j86p8P6J73K12J47jj42k03j82o8O3J83K20J34Lj42k12j86o5Q0
3336b28J94K06J21mj48k17j68o5Q2J89K10J27k8j49k18j62n9Q2K03K05J16k1j50
3359A18k15j68m4Q6K05K10J10k6j58k17j63m1R4K10K01J09k6j64k07j82l7J00
3381b05K03K07J06l7j73k13j73k7J05K10K03J11m7j77k21j66k9J06K24J99J07
3402C13n2j76k18j51l4J20K28J95R1m1j83k27j54k3J29K09K03R3o1j78k26j50
3424b93j4J22K19J97Q9p3j76k23j60pJ33K19J93Q3o5j85k21j47j0J44K19J91Q1
$$ plain form
3267 251 280 176 -25 -214 -294 -266 -98 109 264 277 167 -23 -210 -305 -256 -90 120 263 285 169 -29 -209
3289 -209 -297 -232 -65 138 274 287 179 -39 -217 -309 -239 -62 126 276 286 155 -40 -231 -306 -245 -63 136 278
3312 278 281 141 -54 -240 -318 -242 -69 143 290 289 147 -56 -238 -306 -243 -60 160 294 297 155 -57 -243 -308 -228
3336 -228 -34 172 293 289 141 -76 -244 -309 -227 -38 172 299 271 122 -96 -258 -317 -235 -32 173 289 268 118
3359 118 -97 -265 -309 -223 -18 192 302 276 118 -99 -262 -303 -209 1 202 311 285 121 -86 -268 -305 -205
3381 -205 -2 205 311 274 101 -112 -285 -312 -207 3 206 317 270 93 -128 -294 -323 -217 7 206 313
3402 313 261 85 -133 -284 -318 -198 30 225 316 275 92 -135 -289 -312 -183 26 229 322 261 83 -143 -293
3424 -293 -307 -185 34 231 320 247 71 -152 -312 -319 -186 33 226 309 244 59 -162 -309 -319 -175 44 235 316
3447C16o7j91k26j30qJ42K28J80Q4p2k10k18j37QJ45K26J87P2r1k01k07j41PJ54
3471a50K20J92N3q0k09k09j40J8J56K23J77P3q9k14k20j20K4J56K24J88N0r7k03
3494B3k23j06K4J57K21J89M8j10k16k08j14J8J86K23J63M8j05k20k10j10K8J70
3516a24K32J67M5j24k01k11j19L9J80K21J65M8j15k13k09j14N0J88K19J70K4j12
3538B06k17k01j11N9J77K24J50M2j29k20k06j00N5J76K31J65J8j25k27k08r9O4
3560b76J78K35J57K0j39k19k05q9O0K00K19J62J3j32k42j94q2O0K11K26J54%j36
3583A81k34j92q7P2K02K28J43Mj50k25k03p9P1K06K32J35Lj60k26j96p0Q4K05
3606e6K33J34oj64k24j88o8R0K05K23J31Lj65k35j84o4R8K02K33J34k4j61k32
$$ plain form
3447 316 249 58 -168 -298 -306 -164 64 244 328 256 46 -172 -309 -301 -156 70 257 329 238 37 -170 -311 -304 -150
3471 -150 70 262 315 235 26 -183 -323 -305 -149 74 251 324 235 21 -199 -319 -295 -139 85 273 323 226 23
3494 23 -200 -306 -282 -125 96 285 333 223 7 -201 -315 -297 -111 112 275 323 218 -2 -212 -322 -294 -124
3516 -124 108 275 320 196 -5 -216 -335 -296 -116 105 270 318 203 -10 -219 -333 -283 -95 124 294 318 206
3538 206 -11 -212 -323 -264 -87 137 287 329 200 -20 -226 -326 -271 -95 136 301 319 194 -33 -241 -340 -276
3560 -276 -98 137 294 314 175 -44 -249 -338 -278 -78 141 303 316 184 -58 -252 -334 -274 -63 163 317 317 181
3583 181 -53 -245 -332 -260 -58 170 313 317 167 -58 -261 -340 -269 -63 169 304 307 147 -79 -275 -345 -261 -56
3606 -56 177 311 305 141 -83 -271 -339 -249 -44 179 310 313 148 -87 -271 -335 -237 -35 198 332 308 147 -85
3629h5j86o2R6K21K10J31k5j74k20j98m2R7K23K14J30m6j65k40j66o1J12K20K17
3652B01J23l6j73k34j67n7J23K18K09J34n5j66k41j71l8J17K23K14J17n9j75k42
3674a35j64l5J23K22K05J18n8j86k23j71l9J32K21K11J06n4j99k19j64l2J49K07
3696A5K13R7n0j87k33j68j1J42K31J95R9o0j99k39j56rJ39K22K02R1o3j98k33
3719a60j58j9J62K29J93R2p7k01k35j52jJ46K40J93Q3p7k13k28j45J2J46K39J98
3742B67Q7r5k13k14j56%J64K41J88P2q7k15k26j38J4J65K36J90O0r2k22k33j34
3765c41K1J49K57J92N1j08k01k32j34K8J65K43J95N8j12k20k26j35M9J70K43J93
3787C05M4j11k32k19j25L7J76K49J83M2j28k21k29j07L3J84K32J86L6j26k22k25
$$ plain form
3629 -85 -271 -333 -237 -16 194 325 300 126 -94 -292 -334 -237 -14 200 330 284 119 -121 -287 -348 -236 -16 201
3652 201 324 288 115 -119 -286 -343 -220 -2 207 341 286 120 -121 -292 -330 -213 10 224 341 282 107 -135
3674 -135 -299 -334 -211 11 216 334 276 90 -133 -304 -343 -211 10 221 327 273 74 -145 -309 -341 -192 15
3696 15 228 325 275 88 -145 -313 -324 -182 49 244 343 283 84 -155 -311 -320 -181 41 243 334 271 73 -160
3719 -160 -318 -337 -175 54 247 339 262 61 -174 -326 -327 -181 59 252 335 258 45 -183 -328 -316 -170 69 267
3742 267 354 259 46 -168 -324 -324 -160 81 269 341 254 39 -187 -325 -311 -146 90 280 340 248 26 -207 -341
3765 -341 -320 -171 86 278 329 221 20 -212 -346 -318 -153 90 285 343 231 11 -215 -350 -301 -131 112 305
3787 305 349 238 6 -213 -338 -301 -125 124 307 349 221 0 -229 -336 -303 -119 113 299 335 209 -13 -238
3809b38j23N6J87K37J87L0j28k26k34j04N3J87K51J75L1j32k37k23r2N3J99K41
3831A50J72K2j35k33k21j01O4J89K56J61Oj36k40k15j03Q4J98K46J56Rj41k46
3853e8k12q3P1K17K32J60Nj56k33k22q5P7K18K43J60Rj71k29k14p3Q0K10K42J56
3877C44kj71k45k02p3R6K15K34J37lj79k35k01p1R4K08K45J47l0j55k45k09n9
3900c60J00K26K27J48k4j80k46j86o4J00K44K20J38j4j84k35k00o2J10K29K28
3921B15J33k3j90k53j87m5J17K18K30J40n6j78k48j91m6J22K36K20J28m3j80k52
3943a33j78n5J28K43K29J10m0j89k45j86l1J33K33K28J14n2k05k30j85m1J50K30
3965B8K24J07o7k00k36j79k4J47K28K20J04p4k00k46j74nJ45K41K14J05p0k05
$$ plain form
3809 -238 -361 -305 -118 119 306 336 208 -18 -252 -356 -303 -116 135 310 341 209 -28 -251 -343 -290 -91 150
3831 150 322 344 209 -24 -245 -346 -282 -93 163 324 330 194 -46 -261 -364 -280 -82 164 320 329 188 -58
3853 -58 -270 -353 -282 -65 167 327 332 176 -57 -279 -364 -287 -69 174 334 343 172 -57 -271 -344 -264 -54 188 344
3877 344 342 171 -74 -276 -349 -253 -38 196 333 330 151 -84 -285 -356 -262 -54 191 338 308 153 -92 -301 -360
3900 -360 -260 -34 193 341 317 137 -109 -295 -359 -259 -15 205 343 329 145 -90 -290 -352 -242 -13 215
3921 215 348 325 135 -118 -305 -350 -233 -15 215 355 299 121 -127 -318 -364 -242 -6 214 342 299 119 -133
3943 -133 -311 -366 -238 5 234 344 304 115 -130 -316 -347 -214 19 247 361 309 104 -126 -311 -352 -202 28
3965 28 252 359 292 92 -144 -323 -347 -200 28 248 352 278 78 -168 -342 -347 -202 39 253 358 288 83
3987H3k44j68qJ47K40K20R2q2k13k35j63kJ54K42K14Q0p9k13k45j55lJ62K26K18
4011B68R3q3k23k47j46rJ69K43K08Q4j08k13k38j46OJ64K55K08O2q4k27k33j56
4034c53L1J67K39K03O7r9k26k33j40K3J85K40K06N4j19k28k30j42K6J99K31K04
4056C05N0j16k38k26j47N0J84K55J79M7j11k36k34j22L8J92K51J83L8j12k36k28
4078b34j16L2K02K43J84L5j09k41k33j24N3K04K42J83L1j35k42k22j16N0J95K55
4100A37J75K2j38k23k29j05N7J99K45J78K5j43k40k14j07O7K09K39J71K4j37k50
4122c8k10j03O2K08K50J69Jj37k43k24q7P2K13K30J67Pj51k55k17q0R0K12K35
4145A71J57mj49k42k18q6J02K07K50J53j1j67k38k04p6Q7K34K36J37kj73k51j99
$$ plain form
3987 83 -161 -329 -337 -190 50 270 362 280 67 -168 -331 -333 -179 63 277 357 278 65 -180 -335 -338 -176 50 268
4011 268 361 278 55 -192 -338 -347 -178 65 273 357 249 36 -202 -348 -342 -178 77 285 347 263 36 -197 -353
4034 -353 -322 -155 84 287 354 255 29 -204 -344 -321 -136 104 310 364 245 17 -213 -355 -329 -130 101 305
4056 305 355 239 1 -225 -372 -322 -138 117 296 343 232 -4 -238 -360 -322 -130 121 304 342 230 -6 -234
4078 -234 -350 -318 -116 127 311 346 237 -4 -237 -361 -308 -104 138 321 352 217 -25 -247 -363 -313 -118 137
4100 137 312 334 196 -27 -256 -361 -304 -105 140 318 343 200 -40 -254 -361 -294 -85 154 325 349 212 -38
4122 -38 -248 -351 -289 -81 169 338 339 202 -41 -265 -352 -280 -67 163 330 337 186 -69 -286 -366 -276 -64 171
4145 171 328 324 175 -67 -285 -371 -269 -62 188 341 330 163 -75 -279 -355 -268 -34 202 339 337 164 -87 -286
4168b86p6J02K20K53J38k1j71k48k06o5R7K33K45J20j4j90k44j88p4J26K24K44
4190B19J24k9j82k46j93n9J23K40K26J35m1j83k52j91n4J40K17K37J39n4j87k52
4212a23j80n7J47K30K25J21m9k01k53j81m3J39K38K21J07m7k06k35j82l4J46K40
4234B3K14J28p2k08k33j79k4J45K48K31R3p0k06k53j62j7J49K41K25R4p5k19k42
4257a69j63oJ49K53K01J01q0k25k35j71j5J66K55K04Q0p4k18k54j50OJ58K56K13
4280B82Q0r3k20k36j58OJ77K41K09Q7j02k19k49j46MJ82K42K11O9j10k13k56j37
4303c49OJ83K53K00O1r8k36k39j33RJ94K41K02O0j05k35k30j41K4J93K46J99N8
4326C63j23k24k30j34K2J96K54J91M8j15k36k36j38M0K02K44J92L7j20k39k38
$$ plain form
4168 -286 -362 -260 -40 213 351 330 159 -89 -295 -360 -263 -30 215 335 321 131 -113 -301 -375 -249 -25 219
4190 219 343 314 132 -114 -307 -366 -243 -3 223 358 317 134 -118 -309 -363 -223 -6 231 370 316 129 -123
4212 -123 -303 -360 -213 17 242 363 314 113 -140 -321 -364 -225 13 234 341 294 88 -147 -329 -363 -217 23
4234 23 237 365 293 85 -148 -327 -351 -206 42 273 366 296 90 -163 -325 -342 -193 48 273 367 292 73 -169
4257 -169 -332 -338 -189 64 265 366 286 61 -174 -345 -360 -194 61 265 345 271 53 -201 -351 -345 -187 69 282
4280 282 362 269 49 -187 -345 -339 -162 79 288 375 273 54 -195 -341 -337 -155 87 298 367 257 44 -212 -349
4303 -349 -343 -160 93 293 354 256 20 -219 -352 -343 -149 92 294 354 249 14 -216 -357 -333 -140 106 305 363
4326 363 240 16 -214 -348 -326 -130 124 315 363 248 12 -224 -362 -322 -120 124 316 353 233 -6 -244
4347b44j18N6J84K44J83M2j35k34k27j20N2J93K54J87L2j32k33k36j09O3J98K52
4369A52J73L5j37k40k37j01O5K07K49J71K1j42k43k30j05P0K14K39J76J0j47k41
4391d1k25j07P7K04K49J71Qj58k41k13j08R7K11K45J55L2j65k58k04r9Q6K26K40
4414A82J62jj59k51k06q7Q7K24K39J59pj69k49k07p3Q2K17K48J51j5j70k39k12
4437b94p7R0K29K38J51oj74k49k01q0J23K11K45J48k7j73k47j97o6R9K36K37J48
4460C64k7j87k56j88o7J07K35K45J37m7j87k35k05n9J17K33K38J31l2j93k38k07
4482c21m5J14K32K42J30l4j94k56j90m3J25K45K30J16l5j90k48j95l7J36K30K33
4504B45J15m4j93k54j82m7J41K36K22J21n7k05k65j56n1J55K39K32J05o3k10k43
$$ plain form
4347 -244 -362 -306 -122 122 305 347 212 -22 -249 -369 -317 -124 130 317 349 217 -16 -252 -361 -298 -100 152
4369 152 325 360 223 -17 -254 -355 -290 -83 166 337 358 216 -27 -257 -362 -292 -78 161 337 347 200 -41
4391 -41 -266 -373 -296 -92 157 328 336 178 -63 -276 -384 -287 -76 169 324 356 191 -67 -271 -370 -284 -58 182
4414 182 344 343 184 -67 -273 -360 -273 -49 190 349 342 173 -76 -283 -356 -274 -57 191 342 327 157 -82 -294
4437 -294 -371 -281 -52 186 337 331 157 -92 -293 -373 -250 -39 206 354 327 154 -93 -290 -356 -257 -21 216 364
4460 364 337 150 -106 -294 -361 -254 -19 226 363 316 129 -106 -311 -370 -253 -20 218 349 317 124 -114 -321
4482 -321 -366 -252 -20 222 352 318 124 -132 -322 -365 -240 5 235 351 316 126 -122 -317 -354 -218 12 245
4504 245 360 316 123 -131 -313 -360 -219 17 239 360 303 98 -167 -323 -374 -219 20 252 357 294 84 -159
4526a59j78k6J41K50K24J03o2j97k51j68k9J52K52K03J03n7k11k56j61l0J67K34
4548D4K18J04p9k17k32j86j1J62K45K13Q7p3k16k45j60nJ53K50K12Q8p5k28k36
4571a87j62lJ65K45K18R3r0k16k48j66OJ68K54K09P8r4k14k59j51J1J88K27K30
4594C02N1j02k26k25j56PJ79K56K03O2j07k28k35j38K1J87K42K02O1j08k37k32
4616b21j37L3J72K67J89N5j03k33k50j23K7J91K48J86O3j28k30k38j27L8J97K37
4638A13J92M9j42k30k32j12M1J90K62J76L2j28k31k23j28O2K02K33J86L7j38k33
4660b2k20j20O1J94K57J68L6j41k33k24j19O4K03K56J60J8j23k45k24j16O7K16
4682h7K31J65K4j50k28k20j07P5K08K42J68J5j47k46k08r6P0K02K56J58J5j52
$$ plain form
4526 -159 -337 -363 -222 28 252 355 293 96 -155 -323 -352 -200 52 255 358 301 90 -166 -327 -357 -190 44
4548 44 262 366 287 70 -162 -348 -359 -197 48 261 348 275 59 -186 -346 -351 -198 52 264 352 277 49 -187
4571 -187 -349 -352 -187 58 276 369 279 63 -185 -351 -345 -177 77 286 364 270 56 -203 -354 -343 -155 72 302
4594 302 353 251 25 -200 -356 -349 -170 86 289 351 244 16 -219 -357 -336 -149 93 295 356 248 11 -221
4616 -221 -358 -325 -153 114 303 358 255 22 -228 -351 -324 -133 115 301 364 236 6 -232 -359 -321 -124 113
4638 113 305 354 212 -18 -250 -362 -321 -131 131 307 339 211 -20 -243 -371 -309 -107 126 312 349 211 -22
4660 -22 -242 -362 -301 -107 150 318 354 213 -20 -244 -363 -299 -96 160 320 338 215 -30 -254 -370 -303 -87
4682 -87 144 309 333 183 -45 -265 -372 -297 -89 153 321 336 189 -57 -265 -361 -291 -89 167 325 340 188
4704A88k32k18r2P8K06K45J56Kj56k36k13p3O9K25K42J39rj53k37k13q1R0K04
4727f9K44J56j6j61k47k05p1R1K28K35J41mj67k45j87p8R6K16K32J52j1j66k56
4750i2j83q2J10K17K30J39rj88k31j87q1J09K13K39J34l0j77k35j96n8J18K08
4772c2K30J23k7j69k32j90n5J13K21K37J22n0j72k43j78m3J21K26K21J12k8j90
4794A17k37j89l1J19K20K42J00m6j87k39j84l0J24K22K14J28n3k00k25j81k5J31
4816b10K25K07J14n9j79k34j72k9J24K44K08J02n1k07k15j73j8J21K37K04J06
4837C45o1j93k37j53k4J34K22K10R3p2j90k28j62j3J37K22K13R7q0j95k29j61
4859c25mJ51K25K08Q2o9k10k26j43rJ51K25K00Q0p8j97k29j49LJ60K28J92P9r5
$$ plain form
4704 188 -44 -262 -354 -276 -70 175 331 333 177 -59 -272 -345 -276 -51 191 330 321 168 -69 -282 -363 -273 -69
4727 -69 175 331 315 154 -93 -298 -369 -278 -50 185 326 322 155 -90 -277 -355 -259 -43 189 341 330 164 -92
4750 -92 -275 -357 -247 -30 200 339 330 142 -89 -276 -357 -248 -35 204 338 308 131 -104 -300 -358 -240 -32
4772 -32 198 321 294 125 -107 -297 -352 -239 -18 219 341 291 119 -124 -302 -345 -224 2 223 335 307 117
4794 117 -120 -309 -340 -221 -1 241 341 295 108 -131 -315 -345 -221 1 215 343 290 90 -135 -316 -341 -210
4816 -210 15 222 336 277 98 -136 -308 -337 -213 31 239 341 290 83 -132 -305 -323 -202 35 239 345
4837 345 284 91 -146 -299 -323 -189 33 243 336 264 74 -154 -316 -329 -192 30 243 340 260 65 -164 -325
4859 -325 -329 -178 47 255 337 268 58 -168 -311 -320 -169 56 256 336 258 61 -168 -317 -314 -154 74 266 345 250
4883B50j91k30j56J2J49K33J98N6p4k14k33j40J6J51K52J96N0p4k15k28j37K3
4905c06J55K45J73P5r2k25k07j39L0J66K24J86N5j01k07k17j32K0J63K38J86M8
4927C38j02k14k25j20J2J75K34J77M4r9k22k11j24M0J74K28J83L6j14k17k08j12
4949c27M1J72K33J73M7j24k20k08j06M5J71K32J65L6j13k22k03j21N3J72K33J60
4971B89L2j24k24k08j06N4J84K22J67K7j42j99k11r8O1J85K29J58K9j44k20j92
4993b31q8N5J92K30J45J0j29k18j96r1O6J87K29J38Lj21k22k09q4P8J85K28J39
5016B96Rj55j94k17p5P2J97K35J29oj44k12j88o8P0J97K25J35mj46k27j74q1Q7
5040b39J97K17J42j8j39k25j81p2Q5J98K02J36j2j56k11j90n5R6J85K09J28k5
$$ plain form
4883 250 59 -171 -327 -315 -166 67 265 321 247 33 -200 -340 -324 -173 79 275 325 251 36 -192 -329 -306
4905 -306 -151 94 267 342 250 25 -182 -321 -291 -125 99 285 340 239 32 -185 -317 -297 -134 104 290 338
4927 338 236 22 -203 -323 -311 -136 98 275 319 220 -2 -213 -337 -297 -123 105 288 324 210 -7 -215 -327
4949 -327 -286 -114 119 292 339 215 -5 -213 -319 -274 -103 129 294 330 217 -5 -208 -329 -276 -104 129 289
4971 289 321 197 -27 -235 -341 -287 -103 119 286 313 171 -28 -239 -337 -276 -91 138 296 325 181 -39 -231
4993 -231 -319 -264 -72 158 303 313 184 -34 -230 -321 -255 -68 161 299 302 181 -41 -250 -334 -256 -71 157 296
5016 296 305 150 -44 -261 -336 -264 -67 168 297 291 147 -65 -253 -321 -251 -54 171 306 302 156 -71 -245 -326 -239
5040 -239 -42 175 317 299 160 -65 -246 -318 -233 -35 167 303 291 135 -76 -266 -321 -225 -40 169 297 272
5062B72j43k28j68o2R1K00K13J34l5j54k13j69n1R6K01K04J21l0j54k15j77m4
5084c11J03K04J90J19k4j71k13j68m6J04K02K16R2l0j70k14j63l2J03K06J94J06
5106B97m9j64k08j68j2J06K10J91R7n0j74j93j62j9J12J97J98R6l7j85j94j50
5128b61m1J31J99J84R1n3j73k08j35l2J23K04J70Q8n3j74k05j43j0J22K01J88
5150B13Q2o1j78k07j42lJ39K11J74O8n6j80k02j47RJ40J93J83P0p5j73k04j31
5173b77OJ23K06J72P2q0j88j96j28J4J30K00J77O1r1j73j87j29QJ44K03J59N2
5196B78p0j94j85j06J7J29K01J72N3r0j74j95j12J5J37K03J59N3q6j82j95j04
5218b76K3J36J88J58L8p8j84j80j06J7J48J86J60M5r7j79j84r6K5J48K00J40N2
$$ plain form
5062 272 129 -99 -267 -329 -238 -38 175 309 274 120 -93 -262 -313 -217 -16 188 309 279 125 -90 -267 -311
5084 -311 -208 -4 186 305 281 110 -103 -271 -317 -213 -11 205 297 267 97 -117 -280 -312 -209 -3 191 297
5106 297 248 84 -124 -292 -304 -198 12 203 300 250 76 -117 -279 -298 -186 11 209 305 268 83 -111 -261
5128 -261 -302 -171 28 212 303 250 77 -131 -266 -298 -175 29 199 287 234 60 -145 -288 -298 -176 25 213
5150 213 295 234 56 -151 -293 -296 -157 54 228 296 240 60 -142 -289 -280 -140 53 236 306 231 58 -146 -277
5173 -277 -271 -148 58 230 302 222 34 -162 -290 -276 -146 54 231 292 201 28 -159 -288 -280 -136 67 226 278
5196 278 208 14 -171 -277 -260 -131 70 242 295 205 31 -164 -276 -261 -124 79 238 291 205 23 -172 -276
5218 -276 -253 -117 71 229 267 189 5 -175 -281 -264 -116 70 230 275 178 -1 -185 -281 -256 -108 92 232 284
5241B84r6j91j73r9K8J52J96J60K3r1j90j84r5L1J59J86J29M2r9j82j73q6J9J52
5265i8K01J45J7j00j87j84p3L7J50J99J20L3j03j78j71q1O0J37J89J48Pj13j73
5288a8j72p2M9J38K05J23J2j14j82j64p8O3J55J88J19Pj18j92j62o9N7J56J80
5311A11J37lj19j76j65n7N6J63J81J20pj20j71j71n2O8J63J75J23nj22j73j62
5334b06o1O9J60J90J05j5j21j82j50n7P9J52J85J05j9j31j68j61m4P4J66J77R4
5357B41j2j27j84j43m2Q0J53J90Q7nj31j81j44l7P8J78J70Q9k9j20j77j48l8P2
5381a80J78J62Q7k6j36j71j29m9R7J50J76P3j0j42j75j29m1R7J65J66P9l6j36
5404G0j63j31k9Q6J70J61R2l8j44j73j29k8J07J61J66P7m9j28j85j12k5R8J66
$$ plain form
5241 284 188 -3 -176 -275 -247 -95 101 261 284 193 3 -181 -276 -245 -86 100 229 271 172 -10 -183 -269 -250 -98
5265 -98 103 248 265 165 -22 -206 -279 -242 -92 107 227 260 157 -21 -192 -273 -213 -76 113 261 268 155 -18
5288 -18 -190 -262 -213 -75 130 253 265 151 -31 -195 -273 -210 -55 133 252 259 141 -51 -213 -282 -225 -69 111
5311 111 248 245 126 -50 -215 -272 -216 -53 128 248 241 121 -50 -221 -273 -205 -42 133 256 251 129 -44 -206
5334 -206 -267 -198 -38 152 257 242 121 -61 -211 -268 -189 -37 148 253 234 103 -65 -226 -270 -196 -30 147 241
5357 241 229 102 -82 -225 -267 -187 -34 156 243 238 107 -74 -218 -255 -177 1 171 260 231 111 -66 -214 -252 -180
5381 -180 -2 160 247 221 85 -86 -215 -264 -167 -17 159 232 222 80 -95 -224 -265 -168 -3 163 242 206 70
5404 70 -93 -224 -253 -167 3 164 256 218 74 -99 -228 -256 -149 12 178 255 206 78 -107 -219 -244 -146 20
5427B0J48P4m7j49j55j24j7J04J62J55O9m8j37j68j15rQ8J73J49P1m0j46j64j16
5451b22mJ00J63J51N9n8j27j68j24NJ16J52J42O2n8j47j54j20J2J09J45J58M4
5474B36n8j48j43j24J0J12J50J43N0n9j35j66r1NJ02J66J43N1o5j41j67q9RJ13
5498i6J59J30M2n0j54j55j08L2R7J65J35L5p8j43j37r7J3J17J60J17M5p6j55j44
5522a46q5J5J19J59J25K5p5j37j46q6K1J24J68J17L8r1j36j41q6K4J16J52J30
5545B04J4o4j48j39q9K9J21J48J23J5p3j50j43p9M3J21J56J04J6p9j41j45o9L2
5569a93J18J56J16Ko9j50j34o5L5J36J36J13J0q3j43j37o1L6J26J44J12Rq8j43
5593a7j36o1M0J14J59Q6J3q8j45j28n6L6J34J45J00Rr5j44j31n2M5J27J48Q9P
$$ plain form
5427 20 168 242 195 46 -109 -233 -250 -146 16 171 240 192 55 -113 -228 -237 -149 24 173 244 204 58 -106 -222
5451 -222 -226 -126 37 188 247 189 62 -106 -230 -225 -109 43 185 247 189 42 -112 -232 -220 -111 34 192 236
5474 236 178 30 -113 -237 -227 -115 35 178 228 169 34 -132 -223 -218 -116 50 193 244 179 38 -129 -218 -209 -96
5498 -96 63 193 235 185 31 -124 -232 -200 -103 62 197 232 154 11 -126 -223 -210 -93 67 184 229 153 -2 -146
5522 -146 -231 -216 -97 62 187 212 137 0 -146 -232 -211 -87 81 198 236 145 9 -132 -218 -194 -78 74 204
5545 204 218 154 6 -133 -222 -193 -72 76 199 214 141 -9 -152 -231 -188 -67 89 193 209 130 -11 -156 -225 -193
5569 -193 -75 81 197 199 130 -20 -154 -219 -184 -48 88 201 211 128 -15 -152 -213 -177 -51 93 205 214 126 -17
5593 -17 -153 -214 -174 -60 99 185 198 110 -35 -163 -219 -183 -49 96 196 205 110 -34 -165 -217 -172 -45 103 192 199
5618A99r5j39j17n5N8J25J41Q4Qj03j43j24n3N3J26J49P9rr5j35j24l6M3J31J38
5643A06Q1or4j48j13m2N7J34J36Q8j7q7j43j16l0N8J25J38P2oj00j39j12m6P1
5668a33J25J26Q2j2j04j32j19m2O7J31J33P1k3r2j34j13l1O1J24J29P7j7j04j46
5692g6j00k5O4J29J30P0k2j00j42r5k6P0J19J37O9k7j02j43j00k9P6J22J38O3
5716B00l4j00j34j00l1P6J25J20O4k6j13j37q8j8O9J27J35M6k4j06j32r1k0P6
5740a16J25J22N5k2j15j30p0k9P3J31J11O4m3j10j26r4nO7J38J03O7m4j12j36
5764i6p3j7O8J20J18N9l8j14j27q3JP9J22J17N0m6j12j31p9J5Q1J19J17L6m4j11
5790C1j18p7pP7J24J10M8l1j23j28p3kP4J32J15L3n5j16j27o5kR0J20J14K3l3
$$ plain form
5618 199 104 -35 -152 -207 -149 -24 117 201 209 106 -37 -161 -214 -161 -35 114 193 184 89 -46 -170 -206 -163 -32 106
5643 106 187 181 87 -61 -174 -216 -159 -25 111 199 182 95 -48 -164 -194 -136 -11 127 199 193 93 -46 -158 -204 -133
5668 -133 -8 118 200 188 84 -48 -167 -209 -142 -11 122 193 170 78 -56 -169 -200 -139 -15 114 191 174 70 -76
5692 -76 -176 -201 -137 -8 122 192 170 70 -72 -167 -193 -123 -4 133 202 175 73 -70 -170 -199 -123 -1 137 200
5716 200 166 66 -68 -168 -199 -123 2 122 186 160 47 -90 -178 -196 -127 0 135 181 157 51 -81 -172 -192 -116
5740 -116 9 131 186 164 49 -81 -151 -180 -107 24 135 199 156 46 -80 -174 -179 -112 26 129 196 152 40 -96
5764 -96 -169 -186 -118 2 120 179 141 27 -100 -183 -182 -103 19 136 186 140 28 -103 -182 -167 -86 33 150 186 142 31
5790 31 -87 -164 -171 -94 30 140 188 157 34 -94 -167 -169 -95 37 152 185 130 14 -113 -178 -180 -90 30 144 167 134
5816A34j29j07q3K0P8J22J03M6n7j05j18p6PQ3J32J01L0m3j17j18p7J0Q5J29R8
5841A48L3n7j22j20o8L2Q3J15J04K3n7j12j12p8K1R3J22Q4L8o2j08j21o0J8R0
5866g3J35Q7L1n5j24j08o2K5P7J30R7On8r8j16o2K5R3J21P3J8o6j02j12n4J9R9
5893e4J09R2K1o0j16j05n7K0Q5J34P4K2p0j00j14m0J0R7J18R6On6j26j16m8M7
5919a31R0J24P9ko2j17r4n5K7R6J14P4K1q6j01j05m4L2Q1J20Q1jo0j05j08l4L5
5946a31R2J07P3Qo8j03r3m0L5R1J24N0J6p7j15r2m2N0R2J06P5j1p7j06p8n2M5
5973a21Q3J11P7rp8j07q3m2L8R6J10P2jq1j03r9l0M8R7J09O7Mp1j11j00l1L6J09
6001a0J05O6j4p2j18p7l2M5R2J00O7pq0j25q2k5M9R1J08N3lo8j14p8l0M9J04Q5
$$ plain form
5816 134 5 -102 -185 -165 -87 35 138 184 127 22 -96 -172 -165 -82 50 151 181 138 21 -97 -174 -164 -79 50 148
5841 148 181 124 2 -118 -186 -154 -71 44 148 171 114 2 -110 -188 -167 -74 48 132 170 108 0 -121 -181 -163 -73
5866 -73 62 149 180 125 1 -107 -169 -144 -67 63 160 166 108 10 -106 -168 -143 -50 71 144 162 96 -6 -118 -172 -153 -54
5893 -54 55 147 168 108 -8 -113 -170 -150 -65 69 143 165 95 -5 -119 -159 -149 -52 66 162 168 112 -14 -130 -178 -131
5919 -131 -41 83 162 160 98 -19 -113 -168 -141 -45 69 143 164 78 -23 -128 -172 -140 -59 61 142 141 81 -24 -132 -166 -131
5946 -131 -39 68 141 149 81 -22 -115 -155 -120 -29 95 145 161 84 -31 -123 -165 -115 -23 83 158 147 70 -36 -114 -166 -121
5973 -121 -38 73 150 141 63 -44 -127 -169 -131 -35 75 147 146 65 -38 -137 -167 -119 -22 87 154 158 87 -24 -124 -155 -119 -10
6001 -10 95 161 147 75 -43 -120 -152 -107 -15 85 152 145 65 -60 -142 -167 -118 -27 81 134 131 63 -51 -129 -159 -110 -6 79
6029G9N9rp8r6q6j8M6R6J09O0k0q1r9r1j7M9R4J03N6k8o5j13p6k3M9R1R8N2k9
6058A12p9r7p3k5N1J08R1N7k7q0r8p6j2N6Q6R9O1j7r4r5p3k0N0J06R0N9l2p8j19
6087f9n6pM2J10Q8M3k6q4j15o5j1O0R3R9M0k9r0r3o9qO0R3Q4N8l0q3j03n8j3N0
6117h9R4R7N0m4o7j10m8j0N4R8Q4M2l9q1j01o2rO6J02P3L2k9q3r2o4j8P2R0Q6
6146I4M3m4q3q9n2nO8R0Q5J7j4r2q8n1nO8R7P6J1k0q0j01o0J3O1Q2Q6L0m3q2q5
6177g3p1LQ6Q6P3K9n1p9q8n4NO9R4P1K5m4p4q9m5NN9R8P3L4l7r9p1n8J3O8R0O9
6209A17J0l0q6q8n4K5N1J00P5kl8q9q3n1K0P1Q6Q4J2o1r2q2k4J1O9Q1O8K0n6p3
6239iq9l1J6Q1P5P0Ol8q8q4l8K7Q0P3O7Pn3q4p4m0K1O9Q2O0Nn0q3o3m7K2P6P6
$$ plain form
6029 79 138 129 51 -45 -131 -149 -103 -7 102 162 142 61 -38 -129 -146 -97 -3 100 156 128 63 -50 -126 -149 -100 -9 89 141 112
6058 112 33 -64 -137 -162 -111 -3 88 145 118 38 -60 -136 -148 -92 -6 93 154 137 43 -52 -125 -145 -95 11 101 160 128 50 -69
6087 -69 -125 -132 -90 20 108 151 125 41 -74 -139 -150 -90 3 102 142 113 23 -70 -139 -147 -87 6 90 148 118 35 -68 -126 -139 -89
6117 -89 5 102 152 108 41 -69 -117 -127 -73 25 109 151 112 31 -70 -132 -141 -75 27 100 132 103 20 -72 -136 -154 -82 8 94
6146 94 137 93 10 -79 -131 -136 -68 22 107 124 110 18 -70 -121 -126 -58 39 115 126 106 26 -75 -135 -122 -61 21 107 137 94 12 -73
6177 -73 -144 -141 -55 31 104 133 82 3 -85 -139 -134 -65 29 100 125 81 7 -82 -127 -122 -63 35 108 142 105 6 -65 -123 -110 -42 48 117
6209 117 127 97 11 -77 -131 -106 -55 45 120 118 80 -9 -92 -143 -123 -52 34 118 130 69 -23 -105 -129 -118 -49 32 100 120 64 -9
6239 -9 -98 -129 -113 -32 43 113 119 81 -7 -91 -129 -102 -22 51 118 125 72 -12 -86 -126 -105 -36 46 106 111 61 -22 -85 -132 -110 -34 42
6271D2O3Km7p6q6k7J7P9R1N1Qn7q0p0k2J7P1Q3O5om5q3p3l6K7P2P8N5%m7q5p4
6303i3k3K0P5P3N4on5p8p0j5L3N8Q2M9km6r1o3j7L3P3P2O0j7n2q0o9j7L2P6O6
6334F2N8j7n1p8o7j5K4P2Q0L7j1m8r3n2k2L8O0Q2M4k2m9p3n3k1K7P5O8M8j6n0
6364C7p4o4pL7P5O8M0j4n6p6n9j6M4O4P6M1j1o9o5n8j4L7P1N9M5l0m6q3o0rM8
6395f9O0P7L5k4o1o0n5j3L6O3P9L9k4n2p9m0j4M0P0O7M6k2n9q5m6nM2P0P1J5j9
6426H3n8p0m8j1M4O7O8J9j9o2o4n6LL8P2O2K7j9o4o0m4JK6Q2O7K3l2n1p5l3mM4
6458d4O7O4K6l1o2o8m1nM1O1O7K2k6n2p0m9J4L2P0M9K3j8p1n2l5rM8P2N5J8k5
6489G1n3p4l6QM3O5N6L1l3o9m9m6J3M1P0M6Nk3n4o5l6MM1O6N6J7l2o4p7j1mM5
$$ plain form
6271 42 105 107 60 -16 -102 -129 -112 -33 58 109 117 60 -20 -90 -112 -95 -24 59 124 118 73 -10 -83 -119 -92 -20 58 113 113 66 -19 -93
6303 -93 -116 -96 -21 52 106 100 45 -33 -103 -118 -85 -27 55 104 102 56 -35 -98 -115 -82 -9 63 123 106 54 -26 -95 -112 -80 -4 62
6334 62 120 103 52 -26 -93 -108 -84 -12 68 105 94 46 -47 -99 -121 -83 -23 59 103 81 32 -41 -94 -115 -88 -13 55 103 87 37
6364 37 -37 -101 -108 -71 4 72 112 98 42 -34 -93 -109 -65 -1 75 116 105 36 -29 -87 -101 -64 7 66 111 81 35 -48 -108 -117 -69
6395 -69 -9 68 103 79 18 -42 -97 -110 -74 -11 68 107 83 31 -48 -88 -102 -62 8 75 121 99 40 -45 -91 -96 -54 16 87 102 83
6426 83 25 -45 -93 -104 -60 7 75 94 75 13 -51 -107 -104 -66 6 68 95 76 12 -48 -92 -91 -65 17 84 107 75 24 -51 -84 -88 -44
6458 -44 23 87 113 82 20 -48 -89 -94 -53 8 75 97 71 19 -51 -100 -86 -54 16 65 88 70 -1 -53 -88 -97 -49 23 78 96 71
6489 71 18 -56 -92 -84 -41 24 80 111 78 9 -40 -86 -73 -32 38 84 89 66 12 -53 -89 -85 -44 22 78 95 63 -1 -78 -89 -93 -48
6521d8N6O5J2k7n9n2n0J6M2O5N9Qk8n3n9l6PM7P7L8J5k5o2o2k5MM2O1N9kk9n8
6553bo0l3J0M6O6M4Pl0n4o3l4K6M2N7N6qj8o6m4k8jM8P4M1J1l4n8n7k4K2L6P1
6585D3M2J8n0m2o3l9J1N3N2N1Rm1n9m9k7J1L9P3L7Nl7n3p0j6K9M4N4M7J1l4m8
6616Ao0l6L8L3O0M7Lk8o4n2k8K1N5M0O1pm8l9n9k3J4M3N8M1Mm2n1n1k2J4O3M8
6648C4L7j8l6m7l0k5J7N4N6L2Nl5m9n9j0J9N1N7K7pl9n1m9j3J8N9M3M4nm2o9l5
6680f6k2J0O7M5K8nl1n7m6j2L6L3O0L2nm8n4k9l7M0N3N3M2pm9n7m1j2L4N0L9L7
6712H1j3k3o7m4jJ2N7M9J2Km3n3l7j3J9N3M9L3j3l9m6m2j3K6N5L8L8j4l5n6l6
6743f4oK7O0M2J6ln3l6l8j3K8N2L3L0pm7m7m0j8L5N4M2J6mm3n9l1pL5M6M1J8o
$$ plain form
6521 -48 8 73 85 58 -1 -53 -103 -87 -45 20 79 87 59 6 -53 -89 -82 -35 42 80 95 70 8 -54 -79 -75 -33 28 87 85 56 -2
6553 -2 -62 -95 -85 -39 27 71 78 48 -6 -69 -103 -77 -35 22 78 70 52 -14 -58 -86 -87 -39 35 76 87 53 -5 -62 -86 -64 -28 43
6585 43 85 103 53 11 -52 -91 -80 -27 25 76 85 44 -15 -64 -91 -80 -41 32 69 74 37 -16 -86 -102 -73 -29 25 72 83 49 1
6616 1 -59 -95 -57 -24 36 83 86 58 -6 -58 -86 -65 -10 30 91 84 36 -3 -62 -85 -71 -28 30 71 75 33 -18 -69 -91 -77 -14 34
6648 34 71 53 17 -30 -60 -85 -68 -14 42 74 79 44 -5 -64 -74 -55 -4 53 80 73 34 -17 -66 -79 -61 -2 41 85 80 38 -31 -66
6680 -66 -88 -78 -11 34 62 57 26 -31 -77 -89 -53 -20 40 72 67 19 -35 -64 -101 -61 -8 45 87 80 31 -26 -67 -79 -45 5 44 81
6712 81 68 45 -22 -66 -67 -55 2 51 63 65 22 -31 -68 -81 -62 -9 40 73 60 21 -25 -67 -80 -54 1 39 77 63 28 -28 -64
6743 -64 -70 -43 17 59 75 72 19 -17 -55 -68 -40 12 45 75 68 21 -26 -66 -84 -49 5 47 63 59 16 -43 -74 -81 -46 0 41 59 53
6776E3l9m9l6OK3N4M4J3pm6l7l9rM2M1M2K3pm2n5l5rL4M2N3J6j9m2n2l2%J7O2
6809A0L3K2rn0n2k9MK4M7N0J4j9l1m0l9ML0N3L5J8k6l1m6k6jK6M9L3K3j6l7n5
6841c2k6oK5N3L2J1j0n0l5k6j1K6O0L4J2j7m4m7j5MM0N0K8J8l3m1l6k8ML2M5L8
6873E5J8k2l7n8j5PK9N1K9K2l5m6m0j6lL9L2M7Kk4l1n7k3NL3N0M1Nk0m3m5j4P
6906e7M0M4L5Jk1l9m2j5J2K9L9M7pk5m2l7l1J1M1L6L3Pk1m0m2l2J5K9N8K2Qk8
6938B8m5m0k0J4M1L9L2Ql1k9l2l6J6L4O0K9nk2m5l3k3J1L3M0M5j2j6n3l6j7J2
6969e3L2L7L1Mj9m9l7k4K5J6N2L3%j6n3l5nOL8N2J6kk1m4k9j8K0M0K8L1Lk0m4
7002el6j8J8M2L3L3j5k4k9m5k6K1M7L1K1Lm5j7n4mJ3L6M6J4Mk4l7l2j2J1M4L2
$$ plain form
6776 53 14 -35 -71 -65 -42 12 56 69 62 16 -21 -60 -69 -27 14 56 79 72 30 -25 -60 -69 -35 7 60 76 57 15 -37 -69 -69 -52 10
6809 10 43 65 56 6 -46 -75 -71 -47 0 50 64 45 14 -26 -65 -61 -31 22 57 75 49 18 -28 -54 -55 -29 20 53 76 60 23 -32
6841 -32 -58 -64 -39 14 46 57 47 -3 -38 -64 -75 -49 11 45 57 40 -4 -51 -66 -62 -22 28 56 74 41 0 -36 -64 -60 -28 17 55
6873 55 73 51 14 -44 -59 -52 -23 28 57 79 44 -2 -42 -58 -61 -22 10 57 59 35 4 -53 -76 -71 -38 12 53 58 38 -5 -50 -64 -57
6906 -57 -17 27 62 63 42 3 -39 -54 -42 -13 26 73 66 41 -1 -38 -69 -58 -17 19 52 59 38 -2 -44 -76 -61 -32 26 48 56 28
6938 28 -17 -57 -77 -63 -22 17 49 57 26 -3 -35 -71 -55 -21 39 68 63 41 -4 -37 -60 -49 -16 24 69 57 41 -12 -48 -65 -53
6969 -53 -21 16 47 51 32 -17 -54 -78 -53 -37 15 48 48 32 -21 -56 -61 -55 -17 35 51 49 28 -16 -45 -63 -43 -3 25 56 59 39 -5
7002 -5 -41 -59 -41 1 34 67 52 28 -1 -46 -72 -51 -4 27 48 51 6 -11 -65 -69 -56 -20 26 40 44 20 -17 -49 -61 -50 -6 26
7034B6K8ok7l5l4mJ7L5L1L1j3k6l4m0KJ8L5K9J9pl2m1k4lJ6L5L0L3j0l2m0k7k2
7067g2L5M0L3J6pl4l6l0JK9L4K6K2Nl9m0k3kJ1L3L5K1qk9m6k6JJ3K7N0Lqj7n0
7101c2k8kK4M0K7J7Nm2l3m1NJ9M0M3Pj0k7l9pj1J2M6L6Qj3l1l1j8j5K5L2L9J4
7134E9j2l3l1l7MK0L1K8Rjk4m8j3j8L4L7L3Pj1j8m3k5%K1M4L3J2j4m1k8k1QJ8
7167b0L0K9K2k1l9l2k1J0K0M3J2Qj5m0k6j5QK1L0K0J8k3k5l1k5J9K8J9K8J9j8
7198C3k8m4nML1L2J6J2j8l1l4j6LJ9M8J3Oj2l2k6j3J0K2K8K1Lj0l7l2j4%K2K7
7231bL0Qj6k3k9k3RM4K9J8lj5l0l1j3J7K0L5K2lj5l0k9oLK3K0L4prl7k3j4%K7
7266a9L2K8nj6k6l4j3ML5L3K0jl1j4k4j3J0L0L3J9jj2m2j5j7LL2L1J8Qk9l3k7
$$ plain form
7034 26 54 48 21 -14 -48 -52 -35 0 31 62 49 23 -11 -51 -49 -31 4 33 52 45 13 -28 -52 -55 -39 -4 26 59 49 17 -23 -50 -72
7067 -72 -37 3 36 52 45 11 -25 -55 -54 -25 9 35 57 62 23 -17 -40 -42 -31 2 37 58 50 21 -25 -51 -50 -37 -10 40 43 35 18 -32
7101 -32 -60 -62 -38 2 29 46 51 9 -24 -65 -60 -41 -1 42 49 39 12 -27 -34 -45 -33 13 49 57 44 13 -18 -36 -51 -26 6 45 59
7134 59 47 14 -17 -54 -50 -30 1 29 38 37 13 -35 -48 -66 -32 5 38 45 34 16 -27 -52 -52 -31 13 46 58 44 3 -25 -46 -38 -20
7167 -20 10 39 61 40 1 -31 -52 -42 -22 21 33 41 26 -14 -40 -55 -47 -26 4 24 42 19 -6 -37 -62 -43 -15 4 32 51 33
7198 33 5 -39 -44 -40 -9 23 39 51 33 2 -32 -48 -45 -26 22 35 41 29 -3 -29 -42 -32 -10 18 39 42 32 -5 -37 -51 -51 -29 -2
7231 -2 28 36 20 -3 -32 -55 -46 -2 27 45 42 27 -3 -34 -47 -30 -10 25 47 44 29 -1 -30 -36 -33 -10 10 44 37 28 -9 -32 -46 -46 -19
7266 -19 13 41 36 20 -6 -40 -53 -49 -14 19 39 38 7 -7 -31 -44 -34 -4 29 48 47 35 -7 -22 -39 -36 -4 27 45 53 24 -9 -36
7299c6plL9K9K3nl1k7k6mPL5K1K0Kk6k9k3pJ5L6K1J8Ok4k6k8j1J9J8K6J8Nj7k6
7334Bk7nPK8L4LKk1l0l2QRK1K8Rmj2m6j4nK0K2J6L1ol3k3l3MJ6L0L2J3qj9l3j1
7371b7qJ4K0L1J3lj8k7k5rK1K5J8J5%l1l2k9JJ4L7K5J7j5l2k1j2j7K6K0J4K3K
7404C0l0l2j0MK7K2J1K3j5j4l2j1j2K1K7K6Qok4k5k5nK4K2K7jok3l2jqQL7PK2
7439C4j2k2j8k1jRL6L5Jj9j7j7l0J0K7RL5Kok7k2j8NJ5K2J5J8j6l1j6k5mL1J8
7473@J6J0rk3k5j5NK7J7K3Qj9k1j8k5K1J9K2J1K1k3j4k0j9RNL4K0Ok1j9k4j3K
7507c2RL6K6j2j1j7k3qjK1J9J5Nkl1l3lJ0J1L0J2Qqk1k0pKJ7L6jMnk2j7mKK1R
7545A5K4j0ql2pj5NK7J2J4Krl2j3oJJ4K8J6rj8j5k2RLK0K0J2Kqk9j9jMK4J9J6
$$ plain form
7299 -36 -43 -46 -7 22 45 40 9 -18 -44 -48 -41 -6 15 35 37 11 -18 -41 -48 -33 3 24 42 48 24 -2 -30 -41 -22 -4 22 40 45 28 2
7334 2 -25 -30 -23 5 39 42 44 23 -7 -39 -31 -22 -1 27 36 32 20 -26 -40 -45 -25 -3 13 44 38 5 -18 -51 -47 -31 -1 31 44 36 17 -16 -27
7371 -27 -35 -21 -1 30 43 40 22 -5 -30 -39 -18 7 25 40 40 9 -23 -52 -51 -37 0 25 42 27 -5 -26 -38 -55 -29 -9 5 28 30
7404 30 0 -32 -42 -38 -11 11 22 45 30 16 -16 -27 -39 -18 9 35 43 37 13 -12 -37 -42 -18 4 31 30 24 1 -31 -32 -40 -32 5 12 34
7439 34 22 0 -18 -39 -40 -31 5 40 41 22 5 -12 -42 -32 -5 4 39 41 35 8 -14 -32 -27 -12 10 25 43 27 -4 -20 -45 -49 -18 0
7473 0 16 26 17 -6 -31 -46 -41 -14 3 26 34 15 -6 -24 -49 -28 -9 13 24 45 22 8 -12 -31 -22 -17 17 37 43 22 3 -21 -34 -32
7507 -32 -23 13 39 27 16 -1 -24 -32 -33 -12 7 22 27 25 -6 -39 -42 -32 -21 9 21 29 21 0 -20 -27 -25 -8 28 27 31 26 4 -13 -17 -15 6 15
7545 15 39 29 21 -11 -18 -33 -28 -1 11 25 27 18 -14 -27 -33 -32 -18 10 26 17 -1 -16 -38 -29 -26 -6 14 26 28 20 -9 -28 -29 -25 -1 18 34
7582C4Mj9j1j6j7J5MK6Mlmk6j0j8J5J4J2J1Ok4qk8kJ0K1J4OJ5k6j5Jj2%L3J5J3
7618C4j0jk0k4MJ0K6KMKrk1j2j4K1QK2ljj5j7k5QRK3ORkk5oj9lJ1K6J0Nkj8pj
7658a5j3J3RK8MKk2j6j1mJ7J2K0kPk1k1j2qJ9J1J9mj2Kl1r%J6K1QJ0qj5j0j3%
7695b9OK8J7Pj1k1j0oLRK2OJ3j9j6j1Jj3J7J2J1J1j7j2rj3qK5jJ5J0mj3k5%KK2
7732aOJ3kj3j8mplK2J6J5omk0j0j0J7PQJ6J2rl0j0mj2K8J4JPj0k0j9j1J0J3K0
7769BJ5qj6kj4j1OJ4K7lNqj6j7PKK2RQJ3j7k4j5RjQL3Poj1k8p%nK9mJ3jj7j3j3
7810b8RkJ1J7J3j3k2qj8J2MK5K1Loqj3j4KPK1%J7mj5oj5j3J1J9J2Kmok6j7LJ5
7848a4K4PJ2k0j6j5kJRK2%J1j0j0j5qNjL4J1jj1pj5pOOJ5J0KOk1j2k1J2RJ2K3
$$ plain form
7582 34 38 19 8 -8 -25 -10 -6 20 24 21 17 -9 -19 -37 -22 -8 4 15 21 -3 -11 -39 -41 -31 -10 4 10 25 -1 -16 -15 -27 -27 6 21 34
7618 34 24 23 3 -21 -17 -7 19 21 25 27 18 -3 -15 -29 -8 0 22 19 18 3 -14 -39 -31 -22 1 7 16 14 -11 -17 -36 -39 -28 -2 8 13 11 -7 -14 -15
7658 -15 -28 -15 -6 22 26 28 6 -10 -21 -25 -8 4 24 22 29 8 -13 -25 -33 -14 -3 16 12 0 2 -29 -38 -38 -22 -1 7 17 9 -6 -16 -29 -29
7695 -29 -23 5 22 29 18 -3 -13 -19 -16 -7 15 21 34 15 -1 -12 -11 -24 -7 5 16 27 10 -2 -11 -24 -32 -7 -8 7 17 13 0 -25 -25 -23 -1
7732 -1 5 18 16 3 -15 -19 -26 -29 -7 9 24 18 14 -6 -16 -26 -9 -2 6 22 34 25 -5 -15 -19 -31 -3 11 12 19 9 -11 -30 -41 -31 -18 2
7769 2 17 9 -7 -9 -23 -34 -28 -14 13 10 15 7 -9 -26 -19 -17 5 14 22 35 18 -6 -21 -12 -13 -5 28 35 29 18 -10 -17 -17 -22 7 3 16 15 -2 -15 -28
7810 -28 -19 -21 -10 7 20 7 -15 -23 -41 -29 -25 0 21 24 18 10 -3 -17 -15 -8 13 13 30 26 11 5 -10 -23 -12 7 19 21 17 11 -15 -32 -29 -14
7848 -14 10 17 29 9 -7 -22 -24 -23 -14 8 8 19 9 -1 -16 -24 -19 -20 14 25 24 13 6 -9 -16 -10 -4 11 21 23 29 8 -4 -25 -13 -4 8 31
7886C1q%k4j6j4QOJ3J3Qrj0lj6oK9QK0kpj6j8j5RK2K0MOj6j6j0qJ1NJ7J1j1%j4
7925Bj9kqJ7K0LOmj9l0J1j2K2J4J6Lj6k0loJRL2J3oj6k2lOj0K7J5QQl1rj5LRM
7965bJ1J6pj3k6oj2J5J4QJ9omk4qpPJ7J6J0jj8j0j4NJ0J2J6Oj0pk2jLQJ9J9p%
8004B6j9j2j6%K0NJ3%nj2k1LmMJ8OJ3j3j6j4kmJ4K4J2olj5nk8K0J4J7O%Nk3j6
8042a4Jj5K0K1J5Qj8k0j3j1mJ7J2J7pJ2k7k0LrK1J2NJ0mk3j6lOJ9J2K2mj2rk9
8078b5QoK4K0RMj9j2j8KlJ5K5Ojj3j6k2qMK2J3J1pj2pj8pJ0J6RK1olk9j8kJ9J1
8117cK4J5%j9k4o%LK0J5K2j7qk1j2rRJ0K2Pjj6l1j0kJ5OK3kRj5j2k2PJ0LK9Qo
8156B1ql2moK4J6J3J8ok0l1jlQJ9K2J2j5j7j8pqJ7LJ9Nnj9k4j5J3J2J4K7j
$$ plain form
7886 31 23 23 -1 -17 -31 -23 -17 -4 9 17 8 -2 -5 -21 -27 2 10 30 28 21 5 -13 -28 -19 3 23 27 33 17 1 -9 -17 -6 -1 16 27 16 16 2
7925 2 -17 -19 -27 -10 10 13 19 15 -4 -34 -23 -35 -13 1 17 20 4 -16 -19 -25 -24 -15 17 30 24 8 -14 -17 -11 -21 6 21 29 37 6 -3 -18 -15 -6 -2
7965 -2 9 25 18 5 -21 -27 -39 -24 -10 -2 17 11 7 -17 -25 -32 -25 -8 8 18 17 -1 -11 -25 -20 -10 2 18 24 14 7 -15 -16 -13 -5 14 33 26 26
8004 26 7 -5 -21 -21 -1 4 17 17 12 0 -21 -18 -22 -18 0 6 19 6 -10 -24 -26 -30 -16 8 20 14 11 -4 -9 -37 -17 -3 14 20 20 25 2 -14
8042 -14 -13 -28 -8 13 28 36 18 -2 -15 -26 -30 -13 -1 16 9 21 -6 -26 -23 -32 -11 1 6 16 12 -11 -27 -30 -24 -5 7 29 25 13 4 -25
8078 -25 -17 -23 1 21 30 34 15 3 -15 -13 -16 -1 24 30 29 16 0 -22 -30 -26 -4 9 20 13 1 -6 -24 -31 -21 -5 4 25 19 16 -13 -31 -33 -14 -3
8117 -3 21 36 36 17 -7 -13 -13 -10 10 25 47 30 22 1 -11 -20 -11 -1 21 28 27 11 -20 -30 -32 -17 -11 12 10 19 4 -8 -30 -23 -13 -10 19 27 21
8156 21 13 -19 -23 -29 -5 11 24 42 36 16 -15 -16 -19 -11 8 30 42 27 10 -8 -15 -23 -6 -3 16 21 16 -3 -27 -42 -29 -17 -3 24 23
8191B3
$$ Imaginary data points
##PAGE= N=2
##DATA TABLE= (X++(I..I)), XYDATA
0@%%%%%%%%%%%%%%%%%%Qj6J6j6J6j6K4l2L2l3M1m8N6o4P2q1Q9j04J20j36J50j66
40h8J85k02K26k50K74l06L38l72M10m53N00n50O06o69P37q15R04j004J122j260
60f67J424j623J870k190K621l232M174n852R732l5607j3477O2149L6272J9730
74G5324k1425m2189n2657k8471J789L5230M7588M3420J3758j9701m5597m6171
86c9102k8858L880L3408M8773L8306J1914k0254m1639m5447k6358M664L3630M5138
99A8055L6575J0582k0025m1445m2297k3818N467L1700M3606L4534R002k0464l9163
112B309l9642k2101N758L1348M1631L1909P512j9601l7599l8349k0756P012L0583
125a9986L9077K9722O922j9427l6520l5915j8551O895K9096L7977K8722N507j9760
$$ plain form
0 0 0 0 0 0 0 0 0 0 0 0 0 0 0 0 0 0 0 0 8 -8 8 -8 8 -8 16 -16 16 -17 24 -24 32 -32 40 -41 48 -56 64 -72 78 -88
40 -88 97 -105 121 -129 145 -161 177 -195 215 -238 262 -288 318 -351 386 -429 475 -529 593 -667
60 -667 757 -866 1004 -1186 1435 -1797 2377 -3475 6257 -29350 -42827 19322 55594 75324
74 75324 53899 11710 -40947 -69418 -67629 -32399 15189 58609 72367 52666 7069 -39102
86 -39102 -67960 -64080 -30672 18101 56407 68321 48067 6428 -39019 -65377 -60713 -27083 18055
99 18055 54630 65212 45187 3742 -38555 -62373 -56906 -25206 18400 52934 61936 41472 2309
112 2309 -37333 -59434 -53676 -22328 19303 51212 58724 39123 1524 -36825 -57581 -50569 -19986
125 -19986 19091 48813 55735 36308 -212 -36127 -54678 -47783 -18687 19290 48012 53519 33759
138C3759l4943l3921j7436P394K8627L5927K6427M942j8818l3846l2740j6009
150e0637P931K7698L4538K5227L882j9057l2454l0678j4958P776K6981L3236K3679
163D3164L143j8531l1381k9531j3745Q458K6301L1670K2353K589j8343l0424k8095
176c2372j2664Q556K5554L0470K1103J839j8113k9332k6809j1776Q738K4984K9379
189A9557J9997J249j7853k8399k5610j0900Q866K4251K8210J9012Q55j7657k7638
202f060k4558j0008R095K3771K7241J7925K16j7391k6635k3513r398R221K3311
215f783K6267J6959k31j7211k6010k2529q510R406K2656K5304J6203o06j7074
228A7841k5268k1591p864R494K2288K4526J5237j156j6833k4524k0745p220R702
$$ plain form
138 33759 -1184 -35105 -52541 -45147 -16520 19407 45834 50776 31958 -1888 -34628 -50637
150 -50637 -42706 -15008 19530 44757 48639 29582 -2872 -33550 -48508 -40732 -13751 19485 43164
163 43164 46307 27776 -3605 -33136 -46881 -38423 -12122 19548 41901 44490 26147 -4277 -32372
176 -32372 -45036 -36480 -10926 19544 40647 42486 24373 -4959 -31768 -43544 -34806 -9822 19557
189 19557 39554 40803 22950 -5449 -31059 -41959 -33093 -8842 19368 38380 39235 21578 -6060
202 -6060 -30618 -40626 -31531 -7760 19481 37406 37622 20231 -6404 -29917 -39315 -30094 -6783
215 -6783 19484 36443 36212 19001 -7009 -29538 -38048 -28642 -5986 19318 35521 34915 17841
228 17841 -7427 -29018 -36882 -27388 -5100 19426 34663 33507 16674 -7850 -28595 -35815 -26113
241b6113K1861K3665J4460j543j6747k3931j9843o483R839K1385K2912J3688k022
254C1128j6628k3252j9034n919R986K1062K2146J2868k399j6445k2683j8299n256
267c2725J0172K0615K1400J2200k755j6359k2096j7476m725J0201K0243K0762
279A9457J1509l146j6161k1519j6795m220J0338J9891K0042J0854l380j5972k0992
292a0094j6153l734J0374J9473J9419J0319l672j5825k0429j5484l318J0392J9101
305C69J8813R739l915j5614j9902j4899k896J0438J8716J8188R219m128j5426
318H702j9397j4282k498J0400J8305J7657Q714m310j5205j8862j3743k184J0404
331a6299J7970J7080Q216m529j5017j8401j3184j750J0452J7615J6483P715m742
$$ plain form
241 -26113 -4252 19413 33873 32330 15583 -8348 -28191 -34674 -24835 -3450 19462 33150 31128
254 31128 14500 -8752 -27786 -33705 -23719 -2657 19489 32357 29958 13513 -9170 -27469 -32725
267 -32725 -22553 -1938 19462 31662 28907 12548 -9548 -27024 -31749 -21548 -1305 19457
279 19457 30966 27820 11659 -9860 -26655 -30875 -20537 -646 19396 30250 26870 10898 -10094
292 -10094 -26247 -29981 -19607 -134 19285 29604 25932 10107 -10322 -25806 -29124 -18732 369
305 369 19182 28921 25006 9392 -10510 -25409 -28305 -17867 849 19037 28256 24128 8702
318 8702 -10695 -24977 -27475 -17075 1230 18887 27601 23291 8086 -10776 -24519 -26703 -16299
331 -16299 1671 18751 26967 22438 7421 -10980 -24164 -25914 -15462 2153 18636 26351 21609
344B1609j4860j7906j2596j371J0439J7228J5970P220m928j4665j7421j2075j044
357b4400J0446J6895J5423O744n111j4467j6956j1546o76J0419J6540J4894O309
370B4514n266j4259j6495j1044m13J0389J6214J4419N868n401j4042j6055j0567
383b2138j17J0368J5845J3929N488n528j3857j5636j0105J70J0300J5495J3470
396A7684N105n647j3642j5214r662M28J0257J5195J2999M725n764j3443j4780
409a1759r225O86J0214J4862J2564M380n882j3245j4378q794R35J0158J4531J2110
423A7157M029n968j3074j3996q394J197J0145J4244J1660L638o102j2874j3575
436a1913p952J405J0087J3946J1268L316o226j2705j3201p544J701J0046J3604
$$ plain form
344 21609 6749 -11157 -23753 -25124 -14685 2543 18513 25733 20805 6140 -11281 -23356 -24400
357 -24400 -13954 2941 18364 25108 19997 5530 -11426 -22972 -23648 -13229 3311 18205 24514
370 24514 19248 4989 -11506 -22550 -22963 -12574 3640 18059 23927 18526 4484 -11571 -22138
383 -22138 -22255 -11887 3958 17887 23375 17847 3990 -11646 -21751 -21581 -11281 4214 17684
396 17684 22789 17142 3500 -11714 -21376 -20948 -10691 4504 17503 22228 16464 3021 -11759
409 -11759 -20984 -20298 -10084 4778 17342 21722 15840 2595 -11783 -20577 -19642 -9484 5047 17157
423 17157 21186 15218 2144 -11852 -20246 -19049 -8904 5340 17000 20638 14536 1662 -11913
436 -11913 -19865 -18460 -8373 5573 16841 20157 13931 1226 -11975 -19519 -17818 -7772 5832
449E832J0841K974o296j2511j2854p153J919J0007J3342J0416K604o405j2325
462C91j2438o765K118R965J3037J0029K303o499j2135j2058o378K341R889J2690
476F490R638K043o540j1947j1756o018K549R832J2412R226J708o622j1725j1336
490a2046n668K697R733J2161Q868J412o689j1524j0962n307K881R649J1802Q510
504A5517J192o672j1357j0669m972L058R554J1516Q131Q97o713j1103j0277m700
518a6598L143R446J1288P775O74o749j0891r947m351L310R298J0933P485M78o747
533H547j0705r651m043L442R224J0660P096K35o734j0433r307l804L503R111J0408
548G549O807Ko741j0238q966l507L621Q973J0079O513j46o744j0075q654l202
$$ plain form
449 5832 16673 19647 13351 840 -12014 -19167 -17248 -7241 6101 16517 19121 12716 391
462 391 -12047 -18812 -16694 -6729 6308 16337 18640 12141 6 -12052 -18430 -16089 -6200 6490
476 6490 16128 18171 11631 -316 -12072 -18090 -15541 -5709 6703 15929 17637 11015 -710 -12046
490 -12046 -17714 -15017 -5284 6877 15745 17157 10468 -1056 -12018 -17325 -14444 -4795 7007 15517
504 15517 16709 10037 -1320 -11989 -16961 -13903 -4349 7167 15298 16195 9482 -1621 -11898 -16598
518 -16598 -13455 -4009 7279 15054 15728 8979 -1912 -11859 -16210 -12900 -3602 7331 14816 15294 8547
533 8547 -2158 -11809 -15852 -12410 -3186 7474 14570 14805 8071 -2362 -11669 -15473 -11970 -2859 7549
548 7549 14356 14358 7617 -2621 -11587 -15094 -11473 -2500 7579 14092 13946 7202 -2873 -11527 -14729
563a4729L753Q858R792O160l67o701r798q363k995L810Q761R552N860n51o689
578F353r603q030k713L873Q590R270N613o98o668r418p758k450L971Q496Q970
593G798N298q89o636r170p470k239M072Q384Q725M986j096o612q956p158j976
608a2939M133Q233Q439M736j227o592q779o849j746M221Q092Q185M451j390o548
623D420q558o595j514M290P990P923M163j574o509q337o280j303M330P817P679
638G942L925j695o466q144o030j077M365P693P416L664j815o417p952n766q57
653a1214M423P589P153L404j988o367p724n483o67M464P443O922L150k104o332
668B669p523n223m49M511P295O664K925k240o262p330m976k72M559P179O406K672
$$ plain form
563 -14729 -10976 -2118 7674 13834 13467 6766 -3032 -11395 -14390 -10580 -1819 7733 13593 13042 6353
578 6353 -3250 -11280 -13993 -10120 -1530 7740 13353 12655 5987 -3431 -11189 -13639 -9668 -1172 7798
593 7798 13096 12207 5571 -3599 -11069 -13308 -9236 -852 7873 12859 11763 5151 -3805 -10963 -12939
608 -12939 -8806 -573 7866 12602 11375 4783 -3996 -10845 -12591 -8370 -278 7907 12358 10968 4420
623 4420 -4138 -10733 -12247 -7957 33 7956 12119 10545 4036 -4301 -10581 -11884 -7554 263 7942
638 7942 11867 10172 3706 -4438 -10468 -11545 -7180 513 7929 11593 9778 3361 -4591 -10357 -11214
653 -11214 -6791 798 7951 11355 9367 3000 -4724 -10207 -10874 -6410 1033 7955 11105 9001 2669
668 2669 -4854 -10077 -10526 -6015 1280 7944 10869 8629 2367 -4963 -9939 -10211 -5652 1527 7933 10605
684A0605k350o211p121m722q9M586P040O180K438k456o170o913m481R9M612O875
700A922N954K221k548o083o724m256K65M603O750N733K026k621o017o532m028
715i335L92M591O607N525J851k699n928o344l850N17M596O470N325J672k776n847
731G67o175l627O51M585O343N112J490k818n789n996l425P74M591O204M914J329
747H930k897n691n819l253R05M566O077M728J155k946n627n650l043J016M554
762b995N946M532R91l005n545n488k843J121M540N818M328Q44l046n465n323k667
778h257J223M526N679M155P01l097n381n136k502J304M503N542L978N68l113n302
794f09m986k320J406M459N409L802M24l152n210m825k166J513M441N281L617K77
$$ plain form
684 10605 8255 2044 -5077 -9799 -9888 -5302 1738 7918 10356 7900 1730 -5183 -9664 -9565 -4953 1922
700 1922 7876 10097 7549 1466 -5258 -9514 -9249 -4646 2104 7837 9863 7242 1225 -5307 -9335
715 -9335 -8943 -4352 2255 7780 9631 6932 1004 -5340 -9190 -8673 -4077 2393 7718 9390 6614 767
731 767 -5408 -9035 -8384 -3799 2544 7656 9146 6328 539 -5457 -8882 -8108 -3517 2687 7601 8930
747 8930 6033 342 -5477 -8730 -7825 -3259 2818 7546 8701 5755 128 -5522 -8565 -7549 -2995
762 -2995 2951 7483 8474 5469 -76 -5564 -8407 -7286 -2746 3072 7400 8244 5198 -267 -5590 -8257
778 -8257 -7034 -2508 3171 7326 8027 4930 -451 -5587 -8089 -6785 -2282 3260 7238 7806 4693 -609
794 -609 -5595 -7915 -6509 -2050 3359 7161 7585 4433 -777 -5602 -7768 -6255 -1814 3467 7084 7361
810G361l184n133m648j999J585M409N146L456J49l224n041m500j830J682M385
825a386N027L265J4l246m963m332j667J780M356M899L099j35l267m883m167j512
841g118J862M320M763K928k70l309m786m007j332J937M282M623K738l82l318m708
857a777l839j167K009M248M487K580n10l342m603l683j015K076M208M359K417
872F448o32l343m518l518q74K138M166M221K248p22l356m420l365p43K199M113
888D2M091K101q25l363m321l212o17K234M072L946J967r14l360m227l062n03K295
905c656M027L821J810j015l350m121k922l60K335L971L707J654j094l363m029
920b585k789k35K380L912L587J530j189l337l943k653j19K413L875L442J380j259
$$ plain form
810 7361 4177 -956 -5604 -7603 -6018 -1609 3537 6993 7142 3918 -1123 -5623 -7453 -5771 -1386
825 -1386 3641 6906 6920 3674 -1289 -5621 -7288 -5508 -1152 3747 6846 6711 3444 -1439 -5606 -7118
841 -7118 -5256 -936 3827 6755 6485 3176 -1610 -5617 -6949 -5012 -730 3893 6631 6249 2931 -1777
857 -1777 -5616 -6783 -4774 -526 3961 6541 6031 2689 -1914 -5597 -6612 -4536 -328 4031 6448
872 6448 5816 2473 -2045 -5563 -6437 -4299 -133 4088 6336 5614 2258 -2162 -5527 -6270 -4071 42
888 42 4133 6234 5409 2046 -2275 -5487 -6104 -3870 202 4148 6115 5201 1841 -2386 -5448 -5951 -3656
905 -3656 371 4192 6002 4987 1637 -2484 -5406 -5766 -3431 540 4247 5901 4807 1444 -2585
920 -2585 -5374 -5609 -3229 683 4270 5800 4611 1274 -2669 -5322 -5441 -3028 847 4289 5669 4410
936D410l333l848k512oK472L803L315J254j349l329l757k352J09K492L759L198
952D326J115j423l302l669k221K18K528L706L071R79j485l294l570k088L19K541
968b249L638K966Q70j556l291l470j966L97K583L569K846P63j593l275l387j843
984d998M86K583L527K738O55j656l234l290j746N60K594L466K639N70j715l218
1000c9l202j617O32K617L402K508M69j737l184l108j528P14K612L344K422L49
1016D654j786l162l020j409P84K613L291K313K65j834l138k938j288Q62K632L215
1032B054K201J70j876l096k840j192R32K636L157K077P3j900l059k741j087J003
1048c488K633L090J971j4j950l026k648r78J069K622L013J863r2j954k999k564
$$ plain form
936 4410 1077 -2771 -5283 -5289 -2817 986 4301 5555 4206 877 -2880 -5232 -5123 -2631 1128 4326
952 4326 5441 4018 716 -2953 -5174 -4956 -2428 1278 4349 5328 3843 549 -3021 -5109 -4790 -2249
968 -2249 1389 4355 5225 3669 378 -3092 -5058 -4661 -2078 1491 4337 5100 3507 232 -3155 -4998
984 -4998 -4512 -1929 1598 4336 4991 3335 101 -3189 -4935 -4375 -1781 1685 4324 4894 3179 -39
1000 -39 -3241 -4858 -4226 -1609 1793 4301 4770 3033 -151 -3259 -4787 -4073 -1461 1883 4305 4654
1016 4654 2868 -294 -3314 -4723 -3939 -1326 1965 4278 4543 2709 -429 -3367 -4655 -3793 -1161 2054
1032 2054 4255 4425 2549 -547 -3387 -4579 -3647 -1011 2146 4223 4296 2396 -663 -3404 -4491 -3488
1048 -3488 -855 2235 4206 4192 2242 -784 -3432 -4410 -3341 -719 2294 4157 4065 2111 -888 -3452
1064c452q85J115K637K925J768j74j966k960k473p85J159K613K880J673k50k002
1080A823k906k380p01J218K601K806J573l22k015k877k293o02J261K598K730J484
1096C998m02k041k808k208n40J321K568K645J413m52k059k770k122m77J352K567
1112a5K570J343m99k094k726k038m10J402K572K499J248n48k116k668j961l34
1128c775J433K544K436J182o15k118k635j870k65J468K526K369J094o72k142k577
1144a617j795j98J500K500K306J016p17k145k521j740j17J519K485K238R48p73
1160B889k137k483j657n3J556K444K184Q73q25k117k448j594PJ573K430K118Q02
1177C562q59k135k398j516P0J608K399K044P24r02k142k346j448J35J626K386
$$ plain form
1064 -3452 -4337 -3222 -585 2340 4108 3934 1968 -992 -3465 -4250 -3091 -478 2402 4075 3825 1823
1080 1823 -1083 -3463 -4164 -2946 -345 2461 4034 3712 1697 -1180 -3473 -4075 -2814 -216 2514 3998
1096 3998 3596 1555 -1253 -3461 -4001 -2680 -112 2533 3946 3494 1435 -1335 -3457 -3934 -2582 -15
1112 -15 2555 3898 3399 1305 -1421 -3459 -3869 -2467 105 2604 3852 3304 1188 -1480 -3441 -3775
1128 -3775 -2342 202 2638 3820 3205 1087 -1548 -3418 -3683 -2215 311 2680 3774 3102 960 -1617
1144 -1617 -3412 -3610 -2110 390 2696 3712 2995 850 -1671 -3411 -3528 -2009 476 2714 3662 2889
1160 2889 752 -1731 -3388 -3441 -1885 559 2743 3616 2791 674 -1774 -3368 -3361 -1788 642 2760 3562
1177 3562 2703 568 -1830 -3346 -3276 -1668 731 2775 3499 2597 455 -1891 -3339 -3204 -1578 808
1193H08J971O63r55k134k297j366J83J654K344J927N98j006k131k249j291K43
1209c038J679K312J856N32j036k131k201j234L01J711K286J802M36j080k128k148
1225b081j137L61J705K272J713L79j127k116k096j078M32J728K216J655L13j161
1241A978k099k046r96M80J719K208J590K39j197k071j986r41N32J735K152J528
1257B825J94j229k056j938q68N67J747K102J471J21j235k059j878q08O29J747
1273f68K075J393P3j282k023j828p49O71J764K042J316Nj299k007j755o78P02
1290b248J777J993J253m9j310j999j710n99P44J770J941J196j10j335j976j632
1306b294n56P87J765J898J132j43j380j937j581m96Q35J734J861J087k18j370
$$ plain form
1193 808 2779 3442 2487 353 -1944 -3310 -3127 -1473 871 2798 3396 2390 259 -1990 -3281 -3038
1209 -3038 -1359 953 2809 3341 2305 174 -2027 -3261 -2960 -1249 1037 2839 3275 2195 67 -2081
1225 -2081 -3218 -2857 -1152 1120 2833 3212 2085 -31 -2127 -3205 -2773 -1045 1171 2826 3139 1978
1241 1978 -121 -2167 -3163 -2683 -964 1244 2834 3073 1876 -195 -2181 -3122 -2590 -855 1297 2825
1257 2825 3019 1790 -266 -2204 -3072 -2505 -758 1344 2815 2936 1701 -358 -2236 -3044 -2415 -668
1273 -668 1407 2800 2873 1591 -432 -2260 -3009 -2338 -574 1468 2784 2789 1490 -517 -2272 -2950 -2248
1290 -2248 -471 1522 2775 2726 1416 -583 -2293 -2892 -2148 -378 1563 2759 2649 1314 -662 -2294
1306 -2294 -2850 -2063 -298 1600 2732 2589 1209 -728 -2309 -2805 -1970 -236 1625 2712 2494 1124
1322A124j924j529m29Q63J744J823J014k63j391j884j479l72Q89J743J778R58
1338B665l02j388j865j431l26R23J740J721R05l39j417j836j370k82R46J742J679
1355A765Q38l81j429j812j319k11R65J719J646P87m14j430j793j264j64J000J711
1372B14J602P34m60j442j753j208j35J035J694J569O68m95j440j728j170p4J060
1389a329J675J517O27n36j460j689j115l0J075J670J474N73n78j465j663j050
1405b304K6J082J656J426N31o11j456j626j008N9J113J632J385M74o27j465j592
1422a305r68J13J115J617J339M30o60j449j565r28J50J128J596J292L95o85j459
1439A56j515q83J79J132J570J272L32o97j437j501q28K10J152J554J199L22p30
$$ plain form
1322 1124 -800 -2329 -2758 -1895 -151 1672 2686 2423 1032 -852 -2331 -2703 -1814 -71 1707 2665
1338 2665 2363 975 -890 -2321 -2647 -1724 16 1737 2642 2303 886 -950 -2320 -2602 -1656 86 1765
1355 1765 2603 2222 793 -1019 -2338 -2549 -1584 135 1781 2568 2154 724 -1069 -2333 -2497 -1497 214
1372 214 1816 2550 2090 648 -1105 -2313 -2448 -1413 281 1850 2518 2023 583 -1145 -2315 -2389 -1329
1389 -1329 346 1863 2490 1954 494 -1195 -2310 -2340 -1265 405 1879 2452 1874 409 -1254 -2304
1405 -2304 -2278 -1196 460 1886 2417 1806 350 -1276 -2284 -2225 -1112 520 1905 2379 1752 287 -1305
1422 -1305 -2273 -2160 -1045 572 1911 2341 1681 232 -1333 -2261 -2111 -983 613 1905 2300 1615 156
1439 156 -1359 -2242 -2063 -931 639 1911 2243 1546 109 -1392 -2220 -2010 -858 696 1895 2217 1487
1456A487j430j458p77K32J156J519J179K76p50j419j421p40K57J150J512J125
1472A898K20p44j407j402o90K90J142J482J095J92p67j399j348o59L14J156J439
1489H12J066J51p81j373j324o27L43J159J417J015J22p87j364j282n77L78J138
1506e14J403R67J03q11j350j237n50L85J145J368R29O6q14j339j198n28M14J145
1524d16J332R00M4q32j307j177m93M39J140J304Q60J5q30j296j141m46M41J137
1542c26J290Q20j3q44j276j109m03M53J116J263P92k9q43j260j081l87M75J118
1560b44J226P58o1q40j245j031l64M81J106J209P11p0q48j227j011l24M96J101
1578a77J175O98r7q53j210r73l09N16J099J161O62j37q62j178r54k63N40J076
$$ plain form
1456 1487 57 -1401 -2178 -1946 -790 729 1908 2184 1434 15 -1406 -2146 -1889 -739 773 1898
1472 1898 2118 1374 -33 -1435 -2125 -1835 -693 789 1884 2076 1309 -90 -1438 -2097 -1783 -627 812
1489 812 1878 2029 1248 -125 -1449 -2076 -1733 -574 843 1858 1980 1193 -171 -1453 -2030 -1652 -514
1506 -514 889 1856 1959 1148 -202 -1439 -1989 -1604 -459 909 1838 1904 1090 -249 -1447 -1975 -1561 -416
1524 -416 916 1816 1860 1028 -279 -1456 -1949 -1510 -370 934 1794 1809 979 -317 -1458 -1904 -1463 -326
1542 -326 964 1784 1771 927 -349 -1458 -1861 -1408 -292 971 1763 1734 891 -369 -1450 -1837 -1362 -244
1560 -244 982 1740 1679 839 -406 -1437 -1801 -1320 -214 995 1706 1636 788 -439 -1450 -1774 -1278 -177
1578 -177 998 1696 1599 746 -464 -1437 -1746 -1230 -131 1030 1692 1555 693 -485 -1439 -1702 -1162 -86
1596h6J134O18j58q68j160r19k43N59J076J094N89j78q58j143q89k09N51J081
1614iJ060N71j96q76j126q55j69N64J057J048N24k15q58j108q17j57N77J052J008
1633A075M98k27q74j081p86j37O01J021R90M68k53q70j062p50j04N93J026R49
1651A077M39k68q63j034p25p5N89J018R18M19k89q56j020o99m7O17R93Q99L82
1670A475l12q52r92o67j1O17R77Q67L48l30q51r75o30%O30R76Q24L22l48q46r42
1691g20o03K2O37R39Q09K95l68q31r16n72L9O44R23P95K64l76q22r13n38P5O39
1712e78R05P76K36l89q36q64n21Q9O46Q97P35K01l98q14q62m68J11O38Q77P05
1732A086J77m00q25q24m66J31O57Q68O73J52m18p97q17m25J53O61Q53O27J45m36
$$ plain form
1596 -86 1048 1666 1508 640 -520 -1439 -1682 -1123 -47 1047 1636 1458 600 -543 -1432 -1641 -1090 -9
1614 -9 1051 1622 1426 550 -576 -1431 -1600 -1036 21 1069 1593 1378 520 -588 -1405 -1562 -985 67 1075
1633 1075 1573 1346 472 -609 -1395 -1532 -931 90 1080 1548 1295 425 -637 -1387 -1491 -898 128 1077
1651 1077 1516 1248 385 -649 -1374 -1449 -860 158 1076 1495 1206 350 -670 -1369 -1416 -799 194 1093 1475
1670 1475 1163 311 -681 -1348 -1359 -742 235 1102 1450 1120 269 -706 -1336 -1336 -706 270 1094 1416 1068 222 -720
1691 -720 -1323 -1301 -664 275 1084 1379 1011 180 -736 -1308 -1269 -625 298 1093 1357 981 159 -754 -1292 -1217 -578
1712 -578 327 1103 1339 950 114 -750 -1271 -1182 -536 361 1096 1297 899 85 -777 -1245 -1134 -496 381 1086
1732 1086 1263 863 38 -786 -1252 -1121 -464 404 1077 1229 811 14 -803 -1228 -1075 -414 439 1066 1211 775
1752G75p93p99l92J70O59Q44O26R6m42q02p57l71J93O59Q15N90Q7m66p91p32l47
1773a178K16O50Q15N69M4m62p81p25l14K21O66P96N43K8m72p76o91k96K55O63
1793b29P79M93K0m83p51o68k71K54O67P55M80lm97p45o43k53K69O73P26M62l1
1814A004m98p44o22k20K94O52P15M38n7n04p27o07j80L05O49O89M23n6n12p28
1834b86n70j75L09O50O86L86q8n05p03n51j56L21O55O57L61r7n26o86n31j29L35
1855f43O35O36L29j17n16o78n06r9L48O27O18L16j38n28o59m66q7L56O10O03K94
1876I35j52n15o46m55p0L70O15N73K69j75n04o31m38m0L76N97N48K46j79n23o13
1897d12m02l5L54O08N32K32j97n07o01l87j6L74N89N23K10k08n16n74l68OL67
$$ plain form
1752 775 -18 -817 -1209 -1039 -380 464 1090 1186 744 -58 -815 -1186 -993 -334 481 1071 1158 692 -99 -831 -1178
1773 -1178 -962 -312 503 1072 1116 654 -127 -852 -1166 -945 -279 517 1060 1088 616 -160 -851 -1147 -892 -229
1793 -229 550 1043 1063 580 -171 -839 -1110 -856 -189 566 1046 1043 546 -199 -842 -1095 -826 -153 573 1035 1004
1814 1004 506 -238 -860 -1080 -786 -134 581 1019 962 458 -269 -876 -1056 -751 -102 587 1010 954 442 -286
1834 -286 -856 -1031 -722 -72 614 1000 912 407 -296 -847 -1003 -682 -27 630 991 894 368 -318 -849 -978 -643
1855 -643 -8 628 957 840 324 -354 -860 -959 -611 16 634 950 812 284 -375 -841 -928 -572 38 641 935
1876 935 783 268 -378 -833 -903 -533 82 655 924 749 245 -386 -824 -864 -488 109 657 903 724 201 -412
1897 -412 -814 -849 -495 113 645 877 680 173 -428 -815 -831 -457 132 655 865 657 141 -433 -801 -795 -428
1918d28N91M90J89k09n04n64l52K4L82N60M84J69k22n15n48l38M9L89N65M39J58
1939H09k40n02n28l18N7L99N35M40J30k35n12n14k94P7L92N37M25J15k68m88n05
1960d88k70R7M01N18M12R8k78m88m92k40Q2M17N12L86P0k76m88m72k34J02M11
1981b20N16L55O1k84m90m57k16J25M13N03L49M5k89m81m42k08J48L98M89L48L3
2002F96l02m88m23j92J51M23M86L15J0l02m84m14j68J62M22M61L08ml14m73m16
2023e46j43J80M14M63K80j6l17m81l85j33J87M19M59K68l1l38m65l68j15J93M32
2044d3M36K69m8l41m65l54j15K15M30M32K48p5l32m66l44r4K29M18M19K39q7l59
2066B12m42l38p6K29M31M00K15q4l53m40l27o0K48M17M00K03j03l48m42l03n5
$$ plain form
1918 -428 163 653 842 633 129 -435 -787 -763 -381 179 663 832 610 95 -453 -791 -742 -353 212 651 809
1939 809 569 67 -461 -779 -722 -323 212 652 782 547 35 -479 -773 -696 -304 233 658 773 505 17 -488
1960 -488 -758 -661 -260 258 670 768 490 2 -490 -730 -648 -231 281 667 737 461 -27 -499 -733 -631 -220
1981 -220 296 651 712 428 -62 -519 -735 -610 -197 306 655 700 411 -70 -512 -720 -572 -174 315 663 696
2002 696 394 -94 -517 -709 -558 -135 351 666 676 374 -110 -524 -692 -530 -108 353 661 657 343 -130 -546
2023 -546 -689 -509 -95 368 648 632 315 -166 -551 -684 -497 -78 381 649 618 280 -185 -553 -668 -475 -43
2044 -43 393 662 614 273 -192 -546 -661 -446 -16 416 664 589 257 -209 -553 -647 -418 0 419 658 571 212
2066 212 -230 -568 -644 -415 16 416 631 547 194 -246 -573 -633 -385 32 432 635 532 184 -258 -561 -616
2087f16K53M18L93J92j16l59m15l05m0K64M15L65J82j28l67m13k94j8K64M07L70
2108D52J53j29l60m14k80kK66M09L64J39j42l77l90k54MK78M03L42J25j30l76
2129H1l95k43J5K74M09L38J07j57l62l93k22K4K78M03L14J08j73l62l83k21L9
2150e21K83L92L13R1j82l71l62k05N9L10L66L03P4j78l78l44j91O5K91L81K82
2171D78O4j83l64l46j94R2K96L74K75N2j98l78l45j49P8L00L70K65L4k09l67l30
2193c85j53R6K96L60K66L8k30l66l20j40J12L08L62K40K9k35l64l17j20J14L38
2214g1L34K26J1k28l71l02j17J34L13L45K31k9k40l53l08r1J44L15L39K06l0k52
2236B06l41k91r2J57L27L28J77k9k54l41k74p7J69L23L14J78m8k61l29k62p4J87
$$ plain form
2087 -616 -363 55 448 640 524 165 -250 -555 -595 -331 84 449 631 503 136 -277 -571 -589 -325 82 452
2108 452 605 476 116 -298 -578 -580 -314 95 459 598 456 79 -311 -565 -561 -283 120 462 587 457 81
2129 81 -314 -557 -542 -268 141 479 586 429 67 -326 -548 -524 -246 157 471 579 406 44 -339 -560 -521
2150 -521 -238 154 467 558 376 5 -357 -562 -503 -193 173 476 550 372 -6 -350 -541 -476 -185 196 478
2171 478 542 359 -5 -351 -545 -453 -157 217 492 544 346 -32 -377 -526 -448 -148 222 487 521 312 -55 -385
2193 -385 -538 -442 -146 214 480 518 288 -78 -398 -538 -426 -118 244 484 513 278 -86 -403 -523 -409 -71
2214 -71 263 489 500 272 -99 -401 -518 -384 -71 274 505 476 236 -117 -425 -516 -372 -57 282 488 458 206
2236 206 -135 -426 -518 -361 -34 294 471 442 188 -153 -427 -504 -335 -12 302 480 432 171 -158 -420 -494 -307
2258c07L09L21J58n6k63l27k47o3J79L12L01J65o9k58l30k50n0J74L29K87J38
2279D53o3k73l22k06n7J86L20K94J28p9k66l18k12k5J95L09K76J26r6k51l07k34
2301d22j3J94L10K81J10r8k77k95j98j0J91L12K58J06j11k73k84k04MJ98L12K43
2323C34J11j23k68k93j80K0K04K94K51P5j02k72k85j71K5K10K88K33P8j19k70
2344D0k86j66K5K16L03K21P0j40k62k76j53M1K08K91K21O0j41k73k60j53M1K29
2366a44K68K28M7j39k69k68j42N8K29K73K25N3j55k69k66j31O6K23K86J94L9j51
2388B55k76k42j34N8K25K73J98L8j56k74k55j16O9K31K72J94K2j57k77k37j08
2409c97P3K31K73J91Lj60k78k33r6R1K35K59J77Rj65k68k40r4R1K39K68J65jj74
$$ plain form
2258 -307 2 323 481 425 162 -165 -412 -475 -296 16 317 482 413 155 -175 -425 -475 -301 28 315 453
2279 453 390 117 -205 -411 -468 -282 38 332 460 381 115 -203 -415 -440 -245 64 340 466 370 119 -188 -422
2301 -422 -435 -241 69 350 460 362 85 -210 -408 -418 -227 85 343 449 338 65 -219 -423 -419 -221 91 334
2323 334 445 322 54 -239 -419 -399 -195 99 350 425 323 51 -234 -405 -380 -170 118 351 429 310 40
2344 40 -246 -412 -387 -171 132 353 423 283 21 -255 -408 -367 -159 132 353 413 272 -1 -261 -414 -373 -144
2366 -144 124 352 399 260 -9 -277 -419 -361 -132 141 366 419 264 -5 -271 -402 -336 -113 173 367 406 255
2388 255 -21 -263 -397 -339 -114 159 357 395 239 -35 -290 -406 -337 -106 166 360 382 225 -52 -289 -397
2409 -397 -324 -93 180 371 374 214 -64 -297 -393 -302 -67 192 369 378 213 -55 -295 -389 -298 -59 209 374 373 199
2433A99k72k22r8R9K33K61J63pj67k77k33q6J11K56K46J60qj92k71k16p3J15K37
2456d2K53J62j4j89k65k16p9J24K41K55J49k6j88k66k10o4J15K50K43J53l6j94
2478A56k69k06n8J19K37K58J30l7k00k51j96p1J28K45K44J36m2j86k65j86o0J36
2500b38K44K42J34m8k01k62j88l8J19K49K33J23n1j96k59j90l7J37K40K26J39
2521C78n8k04k67j76l6J37K40K33J01m0k14k54j74k7J44K39K31J04n8k02k52j71
2543c26k1J52K46K10J14p0k08k54j59k5J46K52K14R9p8k04k44j69j6J52K45K11
2565B67P5n7k21k37j52j1J50K37K06Q6p0k14k43j49NJ56K27K16R1r7k12k27j52
2588c26LJ62K37K13O8r4k00k32j52LJ61K35K06O4r2k24k28j24jJ73K31J95O2r7
$$ plain form
2433 199 -73 -295 -393 -294 -61 200 363 356 189 -88 -321 -407 -296 -40 206 366 358 166 -105 -321 -394 -279 -42
2456 -42 211 373 359 170 -95 -311 -390 -266 -25 230 379 353 165 -101 -311 -375 -260 -10 233 386 350 156
2478 156 -113 -319 -377 -258 -21 237 367 330 130 -121 -317 -388 -260 -15 229 365 323 137 -128 -314 -374 -238
2500 -238 6 248 382 334 133 -129 -317 -355 -236 13 246 369 318 122 -137 -327 -364 -227 13 239 378
2521 378 320 116 -151 -327 -363 -226 14 247 348 308 94 -160 -334 -361 -217 22 253 357 299 97 -155 -326
2543 -326 -347 -195 51 261 375 305 97 -157 -316 -341 -195 57 271 370 292 88 -156 -325 -341 -189 56 267
2565 267 342 285 64 -173 -325 -336 -186 51 257 343 273 59 -184 -333 -328 -172 55 271 362 265 53 -174 -326
2588 -326 -323 -161 76 289 357 263 63 -169 -321 -318 -157 78 284 348 256 32 -196 -320 -321 -148 83 278 340 243
2612B43k19k23j30J3J67K45J80N7j05k11k22j29L8J73K21J87N7j14k13k15j20
2633c20L4J69K39J65M3j02k10k29j11M1J71K17J68M2j21k06k16j08N5J70K19J66
2655B76L2j27k07j97j11N5J79K19J63K5j14k19j96r8N3J76K34J46K5j34k11j89
2677b20r5O1J79K22J58Mj33k15j82r2O2J87K01J63qj18k23j82r1P8J87K02J41
2700B86J1j44k05j86p8P3J77K19J26Lj27k05j87o5P0J86K06J42rj39j98j91o2
2723b97P2J97J80J29Jj44k04j81n9P6J82K09J12kj38k16j59p5R2J92J98J18j9
2746B64j40k06j66n5Q5J97J95J18k7j36k07j65n0Q0J90K05J09j5j53k01j67m4
2768b89R0J92J85J10k3j48k04j72l8R9J89J84J08k8j55j98j54m1R1J92J92R8k6
$$ plain form
2612 243 24 -199 -329 -316 -149 96 276 333 228 17 -205 -334 -296 -123 98 285 342 228 15 -200 -320
2633 -320 -286 -117 122 287 330 228 18 -211 -322 -281 -110 107 275 317 196 -10 -226 -334 -279 -109 110 276
2655 276 308 181 -26 -223 -334 -279 -100 119 282 307 193 -26 -222 -320 -267 -91 143 289 314 180 -31 -220
2677 -220 -315 -254 -75 147 305 309 176 -39 -221 -313 -251 -64 137 300 292 174 -49 -231 -322 -244 -57 145 286
2700 286 297 153 -52 -238 -316 -243 -66 153 279 282 155 -50 -237 -302 -232 -46 160 302 293 154 -44 -235 -297
2723 -297 -225 -28 152 281 282 138 -66 -247 -306 -230 -48 161 273 271 133 -83 -242 -317 -225 -33 165 283 264
2746 264 124 -82 -248 -303 -218 -21 174 292 265 129 -78 -243 -293 -213 -23 182 291 276 123 -78 -245 -289
2768 -289 -199 -7 178 288 265 117 -87 -259 -297 -198 -9 175 283 255 100 -98 -252 -293 -202 -10 182 280 254
2791B54j48j98j69k0R3J91J99R6l8j56j96j60k2R7J84J96Q7m0j53k00j58k0J05
2814a76J88K02P7n3j54j92j43l8J09J91J78Q8m7j64j93j38k1J24J88J66R6m3j71
2837G4j98j24k3J19J96J76P5n3j76j92j34kJ18J82J75O7n2j76j92j32KJ12K00
2860D2J75O2p8j56j98j19PJ22J86J70O5p5j66j84j22jJ29K03J66N7q0j66j78j27
2884b66J6J19K03J56N9o8j83j94j06LJ35J96J58N4q4j77j87j17J7J35J94J60M7
2907B70p8j81j79j10J4J44J94J59N4r0j74j89j04J7J50K01J43N0r4j83j90r2L4
2930b34J40J83J58M3j01j92j76j04L5J55J88J48M1j09j90j87r0M1J49K00J50L4
2952B82j15j81j77j01O0J49J98J39L3j07j91j85p9M5J55J88J52K0j07j90j79q6
$$ plain form
2791 254 106 -92 -261 -281 -188 3 202 298 260 104 -92 -252 -274 -177 7 203 290 250 97 -103 -261 -281 -176
2814 -176 12 214 291 238 84 -108 -251 -289 -180 11 189 277 230 66 -127 -265 -286 -162 26 192 288 245 74
2837 74 -124 -248 -271 -152 44 220 295 242 66 -126 -260 -262 -144 38 213 280 228 52 -140 -272 -270 -158 42
2860 42 217 279 201 45 -153 -272 -265 -143 43 213 278 203 37 -147 -269 -270 -141 62 228 285 205 39 -139 -266
2884 -266 -250 -131 72 228 287 219 36 -158 -264 -261 -126 70 228 282 198 21 -166 -283 -266 -131 63 223 270
2907 270 192 11 -168 -278 -264 -120 74 233 287 197 23 -166 -270 -253 -103 98 241 291 197 14 -176 -268 -234
2930 -234 -94 89 247 290 189 -3 -179 -283 -248 -93 95 243 284 175 -15 -202 -292 -251 -102 98 248 282
2952 282 167 -14 -191 -292 -232 -83 115 254 287 180 -11 -196 -275 -230 -75 113 265 285 178 -12 -191 -277
2974b77N0J61J93J34J5j08j90j88r6O9J67J96J28J8j26j92j83p0N4J83J93J28
2996B59J0j24k08j63n4N9J76J89J35kj37j85j82m8N5J81J86J23J6j38k12j56o4
3019b84Q0J67J97J05j7j25k10j50m9Q7J65J92J05j0j40j94j64m6Q8J71J99J08
3041B75j7j46j97j61l1Q8J77J95J01j7j51j99j61m5J10J73J87J03k5j46k03j50
3063b40m7J04J82J80R6m0j37k10j42l1R3J98J79R8n7j48j96j38k8J14J89J76R8
3086B93m3j67j85j44k2J11J83J77R4n7j53j99j41j1J18J80J81Q1n7j67k02j28
3108b58j0J08J90J81P4o7j66j88j36JJ24J88J64P8o1j76j86j22lJ26J93J62P1
3131B87o8j72j89j19LJ27K07J55O4p2j76k02j09jJ33J98J54O2p0j93j84j23J7
$$ plain form
2974 -277 -227 -66 127 261 276 168 -22 -210 -306 -237 -70 126 254 272 146 -46 -229 -299 -245 -62 131 259
2996 259 269 145 -63 -226 -280 -221 -45 144 279 277 140 -45 -227 -275 -220 -39 147 270 286 148 -64 -220 -284
3019 -284 -204 -37 160 265 248 123 -87 -237 -286 -199 -34 158 263 253 113 -81 -245 -291 -203 -32 167 275
3041 275 258 112 -85 -246 -277 -189 -12 183 284 267 116 -83 -244 -289 -179 -6 181 284 259 113 -90 -240
3063 -240 -287 -183 -1 179 275 235 98 -112 -254 -285 -192 6 185 283 226 78 -118 -256 -284 -170 19 195 293
3086 293 250 83 -102 -246 -268 -157 26 203 297 240 87 -112 -253 -264 -146 34 215 296 239 72 -130 -258
3108 -258 -268 -160 30 211 285 218 52 -136 -272 -271 -147 41 205 283 222 46 -140 -262 -265 -139 54 216 287
3131 287 219 47 -142 -261 -258 -131 76 231 295 223 47 -155 -264 -265 -132 66 220 282 212 19 -165 -288 -271
3154b71J27K03J64O3q5j80j90j21K3J40J98J57O6r2j86j89j14K6J52J91J68L7
3176B87q5j89j91r5J8J54J99J55M1j04j92j93r8L7J48K12J40L7j00j88j94j06
3198c07M7J63J86J58L2j03k01j72j03M7J56K06J60J7j04j96j86r3M6J77K00J36
3220B66L1j22j86j92r3N7J72K03J30J6j19k07j79p1M8J63K04J36J5j21k12j62
3242b23p8O4J70K07J38J1j42j94j80o6P1J62K09J35Jj33j97j81o2P2J77J97J31
3265B89qj41j98j70n7O9J77K03J25j6j46j98j75o3Q0J86K00J29j9j42k05j71o3
3288c14R9J94J81J35k5j46k03j65n9J05J88J99J14k6j47k22j59l9R4J93K01J12
3310C10l6j61k11j68m2J16J85J96J05k5j65k21j60k8J13J97J93J02l8j76k01j64
$$ plain form
3154 -271 -144 59 223 286 201 21 -169 -290 -267 -127 71 228 294 202 16 -173 -287 -261 -109 82 250 287
3176 287 202 13 -178 -273 -255 -101 98 253 294 190 -2 -195 -293 -256 -108 104 244 281 181 -7 -201 -307
3198 -307 -260 -97 89 247 279 176 -25 -197 -300 -253 -97 109 269 286 182 -14 -200 -293 -247 -70 130 266
3220 266 297 175 -11 -203 -296 -239 -67 136 266 282 163 -44 -223 -294 -246 -83 121 257 272 151 -61 -223
3242 -223 -301 -237 -67 140 278 289 147 -47 -227 -293 -222 -60 149 284 285 152 -45 -226 -288 -216 -39 158 289
3265 289 281 140 -58 -228 -285 -216 -39 164 289 273 127 -71 -246 -309 -229 -43 157 286 267 125 -80 -251 -314
3288 -314 -215 -21 160 295 270 124 -79 -244 -303 -198 -10 189 303 277 130 -92 -251 -290 -196 -3 198 310
3310 310 274 113 -98 -266 -308 -192 -7 189 294 269 104 -117 -277 -305 -192 5 198 300 262 86 -115 -279
3332b79k0R9K15J92J06m9j66k19j57j9J14K13J89R0m7j61k16j61k2J22K16J85
3354B25Q8m9j99j97j54j7J27K14J91Q0n9j86k08j51j1J35K08J91P0m4j88k06j61
3377c01LJ34K17J97P5p6j83k12j45jJ37K20J86P1p8j98k01j48lJ56K12J80Q4r2
3401B34k08j98j39J0J51K26J64Q3j00j94k12j39J8J53K32J72O1r9j86k05j24J3
3423b87J63K11J94M9j04j98k16j17K5J61K21J77M6r8k10k15j21L3J75K21J71M5
3445C26j15k12k09j26M8J72K34J66K7j03k13k07j10M3J69K47J59L7j25k07k07
3466b06j12N8J76K26J59K3j18k14k04j08O1J72K27J58K5j27k20k11r7O6J88K06
3488A28J73J1j39k14k02q7O1J90K24J49K1j37k10k06r3P3J97K31J44J1j57k07
$$ plain form
3332 -279 -299 -200 15 207 313 264 98 -121 -278 -297 -183 30 219 309 262 101 -115 -276 -298 -176 40 225
3354 225 313 264 65 -132 -286 -303 -176 38 229 309 250 64 -144 -295 -306 -171 37 228 298 254 66 -140 -301
3377 -301 -298 -164 53 250 325 249 66 -146 -291 -292 -155 65 251 322 244 46 -155 -303 -306 -150 62 242 326 234
3401 234 26 -172 -311 -301 -150 76 240 323 223 29 -183 -322 -304 -151 81 253 314 215 29 -176 -300 -287
3423 -287 -124 87 281 330 226 28 -188 -305 -280 -119 102 279 325 227 17 -198 -319 -286 -111 110 281 326
3445 326 211 -1 -210 -336 -288 -116 118 284 311 208 -5 -212 -322 -279 -110 137 296 333 208 1 -206
3466 -206 -318 -260 -84 142 301 324 206 -8 -212 -320 -259 -87 140 298 323 196 -24 -235 -332 -266 -78 128
3488 128 301 312 173 -41 -243 -330 -269 -79 145 294 315 178 -32 -238 -331 -258 -61 170 314 325 168 -39
3510c9k03p4O1K06K13J49mj39k16j99p5O3K04K21J28Qj51k23j92q0J01J89K32
3533A80J36j7j47k28j84o9Q8J98K27J37k2j48k33j79o5R3K06K23J38l0j57k27
3555h0j97n2J07J92K23J27k1j66k27j82o4J11K18K05J36m0j63k37j72o3J09K22
3577a4K09J38n1j71k32j63m2J06K13K17J20m2j70k25j74m1J08K17K18J22o5j61
3599A17k49j72j7J10K18K20J06m5j82k33j86k6J31K22K09J14n8j84k45j60j7J24
3621b03K22K17R5n7j92k30j55j1J29K35J87J01o0j95k31j55j4J52K14K10P8o3
3643B74j96k35j44k3J40K24K01R0p2k02k18j60lJ47K27J95R1r5j90k29j43QJ37
3666a76K36J97P9p9k01k40j37KJ64K33K09P0j03k05k24j51J3J56K33J94O4q0j94
$$ plain form
3510 -39 -242 -316 -255 -49 164 313 309 170 -46 -245 -320 -257 -53 168 296 304 153 -70 -262 -342 -241 -52 180
3533 180 316 299 152 -76 -260 -329 -241 -43 184 321 299 151 -82 -261 -326 -233 -27 196 334 304 147 -80
3555 -80 -277 -329 -222 -30 193 320 299 133 -94 -276 -340 -229 -11 194 330 290 127 -110 -282 -345 -236 -14
3577 -14 195 333 282 111 -121 -284 -326 -220 -7 210 330 288 118 -107 -281 -322 -214 3 221 343 278 117
3599 117 -132 -304 -321 -211 7 227 333 288 106 -127 -313 -339 -208 14 223 337 279 95 -150 -310 -327 -203
3621 -203 19 236 331 274 82 -148 -303 -314 -185 50 237 338 278 83 -148 -303 -317 -165 49 259 337 274
3643 274 78 -157 -301 -324 -184 40 241 331 259 57 -161 -321 -324 -177 50 245 336 241 51 -178 -321 -313 -176
3666 -176 60 257 336 257 56 -184 -321 -319 -155 78 287 357 254 49 -175 -326 -313 -157 76 270 334 254 60
3689F0k49j47K2J70K29J84P0j04k16k14j40K1J63K38J85O1r7k20k12j33L1J66
3711a32K41J87L9r7k19k23j20L0J78K26J88N2j19k11k29j22L0J93K28J69N2j22
3733B19k17k17j24M1J80K30J82K7j15k26k22j09N9J78K48J59L7j26k16k17j14
3754c43O0J88K45J66K7j28k33k13j02N8J99K34J61J5j22k42k13j02O4J93K35J52
3776B99K4j33k41k17q5P5K01K33J47J0j50k26j96r3Q3J96K38J60Qj53k37k20p4
3799c51Q7K08K36J55kj61k25k13p6Q2K14K24J49j3j61k30k10q2J09K03K36J45
3821C24j1j55k51j96p9J12K10K39J36qj81k41j91o2J07K17K33J42j9j77k40k06
3843b97m9J06K18K39J38l5j81k48j89n9J29K19K22J22l7j72k50j83l4J00K34K06
$$ plain form
3689 60 -189 -336 -314 -144 85 269 339 235 19 -195 -335 -314 -151 87 272 333 236 16 -196 -329 -298 -132
3711 -132 109 296 335 238 19 -204 -324 -294 -116 110 298 350 231 20 -209 -331 -301 -108 120 289 341 219
3733 219 2 -215 -339 -298 -118 112 294 321 206 -20 -242 -351 -292 -114 134 293 330 204 -12 -229 -343
3754 -343 -283 -95 150 316 343 215 -18 -231 -333 -275 -76 158 319 334 212 -30 -243 -345 -281 -88 147 299
3776 299 323 190 -51 -268 -353 -278 -77 156 303 313 163 -63 -259 -352 -269 -73 165 325 333 180 -57 -277 -351
3799 -351 -264 -56 180 335 333 172 -53 -266 -342 -260 -46 178 327 314 153 -77 -287 -369 -260 -57 179 324
3821 324 313 158 -93 -289 -368 -256 -46 193 329 321 140 -101 -292 -354 -247 -30 203 345 326 149 -91 -297
3843 -297 -346 -240 -22 217 355 320 139 -109 -298 -357 -228 -9 213 335 298 126 -124 -307 -341 -241 -7 199
3865A99J37k9k02k41j78m4J16K36K31J17m7j83k38j81m6J22K45K23J08l8k10k36
3887a39j61m4J28K41J95J30n6j88k49j75k8J30K43K08J12p3j81k58j57l7J57K26
3909B4K21J03p0k03k43j59k1J57K32K03J10o6k10k37j75qJ58K35K17Q7q0k07k36
3932a68j63qJ59K35K11Q8q0k21k36j57QJ54K38K08Q2q3k24k48j42NJ59K54K05
3955B76P3q4k31k28j55J4J68K47K11O7r5k30k33j42K2J69K53J99N7j04k25k36
3977b07j46M5J66K44K02N7j31k18k29j53M8J75K41J94N3j12k27k37j21K8J93K49
3999A14J90M6j18k36k30j14L5J95K40J93M1j22k39k21j19N2J74K54J78M0j30k44
4021b1k10j30N4J94K48J86L0j50k39k20j12N7K12K41J68J8j26k40k17j02N5K08
$$ plain form
3865 199 336 307 105 -136 -314 -358 -242 -6 225 342 295 112 -126 -307 -353 -231 14 237 345 307 97 -139
3887 -139 -300 -344 -216 25 220 350 294 106 -143 -318 -346 -216 27 235 347 274 93 -165 -322 -359 -202 24
3909 24 245 348 278 75 -168 -327 -348 -191 41 244 354 288 78 -159 -334 -342 -184 51 268 355 275 68 -168
3932 -168 -331 -339 -180 55 266 354 274 53 -183 -340 -332 -178 60 268 350 267 43 -205 -347 -342 -183 71 276
3955 276 349 265 34 -194 -349 -335 -167 80 291 358 263 33 -200 -342 -320 -151 102 301 358 254 29 -207
3977 -207 -353 -308 -142 102 304 361 230 12 -217 -370 -322 -147 94 288 341 229 2 -235 -356 -328 -135 114
3999 114 304 350 232 -4 -234 -348 -313 -118 122 315 356 234 -5 -226 -345 -293 -119 135 313 353 223 -21
4021 -21 -231 -361 -307 -113 135 321 351 201 -38 -258 -370 -313 -101 140 308 326 200 -40 -257 -359 -304 -96
4043i6K55J69K4j46k43k22j07P4K20K34J72J7j49k44k21r4Q2K07K35J73kj57k35
4066e4k29r1R1K10K39J60%j56k44k07q8Q0K20K26J73nj61k38k11p6J01K12K37
4089A89J48j0j54k45k11p1Q8K20K39J48j2j71k47j95p0Q7K33K29J43j3j78k49
4111a02j98o9R7K36K23J55k6j73k59j93n1J04K32K32J47l0j91k45j91n3J17K30
4133hK28J33k9j75k64k00m3J21K36K31J42n2j96k55j90m0J35K35K20J22n5j91
4155A05k46j84k4J25K41K18J16m5k04k48j85k3J38K28K37J08n1k12k46j67k2J48
4177a93K29K30R1o4k08k36j75k0J44K51K02J19q3k08k46j77qJ55K30K22J04r1
4199B68k10k53j49j7J67K37K33P9p6k16k52j53OJ69K18K31P9q5k24k39j61J3J75
$$ plain form
4043 -96 159 328 352 206 -37 -259 -366 -292 -72 162 334 351 202 -42 -263 -357 -275 -68 167 340 338 181 -54
4066 -54 -283 -374 -283 -73 166 326 326 170 -74 -281 -369 -289 -69 157 330 325 164 -74 -285 -361 -260 -48 189
4089 189 337 327 173 -72 -283 -354 -266 -46 193 341 329 158 -89 -284 -354 -267 -34 195 338 325 147 -102
4111 -102 -300 -369 -272 -36 187 342 316 143 -116 -309 -360 -256 -24 208 355 325 134 -111 -302 -355 -238 -8
4133 -8 220 353 324 149 -115 -315 -358 -237 -1 230 372 320 124 -131 -321 -361 -226 9 229 351 296 105
4155 105 -141 -325 -349 -224 17 235 351 306 102 -146 -331 -354 -216 12 249 357 306 94 -152 -319 -341 -193
4177 -193 36 266 357 293 85 -151 -326 -346 -202 49 251 370 287 79 -167 -344 -352 -197 33 255 359 268
4199 268 58 -195 -344 -361 -194 43 276 355 279 63 -189 -342 -336 -167 51 282 361 276 52 -187 -348 -335 -160
4222a60K45K03R1j07k21k42j54J2J77K46J97P9j12k24k44j48K1J82K38K09P2j16
4244B44k29k42j40L7J82K55K01N1j13k26k31j41M7J88K30K02N1j24k31k33j38
4265c60M5J85K54J89N1j36k25k37j24M6J75K62J93K8j23k35k26j28M4K06K41J95
4287C20L1j36k38k34j18P7J90K59J71L1j32k49k21j11N5K12K51J85J4j37k60k21
4309b61r4O0K11K41J84Rj43k59k19r3O5K14K49J66Pj60k39k20p9O9K05K54J63
4332C30J8j65k36k32q6Q2K10K62J52J4j57k55k09r7R4K22K41J59jj72k43k14q0
4355c63R0K21K50J35nj54k53k25o2Q6K21K45J53rj81k42k05q4J04K39K50J46k3
4378C34j87k39k03n9J09K23K40J38j7j90k44k03p2J20K41K42J20j9j96k52j99
$$ plain form
4222 -160 85 288 379 272 51 -191 -345 -333 -156 90 287 366 254 30 -214 -362 -341 -159 79 288 360 244
4244 244 15 -227 -367 -330 -148 107 308 359 246 20 -211 -352 -305 -117 113 315 366 242 11 -222 -360
4265 -360 -315 -130 124 313 364 228 3 -234 -358 -312 -137 125 318 346 223 -12 -238 -366 -322 -116 125 320
4287 320 351 215 -23 -257 -375 -298 -108 151 322 353 221 -28 -249 -360 -305 -93 158 343 357 220 -40 -261
4309 -261 -355 -295 -84 157 341 350 207 -52 -271 -364 -299 -85 164 330 337 177 -62 -282 -361 -292 -87 167 330
4332 330 348 183 -53 -285 -371 -289 -79 183 335 349 192 -63 -272 -369 -275 -53 188 347 346 174 -69 -283 -363
4355 -363 -273 -52 198 333 328 174 -79 -304 -366 -280 -59 186 339 330 149 -93 -298 -382 -278 -39 211 357 334
4378 334 147 -92 -295 -354 -245 -22 218 356 339 149 -95 -298 -370 -250 -9 233 353 334 138 -114 -313
4399c13m4J06K26K44J30m5j77k47j99n0J20K39K34J25m4j89k39j93m2J36K28K26
4421B32J27m6j92k45j87m6J33K44K38J15n4j97k63j76l6J41K31K43J02n3k22k30
4443a41j89l2J48K46K15J13p2k04k43j76k5J42K50K25J00n9k19k44j57k4J50K55
4465E9K21Q1m8k24k52j62qJ49K41K20Q7p3k08k52j63j0J52K52K00R9q5k09k47
4488a80j68LJ59K32K30R0r0k26k43j57J0J64K47K10R1r7k19k47j51J2J63K47K12
4511B92Q0r7k30k39j55J3J70K64J97P4r9k38k37j49J2J79K45K10P0j06k35k43
4533b22j36J9J76K53K07O4j09k27k53j20K6J80K49K09N0j10k32k42j33L0J86K46
4555A11J98N2j08k45k31j34L5J89K40J97N2j32k21k34j35M7J99K45J87N0j47k27
$$ plain form
4399 -313 -357 -251 -25 219 349 304 127 -120 -319 -369 -249 -10 224 349 305 116 -123 -316 -358 -222 6 232
4421 232 359 313 121 -124 -311 -357 -224 20 258 373 319 122 -141 -317 -353 -212 19 262 364 311 89 -141
4443 -141 -330 -362 -214 32 247 360 288 84 -159 -335 -360 -218 32 257 357 298 79 -165 -322 -346 -196 59
4465 59 280 361 313 89 -163 -325 -333 -184 57 277 364 291 83 -169 -332 -342 -190 62 262 361 276 67 -180
4488 -180 -348 -345 -186 46 276 366 276 50 -193 -350 -340 -176 71 281 372 275 56 -191 -342 -330 -167 80 292
4511 292 372 275 45 -194 -349 -336 -166 98 295 369 270 32 -205 -354 -342 -163 82 292 362 256 21 -222
4533 -222 -358 -339 -163 90 297 361 252 25 -228 -348 -322 -142 107 316 366 256 24 -218 -351 -321 -135 111
4555 111 309 361 253 8 -223 -357 -322 -133 107 304 356 224 3 -231 -366 -319 -120 125 312 362 215 -12
4577a2k31j17N0J88K52J83M2j21k54k33j07N7J88K55J82L7j40k23k39j07N4K01
4599i5K53J72L6j48k41k26j15O6J93K56J72L4j58k46k14r8O8K06K44J72J6j55
4621A92k47k19q6P3K08K48J63J6j59k43k21q7P7K23K36J75oj61k39k23p7Q2K23
4644e2K33J63j1j57k47k18p9J02K05K46J46oj67k42k11p3Q9K22K47J43oj80k30
4667h3k01q8J11K27K33J46kj78k45k10o5J00K27K38J45k2j77k54j98o6J14K36
4689a2K36J17k1j87k40j97n1J17K10K29J37l8j70k51j85m7J14K34K20J37m2j91
4711A19k40j84m0J20K24K33J26m7j97k28j87m6J27K30K23J19m7j92k38j90m5J30
4733b30K28K31J19m6k01k39j77m6J37K32K27J08n4j95k44j68l0J38K38K03J14
$$ plain form
4577 -12 -243 -360 -310 -122 130 313 355 234 -20 -253 -360 -303 -115 140 322 359 219 -4 -243 -350 -296 -95
4599 -95 158 330 366 218 -23 -249 -364 -298 -105 151 323 357 199 -47 -261 -359 -291 -85 159 331 347 192
4621 192 -55 -274 -360 -287 -79 169 332 348 189 -54 -275 -362 -285 -62 174 349 343 182 -57 -280 -357 -275 -52
4644 -52 181 344 333 176 -71 -289 -368 -266 -61 185 331 325 158 -84 -295 -368 -279 -57 190 333 327 147 -83
4667 -83 -284 -372 -261 -34 199 345 343 165 -80 -290 -355 -255 -28 210 355 333 156 -98 -296 -362 -248 -12
4689 -12 224 341 320 133 -107 -304 -355 -238 -28 201 338 300 130 -121 -306 -353 -239 -5 215 352 310 119
4711 119 -121 -305 -345 -225 -1 232 358 311 114 -114 -301 -347 -220 10 233 352 305 113 -125 -315 -360 -230
4733 -230 -2 229 348 302 101 -138 -315 -361 -224 8 235 343 289 94 -150 -318 -348 -210 28 231 345
4754C45n2k00k35j75k0J38K45K17J02o5k10k36j65j5J30K45K08R8p6j95k47j67
4776c30%J43K23K18Q2o3k04k42j62rJ65K22K21P7p8k04k27j50mJ44K43J98P9p9
4800B63j91k36j69PJ66K39J86Q8q2k13k28j54LJ63K36J89Q3j12k02k23j43JJ65
4823a64K41J91P1j05k13k32j27J7J73K33J90O2r6k18k25j32K8J73K25J88O7j08
4845B39k14k21j33K6J75K30J80O0j10k17k27j22K6J81K25J82M8j10k19k23j16
4866c40M2J72K36J64N2j12k26k05j21M0J78K42J75L9j19k15k20j15M8J86K37J64
4888C02L5j23k24k07j19N2J88K23J59M7j25k22k20r8N1J75K38J70K3j24k29k23
4910b51p9N0J92K25J72J4j35k14k10r6O2K06K22J53J8j41k24j92j00O0K09K11
$$ plain form
4754 345 293 93 -142 -317 -337 -199 46 263 365 300 90 -146 -311 -326 -196 49 257 355 279 84 -163 -330
4776 -330 -330 -187 36 254 336 273 69 -173 -335 -344 -179 43 264 341 263 59 -168 -318 -322 -178 65 263 342 263
4800 263 72 -164 -333 -326 -160 79 265 353 271 58 -170 -324 -321 -158 78 267 350 238 36 -187 -330 -329 -164
4823 -164 77 268 339 234 21 -211 -338 -321 -148 85 275 337 241 23 -202 -334 -306 -133 92 280 347 239
4845 239 25 -196 -329 -303 -128 102 282 342 232 15 -212 -334 -308 -127 98 280 328 218 -1 -224 -340
4866 -340 -298 -126 110 274 326 214 -12 -217 -338 -298 -120 122 297 336 217 2 -218 -333 -285 -99 138 302
4888 302 337 214 -10 -217 -336 -284 -96 127 286 333 208 -14 -234 -332 -281 -106 132 302 325 201 -28 -251
4910 -251 -330 -280 -88 137 309 323 188 -26 -236 -332 -270 -64 158 311 329 188 -36 -228 -328 -268 -59 152
4932A52J64J0j35k34k06q5P6J95K19J41K4j46k29j93q2O3K07K20J51Jj49k35k02
4955b73o4Q0K09K28J28%j44k26k00o6Q5J99K20J38pj49k23j90p4Q0K13K30J21
4978C15j1j66k23j79o9R7K00K21J29j9j67k30j74n5R1K14K11J25k9j60k29j74
5000b82n0J13J94K27J21k6j74k19j71n2J16K09J97J21k1j87k20j69m8J11K08K03
5022B01J10k8j85k09j68l7J00K12K11J08m5j70k16j66l9J18K24J90J02l1j80k22
5044a20j60k5J17K10K10R7n3j72k13j73j5J23K02K02R5n5j82k16j64j8J24K19
5066C3J93P8m5j87k20j47j9J37K12J85Q1n5j84k17j43nJ32K08J98P4o5j79k13
5089a48j31j9J44K06J96P1o5j95k05j39QJ24K15J73Q9p9k02k01j33PJ38K05J84
$$ plain form
4932 152 316 326 191 -43 -249 -334 -258 -63 156 297 321 175 -54 -247 -329 -266 -59 161 312 313 164 -71 -273
4955 -273 -337 -257 -48 180 308 308 164 -62 -262 -328 -243 -44 176 314 307 158 -65 -255 -329 -249 -36 194 315
4978 315 304 138 -85 -264 -333 -236 -36 185 314 295 128 -102 -276 -331 -240 -26 185 310 281 121 -108 -282
5000 -282 -332 -219 -25 202 323 297 123 -96 -267 -319 -203 6 203 324 303 116 -104 -273 -321 -210 -2 201
5022 201 311 283 98 -111 -279 -316 -216 -4 207 315 270 100 -116 -282 -321 -203 21 211 313 282 102 -120
5044 -120 -280 -305 -188 22 232 329 276 104 -109 -282 -297 -174 28 230 325 270 88 -128 -292 -310 -186 33
5066 33 226 304 259 72 -148 -295 -314 -177 35 220 301 246 62 -155 -298 -303 -171 37 235 309 244 65 -148
5089 -148 -279 -298 -154 52 248 319 254 59 -146 -285 -277 -153 62 235 324 245 43 -158 -291 -284 -146 59 243
5112B43O4q6j80k09j33RJ54J95J81O7p3j85k18j25K0J44K00J81O0p9k00k05j12
5135b87K0J45K13J72N0q6k05j95j11J5J52K03J67N1r2j96k10j18M2J52K15J46
5157B43L9q4k02j89r9K2J60K07J59L3r5j99j82j11L7J74J98J58K3j05j85j98r2
5180b88L9J55K08J47K0r9j88j90j00N5J48J94J55K1j12j93j78r3N6J58J97J49
5202B61Qj02j90j88p8M7J61K09J37J0j16j86j77q2O4J55K00J36Qj15j91j74q4
5225b87O5J58K05J25J1j23j94j74p1O2J59K03J19mj24j94j61o3N4J80J91J16r
5248B44j20j79j56o8O7J67J82J32j8j06j97j58o8Q5J49J96J20qj24j98j57o2P7
5271b00J65J83J24pj36k02j67m4Q1J71J86J00j9j43j78j39n3P5J77J85J09k8j29
$$ plain form
5112 243 307 221 41 -168 -301 -292 -138 57 238 305 232 47 -171 -296 -276 -132 68 249 309 230 30 -175 -287
5135 -287 -267 -122 91 263 313 227 22 -173 -284 -269 -117 86 253 304 212 16 -194 -312 -270 -118 97 243
5157 243 282 198 -4 -193 -292 -270 -110 97 256 289 194 -5 -187 -298 -261 -87 111 269 292 187 2 -196 -288
5180 -288 -249 -94 114 261 281 182 -6 -196 -296 -241 -93 101 256 277 165 -28 -206 -299 -243 -85 112 261
5202 261 269 167 -23 -211 -289 -242 -81 128 265 275 159 -27 -204 -286 -222 -67 133 269 277 162 -29 -203 -287
5225 -287 -222 -64 141 266 277 154 -40 -214 -285 -223 -64 139 258 254 130 -64 -225 -288 -234 -54 137 253 244
5248 244 124 -55 -211 -279 -212 -45 137 269 251 145 -52 -210 -278 -193 -44 152 272 264 140 -58 -215 -277 -200
5271 -200 -35 148 272 265 129 -73 -240 -284 -203 -32 154 254 235 92 -86 -225 -278 -203 -26 159 268 240 111
5294A11j83j57l9Q2J86J68J09l9j27j84j55k3O9J86J79R1l7j45j83j41l4R6J67
5317cJ81Q6l4j47j88j40k4Q8J82J59R8m0j48j71j32m1J07J76J69R1m4j47j75j33
5341b30l1J00J73J75Q2m3j42j87j30k3J03J78J62Q3n1j46j86j31j0J03J70J60
5363A79Q1m3j65j69j27j8J09J74J50Q5n6j39j83j14pJ12J68J57N8m5j46j76j20
$$ plain form
5294 111 -72 -229 -268 -186 0 168 277 238 111 -73 -228 -251 -182 4 183 274 237 92 -91 -232 -266 -170 -3
5317 -3 178 264 230 83 -105 -245 -269 -181 1 160 258 218 70 -101 -233 -274 -167 9 178 269 225 78 -97 -230
5341 -230 -261 -161 12 187 269 226 84 -103 -233 -256 -153 25 187 270 219 73 -113 -244 -254 -151 19 179
5363 179 260 217 52 -117 -244 -262 -153 21 171 256 200 61 -122 -236 -243 -131 37 194 252 207 61 -115 -235
$$ [...]
8191B
##END NTUPLES=NMR FID
##END=
