##TITLE=1H_Pr 4631-Bzt
 CDCl3
 8 sc, 
 12.05.2022
##JCAMPDX= 6.0         $$ Bruker NMR JCAMP-DX V2.0
##DATA TYPE= NMR FID
##DATA CLASS= NTUPLES
##ORIGIN= UXNMR, Bruker Analytische Messtechnik GmbH
##OWNER= root
$$ XWIN-NMR		Version 3.5
$$ Thu May 12 11:25:06 2022 Russian Standard Time (UT+4h)  she@DPX200
##.OBSERVE FREQUENCY= 200.1313499996
##.OBSERVE NUCLEUS= ^1H
##.DELAY= (6, 6)
##.ACQUISITION MODE= SIMULTANEOUS
##.ACQUISITION SCHEME= undefined
##.AVERAGES= 8
##.DIGITISER RES= 18
##SPECTROMETER/DATA SYSTEM= spect
##.PULSE SEQUENCE= zg30
##.SOLVENT NAME= Pyr
##.SHIFT REFERENCE= (INTERNAL, Pyr, 0, 15.7039)
##AUDIT TRAIL= $$ (NUMBER, WHEN, WHO, WHERE, WHAT)
$$ ##TITLE= Audit trail, XWIN-NMR		Version 3.5
$$ ##JCAMPDX= 5.01
$$ ##ORIGIN= Bruker BioSpin GmbH
$$ ##OWNER= she
$$ F:/spectra/data/she/nmr/H-F/1/audita.txt
$$ ##AUDIT TRAIL=  $$ (NUMBER, WHEN, WHO, WHERE, WHAT)
(   1,<2022-05-12 11:23:28.28 +0400>,<she>,<DPX200>,
      <created by zg, POWCHK disabled, PULCHK disabled
       configuration hash MD5:
       00 E9 B6 7A A2 85 ED C7 34 08 36 98 17 FE 4E 26
       data hash MD5: 16K
       5D 20 09 A6 F6 24 E7 3E 84 0E 7C 48 32 52 C2 C5>)
$$ ##END=
$$ 
$$ hash MD5
$$ F0 36 9F EC DA 28 94 2D D8 71 71 60 EC 58 62 EF
##$RELAX= 
##$RELAX= 
##$RELAX= 
##$RELAX= 
##$RELAX= 
##$RELAX= 
$$ Bruker specific parameters
$$ --------------------------
##$DU= <F:/spectra>
##$EXPNO= 1
##$NAME= <H-F>
##$PROCNO= 1
##$TYPE= <nmr>
##$USER= <she>
##$AMP= (0..31)
100 100 100 100 100 100 100 100 100 100 100 100 100 100 100 100 100 100 
100 100 100 100 100 100 100 100 100 100 100 100 100 100 
##$AQSEQ= 0
##$AQ_mod= 1
##$AUNM= <au_zg>
##$AUTOPOS= <>
##$BF1= 200.13
##$BF2= 200.13
##$BF3= 200.13
##$BF4= 200.13
##$BF5= 200.13
##$BF6= 200.13
##$BF7= 200.13
##$BF8= 200.13
##$BYTORDA= 1
##$CFDGTYP= 0
##$CFRGTYP= 5
##$CHEMSTR= <none>
##$CNST= (0..31)
1 1 145 1 1 1 1 1 1 1 1 1 1 1 1 1 1 1 1 1 1 1 1 1 1 1 1 1 1 1 1 1 
##$CPDPRG= <>
##$CPDPRG1= <>
##$CPDPRG2= <>
##$CPDPRG3= <>
##$CPDPRG4= <mlev>
##$CPDPRG5= <mlev>
##$CPDPRG6= <mlev>
##$CPDPRG7= <mlev>
##$CPDPRG8= <mlev>
##$CPDPRGB= <>
##$CPDPRGT= <>
##$D= (0..31)
0 1.2 0 0 0 0 0 0 0 0.06 0 0.03 0 0 0 0 0.0002 0 0 0 0 0 0 0 0 0 0 0 0 
0 0 0 
##$DATE= 1652340207
##$DBL= (0..7)
120 120 120 120 120 120 120 120 
##$DBP= (0..7)
150 150 150 150 150 150 150 150 
##$DBP07= 0
##$DBPNAM0= <>
##$DBPNAM1= <>
##$DBPNAM2= <>
##$DBPNAM3= <>
##$DBPNAM4= <>
##$DBPNAM5= <>
##$DBPNAM6= <>
##$DBPNAM7= <>
##$DBPOAL= (0..7)
0.5 0.5 0.5 0.5 0.5 0.5 0.5 0.5 
##$DBPOFFS= (0..7)
0 0 0 0 0 0 0 0 
##$DE= 6
##$DECBNUC= <off>
##$DECIM= 32
##$DECNUC= <off>
##$DECSTAT= 4
##$DIGMOD= 1
##$DIGTYP= 9
##$DL= (0..7)
0 120 120 120 120 120 120 120 
##$DP= (0..7)
150 150 150 150 150 150 150 150 
##$DP07= 0
##$DPNAME0= <>
##$DPNAME1= <>
##$DPNAME2= <>
##$DPNAME3= <>
##$DPNAME4= <>
##$DPNAME5= <>
##$DPNAME6= <>
##$DPNAME7= <>
##$DPOAL= (0..7)
0.5 0.5 0.5 0.5 0.5 0.5 0.5 0.5 
##$DPOFFS= (0..7)
0 0 0 0 0 0 0 0 
##$DQDMODE= 0
##$DR= 18
##$DS= 0
##$DSLIST= <SSSSSSSSSSSSSSS>
$$ [...]
##$SUBNAM2= <"">
##$SUBNAM3= <"">
##$SUBNAM4= <"">
##$SUBNAM5= <"">
##$SUBNAM6= <"">
##$SUBNAM7= <"">
##$SUBNAM8= <"">
##$SUBNAM9= <"">
##$SW= 18.0517283424761
##$SWIBOX= (0..15)
0 0 2 0 0 0 0 0 0 0 0 0 0 0 0 0 
##$SW_h= 3612.71676300578
##$TD= 16384
##$TD0= 1
##$TE= 0
##$TE2= 300
##$TE3= 300
##$TEG= 300
##$TL= (0..7)
0 120 120 120 120 120 120 120 
##$TP= (0..7)
150 150 150 150 150 150 150 150 
##$TP07= 0
##$TPNAME0= <>
##$TPNAME1= <>
##$TPNAME2= <>
##$TPNAME3= <>
##$TPNAME4= <>
##$TPNAME5= <>
##$TPNAME6= <>
##$TPNAME7= <>
##$TPOAL= (0..7)
0.5 0.5 0.5 0.5 0.5 0.5 0.5 0.5 
##$TPOFFS= (0..7)
0 0 0 0 0 0 0 0 
##$TUNHIN= 0
##$TUNHOUT= 0
##$TUNXOUT= 0
##$USERA1= <user>
##$USERA2= <user>
##$USERA3= <user>
##$USERA4= <user>
##$USERA5= <user>
##$V9= 5
##$VALIST= <valist>
##$VCLIST= <CCCCCCCCCCCCCCC>
##$VD= 0
##$VDLIST= <DDDDDDDDDDDDDDD>
##$VPLIST= <PPPPPPPPPPPPPPP>
##$VTLIST= <TTTTTTTTTTTTTTT>
##$WBST= 1024
##$WBSW= 4
##$XGAIN= (0..3)
0 0 0 0 
##$XL= 0
##$YL= 0
##$YMAX_a= 418408
##$YMIN_a= -459151
##$ZGOPTNS= <>
##$ZL1= 120
##$ZL2= 120
##$ZL3= 120
##$ZL4= 120
##$ABSF1= 10
##$ABSF2= 0
##$ABSG= 5
##$ABSL= 3
##$ALPHA= 0
##$AQORDER= 0
##$ASSFAC= 0
##$ASSFACI= 0
##$ASSFACX= 0
##$ASSWID= 0
##$AUNMP= <proc_1d>
##$AZFE= 0.1
##$AZFW= 0.1
##$BCFW= 1
##$BC_mod= 2
##$BYTORDP= 1
##$COROFFS= 0
##$CY= 11.3945322036743
##$DATMOD= 1
##$DC= 2
##$DFILT= <>
##$DTYPP= 0
##$F1P= 2.36226072786647
##$F2P= -0.459571619588291
##$FCOR= 0.5
##$FTSIZE= 0
##$FT_mod= 4
##$GAMMA= 1
##$GB= 0.15
##$INTBC= 1
##$INTSCL= 1
##$ISEN= 128
##$LB= 0.24
##$LEV0= 0
##$LPBIN= 0
##$MAXI= 10000
##$MC2= 0
##$MEAN= 0
##$ME_mod= 0
##$MI= 1.114404
##$NCOEF= 0
##$NC_proc= 0
##$NLEV= 6
##$NOISF1= 3.799351
##$NOISF2= 2.8
##$NSP= 1
##$NTH_PI= 0
##$NZP= 0
##$OFFSET= 15.70392
##$PC= 1
##$PHC0= -17672
##$PHC1= 15.80075
##$PH_mod= 1
##$PKNL= yes
##$PPARMOD= 0
##$PSCAL= 0
##$PSIGN= 0
##$REVERSE= no
##$SF= 200.130013532006
##$SI= 16384
##$SIGF1= 3
##$SIGF2= 2
##$SINO= 400
##$SIOLD= 16384
##$SREGLST= <1H.CDCl3>
##$SSB= 0
##$STSI= 0
##$STSR= 0
##$SW_p= 3612.71676300578
##$SYMM= 0
##$S_DEV= 0
##$TDeff= 0
##$TDoff= 0
##$TI= <>
##$TILT= no
##$TM1= 0
##$TM2= 0
##$TOPLEV= 0
##$USERP1= <user>
##$USERP2= <user>
##$USERP3= <user>
##$USERP4= <user>
##$USERP5= <user>
##$WDW= 1
##$XDIM= 8192
##$YMAX_p= 0
##$YMIN_p= 0
$$ End of Bruker specific parameters
$$ ---------------------------------
##NTUPLES= NMR FID
##VAR_NAME=  TIME,          FID/REAL,        FID/IMAG
##SYMBOL=    X,             R,               I
##VAR_TYPE=  INDEPENDENT,   DEPENDENT,       DEPENDENT
##VAR_FORM=  AFFN,          ASDF,            ASDF
##VAR_DIM=   8192,          8192,            8192
##UNITS=     SECONDS,       ARBITRARY UNITS, ARBITRARY UNITS
##FACTOR=    0.0002768,     1,               1
##FIRST=     0,             0,               0
##LAST=      2.2672688,     0,               0
##MIN=       0,             -459151,         0
##MAX=       2.2672688,     418408,          0
$$ Real data points
##PAGE= N=1
##DATA TABLE= (X++(R..R)), XYDATA
0@%%%%%%%%qJ6j6K2l0M0m8N6p2Q8j04J28j60J92k25K65l13L69m32N00n78O65p61
31d06Q68r88J121j269J433j610J804k019K256k512K796l108L443l809M210m649
47b439N129n654O229o862P560q331R186j0141J1214j2429J3817j5420J7296j9525
61a0370K2225k5577K9868l5589M3643n5904P7092j23898M13576j01140m01735
72a67809N19941q6557k63622p7747J58482k18315j38338K88737N5733k70369Q4068
83a15796J56001n6060j11136J22063P9334j62503r4847J63576J6717j20654N3632
94f9673J31223k0458n0776P3690J33952n5759r8197K7327j4675l9362L1132k0162
106B8262q3132m5508J00089P3514j24373n0764J06088K0559m6283k4814K0317
$$ y = [0, 0, 0, 0, 0, 0, 0, 0, 0, -8, 8, -8, 14, -16, 24, -24, 32, -40, 48, -56, 72, -88, 104, -121, 144, -169, 200, -232, 268, -310, 355, -406, 462, -526, 595, -674, 759, -851, 953, -1066, 1190, -1322, 1474, -1634, 1809, -2000, 2210, -2439, 2690, -2964, 3265, -3597, 3963, -4368, 4818, -5323, 5891, -6538, 7279, -8141, 9155, -10370, 11855, -13722, 16146, -19443, 24200, -31704, 45388, -78510, 335066, 233926, -167809, 352132, 265575, 1953, -75794, 82688, -135627, -273965, 14772, 70505, -199864, -115796, 40205, -15855, -126991, -4928, 74406, -88097, -182944, -19368, -2651, -123305, -69673, 61550, 41092, -9684, 64006, 197958, 142199, 44002, 71329, 56654, 17292, 48424, 28262, -54870, -100378, -289, 73225, -51148, -101912, 4176, 24735, -21548, -46362, -26045]
117b6045K4763m1042j159K9347l0572J0397L1272m46l000j7938L9074L9665m2235
130A2081J3865K6080k7434K0233K7155J661l1870m8441L6839J1129p0943j7759
142d7404o707o465K3657o082J3537J5267n625K8887j6323k2133L7160l780k6134
155b2145k4256n625O8119J2938m3892K6391K7134J1154J6313L636M278m5506k7943
168E96M3519k4495n3685p517j7477N139J6442J0325K2008j9528P764M6556j1972
181A7675j6084n867j0615J3600j7545p871K6560o967P604J2873o937K6490P430
194D0346j1217j415j7870J3578M81m0235K727k445j5895J7086n30K701L486p005
208a6207K6758J627j6671R337j3873L872J4371k2067M160J067r993K2519N47m262
$$ y = [-26045, -1282, -42324, -43483, -14136, -44708, -34311, -3039, -3485, -6485, -24423, 14651, 54316, 12081, 25946, 52026, 24592, 44825, 71980, 73641, 41771, -6670, 30169, 41298, -29645, -47404, -54111, -60576, -36919, -43001, -29464, -14197, -19822, 9065, -7258, -29391, 7769, 3989, -22145, -46401, -52026, 16093, 29031, -14861, 11530, 38664, 49818, 66131, 69767, 74045, 28539, 596, 44115, 19620, -34065, -41582, -59059, -53920, -37478, -27153, -5145, -24673, -16909, 29647, 17675, 1591, -4276, -14891, -1291, -18836, -26707, -147, -7114, 490, 13363, 6426, 32916, 40346, 29129, 27714, 9844, 23422, 23903, -16332, -13605, -16050, -31945, -14859, -15389, -12688, -9202, -16207, 10551, 12178, -4493, 4844, -9029, -5157, 9214, -12853, -8693, -7626, -17619, 4900, 5447, 1185]
222A185O371l453K4613l953k6253K1152j085j4185L741j5271M154M19j3908J2977
236c496r755m385J9426j3282L719R768j0082J3808m246p197J6661j4955k687J0136
250C433j1991N526k395K940J7864j8987L543K0309j5003M498K875j2174M004r052
264d610N903N292k5271R807J2252p488P617j0182M458J6682j5747K217O098j0425
278c397N340q609P97R574j8208Q767J0586j3459J0463o32k983J1385j1021L886
292B489N433j1980R305n013n654J1584j3112M720J1519j6160P214M067l821Q700
306I291j2598J666R935j2763N447l892p636J4710j1516k444J4670j1245L870M286
320A781m015J0586j1079K77J2873j3634N441M358j0808J1357m961m298J0871r932
$$ y = [1185, 7556, 4103, 28716, 24763, -1490, 19662, 18577, 4392, 8133, -7138, -2984, -2565, -16473, -3496, -13251, -17636, 1790, -11492, -7773, 1995, -8087, 5721, 1475, -5722, 10939, -4016, -6703, 3433, -8558, -3032, -5427, -2487, 15377, -3610, -67, 20242, 5239, 9737, 12612, 438, 4442, -4610, 1293, 6585, -18686, -8879, 3373, -4115, 3502, -6680, -2222, 14460, -1287, 930, 7028, -3397, 1943, -6666, -5869, 3705, -14503, -5736, 4850, -8609, 1854, 1222, -1761, 9624, -1397, 2489, 7922, -4058, 5247, 234, -5420, 6164, -6948, -2228, 9291, -6869, 345, 4412, 591, 9291, -3307, -1641, 8294, -4469, 978, -2914, -10550, 4160, -7356, -9800, 4870, -6375, -2505, 1781, -2234, 8352, -2727, -2450, 10423, -3211, 2230, 6588, -4220, 7137, 2176, -2122, 8749, -1183]
334a183L050M344q662Q229p800n309J1485j3223J183P366r772R638j454o719J1520
349B693p161L13L699q258J2219k789q109J6762m439q56Q591p310P379k340j0373
364B1Q479q150l343M558j0727R979M11j1780J4650k682p275O595p073M335l079
379e081r098J4103n516n901J3290n244M146L616o578J3320l077p219J0827n811
393E777M61m94j0455R840m750o970J2490p548N03P091j0043N600j802q985O041
408c244n394L090M167j0862J2357J235j0859J2587o97k888N911m560Q319j352
422G810p407J1874o838l827Q704r239L403N36j2062N111l808k069O438r054O829
437c599O565r419P589k846m980N162q930N665O019j0961R997M078l771P333m070
$$ y = [-1183, 1867, 6211, -2451, 5778, -2022, -7331, 4154, -9069, -7886, -520, -10292, -654, -2108, -8827, 2693, -4468, -4155, -456, -8714, 3505, 716, -7393, 9369, 4930, 4074, 12665, 5355, 12734, 10394, 21, 8500, 350, -2993, 1565, -9162, 817, 1228, -10552, 4098, 1416, -5859, 736, -6337, -2002, -5081, -14179, -76, -5592, -11493, 1797, -3447, 699, 4315, -2263, 11057, 7980, 761, 11588, 5777, 6238, 5744, -4711, 5129, 379, -6591, 5899, -1649, -1146, 5945, -4098, 1502, -300, -9285, -3244, -8638, -5548, -1381, -12243, 114, 1349, -9510, 3077, 2380, -508, 5403, 843, 9162, 7810, 403, 12277, 5439, 1612, 10316, 1077, 4480, 5016, -7046, -1935, -5743, -7812, -1374, -10428, -3599, 2966, -6453, 1136, -1710, -6690, -1528, -10458, -4793, 1226, -9735, 262, 4340, 569, 7902, 3832]
452C832M775K956q891J0482l274j1495R086p314n048M830p423K037j187o83J0554
467C237r140K516J2623j2020J058N416p001J209o328L487Q119j0748Q361P389
481H178p911O304k772k829N444r322L863L636r699P312k809m015Q701p757L56
496c320M711m569R347l149m007Q705j1806k256Q416q690o31l1K246J0065q371
511c340M634Q403j1677N017M844o140M560m846m60N070q673L516k507q171J1030
526A260l751l280Q768n694J340J335l911Q020o889k537J1944n463P55L281o685
541a507K124o112L37R859j0485J100R891m707M286k90m610J136p084O809L899
556D646j1089Q771J979r386R904J282m553j037k453R871n693p892J2456p671q481
$$ y = [3832, 8607, 11563, 2672, 13154, 9880, -1615, 7471, 157, -4891, -61, -7484, -5447, -6634, -7317, 3237, -5903, -3387, 9236, -2784, -1726, 3690, -3311, -2102, -8430, -4943, 3176, -7572, 789, 8178, 267, 6571, 3799, 970, 6414, -2908, 955, 4591, -5108, 2204, -605, -4620, 4081, -3676, -3320, 1391, -3178, 6169, 3020, -987, 7718, -4088, -6344, 2072, -6618, -7249, -7280, -5034, 5031, -3340, 1294, 9697, -1980, 3037, 7881, 1741, 6301, 1455, 995, 6065, -2608, 908, -1599, -9770, 1260, -2491, -5771, 2997, -2697, -1357, -22, -3933, 4087, -2802, -5339, 6605, 1142, 1897, 5178, -1507, 617, -5495, -5158, 4701, -5784, -4684, 5207, 500, 4786, 4496, -114, 1022, -6062, 747, 4646, -6443, 2328, 4307, -5079, 4825, 6107, 1554, 517, -1936, 7935, 2242, -5650, 6806, -865, -9346]
571i346Q401l169r95j695Q86J0562n905J505J0555j1347j064L461p126K619k738
586e396J368P877m874O898L755j0513O321K026n948J781m484M678j877r068J0483
601C027l102j1896Q416J142p02J680k190P222l620m084R648p887k777R195m575
616e03L019K124l112L839m976K342L495j2153N985M216q363O206Q95l637p49l943
632e315Q317j842j1746R122M59m555O242j840N36j951l374J0851k680m694Q247
647E777n677K83O288m603K19m366M46P989p049K913O257j1097K601L712m403k7
663g37n612L886L571q725P962K228r405N245K37j41J811o027O089J585m575P786
679E178l785k949N450n057K747K637m832M990l394p14O779q704j06M319n639L949
$$ y = [-9346, -945, -4114, -5109, -6804, -5918, 4644, -1261, 244, 10799, -548, -1612, 1849, -5277, -2658, -5396, -4028, 3849, -1025, 5873, 9628, -885, 5436, 7462, 1514, 3295, -1189, 3489, 1612, -7456, 3027, -75, -11971, -3555, -2413, -3115, -1435, -3625, 3597, -23, -4107, 5541, -2346, -5123, 4072, -503, 2516, 4640, 1528, 5367, 391, 2733, 6228, -5925, 60, 4276, -4087, 2119, 3014, -623, -1372, -5315, 3002, 1160, -10586, -1464, -1005, -5560, 682, -1158, -622, -2573, -5947, 4904, 2224, -2470, 5777, 100, 383, 6671, 2068, 2287, -2079, -1633, 6356, -693, 2220, 8477, -2620, -19, 3693, -710, -737, -6349, -2463, 1108, -7617, 345, 2573, -6832, -1587, -1350, -1491, 320, -5707, 382, 1967, -2608, 5178, 1393, -1556, 3894, -1163, 1584, 4221, -611, 4379, 985, 271, 7050, -1654, -1760, 2559, -3080, 869]
695H69j248j488L378p265M126M137r169M050J727l420N232k307K298K317n725
710b488O414p08m879O566m584r03N460m575J013j054j996O121o058o48O358o721
726b682J831K455m087L673n261o25O143o228J839K692l923N105j289m07N880o820
742a704K541L936m851M836k278m022N858m101M57K145n217M200j928k075P360
757E157o229j348M408l879K303j746l109M648n003Q90N130n877L996J634l206
772b231O041k368j108L789m639L315K17n250M975l543k085N122m122K112J708
787A933l882O168k534k826M783m908O90Q69m792M803k905l341P050l512J176L416
803B188l987N330q20l191M466n164M3K746m981M580j225l782O567k273n07L535
$$ y = [869, -379, -1867, 1511, -5754, -1628, 2509, -6660, -2610, -883, -4303, 929, -1378, 920, 3237, -2488, 3926, 3218, -1661, 4905, 321, -582, 4878, 303, 1316, 262, -1734, 4387, -1671, -2319, 4039, -2682, -851, 1604, -2483, 1190, -4071, -4696, 1447, -4781, -2942, -250, -4173, 932, -357, -764, 5116, -1704, 837, 4773, -78, 4758, 2480, -1542, 4316, 215, 672, 2817, -2400, 1800, -128, -2203, 5157, -1072, -2420, 1988, -1891, 412, -1334, -4443, 205, -4798, -3908, 1222, -4655, -659, 975, -2231, 3810, 1442, 334, 4123, -516, 2799, 3016, -2234, 2741, -802, -2887, 2235, -1887, 225, 1933, -1949, 4219, 1685, -1141, 3642, -1266, -576, 293, -4499, 304, -2601, -5942, 1108, -2404, -1228, 2188, -1799, 3531, 2711, -480, 3986, -1178, -1135, 1611, -3370, 1210, -15, -3797, 2770, 497, -10, 3525]
819C525m598L609m67m045N394m395j775L619n534L077R00m693N714j325o84M220
835B542l703K857R36m762M920k037k864M292m250K019J932m445M984n73k325M326
851C849l756J906J898o186M029o66m166L991l492J14K359m779M343K01l308N405
867A742k534O17L485n555L372M41m738M182k745j56M012l962M070J685m077M643
883D482k097j168K859n567K164P91n394L919j347k114L673l754K429J805m207
898c526N168j598k505M759l654M98K485l854L635j207j564M744m450J251M191
913D373n275L280L60l024L384l614J16K817n323L014J42m317M042k638p27L532
929A42l676K837J176l318M851k436j430M778m257J799J256k517M656k631j126
$$ y = [3525, -1073, 2536, 2069, -1976, 3418, -977, -2752, 867, -4667, -1590, -690, -5383, 331, -994, -1678, 2542, -1161, 1696, 2632, -2130, 2790, 753, -2111, 2181, -2069, -50, 1882, -2563, 2421, 1848, -477, 3849, 93, 1999, 3897, -2289, 1740, 1074, -3092, 899, -2593, -2479, -120, -4899, -556, -355, -3663, 1742, -792, -175, 3310, -2245, 1127, 1568, -3170, 1012, -1733, -1889, 2123, -1839, 2231, 3916, -161, 4482, 2385, 1217, 4076, -1491, 673, 1464, -3930, -11, -1358, -3472, 201, -3553, -1124, 681, -3526, 1642, 44, -2461, 2298, -1356, -858, 1627, -2227, 1408, 201, -1363, 3381, -1069, 182, 4373, -902, 2378, 2738, -286, 3098, -516, -400, 2417, -2906, 108, 250, -4067, -25, -2663, -3390, 142, -3534, -697, 479, -2839, 2012, -424, -1854, 2924, -1333, 466, 1722, -795, 3861, 1230, 104]
944A04N117m125j46L014l627J927j994j540K947n648J400L104n252L301P46k504
960c176L833k669J025J359l995M676q00l011N443k041r94L347k535K143j215k113
976g23N404m580j147N315m402K43Q21k266K775l998N62M029n759K084K289m094
992c447K800j382j125L714k983L242K169m303M654k90l486L160k858L61R19k982
1008a837M584k381k549N347l554q39K626k781K009p22q96L322m590O01L168n843
1024d335K212J947k903L247p40J301K230m523L789M86n185M307o66k026K478k769
1040a150K533n32l224N222k235k957N530k567L8P09k682K636l478j686M183m965
1056d625J690M475l232J777J128q27K277l602J881J970n290K885K022n256K580
$$ y = [104, 5221, 1096, 950, 3964, 337, 2264, 270, -1270, 1677, -3971, -2571, 533, -4719, -1418, -672, -3176, 657, -2012, -987, 372, -3623, 1053, 253, -2758, 2685, 644, -350, 2997, 462, 2605, 1390, -723, 4681, 101, -1046, 4269, -133, 110, 931, -1335, 1440, -2558, -1996, 2033, -3726, -1642, 647, -3447, -647, -2029, -3154, 560, -2423, 819, 2988, -1315, 3339, 3049, -437, 2723, -135, 226, 1145, -1837, 2747, 366, -2183, 3164, -390, -1229, 1397, -1384, 625, -97, -993, 2329, -2261, -1660, 1508, -4335, -2123, -176, -3079, 168, -572, 729, 2959, -1564, 2225, 2711, -2474, 1833, 1167, -859, 1619, -1150, 1383, 851, -2373, 2849, 614, -2343, 3187, 620, 658, 1367, -1315, 1321, -2157, -3843, 340, -4625, -2935, 1540, -1692, 85, 1213, 386, 2663, -939, 942, 2912, -2378, 507, 2529, -2727, -147]
1071a47r73O55J162l311M080M3k577M544m41l301K774l670J670j009k895L133
1087b63j399j829N345k671P8K218k508K519k233J035K423m430J829J889m406O34
1103a769J338j445J824j040L184J703m714N273j692l693K697j022j852P13l013
1118c508L129q59k101M705k743j181M335j616J084l66j208K679l724q68K644m320
1134c918J881K599j864L160p36N71K978l955K432N91m557K574j029k463J872l009
1150b873J212K18k886M824j029k177N077j902q08J488k293J720k747j326M352
1165H50l611N13M156k223K237N52p40K923l085Q41K008m915J519k04l762K809
1181a32k276p12K473k477L056Q64k377M196k330j736K708l371Q82j55k450M450
$$ y = [-147, -1120, -465, 697, -2614, 1466, 1509, -1068, 3476, 3035, -266, 2508, -1162, 508, -501, -3396, -263, -1662, -3491, 1854, -817, -739, 1479, -1029, 1490, -743, 292, 2715, -1715, 114, 2003, -2403, -1769, -431, -1876, -52, -1092, 2092, 3795, -919, 4354, 2662, -1031, 1666, 644, -1208, -495, -3508, -379, -1238, -3339, 1366, -1377, -2558, 1777, 161, 1245, 879, -329, 2350, -1374, -2242, 402, -3918, -2037, 562, -1302, 1858, 1122, 1693, 4671, 716, 3148, 3739, -818, 1756, 727, -1736, 136, -2873, -1661, -1443, -4329, 495, -534, -2711, 2366, 464, -344, 1144, -1149, 571, -2176, -3502, 850, -2761, -2248, 1908, -315, 1922, 2474, 1734, 4657, 1572, 2413, 4421, -494, 1025, 821, -2941, -132, -2408, -3120, -647, -3124, -68, 796, -1581, 2615, 285, -1451, 1257, -2114, -1232, -1387, -3837, 613]
1197F13k189o90M448k383J579K393k059K294j211q64K185m378R4Q59m302K431
1213a180j30k001K972j481J084K134l078K934n69l093L286k429q76J966k537K438
1229e60J18j350M688j604R0L400k706J457q1k866K207l120q93J965l946J076J459
1246f66k480L000q16j17K685l299J864Q31l494K165o57j747K642k348J389K091
1262A043k329L744p2j280L392k405L20J502m079J567p15k863K286k401L59J927
1278dl156K908P01k290K960j510l63J774l364J585L16k740K850j083K19K777k048
1295d68K247J442k359L047j191j385J896l152N57Pl070K281j521r99K981k117
1311a804Q08J818k473K391o37j772K241k356J94J684k940K522J81j530L640j198
$$ y = [613, -1576, -2266, 2182, -201, 1378, 3771, 1712, 4006, 2795, 1931, 4116, -262, -168, 691, -3611, -1180, -1310, -3311, -339, -1820, -736, 1398, -1680, 1254, 685, -2408, 878, -1551, -2427, -461, -2998, -560, -442, -1792, 2896, 1292, 1382, 4782, 2076, 3533, 3452, 586, 2793, -327, -1220, 745, -3201, -2125, -666, -3146, -146, -962, -1079, 1606, -1693, 171, 1002, -2492, -327, -984, -2731, -89, -2437, -1048, 1043, -1286, 2458, 2386, 1106, 4498, 2093, 2413, 3915, -164, 1403, 688, -2175, 111, -2290, -1931, -4, -3160, -252, 449, -1841, 1119, -391, -754, 1020, -2344, -759, -443, -3183, -333, -1416, -1197, 1580, -468, 1779, 3221, 862, 3909, 2718, 1333, 3229, 77, 634, 641, -2429, -148, -1669, -2668, 313, -1804, -996, 822, -1651, 740, 103, -1669, 572, -1784, -1590, 94, -2846, -324, -143, -1673, 1967, 769]
1327G69P48J741j738J127j52k380K455k317p21J550l101J145N69j460K072j289
1343i82R6K256k675J073O00k262J798j124r51K713k811J373J795k282K613j25
1359A105l85K448k316P67R61k928K026j072j799K455k314%J619k575K667q21j131
1376a293K636k116l91K015k721J028J12j687K270j151j01K597j937J542Q31j884
1392b50L079j832m53J916k461O35O08k515K271q44j263K247k307R75Q44k194K534
1409I90j502j268K683k373j09J523k038J987p39p46K889k373J070J998k340J891
1425A543j40j407K122k101L11J443k835J786R6j893J999j404J8J424k217J142
1441a13K49k028K199j379n24J638j926J640L03j681K687j154q06K822k303O87
$$ y = [769, 1517, 3258, 1520, 2647, 2495, 115, 2570, 253, -468, 1082, -2019, -874, -305, -1765, 307, -982, -886, 1370, -1305, -232, 368, -1894, -96, -1220, -2171, 542, -2269, -896, 899, -1383, 1230, 1105, 720, 3168, 852, 1619, 2580, -348, 1678, 606, -1193, 1262, -1052, -1052, 567, -2008, 659, -162, -1293, 1343, -773, -1164, 851, -1870, -842, -730, -2417, -147, -1298, -1399, 1198, -739, 803, 1634, -250, 2829, 997, 544, 2460, -1, 634, 1242, -1273, 998, 154, -1109, 1138, -1169, -194, 650, -1544, 990, -512, -1780, 903, -1470, -1579, -56, -2094, -107, -846, -1592, 1297, -1076, -6, 1992, -348, 1543, 1403, -4, 2118, 17, 328, 1771, -1064, 722, 818, -1075, 924, -480, -462, 962, -1255, -113, 136, -1892, 307, -1072, -1596, 42, -1884, -244, 59, -1622, 1065, -89, -895, 1927, -376, 311]
1457C11J138j537J606p40o74K025k894J159J290k769J723O7j539J342j484P26
1473b50M04k346K165n18j755K656j553J53J293j884J868J33j333K387j577k04
1489c61K253j906J456K2j421J880j732l68K063k325N51Q87k036J072r43r8J706
1506G00k819J979P43k844K410m19j375J645j346J317N7j345K467q23j058K539
1522A828j363j45J454j626J102m80p38J965k060l32J318k392J195K04j354J581
1538A57j349P98J249k615J653K47k321K238p49l02J226j437K084k38k015L129
1554A755r81r38K290j375N25K00j436J551j902n48K032k150j18J780j617R01l38
1571c69o11J525k177P19J283k382K066k09j309J534q24L29J089j590K106K70j674
$$ y = [311, 1449, -88, 1518, 778, 104, 2129, -765, 394, 1684, -1085, 638, 705, -834, 508, -976, -250, 154, -2192, -27, -545, -2300, 356, -1197, -1044, 249, -1635, 233, 366, -967, 1420, -157, -361, 1892, -14, 1442, 1464, 43, 1923, 191, -177, 1886, -439, 112, 999, -1037, 35, -908, -1006, 700, -2119, -140, 603, -2241, 169, -250, -1625, 20, -1326, -9, 48, -1297, 1170, 347, -711, 1828, 465, 320, 1774, 148, 1250, 770, 32, 1997, -63, -395, 923, -1469, -274, -70, -1424, 157, -1192, -394, 855, -1760, -107, 140, -2181, 57, -692, -994, 232, -1205, 879, 641, -1374, 1755, 774, -164, 2126, 751, 1276, 1476, 40, 1591, -311, -859, 1173, -977, -1095, 685, -932, -31, -369, -980, 545, -1632, -913, 370, -2012, 54, -155, -1464, 70, -754, -425, 664, -926, 1180, 1450, -224]
1588b24K356j010p05J168j515O75m23j585K140j567k89K072j704K97O09j314J510
1605D91j478r5J806k520J235J003k498J602J62k19J299j127J362Q11k020K139
1621A953p90j236J015q67J4O93j575J648l28j592J992j405l15J538j759J314m15
1638a15j064J309j749J12J838j901R66R11q85J733r93M89J226k335J564N44j958
1655c08J547o96o45J115j475J140j29j610K074j285r04J904j412J13R16j713J119
1672b49j095k27J710j644R68J316j682J497R1p49J526j368M43J110j995J137Q7
1689H76j079J187j091J99Q71j760J116N8j388J545r10m23R17j486O67J46j162
1706a717K085j350j12J923j603O39P92r96J691o73o18J531j628O13P16j540Q97
$$ y = [-224, 2132, 1122, 417, 1585, 70, 745, 322, -1263, 877, -690, -979, 1093, -611, -314, 295, -1019, 491, -987, -1082, 724, -1796, -561, 442, -2056, -454, -292, -511, 788, -339, 1023, 1834, -186, 1953, 1163, -73, 942, 75, 89, 782, -793, 855, 527, -1065, 927, -478, -793, 745, -1014, 300, -115, -1179, 130, -1619, -1507, 331, -1570, -604, 307, -578, 1155, 162, 651, 1877, -458, 1106, 1650, -308, 1239, 543, -102, 1013, -462, 678, 549, -1061, 1013, -272, -1176, 728, -684, -571, 345, -1368, -249, -1344, -1571, 139, -1505, -537, 779, -903, 594, 685, -64, 1462, 94, 537, 1647, -348, 789, 876, -203, 984, -107, 92, 963, -797, 319, 377, -1011, 534, -376, -799, 118, -1368, -701, -555, -1717, 368, -982, -1094, 829, -774, -135, 657, -339, 1352, 679, 61, 1592, -36, 577, 1293, -247, 650]
1723F50L8q76P70q15N06M72j506R56l97q57J469j765K01Q96j461J415l0r55K016
1742G27r74j62J544j132R81l14j042J812j008k35J070j352N72L68j137J077p22
1759G3l33J182j865P85L36j425J395q98n97J391j214M29O91j224J512l42l82J506
1777A020j338N64R87j371J143l64q21J386r27K23M99j441J224l32j242J833j416
1794c73l96J026j406R81Q6j429J777r20k62J285j492J021L34j269J934p57m54
1811c14J408j215O61N93j381J488q40l29J346j617O29L56j374Q76k85q27J264
1828D39j363J32N65j007R06M0r84J539j203M29J066j620J474R5p24J455j054K36
1846D21R36j468Q62L25j290J426r93l18J270j633O77K06j315J098p77l80J056
$$ y = [650, 688, -188, 582, -233, 273, 745, -761, 195, -202, -1059, 410, -1355, -1154, -258, -1719, -304, -334, -1289, 727, -247, -409, 1135, 3, 984, 670, -372, 1440, 432, 197, 1267, -85, 487, 855, -282, 795, 73, -260, 922, -943, -158, 178, -1247, 148, -750, -1347, 44, -1170, -741, -50, -1274, 238, -104, -486, 1020, -318, 246, 1233, -138, 1005, 641, -180, 1206, 279, 502, 1001, -440, 784, 452, -790, 1043, -373, -769, 257, -1149, -168, -82, -1511, 266, -654, -916, 369, -1123, -102, 232, -1037, 897, 140, -314, 1094, -121, 540, 1133, -248, 1240, 400, 71, 1417, -200, 429, 785, -589, 287, 2, -825, 439, -924, -792, -227, -1234, -328, -288, -1272, 267, -936, -507, 559, -1061, 413, 508, -216, 1239, 185, 421, 1357, -111, 751, 1076, -214, 1212, 219, -99, 1171, -462, 215, 421, -894, 204, -573, -953, 103]
1863A03j446Q34O40j716J437k76m81J110r29P49O22j352J643n44n30J579j537
1880i4P88N79j611J217l56q45J181j036J69N66j568J190j84j059J390r65j13Q65
1898A14j286O82L01q76J270o32KJ218j363R27N07j417J828r41k12J072j333M75
1916C36N57j159J201p45m74J138j547M23Q53j510R15l70n78J235j295O01K84j043
1934a178J140j01n41J451j075N57P62j267R40R0o42Q70r88L28N62j428J153K47
1952H80j392J159o17n13Q25j119O38P2j109J213p24k28J116j378P68O13j118J605
1970F91o97m45J622j564J048K67j035R83k90o69J254j080J54O99j315J145l19
1987D49j157J239j030k68Q53j227P19j58r30J605o55L5K39m39J34P78n6N63J58
$$ y = [103, -1343, -509, 131, -1585, -148, -424, -905, 205, -724, 25, 647, -705, 938, 394, -136, 1443, -94, 694, 1273, -338, 879, 523, -322, 859, -177, -8, 558, -1010, 180, -4, -1063, 327, -638, -751, 114, -1172, -490, -189, -1065, 205, -427, -425, 793, -570, 357, 864, -553, 1275, 334, 122, 1194, -139, 336, 893, -266, 935, 190, -284, 854, -693, -270, 583, -927, -12, -382, -960, 275, -1020, -419, -135, -1178, -38, -139, -680, 771, -304, 253, 1015, -252, 688, 778, 136, 1006, 18, 346, 908, -520, 633, 880, -512, 647, 30, -483, 342, -777, -139, -67, -1176, 37, -687, -915, 201, -1177, -409, 204, -914, 691, -6, -451, 1171, -393, 655, 922, -113, 870, 580, -89, 1165, 85, 239, 938, -377, 768, 449, -708, 531, -499, -767, 86, -1141, -422, -580, -1510, 95, -560, -525, -286, -725, -591, 187, 131, 694, 852]
2006H52q50J981j601m14N51k97Q57q64k18Q82j387N82N03j406J037n23l40P87
2024A32j087L08M90j161R66k4l51J453j275P72Q9j046J567m18p71J418r28Q0O58
2043H72j101R58m60k09P56j047K47R29j879J313k11j035R73r89K1L53p38R19K79
2062d9j246J175K6j129K266j263O14J13m72J150q11Q5J145j628MJ110j115R94
2080I69n06o59M85j152J041J1j082L83O65j284J135o74L98N79j213Q09l04k00
2098e99J030m05r7O62j310J136M74j059J468j086K24O06r39N69o69K44M94q43
2116a00p45J803j520O62O77j009P26o55j90P90j438J231L35r40N08O06j351J665
2134A055m1j446K272k183J115K85j337J828m13n68N89j386P37k88j045R88n77
$$ y = [852, 2, 1983, 382, -32, 519, 222, 1079, 215, -3, 879, -508, 74, 577, -829, 208, -315, -655, 132, -955, -647, -157, -1318, -352, -376, -727, 726, -549, 223, 312, -734, 833, 415, -356, 1062, 134, 214, 872, -229, 729, 269, 60, 816, -231, 16, 945, -934, 379, 168, -867, 106, -883, -862, -509, -1247, -328, -49, -1295, -120, -94, -1223, 1043, -220, 394, 507, 35, 1185, 374, 459, 1604, -24, -20, 1090, -25, 969, 463, -196, 289, -863, 178, 189, -893, -510, 155, -1129, 6, -668, -270, 309, -904, -95, -399, -599, 431, 26, -71, 591, -719, 417, 891, -168, 1300, 214, 438, 1044, 105, 674, 5, 249, 743, -100, -845, 958, -562, 100, 777, -232, 494, -161, -351, 439, -999, 232, 567, -373, 135, 741, -610, 1055, 1014, -432, 1840, -343, 772, 1057, -280, 1548, 1135, 567, 1156, -230, 507, 219, -826, 162, -415]
2151d15M70R57j760P39m42l99J046n98m59J542j547J182K2q33J145o26k7J137
2169A134j183M67K06n46J000r11k98J181j201J94M40j015J001m71o18J142q84
2186c62j00L82r13R98n96m20J288j226N72J171j460R16n8m93J180p82J86N99j275
2205c93J036k66m44P23l66k35P25j183O65j32n31Q17q64m75R59r21L90N72j143
2224a066J290o28p3Q06p50N18O93j056J067m59m50J328j612N13N31q50J253l85
2242F70r25Q37k68qk76p01O20o79n21J102p7j79K27n66N04N19j313K002q59M84
2262E93M76j717J974j166m43J706r44j110J130N24o21J67j246P66K03m87Q08j505
2280h92J714o20j248J594j002j34K54o21N75j44l36J54P73j078J104Q1K16K5j060
$$ y = [-415, 55, 1012, -748, -9, -451, -850, 196, -402, -861, 681, -866, 316, 338, -495, 650, 24, -3, 1134, -49, 418, 624, 78, 1078, 167, -131, 1050, -151, 43, 483, -532, 469, -2, -620, 522, -362, -462, -80, -993, 5, -591, -1011, 277, -949, -377, 794, -666, 250, 192, -301, 879, 97, 283, 882, -393, 643, 377, -67, 656, 290, 55, 780, -403, 262, 130, -401, 416, -448, -923, 36, -885, -495, 77, -1066, 224, -404, -477, 329, -421, 97, 790, -266, 801, 342, -108, 1220, -392, 121, 652, -198, 1055, 670, -255, 582, 314, 306, 30, -671, -51, -730, -1251, -149, -226, -405, -178, -744, -240, 279, -1034, 968, 109, 593, 1069, -648, 1326, 160, -283, 1423, 479, -631, 499, 1023, 402, 569, -677, 89, 292, -195, 613, -892, 822, 202, -1046, 548, -454, -588, -334, -955, -380, -524, -860, -706, 67, -1011, 93, 174, 390, 415, -645]
2299f45J365Pp16J148r85P41K89j193O11k0p24N06p55m65J117r86L66l58m93J043
2319a47n93M03Q55r53M95K17p64P61l16k3P15q41M06M64p20J016n88k8N90o84
2339B65j57N06j264R73m93m88O01o14q1Q30j072P03k1n03J121q23M30N47j130
2358f70O89L67o43R66p28R8R26r77L69L03o06Q18o37J86K63r77K38N12j156P56
2378I7l09o82Q17r03K13R19r48Q34J1l97Q42r53N97M00o95N39j84j73P89o19K35
2399D30L47p01P78k07m62M48p59j40M65r38M50j48k65O81n77J75P42j111Q11M21
2419D40n20lJ46r92J235J142q55m28P7O68n46J85j29l54O50j32j053O19j73n9
2439h2L90o56J18J38q44J149l60n85J357q88M09J85j630J486J1o84J112q29M49
$$ y = [-645, 720, 727, 11, 1159, 174, 915, 1204, 11, 622, 602, -122, 384, -371, -836, 281, -705, -339, -697, -1190, -147, -740, -337, 518, -435, 60, 277, -487, 274, -42, -65, 650, -191, 215, 679, -41, 975, 387, 359, 949, 265, 108, 614, -650, 323, -170, -658, -57, -671, -752, 78, -994, -291, -312, -815, 306, -517, -87, 460, -670, 19, 386, -257, 709, -19, 79, 1005, 28, 397, 700, 94, 912, 275, 461, 724, -253, -15, 497, -659, 97, -212, -894, -77, -980, -767, 152, -796, 38, 49, -348, 494, -459, 138, 538, -157, 382, 198, 25, 814, 195, 430, 777, 76, 854, 647, 185, 633, -126, -266, 199, -739, -289, -437, -702, -21, -598, -423, 319, -792, 19, 440, -80, -83, 63, -929, 306, 1448, 593, 165, 242, 910, 364, 549, 420, 66, 716, 584, -469, 150, -23, -82, 308, -348, -230, -92, -936, 213, -147, -732, 625, -263, 146, 331, -1299, 187, 198, -486, 626, -203, 246]
2458B46M94m78k1N95p49M61k46J22L61o55J38O5p07P59p06lO88j321R66K60q15
2479e46R94r59L24O30p95J80o6p39J120l29J99R59j216O91j99m53J341m44l75
2498C17J291j520k8p2n15L44L23j209J349q43K98L62j726J609l13l70P43j7j95
2517a72K92k56L90J47k96N69m71k97P75q50O83Ko39O45j98j72L45q49L91L43q46
2538d64K91j4j80O42n14j17L45o10Q75n99K90Q63j162K99N79j100Q64P8n76N16
2558C06K5k45R22j360O57J81p93J408j116oR70j466M80M70j291Q26L6k75L44n50
2578d77K28J97o47N99j42j10O50n00J72K53m18P45j39l09N17o15L21N8n13N26
2598C96l50k78O12o90R5J77m47O18n09l12P35n45J93N40q24O44K24n67L76m12
$$ y = [246, 740, 262, 241, 836, 87, 548, 302, 424, 785, 130, 268, 333, -374, 385, -321, -324, 364, -957, 9, 269, -546, 448, -511, -187, 443, -352, -172, -238, -977, 143, -186, 13, 972, -244, 447, 248, -205, 1136, 692, 317, 1608, 88, 60, -12, -527, -183, 140, -1069, 280, -563, -265, 97, -1629, -20, -333, -703, 40, 23, -172, 120, -136, 254, 401, 105, 674, 203, -94, 681, -169, 514, 516, -123, 522, 324, 152, 497, -352, 39, 382, -464, -173, -187, -367, 275, -239, -356, -11, -621, 254, -345, -55, 808, -354, -55, 524, -576, 288, 366, -210, 306, 331, 86, 1008, -352, 305, 486, -307, 1101, -15, -21, 949, -517, -37, 433, -858, -32, 4, -271, 73, -477, -249, -52, -699, -100, -242, -352, 298, -202, -30, 223, -195, 550, 411, 102, 619, 4, 325, 383, -130, 396, 46, -232, 380, -310, -215, -38, -485, 133, -376, -688, 47, -498, -305, 235, -589, 55, 279, -288, 88, -324]
2618c24P7M95l24N21K27q00O42m50K80K70p51M41L60q49N90l82l03O58q66K78
2638b10K19n77L98j82j71M63l92K48L27o11P92m27j95P65m59K27N36r72N02J99
2658D80n22Q03o13L8K95o32J90l16k10R76q03j15M45p28L76P7l86P47l72k73O53
2679A10n62M19L79o51O52l28K55J40o02R69n18n95R44o56N6Q68j039P36m42j90
2699e5j70n05l7J48M6J158j20p33M2N8m17N45k04k3P20p76J145Qr55P91k30j44
2721B92K61o90M20J36j79L13q07M46m66l54R84m92J4K15m54R2K11l83J18N77p73
2742e19L92K69l07P05q68LJ041p22J34k90j63J096m06M38m86k55K2J44l28L01
2762B01j279J493n24n23J006m77m89N52m07l30J448j099M37k14Q4k98N02j57N80
$$ y = [-324, -247, 248, -76, 445, 672, -128, 514, 64, 344, 614, -137, 304, 664, -185, 405, 23, -280, 378, -488, -210, 9, -568, -170, -352, -523, -60, -452, -204, 123, -488, 304, -123, -318, 447, -12, 215, 751, -221, 281, 480, -42, 761, 148, 186, 481, -151, 39, -277, -487, 489, -314, -429, 16, -712, -336, -259, -645, 102, -270, -543, 110, -452, -33, 346, -305, 347, 19, 274, 414, -188, 781, 263, -332, 612, -44, 12, 880, -159, 577, 135, -55, -225, -730, -767, -619, -573, 585, 465, -268, -226, -168, -585, -40, -244, -267, 453, -323, 822, 830, -125, 666, 436, 292, 553, -137, 283, 419, 240, 553, -254, 192, -274, -628, 356, -136, -122, 93, -361, -269, -58, -441, -323, 254, -519, -127, 142, -165, 540, -328, -325, 716, -6, 128, -162, -325, 771, 365, 803, 317, 62, 84, 228, -100, 201, -1078, 415, -109, -632, 374, -103, -592, -40, -447, -777, 671, -428, 9, -205, -121, -419, 83, -74, 506]
2781E06k33q16J213j516J693j16j627J736p36p89O60k95M91M10j202J095o86J55
2799e7M29o46Q8p7l24P65n24K54j44l08P64m16L6N55m08L26K47n41K59P9k59M02
2821E00m31J00N54r71K73J33m60N20m40O7K99q90N94M5o32O61l75J01M89o24J39
2842c48O68o74O25L4l91P05o87K34L37n81N05n0m37M73m23l9L51o48L02J79m10
2863b75M52n58O5L95k83m2J24m94M40j18o1N52n95O63j02k32N89o15L23N76q05
2884aJ10K99n46J48O2JL07j41j57q4O4R0j26n13N47m66J53J46l96L84J33l08M00
2907A06k71J58J57l45M72K26o58P37l24k30P60j114O30q2k16L51k75k3J44m67
2927b64p7M27p15O99n28J69K40m35L32J93j33L88n65J97M30l25J22L64l21J08
$$ y = [506, 273, -543, 670, -846, 847, 731, -896, 840, 104, -685, -25, -320, 171, 581, -621, 474, -212, -57, 372, -274, -186, -263, -587, 178, -346, -92, -236, -544, 220, -196, -160, 395, -13, 313, 560, 19, 278, 357, 98, 500, 69, 169, 723, -248, 25, 158, -302, 218, -222, -155, 144, -746, -152, -107, -739, -78, -453, -352, 137, -487, -348, 320, -354, 271, 305, -86, 619, -68, 166, 503, -78, 427, 377, -60, 413, -10, -49, 302, -346, -44, 135, -275, 177, -381, -316, 79, -204, -246, -122, -616, -176, -294, -355, 197, -398, 265, 163, -69, 520, -95, 228, 804, -1, 109, 408, -138, 10, 72, 73, 380, 239, 82, -2, 62, 152, 26, -487, 60, -406, -253, -107, -503, -119, 14, -294, 106, -165, -7, 150, -195, 277, 503, -155, 582, 258, 28, 788, -326, 304, 222, 6, 357, 82, 59, 203, -264, -341, 86, -629, 70, -458, -289, -49, -484, -152, 41, -92, 296, -269, -72, 358, 33, 155, 519, 198, 306]
2947C06O8k50K72j67j6P9n06N24m21l9O10n77mM9j78P3j00k73R26o92j64M91l38
2970c27K04r4r9M18p2k25N52l57J01J62k00M30l89o0N77n79Q0J82p29M46k11k09
2992c99L83j60J00k93mK31j67n0N98p03N29r0l37M24p1j06L61j19R8J56m28L19
3014B72K4j57K60l92J04J78m71J92Q7o23N77n20j36L96k03K19N7m02M88k15k15
3035d80N05j30J18K78l15N29m36k23N37l63N5N21o40K23J06j79M35o93K90K08
3055C46p43M55m0n99O95l39j06J39k50L41J23n02N27l89K28M21k62K31j40N2L01
3076D89k21j75N56l70J2K25n20N83m79k14K17k64n4N05q81M73k3j84L87m92K15
3097b15R2k88N27o1k15O16n52K12j20N9K26j60j15M47m82L73J48p30M44N4n46
$$ y = [306, 374, 124, 396, 229, 213, 292, -214, 310, -111, -150, 460, -117, -121, -72, -250, -177, -277, -550, 376, -316, -480, 11, -327, -123, -217, -316, 102, 30, -195, 357, 0, 101, 263, 63, 493, 104, 44, 621, 42, 122, 304, -425, 21, -190, -399, -16, -176, -76, -369, -373, -142, -309, -359, 239, -464, 65, -25, -362, 62, -9, -115, 246, 127, 225, 381, -47, 272, 296, 139, 399, 7, 111, 289, -182, 10, 97, -526, 51, -469, -605, -209, -412, -193, -136, -538, -50, -265, -480, 25, -105, 13, 291, -24, 505, 69, -154, 383, 20, 75, 596, -44, 179, 285, 106, 541, -152, 138, 346, -397, 58, 18, -581, 114, -225, -331, -192, -442, -101, 22, -480, 47, -342, -114, 307, 45, 276, 136, 188, 489, 268, 93, 649, 279, 291, 516, -4, 579, 100, -114, 103, -161, -215, 290, -591, -118, -141, -325, 62, -430, -215, -123, -411, 116, 55, -160, 456, -96, 116, -4, 55, 281, 121, 6, 453, -29, 344, 492, -238, 206, 260, -286]
3118b86P40o63R4L45m38P6K33o62M03k42J12K96m41M66R7j03L12l57J11J52j82
3139F3q6N31l82J07n1j54O89q59L4L51m52N89l87l43P06o22J23j88k47P18k63
3160a23k91K97k06J15k7j54O50k55J82K83k32j69J87k54K88j8n39R85o48j5K89
3181C45m93K38r0q9j7j18j12M21o04L24j80j2M50k41n1l2J8K03L58m05L26j69
3203G0q0L97m63J77K46l87K80J58m10M32m07q2K82m83K10j97Q8M65l27j70K35
3224C4m58L02J17k19M20p45K62O02m31K99ll18P70k48k88K55m63M24n2k57J85
3245A88N1l20L46m99J14K84o59M54j52L0J21k68J36L58m95L61o7l78N04p5l90
3266c56Q92o41N01k65K3K79k94L4M88q51K13K93n51L33k91K6K13n05K05M12n92
$$ y = [-286, 454, -209, -115, 230, -208, -132, 101, -561, -158, -400, -288, 8, -433, 33, 130, 27, 339, -18, 93, 245, 63, -23, 508, 126, 233, 182, 28, 717, -142, -108, 243, -209, 380, -7, -350, 356, -266, -143, -331, -578, 140, -123, -414, -117, -323, -208, -235, -389, 261, 6, 188, 471, 239, 70, 257, 3, 291, 273, -266, 719, 71, 56, 345, -148, 90, 0, -89, -106, -224, -336, 85, -519, -195, -375, -387, 63, -178, -229, -261, -243, -40, 318, -87, 239, 70, -10, 387, -76, 101, 347, -40, 240, 398, -12, 420, 13, -69, 213, -270, -60, -257, -169, 296, -31, -201, 34, -424, -122, -5, -224, 196, -549, -287, 315, -116, 183, 180, -138, 632, 384, 96, 351, -112, 312, 260, 3, 188, 239, -81, 265, -234, -120, 164, -495, -41, -193, -163, -42, -310, -174, 184, -311, 50, -17, -395, 109, 34, -356, 536, -105, 396, 131, 154, 433, 139, 173, 661, -190, 23, 316, -235, 98, -193, -167, 46, -459, -254, 158, -434]
3287d34O81n73O4K98l17k9L09j75J38j55J31K54j83K40J45n57K49J57j46r8K41
3308B40n10P48q05M06j21j85O43m06k29M14n83L13l6k64R0j5J22J79J1p6J08k55
3330b11K24j91K13J49j84K03K28m86K86r8j17M88n50K20j02l02J55J78m41L82
3350D4k40J76J1j11J66j89j18K01k75K47L21k80N3k6L0K45l52L30O2n28L21r5
3372gk10N18m63J47L1n9L3K38m93K16j79j41M48j89p3K55m05J89L18l05M46j38
3394A77j83j4j44J54p9J38J35k1J82j11j01R5j61k72M88k39O6q4o94N85K33k93
3416a43Jl13n6N46l90L43K6j83L47j69l4O8q5J17j2l12M74l38K54R5j80j65L57
3439B48m51N48m43l30M01j66Q0Q8k34J73k26J28K14k05l4K96l26J03J45K1J80
$$ y = [-434, 247, -326, -262, 36, -281, -310, -1, -176, -38, -193, -62, 192, 9, 249, 394, -163, 86, 243, 97, -1, 240, -270, 478, -327, 79, -42, -227, 416, 10, -219, 195, -388, -75, -111, -375, -285, -300, -178, 1, 12, -64, 44, -211, 13, -178, 35, 184, 0, 203, 431, -55, 231, 133, 16, 504, -46, 174, 72, -230, -75, 103, -338, 44, -196, -20, -9, -120, 46, -143, -261, -60, -335, -88, 233, -47, 6, -20, 10, 255, -97, 233, 295, -233, 88, -7, -217, 301, -162, -15, 16, -43, -10, 228, -265, -49, -228, -369, 79, -110, -183, 72, -333, -144, 174, -131, 315, 177, -6, -20, -164, -10, -89, 49, 184, 163, 345, 234, 133, 228, 67, -205, 283, 44, 110, 26, -668, -83, 150, -143, -142, -455, -511, 35, -355, -12, 14, -169, 178, 9, -25, 43, -42, 75, 63, -249, 225, -113, 141, 236, 56, -109, 248, -203, 345, -98, -428, -27, -193, -113, -25, -259, -86, -312, -184, 30, -175, -209, 87, -239, -136, 9, 30, 210]
3460B10n06K77J75j2k5O5k93L14L4k95K93j90J1L3l44K71jj73K73m91J69J8k06
3483c93L51k08J82J28j71k39O27m71J26J10j13M52k89p1K66j40J63j89o2N31k42
3504C48j36k3m51M45k60J07J00n13L6M30l89K7L13j69K49p8j81K32J0P3K49o29
3526b10K67j26J56j34O6Q9K75l72L3O4j87P0j41O2k37j0L20r1k68M62n12M85O9
3549A30k53O4j83P6j7j0J80M14l97J04j6o0L03m36K93J13j50j1k35J50J34k04
3571a1o0O1j91K15m8l44K06K42j22j18L9p8j4J97qo1K7J65l45K12PQ2J95M3j08
3596A83J69l29j00L64l83J07J89m95L60j33m4O6k54K66m1k50L92j11K6k47J04
3617a61L30l88Q7L16k68PM87k03l41L9L31J0l44J53J18j47N2O0q1j30J53j22l7
$$ y = [210, -296, -19, 156, 144, 119, 184, -109, 205, 239, -56, 237, 47, 58, 91, -253, 18, 17, -156, 117, -374, -205, -187, -393, -42, -250, -68, 60, -111, -350, 277, -194, -68, 42, -71, 381, 92, 21, 287, 147, 310, 121, 59, 590, 348, 212, 189, -262, 183, -77, 30, 130, -383, -347, 83, -306, -279, 34, -135, 114, 36, -145, 87, 97, 170, 419, -210, 57, -69, 87, -47, 19, 108, 383, 11, 44, 108, -79, -9, -150, -88, -325, -335, -15, -106, -374, 88, -424, 61, 130, -123, -59, -242, -166, -183, -193, -13, 401, 4, 108, 92, 32, 335, -101, 192, 305, 155, 144, -91, 59, 193, -11, -71, -10, -201, 14, -34, -378, -172, 70, -52, -170, -131, -209, -223, -26, -34, -95, -68, 97, -248, -36, -29, 53, 248, 291, 183, 352, 23, -77, 287, -96, 11, 200, -295, 65, -68, -112, -46, -300, -34, -75, -325, 67, -44, -18, -265, -161, 169, -219, -132, 184, -84, -77, 410, 207, -134, -95, 236, 246, -98, 55, 173, 26, 78, 138, 57, -73, 80, -42, -79]
3640g9j42J98o0j14K52l52j00J66R4J19K08l44K84j16o3jL36k86Qo2M05l33J16
3663A34nl21M5L30k59J47K27l47J6k36K05K4l67J45L12l51K99j55k65P29l45J15
3685G7J25o8J12l6k11K95j19J32j73p4K53p8k69J78K59m64K05k31P4j62l7L78
3707A66n59L75K21l16M52m83J35K1Q4j22K50k70L08pk25j43L55l34J07j06L58
3728B67j45NK08n56K51J64k13j43K12j62L66n23J33J5J13j48L2o8O1j18L6K22
3750Ip4J20J89k20n1O2r4M14l74o4J82J82p9k74J55r2J46j11lj00k3j21M1J2J35
3775c3l0j61K40k71O9k78P28k47R4j50O7J00J15l51K60J37m48L29O1j8j34O2N
3798A46j81j89L10j36n4p6p3K17k69j6L92l28K91Q4k47K95m65P3M19j20l4o5J4
$$ y = [-79, -221, -23, -83, -197, 55, -297, -397, -231, -137, -18, 190, -154, 130, 14, -49, -50, 286, 0, 8, -54, 351, 18, 134, 129, -192, -147, 183, -76, 71, 298, -49, -33, -269, -64, -40, -407, -262, 50, -301, -2, -157, -422, 307, -38, 77, 202, 134, 246, 210, -1, 294, 175, 307, 134, 60, 313, 235, -34, 144, 403, -61, 144, -87, -13, -175, -212, 166, -393, -18, 203, -113, 339, -144, -9, 12, 96, -26, 224, -46, 262, 255, 30, -113, 242, -92, 15, -91, 267, 122, 127, 335, -221, 30, 194, -19, -162, 50, -112, 254, -269, -136, -121, -8, -156, -124, -192, -131, -249, -213, 9, -65, 55, 244, 24, -27, 35, -59, 355, -19, -83, 99, 281, 202, -72, 83, -9, 137, 26, 23, -77, -100, -221, -180, -168, -33, -63, -224, 16, -255, -186, -464, 264, 17, 111, -39, 28, 128, 243, -108, 152, 289, -159, 170, 231, 213, 79, 141, 146, -35, -224, 86, -50, -104, -180, -253, -36, -305, -321, 71, -257, 34, 118, -129, 166, -299, -226, 193, 73, 39, -26, -12]
3821a2L76o2n12J59k2L2K31k33%J1k47L43j51rJ19j85L4M18m97K21q3K5j16kK31
3846F9q6K26j00j38n7L67j27K6K4j73rL40k97j40J05r6M45o40L44O7k37J70k75
3869a92L9j9L9j76J41K17N8l14J20J4n6J32K15k15J88k30O4K61j73J45j63j8J34
3892B11j32k89K42p2k8k20K14j20L65l83K41J59j47J49o28O04k21j12J94j97o4
3913b34L75P9Pj34pJ64M4l34P8j9J60k57j1K37m5R2j48k64J88J12j41L01m28k83
3937d68N19j24J15k37J04K53l83L24qJ32k28J83l42N28k44j7J65l11m5q9J95K13
3959B35l47q2L04j15L7O5q0k34J11j83L48l21J51J22l12L68j65j83M76l01L17
3980B11K9j01K39k74J9PQ8k28K76k65J51j8k16K56m52L69M4o14M17lP3k23oJ03
$$ y = [-12, 364, 302, -210, -51, -73, -41, 190, -43, -43, -32, -279, 64, -87, -96, 23, -162, -128, 290, -207, 14, -69, -44, -160, -162, 69, -17, 209, 109, -29, -86, 281, 154, 180, 204, 31, 22, 362, 65, -75, 30, -66, 379, -261, 83, 150, -87, 83, -192, -153, -172, -133, -309, -168, 49, 107, -207, -87, -73, -129, 3, 218, 3, 191, -39, 25, 286, 113, 258, 95, 77, 211, 79, -210, 32, -40, -68, -288, -74, -194, 171, -212, 29, 188, 41, 190, -438, 166, -55, -167, 27, -170, -234, 141, 220, 227, 93, 86, 250, 294, -40, 38, 19, 179, -78, -89, 148, 103, 195, 47, -217, -29, 83, -58, 243, -185, -468, 51, -73, 42, -195, -91, 162, -221, 103, 95, 227, -1, 182, -160, 368, 124, 107, 272, -39, -84, -173, 22, 235, -112, -194, 110, -5, 32, 97, 17, -217, -106, -289, 59, -262, -111, 11, -301, 67, -98, -281, 195, -106, 211, 240, 139, 378, 104, 123, 130, 218, -10, 266, 1, 152, 134, -82, 174, -278, 91, 135, -479, -62, -65, 8, -215, -221, -118]
4004a18J01RL0l2l56M03k6J74K7k35J87J70k92R8J1j08J51k13J29j74L04l02L6
4027b6j86J70q7O5J33l87J25L14j41L09n50LL94k08K30N1l60N13o14L61K04l00
4049A3P2l4j38J93q7j48J31j84J60p6J42j80n0Q6L9j20M1K50l00p7N2K23J45j64
4073a1j25L55m0p8n3l66M12J62k34K10j34J86l12J60K7l43J22K22l17j6L1j06
4095b48J25j6j1J84k1k05K46l66J42J04P0K33l11kL81n09M82j19k65N25m10K20
4117B29Rk98J13j03L10k50Q0n1j88K39n6K4n8J15j39r9Q1j13K70p3J15j88J4K49
4141B32Q3l45K5j60L61P1l4k63L61k41j92J80j67J28p1p5L77m02L14k32k92J85
4163a57jp0K19r7J15j32K0L6K23k27J24j08K17K29l57o1q2J80J08J65j65p3m43
$$ y = [-118, -17, -8, 22, -10, -366, 37, 11, 185, 212, -23, 164, 334, 42, 140, 151, 43, 194, -19, 110, -64, 240, -62, -26, -212, -42, -129, -64, 69, -318, -193, 121, -20, 289, -261, -258, 136, -72, 158, 209, -151, 362, -252, 109, 313, 13, 85, 51, -87, 106, 19, -129, 2, -182, -22, -98, 44, -136, -186, -100, -61, -181, -140, 110, -190, -267, -215, 8, 153, -11, -136, 219, 179, 101, 48, -318, 94, 256, 22, 232, 98, 284, -28, 132, 159, -184, -62, 160, -157, -173, -142, -248, -123, -139, -150, 34, 13, -192, 54, -312, -170, -66, 4, 237, -74, -76, 305, -204, 278, 159, -106, 419, 9, 229, 238, -60, 53, -50, 260, 10, 90, 39, -149, 90, 34, 58, 0, 115, -24, -123, -42, -155, 115, 42, 157, -31, -17, 232, 315, -30, -5, -165, 196, 267, 233, -30, 331, 90, -102, 78, -89, 39, -32, -107, 270, -132, 182, -50, -342, -157, -158, -228, -9, -106, 9, -123, -103, -67, 156, -71, 53, -55, 162, 391, 34, -27, -109, 71, 179, 344, 179, 106, -337]
4186c37L27L0l08J10L24o48L98l8O3J19l29J80k2J32L14k73j13m2R9K2k82J50
4208a24K31j5o6K72k11O3n1n07L82j88J75K53k47j03R3P7k58L04O0r8j38R8k20
4231b18J58k04R1K87R8l07q1L31l05K58k23K49O6p7l02K03J59l3j18j63K51k38
4253a18M65l38LJ32j91n1Kk84O8K69n1J34J43k42J46j45K6K86l11j4L24l80K60
4276A33k4n3P8J67j75l18J16L22k78J47j46k68J82j11N6L32j63J30m7k45R1J54
4298H0k70L20j63j19O17k74j0j16p0K45P4l97J60l10M05K6l6j07J27k63o7L36
4320A88l47K15j09K65k54j01rr0k2K60m7j29K12m2J39l17K14P0M9N1j3k40J07
4343E0m6k39L24j80K44o2p3j33K18k49J88j04MM01l78J67m1j19J99k16r2k0J94
$$ y = [-337, -10, 20, -288, -178, 146, -502, -104, -142, -79, 40, -289, -109, -131, 1, 315, 42, -71, -113, -14, 8, -274, -124, 107, 92, 26, 298, 87, 150, 99, -408, -26, -214, -39, 214, -33, -136, -43, 34, -224, 80, 140, 42, -96, 2, -218, -60, -264, -173, 114, 212, -95, -176, 155, -150, 108, -115, 134, 200, 123, -179, 24, 183, 150, 32, -131, 120, -118, 347, 9, 12, 144, -47, -98, -96, -380, -312, -43, -94, 40, 183, -59, 87, -58, -32, 254, -57, -71, 253, -127, 133, 109, 56, 134, 301, 126, -192, -76, 246, -32, 115, -31, -299, -117, -228, -172, 160, -3, 127, 80, -165, -74, 80, -190, 130, -33, -152, 465, 191, 181, 65, -5, 240, 314, -83, 77, -233, 172, 198, 162, 55, 182, -81, -148, 188, -159, 56, -53, 212, -42, -143, -152, -242, -264, -4, -51, -180, 32, -10, 129, -188, 26, 96, 145, 196, 183, -57, 50, 4, -235, 89, -91, 153, 91, 18, -115, 103, -146, 42, -62, -58, 343, -35, 132, 91, -28, 171, -45, -137, -157, 37]
4366C7M2l4j75K40j97M6j1r6K24j3k28K55r9m9J46j00j25L31k23J75k40JJ00j65
4390a58R6K0L1o4J13j52K20j21J61O7k29K30j02k57J81j27o6L37k79J46P0j57
4412d0K9l76M21K48l26J08j28j3O0r1M5K10j93J22L4k32J64j05l07L43K06k18
4434c9r9QK04j22L31q3m6p3k12j86N12l12J71j41o8q8K94l17L28R3j68n2N4MJ34
4459A27j05m4J12j30R1j8l7K00k08L08j13k32onL03k00j53J12o6m7q2M54l63J91
4483H9j64k55K82M1O0l6nr3K62l11K33l36K32k8J79k20r5L65q0J8k3k91L89k15
4507bj46L38L6l39J42J3k23M10m39j26N1O3M9L11j99K66k50J82r7q0R1r8M9K09
4531B11j63J9J99o22L63L53l87J29J63oo3l80K15K47m58M58m70K60O2k69K10J51
$$ y = [37, 79, 45, -130, 110, -87, -41, -52, -148, 76, 63, -165, 90, -9, -58, 88, -12, -137, 194, -29, 146, -94, -93, 7, -158, -62, -42, -11, -75, 38, -114, 106, -15, 146, 213, -16, 214, 112, -145, 36, -91, -157, 180, -99, 47, 117, -40, -11, -387, 34, 282, -44, 64, -64, -77, -17, -108, -63, 147, -46, 76, 110, -122, 42, -63, -370, -27, 179, -39, -138, -130, 74, -48, 283, 200, 154, 81, -131, -317, 195, -117, 54, -87, -155, -243, 51, -266, 62, 155, -13, -65, -11, -7, 127, 22, -22, 90, -40, 51, 33, -4, 196, -12, 296, 183, -49, -55, -60, 243, 43, -110, 2, -64, -111, -193, 261, -102, 89, -75, -330, -48, -7, 53, 17, 12, -81, 181, -130, 103, -233, -1, -29, 150, -70, -165, 200, 120, 138, 115, -176, 213, -2, -148, 190, 226, -113, 29, 42, -181, 229, -210, -336, -285, -222, -173, 138, -61, 205, -45, 137, 40, -40, 51, -47, 2, 211, 48, 67, 266, -356, 7, 360, -27, 102, 265, 259, 196, -184, 31, 278, -180, 278, -192, 68, 130, -139, 71, 222]
4553B22m81M49j34l61K47O9j70K52j61J68l3j23k11R0M77k88O7o0n2k84M18n2
4575D9j77K04j43N06n18k24N38l59K35p1k10J76J45m6o4J63j99J28r0J19L21n68
4597h5O2L3qN0q6o7L60l19K66j68J8P7k03Q0p8n0J6n1j00L28O1l50K26l73O51
4622B90l00j44K75k54n3L43k52K25J19q1K3Ok86M31l34J53L5l89K10L5k18L52
4644A86k70j2L59n01K96o5j55p6O6O5J46j94K51j09O3k94J40L10kk6J87p6k68
4667B1K31k45LL8j18J35r4j96M98j91j64J71l35K49p1j18N04l45n6J26j29K9M35
4690C78l43L3L1l27K65m9J7j65L9L81p3k9O2M3j47k59J60qp2J05R2j86R7j03J7
4715d1jOPKM9j18L1q9J40j1j62l3L9K98o6k60M65j26j16j75N04m71K10k10Q8K3
$$ y = [222, -259, 190, 56, -305, -58, 11, -159, 93, -68, 100, 67, -56, -267, -177, 300, 12, 79, 19, -33, -317, 101, 49, -128, 76, -67, 439, -79, -303, 235, -124, 111, 40, -170, 6, 151, 105, 41, 204, 5, 133, 43, 162, 483, -85, -23, 10, 2, 52, -34, -101, 259, -60, 206, 38, 56, 133, -70, 10, -68, -118, -102, -153, -253, 75, 136, -214, 12, -361, 290, -10, -154, 121, -133, -186, 157, -95, 130, 249, 168, 191, 197, -89, 342, 8, 161, 196, -193, 17, 52, -166, 186, -84, -96, 263, -238, 58, -7, -162, -238, -172, -107, 39, -155, 96, -13, 50, -244, -104, 206, 204, 178, 365, 289, 21, 252, 7, 10, 48, -70, 65, -29, -225, 273, 82, -82, 89, -246, 3, -68, -186, 318, -27, -83, 43, -86, -57, 378, 35, 68, 99, -228, 37, -12, 5, -160, -121, 260, 187, 158, 220, 263, 116, -143, 17, 9, -63, 42, 134, -52, 45, -58, -41, -42, -36, -29, -27, 22, -96, -65, -154, -14, -25, -187, -220, -181, 117, 51, -209, 256, 130, 14, -161, 343, -128, 82, -128, -40, -17]
4741a7j51K14O1l14N1J84K3k5k27K20j19P5N9q2k66N02n1k06kJ47K09j79p2R1
4765A25J16j2m58K02J92j07j17L17k94j0O2J35k23j6N7k61L38PJ12j61K09l18
4787a05J2J28k7J57k6j19Pk3j99K56m1j9j78j4N2O9J49l37j19L98J2j00r7J76
4811A2p4J4Qj06L14k01J08j90J53lpJ87j88J81k83K16j1j49J32k58K79l81M10
4834A63k72L7r9K64m93M51P3l8j42K8r7j13K94l8l90J67K97j02J9j32J71J50k18
4857b0M1j3j11K24K9Q6k11J28J40n37J63R0j16k9J6p5M3R3l16L50Q3j11lq3J26
4882a3N9j49J06J2Q1K62l96J28j09K4R4l00K78l0P6k61K57l25K24J89k87J95k07
4905i2P8n6j08K88l15J45JJ76j45J49r7m3M7j05J5J62j63K87k33J1p4Q1J57q0
$$ y = [-17, -168, 46, 107, -207, -156, 28, 51, 26, -201, 19, -100, -25, 34, -48, -314, 188, 137, -69, -71, 76, 285, 106, 34, 125, 241, 229, -229, -27, 165, 58, -59, 258, -36, -46, 16, 151, -72, -88, -31, -292, 46, 53, 165, 4, 213, -105, -93, 35, 8, 165, 139, 20, 27, 4, -195, 61, 20, 1, -177, -191, -139, -70, 79, -258, -377, 21, 33, -67, -164, 12, -62, -48, -40, -146, 168, -33, 75, -115, 38, 35, 28, 215, 27, 208, -75, 141, 130, -19, 113, -145, 134, -247, 163, -109, -72, -171, 93, -400, 51, 124, 86, -56, -28, -125, -238, 56, 18, -372, -205, 92, -10, 9, -123, 48, 198, -20, 21, 8, -103, 121, 150, 236, 25, 153, 293, -244, -81, 9, -107, -136, -120, -195, -152, -59, -375, -25, 58, -53, -56, -139, -13, 46, -103, 3, 15, 96, 358, -38, 90, -19, 5, 99, -201, 77, 47, 123, -138, 119, -206, 18, 207, -80, 115, -92, -14, -70, -178, 110, -205, -60, -59, 117, -28, 121, 24, -19, 28, -77, -62, 100, -63, 224, -9, 2, -72, 9, 166, 86]
4929H6JJ99M1m86J14l5K07L7J9m3k83JJ13KM7Jk91J90k14L48J40l11O8K57l27
4954a19N01l97P2J88l08J0K94k54o2p6K77j64q1M3o3J53j48J33k74K33K9k37K99
4977D9p5j51K12j95K61r0P3Rj22N7r2K04p1l0J96k04J08j7l17K96j15n1J39j6
5001E8l22J67K17l81J43O8J02J11k53k02M21j17K2j69K15L22l35Kl4k59L53o5
5023F4j91J85p1N4j09Q4R1j69oJ70Rj40Kn2o4K30m16K55OJ62R9n51K98J82m0j05
5049b3P0j74O9m5K41k6l01J63M3NPl35L44n0J86k66J0m5J86n4l47K90j7j69J12
5074a26j34L78k41M2J40j13Q2R7l74L01K7R6M13p42K48n8j53J1K45RJ1l64l5J89
5098e1l5J89k11M2j25q1J58K08l68L38j79J13k5j14J93j94P6J78j02l3J32J30
$$ y = [86, 87, 286, 327, -159, -45, -80, 127, 164, 183, 140, -143, -142, -29, -27, 20, 21, -270, -80, -294, 54, 194, -117, -49, 208, -119, 382, -15, 57, 245, -63, -53, 241, -13, -75, -151, 126, -38, -119, -76, -139, 14, -134, -1, -275, -42, -13, -250, 49, -26, -177, 35, -160, 101, 11, 84, 93, -29, 28, -64, 140, 69, 39, 235, 31, 139, 122, -195, 101, -14, -65, 74, 58, -264, -97, 120, -261, -118, -50, 52, 163, -90, -292, 129, 12, 34, -135, 80, 402, 67, 69, 35, -224, 129, 64, -127, 58, -13, 41, -68, 16, 107, -62, -68, 102, 111, -29, -27, -79, -143, 87, -329, -74, -68, 94, 193, -358, -60, 122, 82, -23, 47, -127, -58, -103, 138, 112, -189, -26, 17, 22, 29, -306, 38, -12, 174, -92, -82, -127, 59, 5, -342, -52, -69, -238, -126, -260, 118, -123, -81, 59, -54, 28, 125, -249, 52, 79, 175, 588, -154, 94, 36, -117, -106, 139, 148, 159, -205, -240, -51, -86, 103, -108, -66, -191, -272, -114, 94, -274, 64, -115, -2, -27, -141, 52, -142, -66, 112, 10, -23, 109, 239]
5120B39j02j79k24M06j6Qk38L21j26m8j47m5K2p0K65j23K17m41R9J58N6q1j18
5143a67L07k48M6k1N2j44L44l76M51k19R9j80K46l3l54J90K25k99J56K05j17j69
5165fJ57j41k2r0k39q7K54M50j85J17Ok72l1J52m4J59m0j0NQ0l6j28j80J71k20
5190a80K70k88J33OK10k61J73j18Q7k84J03J99Q3k60K66l51J71K02m37K15jr3
5212a55K40k8k42K03j33L00O7m35L19p9j17J02j61k5N0N5J88k59j04K06k10qP6
5235a50q4J79Q4o2n6o7J41J00qR5k21k0J59j31k12J92J29P8M7k86K76l2N5n6j55
5260eO5k95Q4J85j02P6l5j97J84M2j25J01l31M46j08j42M99k51j07J46o2k32J27
5283c7j6l8J33k53K99j20J50j41Q6J52j57q5N0q6j88L73L2j13q7j21J84l4RM8
$$ y = [239, 137, -42, -266, 140, 124, 132, -106, 215, 89, 41, -106, -151, -129, -199, 66, -57, 160, -281, -182, -24, 32, -49, -167, 140, -108, -62, -83, -31, -175, 169, -207, 244, 25, 124, -56, 190, 157, -197, -7, 218, -81, 75, 280, 163, -6, 151, 10, -12, -102, -341, -428, -174, 276, 91, 208, 214, -58, -89, 63, 19, 178, 138, 128, 133, 213, 177, 49, -131, 40, -180, 90, -198, -65, -59, 151, -110, 63, -55, 32, -252, -149, 50, 133, -127, 139, -212, -41, 161, -276, -61, -62, -155, 85, 57, -185, 18, -115, 185, 252, -183, 136, 57, -60, 42, -119, -144, -94, -39, 149, -110, -214, -8, -218, -226, -150, -234, -55, 29, -33, -89, -156, -15, 85, 77, 172, -49, -69, 90, -41, -253, -61, 68, 146, 193, -93, 183, 151, 206, 150, -5, 60, -235, -151, 34, -68, 8, -27, -224, -40, 2, -123, -22, -353, 93, -15, -157, 342, 91, -16, 130, 68, -164, -37, -53, -91, 42, -211, 88, -32, 118, -23, 63, 215, 58, -27, 23, -63, -251, 122, 154, 41, -46, -167, 17, -17, -8, 40]
5307D0J46k25J27q1J34j81J84J18m39l7K58k50K03M7j06j48J53j31J00K4j28L79
5329A87j80j66J26q1K54R5j23j05lK12l7l88L65l10J27J22j12K41L6l91J63J8
5351E0o5Q9K5k46J71n0j2J17Q0j79l3J35QJj82J29j50J46O1P1l27P1L15l35N6
5376e4%j17j6L59j94J00j30L09l29Q1j79K04p6K35l52R8K13m1k26N7k83N31l48
5399a58j36L17j62L54k12r3K91j43L8L41l30R7K0k92j49K50J8R3j51Q9J87n16
5421b47K83Pk95L00m7P2J02k56J6J08Mj67m3M38j33l32O8J99LJ22l11M03j13l73
5445a92J60l3p2J79L9k60n5K43K30k62k74K93p5n0J06q6PK10m10J43J70mJ09k50
5469a34J64J24j14j83J83m1LK71j34j05k3n4J57k57Q6N0m3J75k81N1K17k23P3
$$ y = [40, 186, -39, 88, 7, 141, -40, 144, 262, -177, -214, 44, -206, -3, 44, -62, -210, -57, -188, -88, -64, -192, 187, 7, -159, -33, -114, 140, 235, 112, 7, 4, 216, 179, -209, 156, -154, -27, 95, -17, 224, 260, -131, 32, 50, -15, 74, 99, -147, 24, -26, -38, 79, 159, -20, -53, 82, 90, 91, -91, 38, -112, 34, 95, 166, -161, -90, 225, -110, -54, -54, -171, -187, 172, -22, 78, -52, 257, -72, 9, -170, 34, -42, 193, -159, -61, 152, 111, -115, -58, -341, 190, -158, -294, 23, -139, 215, 3, -90, 201, 58, 96, 437, 107, 204, 224, -68, -217, 33, 51, 144, -7, 82, 269, -247, 36, 43, -252, 48, 1, 73, 175, -81, -65, 43, 47, -120, -163, 275, 142, -190, -122, 77, 80, 202, -109, 294, 181, -192, -32, -65, -137, 42, 81, -179, -234, 9, 239, -23, -297, -4, -79, -129, -23, -109, -102, 108, -302, -159, 11, 7, 116, -134, 30, 154, 40, -143, 40, -1, 2, 273, 139, 34, 11, -43, 114, -143, -57, -7, -50, 125, -156, -105, 112, -111, -38]
5492c8k82M01p3l41L54K88q1l03J2N1J48l24K98j45O3jk64O8L62K1l49J44lo1
5516e5j86J90J9j09K25l97J86J18m2n9j7Ln7M35j24l78K35J47J33m69J55O5j39
5539a21K8J81o8k0J90j86O2o0Q7k30n5L34k86J65k3R4m6P3l31J54K93j57o2j10
5563i4J73o0j80J04M3R5K02l79j02K58j36j7J28k48J00q4J41R0k92L52N1j86o4
5586a05J99k33mjL18l85j51M72m02L18m4k0j26K44m4Q7j5r1L09m08j84L11j26
5609h1K45k42R2J76m80L63k49Q2J68O4j83j66K47k35K40k84N18l86q8K06j09J45
5631D3J97m57L64n0n6j33L6M30l37kk1j50J78j46K27j82N3o5J55o6l79P4K40l13
5655c60L33l01M42l24k3J77P8J04m12j43L21J48j45J53J84o45Q25j0k70k83Q4
$$ y = [-38, -320, 81, 8, -333, 21, 309, 228, -75, -63, -12, 136, -188, 110, -35, 28, 27, -237, -169, 193, 214, -135, 9, 6, -55, -241, -51, -32, -141, 84, -313, -127, -9, -51, -110, -127, -124, -181, 254, 130, -248, -13, 134, 267, -202, -47, 18, -121, -93, 88, 20, 0, 190, 4, 66, 6, 93, -137, -192, 142, -144, 21, -2, 92, 46, 119, -212, -58, 235, 78, 16, -94, 79, 19, -161, -57, -14, 81, 283, -96, -198, 60, -76, -93, 35, -213, -113, -197, -56, 34, -258, 94, 145, -41, -105, 94, -139, -143, -144, 174, -211, -362, 110, -292, 26, -18, -38, -164, 80, 36, 123, 108, 17, 326, -82, -266, 45, -81, 164, -78, 14, 190, -290, 73, -176, -94, 74, 138, -45, -211, 36, -199, 41, -243, 275, -111, -199, 7, -102, 43, 240, -217, 147, 97, 41, -92, -56, 374, 37, 35, 14, -136, 42, -104, 123, -59, -6, -71, 84, 18, -361, -287, -47, -360, -27, -328, 114, -210, -233, -56, 22, 126, -286, -429, -108, 40, -105, 48, 232, -413, 412, 402, 132, -151, -67]
5676f7M03k60j78P3J79j18J46p2nj3j12J45l6j18P7j62K75j71l05M93m0j71O1
5699B4k0J85q9k52K26j93K63j2r8J17j02r7K09m77K69J84n35L86j76K47J0N1l6
5722H4j98k5R0L1N3J1q4j17J03jK09k31L6Q4K11l18K01r7j36P5L3j05k2J58Lj27
5748g9j39J11K90l92L39r1J78q8k06l2r4K02l0nJ69j90mn3m6J11q2K31J23j96
5772B7p1J00L7J29j85j67K51l37L76j85j21R6q8j18L55l15K99J62j62J37j36j94
5794a10L77j98j32P6K35%k41l59O01j92o5K11l39j21K71L9J06j76j81L31j7Q3
5816A99Kk29J72j96l3m4K9P2L30j46k44L17j81k56L05j48J30l04k8L57j02J18
5838A20n5j23O0Jm8l6r9K64j88k2J36l5J09j52o5J76j12r7J52J47k7k6o3j58J34
$$ y = [-67, 336, 76, -102, -29, 150, 32, 178, 106, 101, 88, -24, 121, 85, -33, 44, -118, 157, -14, -319, 174, 134, -37, 24, 4, 189, 100, -152, 74, -119, 144, 132, 34, 151, 49, -48, 161, -316, -47, 137, -398, -12, -188, 59, 69, 120, 84, -114, -139, -49, -18, 35, 46, -38, -155, -52, -53, 156, -75, -39, 45, 256, -62, 139, 42, -94, -19, 14, -91, -113, 45, 48, -79, -218, -107, 183, -209, 130, 39, 217, 129, -77, -109, -203, -1, -31, -36, 133, -57, -61, -114, -160, -49, -131, 100, 223, 27, -44, 56, 93, 222, 37, -130, 121, -216, 160, -25, -146, -50, -138, -256, 99, -216, 83, 245, 83, 220, 84, -110, 267, 69, -63, 13, 248, 248, 7, -352, 249, 57, -8, 203, -136, -257, 14, 53, 159, -17, -198, 133, 116, 199, 201, -28, 144, -52, -85, -129, -100, -28, 302, 156, -88, 229, 48, -208, 97, -51, 79, -225, -253, 104, 2, 120, 65, -58, 2, 3, -45, -81, -180, 84, -104, -126, 10, -25, 84, -68, -133, 43, -69, -166, -14, 133, 106, 80, 17, -141, -7]
5863gNJ91k84J64mj71K17m4j83J67J07k60K92k10q5J62k01lJ12j31p9K40j26K17
5887H6k96M02O0j62r0p5%L42j83j66K11k09L47j56j00K83l78pJ23j36Q3kj21J84
5911D0j29K4J50k79Q6K5O1Oj6K53k19j51R4L4n2J84L2q1j36k7j34M44l47j52K55
5936c5O2K8k83J40K37l62K40k63L03j94M9QL69m90Q3N5J13l8j32l0J03j56j48
5959c41R3J54J81k1j4J41k51J04r3K21j9K10m23J94j59K01k38m6M30j43k87P2
5981c4P5j54J73m5k40K29j98L44n6j09J94k48K06j00qMr3J81r5P6j42m65M38Q9
6005B2l44J73K08l04m4L77j82J8o4rl4J01K13j7L5l6k81L7J47j85M6R0j13K23
6029G7J18j19k17K53o0%K02j80L8q5J56k34r1J3K68P7k45j37K10j07K61l49L55
$$ y = [-7, -2, 189, -95, 69, 65, -106, 111, 67, -116, 51, 158, -102, 190, -20, -105, 57, -144, -147, -35, -166, -245, -5, -131, 86, -210, 192, 252, 90, 0, -75, -75, 267, 84, -82, 129, -80, 267, 111, 11, 294, -84, -91, 32, -104, -21, -23, -144, 40, -89, -65, 85, -194, -108, -83, -22, -16, -32, 221, 2, -149, -55, -21, -73, 111, 143, 62, -74, -101, -235, 209, -138, -290, -35, 27, 55, -228, -88, 149, -213, 27, -236, 67, -127, -78, -70, 299, -191, -108, -53, 60, 22, -110, -140, -37, -193, -341, -248, -94, 87, 66, 52, 193, -58, 46, -47, 174, 155, 365, -58, 136, -23, 178, -60, -106, 324, 181, -106, -34, 41, -113, 60, 15, -225, 4, -194, 150, 94, -15, 179, -69, 137, 37, 29, 33, -60, 121, 26, 102, -40, -505, -67, 22, -322, -149, 59, -245, -289, 88, -94, -76, -140, -149, -183, -82, 131, 114, 149, 113, -168, -131, 16, -169, -123, -33, -146, 77, 195, 76, -141, 112, 52, 52, 254, 74, 112, 27, 183, -51, -142, -129, 139, 216, -29, -166, 44, -63, 198, -151, 204]
6052B04k69J29K52N5m31J4K00k47K33j72R0k18Q6J75j33j15K11j42J17M4k81R3
6074a05J24j55k37L55r5m5j02k0K66l5N7K0J18P2j44k7K83l35j60K03j58L25l62
6097a57M0M5N3j49o1L03R6m09M30k46P8q7L8J73K19m18j43L79j93k00l0Q6L03
6120A50n8j77J36j16K84l57J08O5Pk94L20j51L49q9r1J51l23J01L6j57K60k2k03
6143g1J67K3j99J49Lr8J83r3k46L48j13K10j22k73L43p8K21n64K17L4j27R4J75
6166A83j49l29J53q7N15m04K70j92kJ91p8r9J63j0k44L10j66K69l63K74m24L07
6188H8l18J40K77k92J91k12M2J64k75L29k77o0J76p7M3K28pk37j4j17J34k52O9
6211b57M61m43N30k96J03j6j86N9R8n9P7p6J7J90l70K77j22r7J54j16J18j20J8
$$ y = [204, -65, 64, 316, 371, -60, -46, 154, -93, 140, -32, 58, -160, -74, 101, -32, -147, 64, -78, 39, 83, -198, -105, 19, -136, -373, -18, -113, -158, -260, -280, -14, -49, 8, 28, 146, 218, 74, 47, 330, -5, -165, 38, -120, 205, -157, -117, -72, -19, -168, -229, 74, 170, -239, 191, -55, 23, -64, -26, 147, 366, -52, -195, 184, -9, -209, -239, -153, 150, 92, -85, 51, -65, 219, -138, -30, 35, 42, -252, 68, -83, 266, 177, 86, 237, -86, 15, 51, -106, 154, 132, -71, 96, 119, -80, 69, 72, -26, 157, 64, -182, 166, 53, 263, 141, -132, 211, 133, 354, -210, 7, 41, -86, 8, 183, 34, -295, -142, -229, 286, -118, 152, -40, -42, 149, 71, -28, 135, 125, -119, 191, 25, 294, -69, 205, -219, 88, -230, -90, 187, -105, 86, -126, -84, 80, -195, 134, -143, -203, -27, -104, -61, 167, 160, -77, -91, -208, -74, -326, -257, 204, -239, 291, -5, 98, 82, -104, -45, 53, -6, 71, -5, 12, 202, -168, 109, -13, -110, 44, -72, 46, -74, -56]
6234e6j03N13l88J15k04O9J51k5j49M0n1l4J98k22L06k21O7J6K9L26l67m2J72
6257A40p0r9J62j96J2k8Q7J17j52l1J35k31J23N6j05r0K13k41J82J38m31K81k11
6280b39N38m30O7M07m07j20K75j56j5J70j87L61k65J11k6oR0o8j00K21k99j05
6302a83K79j85R5J12J11k33M6j11%j34K24L01o20L34K82k96R3l80M39m48K07m0
6324a07K07J88k32J16n86P15n06L90j2j34Q1k8J24o05O66l73L02j2k15j89J77
6345c3N86j71k99M12n54K20M3m63J4N4J89M81p3o18N2r4N28n48L36k45J29J74
6367A20Pk58M07l43l8Q0J25P3j42k87N13m25j4L02rr5j71n3K90p16P04j88o4k73
6391d55Q42o22M48k85J00K60l84L11j12k56j3N30p21M73k29K90k83J65J47j38
$$ y = [-56, -159, 354, -34, 81, -123, -54, 97, 72, -77, -37, -88, -122, 76, -146, 160, -61, 6, 22, 51, 377, 10, -32, 140, 70, -29, 133, -63, -51, -79, 8, 125, -27, -58, 77, -154, -31, 25, -80, -170, 43, -198, -16, 122, -309, -28, -239, 299, -131, -64, 343, -64, -184, 91, -65, -80, 90, -97, 264, -1, 110, 84, 78, 168, 100, 0, 221, -78, -183, 96, -89, 6, 118, 229, -4, 42, -69, -69, -203, 21, 322, -298, 36, 318, 22, 115, -265, 174, -274, -67, -107, 100, 288, 56, 172, -414, 301, -205, 185, 173, 39, 120, 92, 216, -389, 277, -96, 206, 194, -21, -210, -33, 553, 382, 83, 495, -59, 161, 204, -259, -245, -191, -2, 479, 406, -212, -160, -254, 274, -274, 62, -183, -54, 120, 127, -131, 276, -67, -105, -25, 100, 173, 31, -256, 257, -168, -182, 120, 111, 16, -155, -208, 82, -634, 70, -118, -182, -455, 387, -235, 213, -72, 28, 288, -96, 215, 103, -153, -166, 364, -357, 116, -113, 177, -106, 59, 206, 68]
6411F8J21j8j88Pl1J65j10j5J44j77o9R3j69K42j06L2k23O9l7L89k38J4l04J94
6435a47K38j03l1o7O4o1K76r1J88j30j89k52J56m9L73k49R2KM7J74K5k94J89L
6459A64l87M34m15pL24j95j32K58k9j08m6K33ol85J81K62k04Q3j14K84m0j92R1
6482E4J15j63K9K65m35J55J62j84J44p3j19P9k80J69K07J12j16o6L1N5m02O1J11
6505h9J45j39q3M75l16Po0J58k03P4Q1N1N1j68k87j74L10K80m5l06j46N33k61
6528a12K63k74P3k99R7K55L09o15k69K50P12n58M2P25q75j20N08K32p1r99N05
6549b21O69j58R9o20M47Kn0j59N2j20k18N0L35k68L46m85N68L9k17J3M45j88m09
6572d8Q8n37J77N47j69l11K38l27L09k7J8M32m41k52M19K04n77N58j44J67j45
$$ y = [68, 189, 171, -17, -10, -41, 124, 14, -1, 143, -34, -103, -10, -179, 63, -43, -11, -234, -165, -202, 187, -51, -37, -341, -147, 91, -12, -43, -110, -46, -107, 169, 78, 266, 136, -53, -305, -149, -198, 175, -74, 18, 20, 67, 241, 266, -28, 161, 164, -223, 211, -204, -211, 113, -82, -214, 44, 15, -93, -139, 94, 88, -297, -116, 146, -58, 25, -89, 195, 155, -37, 54, 169, 6, 35, 300, -135, 20, 182, -2, 142, 69, -50, 29, -251, -82, 125, 237, 121, 55, 86, 141, -261, -200, -89, 56, -83, -166, 309, -7, 0, -60, 98, -105, -31, 50, 101, 152, -16, -303, -477, -167, 113, 68, -238, -384, 149, -112, 151, -123, -50, -349, -252, 3, 312, -303, -572, -322, 390, -168, -126, 599, -276, -396, 112, 344, 273, -726, -221, 448, 290, 389, -231, 216, 218, 168, 9, 61, -59, -277, -227, 108, -160, 186, -299, 269, 308, 91, 104, 549, 361, -48, 40, -497, -320, 227, 58, -253, -15, -342, -33, -60, -42, 390, -51, -303, 116, 320, -257, 301, 157, 324, 179]
6593A79p5J8J03l71j37k30M24O0l78M93R1q7k95k28N58K56l45L23n23J36q0R5
6615a3l5M2m1K1O4k24J52Q6lo9k22J87k1K11J61p7Lj13r7L3M9j17n4L74n65J77
6641i1P9J34M5j19l3Rj28N4Q0J11o6l02K87j2k02N0K70j96o1J29r3J9p0K25l09
6666a90L51n6j04P5j2j51K24k41J21j20K41l07K74j89L72k37j60L92l12J04r0
6687a5k23M18j95L6l1J45n2%K3j70R0n9j5P4K1J35k56P9K93mj93r4J3R9k47J28
6713@j15J73o4J71J6m54K78j12J35k6j27L66k62l73j26M71n40M85K53l83J1J05
6735a18N28p53M65J85k51k82J37n94K61R5J84J92p20R5J40O91j01l86L34m63O85
6756C24m02K64l22l67L27N69j57q36O74j31J1n47K24p3J52K28K94n54J48j20L94
$$ y = [179, 104, 122, 225, -146, -283, -513, -89, -29, -407, 86, 177, 90, -205, -433, 125, 381, 36, 359, -164, -28, -108, -13, -48, -6, -47, -26, 38, -186, -34, 52, 49, -20, -242, -55, -76, 135, 296, 219, 222, 109, 12, 45, 94, -23, -77, 297, -268, -91, -12, 122, 167, 48, 15, 24, -104, -50, 30, 141, 75, -227, 60, 48, -154, -104, 166, -30, -91, 38, -55, -36, -106, 119, -190, 161, 105, 1, 76, 64, -87, 137, -104, 17, -103, 138, -169, 105, -84, 288, 51, -109, 283, -29, 75, -15, -238, 180, -15, 21, -10, 135, 83, 83, 106, -64, 26, -33, -48, 26, 47, 182, -74, 5, 298, 294, 101, 7, 20, 119, -128, 0, -115, 58, -6, 165, 181, -273, 5, -107, 28, 2, -125, 241, -21, -394, -520, -49, -589, -104, 149, -234, -223, -118, 410, -343, 122, 307, 56, -226, -89, -683, -422, -327, -143, 49, -671, -576, -436, 255, 154, -232, 102, -361, 324, -78, 186, -136, -503, -176, 393, 236, -600, 74, -57, -46, -593, -369, -442, -290, -62, 232, -322, -174, -294, 100]
6777A00j94R1N15l18l36N84n27K33j30l67P91o66K64Kk92J08J99k65K46m8J27
6798A17L12k92j62K95j39l06J06j65K06l85N77L18r66P38k37r4K26J05m77M52
6818B29m07L01J08m52K84K38l81k5M36j08j95l42Q2O09n24M87m20j72J76p4R4
6839e6j41M6j34J6N41k80L49p29P60o30N4M59k10k01Mk04R8L57j70M0L72k16j57
6862c2L5l0J7o2L6r6J37j09K04r1K43l29J08n6j15P2j32Q6J67Q5j07QJ38r3k20
6887a36M6J48j11L3p5Q5j37J15K10l15M29m73K04k7J55K1k17j37K02Q4j13J5k19
6910b13K73p7j66J2K81j69Q6k24L9j7J90k66K01L0O6M0j2j11oJ57q9p5j90O36
6934C96m85R6J69l67L52j77q6K64k1l06K08ok68J38j00K45j47k48j48P41n06M1
$$ y = [100, -94, -3, 512, 194, -142, 442, -85, 148, 18, -349, 442, -224, 40, 42, -250, -142, 57, -208, 38, -10, 117, 429, 137, -25, 270, 131, -175, -69, -234, -28, -413, 164, 482, -484, 254, 17, -77, 149, 254, -223, 229, -178, 123, 231, -221, 63, 301, -80, -105, 331, 223, 28, -314, -232, 377, -147, 340, -80, -252, -76, -150, -56, -197, -151, -285, -269, 272, -8, 341, -388, 372, -258, -204, 255, 45, -156, -152, -356, -258, 99, -71, -31, 341, 125, -32, 3, -27, -10, -72, -36, -132, 5, -104, 100, 9, 252, -77, 31, -25, -140, -68, -200, -114, 53, 138, 31, 39, 177, 84, -136, -90, 58, -53, -20, -95, -10, -147, -32, 178, -137, 292, -181, 23, -4, 151, 172, -45, -182, 20, 104, -9, 6, -213, 60, -17, -183, -171, 110, -59, 27, -197, -158, -175, 15, -251, -50, -20, 46, 86, 74, -37, -43, 114, 25, -50, -240, 396, -89, 7, 176, -191, 161, -16, -102, 162, 141, -165, 43, 37, -231, -93, -193, 52, -95, -343, -491, 250, -256, -215]
6956b15N5J18M3j63K33K06r0n09K21n19J311r30Q30q62K35J83K05K24j079K46
6976b57L23j21K94k68J52k63J72q9J94J3Nk5j4j6m6k43Q7K90J4j18j3o0P3R5J58
7001C37n04K94j29R6J42j87p8k0O2j02J73k45J71k48R9J77J59M9q6k91J10J90
7023A69j58r7J68j8r1K05j99J22j19O8j39O8J45k96K79j45j07oJ98j5j7J58J09
7046B82k00k11K44r4j45J95l11L70Mr5J15k41o1J23k7J45j5k14n6K24N6L7M5j12
7070E8J17n52K33J00Lj38J75j05J55j17K23k29j06R7L8K40p6j12J38k79J63O9
7092I5o6K2Q5J10o6r2p1j6k44O6M9J63r0J66l83K85N8j19J67j11P9j32j11J77
7116B1mk26J59l10N99r6j84J30k4m8j5K27j30J15k75L51m89J71K9J6J46j27j26
$$ y = [-215, -160, -42, 1, -162, 71, 277, 187, -322, -101, -620, 691, -239, 591, -271, -36, 147, 352, 576, -503, -257, 66, -55, 239, -29, 123, -140, 32, -57, 137, 150, 155, 130, 116, 100, 54, -189, -102, 188, 202, 84, 71, 11, 84, 179, 337, -167, 127, -2, 94, 236, 49, -29, -49, 13, -89, 84, -161, 10, -238, -139, 38, 197, 246, 160, -131, -21, 169, 11, -86, 82, 64, -27, 178, -21, 101, -18, 50, -89, -21, 124, -172, 107, -38, -145, -151, 47, 32, 15, 173, 282, 82, -129, 115, 21, -124, 71, -240, 130, 134, 39, 154, -87, -148, -25, -52, 93, 78, -136, -192, 32, 88, 125, 170, 58, 175, -377, -144, -44, -41, -179, -4, -109, 46, -71, 152, -77, -183, -86, -48, 192, 116, 4, 142, -137, 26, 95, 29, 51, 136, 246, 180, 88, 17, 1, -243, -177, -128, 35, -55, 111, -272, 13, 71, -48, 119, 8, 87, -45, -156, 21, 17, -209, -50, -360, 239, 143, -41, 89, 65, 17, 2, 229, 99, 214, -61, 290, -199, -28, 1, 17, 163, 36, -90]
7139i0m8j06J96K79k64J69o8n1o4q9J70L08n03J83o4J53J11m21L24j75oJ30j73
7162i9J90j04l8n0O6J58k49K71l38K34n1O5N9l4k00K7jL1j53K43M8R4m39K00P7
7187Gm3j0K03j22k12J91l9j20J02M5j00P3m0j43K22q8J6J81k29J15o9j21J16J27
7211F2k14O7j78L29Lm0J45k88J02k1q6J00K64m16K25K64k71j40J32J68k61Q0j88
7234a62J73N5m7J11l37o5K70L8Q7j52J66j08k49L01j02n1q4R7K29j32l8J56j52
7257Dk0j97K28j08L22k24M16l82j49L53l38K03k42jJ59j51J11RJ41p5J51j37R7
7280A70k09K58m47O8J6P0j5K35j67l44L43r5J44O6l17M13l7j85k60K6R6L61P4
7303B64k38k53J91N1O0J5mK7l79M35m4q1j14j24K18j31K7J19j07K59n6l2l29J33
$$ y = [-90, -138, -244, -48, 231, -33, 136, 68, 17, -47, -136, 34, 342, -161, 22, -42, 111, 222, -199, 125, -50, -56, 74, -99, 91, -13, -51, -101, -35, 123, -126, 145, -193, 41, -10, 55, 114, 80, -120, -93, -94, -63, -216, 27, 75, 169, -270, -70, 7, -36, -46, 157, 35, -177, 14, -25, -145, -43, 2, -98, -25, -65, -208, 14, -74, -58, 123, -106, 9, -60, -181, -65, 62, -152, -85, -263, 66, 69, 29, 174, -114, -12, -33, -119, -19, 245, -171, 54, 318, 47, -93, 39, 207, -54, 26, -162, 11, 66, 19, 130, -207, -272, -2, 36, 123, -29, 137, 29, -220, 81, -21, -72, -156, -59, 170, 38, 0, 156, 4, -16, -213, 15, -93, 229, 5, 421, 39, -110, 243, -95, 108, -134, -135, 24, -127, -16, -7, 134, 59, 210, 73, 170, -39, 219, -228, -160, -144, -74, -89, 146, -21, -365, -22, -117, 27, 93, -224, 189, 152, -33, -293, -267, -171, 190, 264, 26, -227, -36, 15, 75, 90, 86, 113, -266, 169, 125, 44, -70, -194, 24, -107, -80, 39, -68, 191, 135, 103, -226, -93]
7327i3K82j10K1K8k38j05L26n0j89J76j2j07K60l45J35pr1o9K9K59j49P3J34k89
7351a31L0j78M18k64nK04P2l29J93k20K51J81l50J50p9k42L03j91K77J59kl97
7373a50M3L1J91k1rJ05l47J77J84l03K16Jk96L20k34k4J75K8J30j48m8J63k07
7396b3K73k94Q2P9k17K48k31K90j20p8pj47J29LN1j93Q1J19J28m0j52j35k5N03
7420C24p25Q54m18k06K10j65K02l8j75J61J68j49j1M3j79K37k6j77k8K00q5m0
7442b3P8k25J93k84J72mJ35L5j45K63k45K02q9n8j35J03J27m4n7j77K67o4L3j64
7466a06K13j44L4l3J26lp4q3Q9J50j52P6J7k40L32k59j6j8j15L53j89N1j11J39
7490C7J2K0P0j8L9l15J12L22m63k52M89P4o2j8l10M03Rn9k2r1n8o0l0R4L34j01
$$ y = [-93, 189, 79, 100, 128, -110, -215, 111, 61, -128, 48, 36, -71, 189, -156, -21, -28, -119, -188, -159, 100, -49, 24, 158, -131, -101, -279, 139, -125, -130, 74, 146, -183, 10, -210, 41, 222, -128, 22, -57, -299, 4, -187, 90, 249, 247, -150, -107, -76, 115, 94, 85, 190, -157, 20, 204, -99, 117, 118, -178, 142, -92, -116, 59, 87, 217, 69, 21, 184, -23, 250, -44, 38, 117, -100, 148, -83, 207, 87, 9, 2, -145, -16, -13, 38, -155, -74, 45, 173, 133, -19, -154, -179, 324, -401, 453, 35, -171, 39, -126, 76, 38, -137, 24, 192, 43, 32, 75, -104, 133, 107, -70, -98, 102, 17, -23, 55, -170, 23, -261, -89, -93, 42, 77, -68, 195, -50, 152, 63, 5, -130, -27, 100, 56, -1, -178, 89, 25, 58, -106, 107, -37, -3, -36, 90, 87, 13, -70, 19, 169, 17, 93, 110, -130, 202, -57, -73, -91, -206, 147, -42, 9, -102, 37, 49, 69, 139, 121, 160, -155, -43, 279, -184, -436, 53, 127, 65, 47, -263, 140, 149, 90, 68, -23, -81, -141, -171, -77, 257, 156]
7516A56O6j39r2m8Q1J67l20L39j53j10J13k00l3K31k69K40O0l8n6J26j24N0p6
7539b9j01J41J15p3M9l87K47j07mJ35J77p5r0j33K91j91R3J18j45j40l1L5J73
7562F8N9k0l57N5J49j89K93K49l93J24O0r6l2N5M7oj48J11n9L6J25L92n15J38
7586A46k52J61o7J30L3k38m5K26m11L38L9l02O5J61J67J1j49n3J55j77p9J35j77
7609a83J34J18RK03j59j02J34r5K67l51j15L0LL26j40r5k7j4J9J11j56J86k19
7632a16N7oQ8N3k72JM97J48n14P0N8M9L1m2k5j25j20L54k15J20j36J35J7l05j2
7657b10L0K59K05l24R1P6j15N9K2r1r5K68k04k2L0l8J86K8l78K28J66j90Nj31
7681a45j15N18l94K76M3k90J80N7J92l05l4l0J21K43m41R6j47L12j50r4k3K07
$$ y = [156, 222, 83, -9, -57, 24, 191, -129, 210, 57, -53, 60, -140, -173, 58, -211, 29, 89, 51, -5, 121, -3, 47, -29, -130, 11, 126, 53, 102, -285, -38, -145, -149, -14, 163, 88, -2, -135, 156, -35, 58, 176, 31, -109, -140, -105, 68, 127, 107, -250, -195, -46, -235, 58, 307, -86, 38, 98, 2, -30, 25, 72, 66, -82, 29, -30, 6, 131, 523, 8, 146, -106, 55, -12, 118, 151, -87, -132, 94, -317, 21, 60, -242, -177, -16, 151, 162, 13, -40, 115, -62, -141, -6, -183, -49, 69, 78, 281, 122, 20, 154, 59, 326, -25, -140, -110, -107, 219, 79, -16, -43, -57, -38, 73, -83, 103, -116, -59, -65, 23, 76, -196, -195, 302, 450, -64, 6, 64, 113, 144, 102, 77, -48, -168, 186, -29, 91, -45, 90, 107, -198, -210, -180, 79, 284, -40, 51, 127, 12, 71, 93, 2, -93, 175, -29, -51, -21, -59, 127, 155, -223, 5, 171, -19, -14, -145, -260, 258, -136, 140, 183, -107, 73, 130, 322, 17, -17, -47, 74, 317, -124, -28, -175, 137, -13, -107, -130, 77]
7703G7j17K4j1K56l03M41j68r5J1k38J40J33j12K18J7l79L21j10M2r8n1O0J6M0
7727A14j55nN1o1RJ55J16j55n1M7j87Q8N7j52L97k92o9o6PL54m70M48l2j42%q3
7753g7J38j6r3M3J54r5j31j3N6j45o3L41j68k46L66m3n8M8L29j48q2m5j50N3R7
7778E2j88J59p7N2l6Q1j63r8L64j47k35L78j92jK09j50j69M2M32m65J82j27j32
7801b29M37j81j35L21m61J33J71L6m39K53K70m58K69O2j63K78p9r9k05J03j79
7822b95L83j91L3L2J66K8j74L9Q5j59P3K98m32K58j03J0k45M5K16m1kr4J61k46
7846a55K25j54J04%l8K9j6l4k06L51q5K2n3j8N6M0J0k10n8%j18L63J86k24k90
7871b73Q6L87j98K11Q5k59Q8k10n6K3P2O4J50l73L16j87J16j40J88j57j5J90j91
$$ y = [77, -40, -16, -27, 229, -74, 367, 199, 104, 115, -123, 17, 150, 38, 256, 273, -106, 215, 105, 147, 49, -2, 58, 74, 114, -41, -46, 5, -56, -47, 108, 224, 69, 18, 65, -122, -34, 23, -129, 268, -24, -93, -159, -152, 202, -268, 180, 148, 6, 6, -77, 61, 45, -48, -5, 149, 54, -77, -90, -34, -179, -242, 99, -69, -315, 51, 8, -50, -2, 327, 179, 97, 52, -98, -45, 52, -136, 23, -54, -2, -38, 43, -120, -218, 146, -1, -236, 142, -50, -51, 158, 8, -161, -119, 313, -152, 30, -97, -229, 208, 27, -108, 213, -248, -115, 56, 92, -347, -94, 176, -282, -13, 49, -114, 164, 85, -14, -219, -116, -295, 88, -103, -70, -38, 128, 156, -18, 21, 106, -53, 20, 318, -114, 144, 41, 51, -194, -149, 67, 26, 24, -70, 91, -155, 70, -84, 20, 20, -18, 11, -5, -39, -245, 106, 21, 43, -10, -28, 28, 68, 78, -132, -190, -190, -308, 55, 241, 17, -273, -187, 200, 2, 213, 298, 39, 127, -83, -139, -116, -44, 20, 170, -203, 113, -74, 42, -98, 90, -67, -82, 108, -83]
7894h3P8J08Pr8k55O8J61O7J23k95M75k79j45L9J74k33M84l56K01j56P0k42J86
7917I9l67M74j74q7kJ59J60n2k12j09J51l05J87J63m4p0J34o6m0j82K39M8m3N1
7941A12j63Q2J87j30q8o9J58k56N7L04k03K61k77m5j87K84j00R7j4J66n5l23P3
7964a29KK6p1K33R8J18j31m0J2o2k71j5J18RM26l5m38J43J69k50J91r5l15N14
7988B07k45J57l54J10JL18l85J22L76m16K40j24O5j1kO7j62J7L12j56k24m6M03
8011B70l11K76l61J95l5p2J88j65K3k92L48l01L66k28q0M0J92j01k0j35J48j45
8033b00J61j26P4J5n0L2K28j0O6j49J02k70L00p7K51l02Q7lk67M68k66j07q3o9
8057a95J80K04k88O0l83P13j45k02K3l6j10J58o8J27J20j65J60k57l2J20R1J34
$$ y = [-83, -5, 103, 110, 12, -243, -175, -14, 53, 176, -119, 356, 77, -68, -29, 145, -88, 396, 40, 241, 85, 155, -87, 99, -268, 206, 32, -55, -57, 102, 262, 210, -2, -111, 40, -265, -78, 85, 41, -29, 105, 39, -1, -183, 56, 104, 61, 112, -51, 31, 218, 88, 0, -69, 89, -167, -110, 194, -9, 252, -25, -70, -257, 27, -73, 24, 10, 176, 121, -202, -129, -127, -101, -172, 61, 159, 277, 146, 106, 118, 56, -215, -230, -112, -103, 323, 288, -150, -7, 162, -88, 103, 8, -307, 207, -38, 119, -235, -125, -124, 194, -191, -69, 307, -109, 131, 7, 72, 61, 59, 126, -36, -19, 293, 137, -87, -133, 270, -41, 235, -126, 69, 34, -38, 150, -15, 8, -284, 64, -237, 129, -99, -179, -139, 53, -48, -68, -203, -55, -200, -39, -165, -91, -76, -126, -94, 134, 124, 190, 41, 143, -127, 173, 96, 347, 45, 132, 129, -138, 330, 64, -43, -126, -195, -15, 189, -99, -39, -422, 291, 146, -56, -33, -69, -179, -21, -89, 38, 158, -7, 153, -104, -136, -16, 75, 209]
8079B09j35m97K03J39K02l4j05KM3j70j4L61j68m5j27P6K41ml22J60J31k80R6
8102c8K9K12j74J57r6k52o9N02k74o5Q2p1J14j43K69l44K29J36k48J64l4Mk2m04
8126c36L58K84k60J42p8j07J9j35K27j92J22j56J09k23Q2L15k72p0L19k80K47
8147A15k32%M4lO4K3k12n3K75L1j37J93j15j05nK96K0m87L13j05L23k05k0J26
8171A44j56j42L10l20k58N94K5k70j38K16R5j66J41L06l21j23j0J98J1k31
$$ y = [209, 74, -423, -220, -81, 121, 87, -18, -16, 27, -143, -157, 204, 36, -9, -136, -60, 181, 177, -145, 15, 146, -134, -38, -9, 203, 29, 186, 90, -162, -231, 271, -3, -68, 14, -57, 57, -86, 183, -161, 68, 204, -44, 120, 86, 90, 68, -336, 22, 306, 46, 188, 110, 3, 22, -113, 114, -78, 44, -112, -3, -226, -144, 171, -101, -171, 148, -132, 115, -117, -117, -73, -76, -12, 11, -201, -254, 21, 52, -85, 108, -7, -112, -117, 179, 199, -288, 25, -80, 243, 38, 18, 144, -12, -154, 156, -164, -422, 172, 197, -73, -211, 5, 100, -66, 75, 381, 60, -63, -73, 125, 136, -95]
8191i5
$$ Imaginary data points
##PAGE= N=2
##DATA TABLE= (X++(I..I)), XYDATA
0@%%%%%%%%%%%qJ6j6J6k4L2l2M0n0N8p2Q7j03J20j38J59j85K16k48K81l20L66
33A95m14M66n25N90o60P38q24R16j017J130j254J386j529J688j863K053k262K491
51A305k743L025l339L691m086M533n050N650o356P203q241R549j1256J3587j6976
66i504K2375l2336N6627k21197k75116O00862K76697l22574j6938K67485j94454
77A51927j53574J71597L4843l11668l1456K25244p2381j13100J30996Q7692j16914
88C206j18269J50904L2423j98401k355Q7291n7512o4104N6917J36391k8443r0748
100i2700R1888P2363j6788M3368k558o4347j9527O4682M5205j33317q3390J26362
112C1241L3746p3451o718K9150K9914l1646l3954K8518k8888k2545L3071j6718
$$ y = [0, 0, 0, 0, 0, 0, 0, 0, 0, 0, 0, 0, -8, 8, -8, 8, -16, 16, -16, 24, -26, 32, -40, 47, -56, 64, -74, 85, -100, 116, -132, 149, -171, 195, -219, 247, -278, 312, -348, 390, -434, 482, -535, 595, -659, 727, -802, 886, -977, 1076, -1186, 1305, -1438, 1587, -1752, 1939, -2147, 2386, -2664, 2986, -3370, 3833, -4408, 5141, -6115, 7472, -9504, 12871, -19465, 37162, -184035, -459151, 141711, 418408, 95834, 78896, 346381, 151927, -1647, 169950, 204793, -106875, -138331, 86913, 14532, -98568, 32428, 120120, 3206, -115063, 35841, 68264, -130137, -132492, -45201, -102713, -166817, -109900, 26491, -1952, -92700, -812, 71551, 54763, 98131, 95573, 31226, 11699, 76381, 121586, -11731, -95121, 31241, 64987, -8464, -15182, 13968, 43882, 12236, -21718, 6800, -22088, -44633, -11562, -28280]
124b8280j8926k348J8525L5134m3823k2590M1206j7196Q248M7648L138m805j33
137A5798N0860M3596n9102k5295K1377j5431l120j9469k3190L736j4200P564J544
150a5332j9723M0141J4885l2485j2998k903L4518m628p6521k420L3773K437J8707
163b2549J6518J9689M93K507O7263P636n5912J408k234j0454N98k4784j2075k5888
177c7784j0395M7894k259j9559J9156N095J5635p288k7131J5324j3340j9153J0843
190b2962j3586J3634J9941j1066J4281Q063J5612K3649k8639r92J5601k5125L723
203A2134r80j9572P52j0762J2526J1565k2874J0228N743k575K2541j5596j0426
216g296R532j6401Q278K219k0591N619J455J3737R555k2653J8976J9191j6139
$$ y = [-28280, -47206, -49554, -31029, 4105, -39718, -62308, -21102, -38298, -30050, 17598, 20736, 15931, 15798, 66658, 110254, 51152, 25857, 47234, 31803, 28683, 9214, -13976, -10240, -24440, -16876, -15332, -35055, 5086, 19971, -12514, -25512, -28415, 6103, 1475, -75046, -77466, -43693, -41256, -22549, -6031, 13658, 14151, 16658, 83921, 91557, 35645, 37053, 34819, 24365, 24963, 179, -11896, -37784, -48179, -285, -2544, -22103, -2947, 2148, 17783, 10495, -16636, -1312, -14652, -33805, -22962, -36548, -22914, -2973, -14039, 242, 8305, 23917, 47566, 18927, 17935, 33536, 8411, 12134, 11154, -8418, -7666, -18428, -5902, 5663, -17211, -6983, -1240, -3815, 18726, 3130, -7296, 2236, -14165, -5887, -3668, -24259, -18640, -17185, -3448, 6107, -16546, 2430, 21621, 5482]
229E482Q318l94k124R309j3652N038r31j7158J3114q843j1048J3689j1182L995
243f387O859j0671J6870m225j1563J5888q866k986L064q514J1795j2174q503K5905
257F492r832l767J6314q374O326K108j514J0212k1537p28J7675j6117j123j136
271e001n561J8893j0428n346J7928q603K160J606o213J1647j3425n180J5445j6258
285h336R23Q587j0933R829l256l430J3901r993L256N544j0589J1425n414p664
299f150J4289j3822j473J2453q604N641k906l624J5946r345k319P882j0444J0378
313G902l903j3674J4946p497o719Q953o790O403j897o581J4563q744l782J2992
327F172j0803N155L441j0209J1505l874m695J0667p515N533K979r079J2394o650
$$ y = [5482, 13800, 13406, 11282, 20591, 6939, 11977, 11046, -6112, 7002, -1841, -12889, 800, -10382, -6387, 472, -10199, 6671, 2446, -9117, 6771, -2095, -5081, -2017, -10531, 1264, -10910, -19413, 6492, -3340, -7107, 9207, 833, 7159, 9267, 7753, 17965, -3572, -4300, 13375, -2742, -3865, -5001, -10562, 8331, -2097, -7443, 10485, 1882, 4042, 5648, -565, 11082, -2343, -7523, 7922, -8336, -7413, 1174, -9759, 70, -3186, -6616, 7285, -2708, 548, 6092, -4497, 6928, 1514, -6150, 8139, -5683, -7156, 5297, -3307, 2334, -572, -4196, 11750, 2405, 86, 7968, -2476, 7902, 3999, -9675, 5271, -2226, -8945, 8, -6782, -379, -2276, -8857, 5706, -3038, -6820, 6172, -4631, 524, 3965, -6244, 5261, 1387, -3308, 7359, -156, 5377, 8356, -723, 11671, 5021]
341E021p960J1525j0804o4M825j1017R667o16p486P370p810M303K862j5707J1229
356d662J452r930J1453l042K291R170p917J0248K271q655P999p410L54N523j5751
371f606Q634O333j2440Q595o10j410L985j0842P785q43j5083R933k198o389O404
386d752p399P389N192j1490J1354K709m030P976o679N643L122j2166R316k164
400D021q421J0999n658J145P629r852M840j28m999M653j1576K092O896j4658P630
415e387N127j0187O179j483K143M350r362R515K234q325J1990j796j150R495q632
430D711K870K568r019M424p194k423R718r745L584O143q312N348m826l595P763
445B015j2474J400Q123r149M016o61j536P354n960P789Q634j0141J0537L384r062
$$ y = [5021, -2939, 8586, -2218, -2282, 2543, -8474, 1193, 577, -6909, 461, -7349, -3046, -184, -15891, -4662, -3210, -13140, -1687, -4729, -2438, 6732, -1185, 9063, 11334, 2679, 10678, 3268, 3622, 9145, -6606, 2028, 8361, -4079, 4516, 3906, 2496, 6481, -4361, 3424, 2581, -12502, -2569, -4767, -11156, -4752, -12151, -4762, 430, -11060, 294, 3003, -1027, 6949, 270, 5913, 9035, -3131, 6185, 4021, -4400, 6599, 941, 2086, 9715, -137, 4703, 4575, -424, 4229, -7347, -5255, 1641, -13017, -5387, -260, -10447, -4268, -5751, -3608, 742, -8620, 895, 3129, -5196, 6794, 4998, 3848, 13343, 4711, 7581, 10149, 1130, 5554, -1640, -4063, 5655, -4090, -506, 5637, -2675, 2673, -2153, -5748, 2015, -10459, -9059, -936, -10085, -6069, -6730, -8266, -912, -6872, 917, 9551, -590, 9947, 13331, 4269]
460D269O909n352m948J772o021O260m621o323J4398p510m829J2275n990n99k6
475c36k270P373j0486k196J0615r873J081N384m308Q509j869n01Q475r701J593
490A490L059q737O375l446m841Q607l814L605J935q223Q473l119n677J2722m655
505C754n625L912l705L601q389n548J0420q175J217J3092m612L206J682m111O483
520G202n413j035L998q442P728K251r487P408l344m976M502n064L488r68o917
535i069J2836q70n064P582n608O66O02m474Q037p397o428J3207m187j223M086
550B696o775K633j004J468P742j0633K818P369j1556M432M393r005J136J260Q059
565E033K188q856J2005j53j3894Q165m79p564J09k126O976k691n461J1132n815
$$ y = [4269, 11178, 5826, 878, 2650, -3371, 2889, -1732, -8055, 6343, -1167, -5996, 6279, 289, -310, -336, -2606, 4767, -5719, -7915, 2700, -7173, -6092, -708, -5016, 3493, 1624, 1123, 9598, -103, 1490, 4549, -4188, 2187, -1259, -6100, 2507, -1307, 2298, 4233, -3990, 4483, 1364, -4313, 8409, 3754, -1871, 2041, -1664, 1937, -6452, -12000, -1580, -9755, -8538, 4554, -58, 3148, 4830, 719, 7202, 1789, 754, 4752, -3690, 4038, 6289, -3198, 4210, 866, -4110, 392, -4672, -1184, -2152, -9069, 3767, 2897, -2167, 5415, -193, 473, 1075, -3399, 4638, -2759, -9187, 4020, -167, -1390, 2696, -4079, -1446, -2450, -982, 6760, -3873, -1055, 6314, -5242, -810, 3583, -5422, -4286, -3026, 5033, 7221, -1635, 10370, 10217, -3677, 4488, 4009, -3555, -3446, -5572, 1404, -1287, -6748, 4384, -1431]
580a431n057J0194m094J3J316l812M995n869k419N840r685M680J0227m996L875
595C777J817R87L053r625N150J869j4659O299N989o037J784k973L200N1q330Q047
611C99k612p460J1349j903k463M859m813K567l14j733O584p829K244J0492r020
626C47J582M456p153J083j326M444K922j2186O475O327r152L639p03n207P08m057
642g801P151J552q687P905j15m502Q677l736l545P29j599Q463l549l114R315p311
658a67j156R112n066j235j101P85N782q058J606N733j1310J998M943m664K169
673f29m177K261N376p137L695L38o703O960j592j582N909m471K566J496m080O834
689E064m477l690P989l785O07L112m509L610m199p00P011q991j02N522n812K525
$$ y = [-1431, -6488, 3706, -388, -375, 941, -2871, 2124, -3745, -6164, -324, -10009, -5329, 4898, -98, 3777, 5594, 6581, 9634, 9, 5159, 7028, -7631, -1332, 4657, -1380, 404, -2569, 631, 682, -7648, 399, -2213, -9673, 1676, -227, -2690, 2169, -2644, -77, -391, -2124, 4460, -3369, -1125, 9367, 347, 1929, 6385, -768, 315, -1011, 3433, 6355, -5831, 644, 6971, -2181, 1458, 755, -4452, -3744, -7801, -650, 902, -7785, 120, 5, -4497, 4180, 444, -3101, -2372, -3971, 4492, 943, -2171, 7144, -167, -1323, 7789, 2723, 1488, 387, 1172, 6954, -1104, 502, 6235, -5075, -3077, 1866, -2798, -629, -4806, -2545, 2831, -4306, -611, -273, -6976, -16, -1608, -3190, 2719, -1752, 814, 2310, -1770, 5064, 587, -3103, 4886, 1101, 1708, 4820, 311, 3921, -278, -978, 6033, -2958, -3060, 2462, -3350, -825]
705h25k30k735L679n451K896M382o665N572O07m400P621l054k318K769l039M952
721C761k035m892P894l688k458O409m209J258p11l693P030m210l704M844n317
736c721J302J848m698M727l412j411P589m527J674K472m786N544n53l225M843
751C666m417J622K076m881O167k201n291O946j994p98K404m292M010j723m052
766b758N507n653j737M341m879L607J177m286N396j669K97M063n148L365J002
781B625m846N278k597k867L804m563L787J839n055N418p97j898M636m630J900
796B034N92o115M848j646l928L775l651J728L527m844N574k02l018N167m056L35
812A20K129o322M280N94m419M757k447O33L777m395M409M8l908N267l521r34L165
$$ y = [-825, -1055, -3790, -111, -5562, -2666, 1716, -4949, 623, 1230, -3170, 4451, 1397, -921, 1848, -1191, 3761, 1726, -3166, 4728, 1040, -1418, 4991, 782, 2040, 1329, -2364, 4666, 456, -3248, 1596, -3721, -2419, -571, -5269, -542, -3954, -5365, 2224, -2303, -629, 1843, -2943, 2601, 2048, -1177, 3666, -751, 871, 2947, -1934, 4233, 2032, -3259, 3687, 1693, 895, 3299, -993, 3017, 1294, -2758, 2749, -2904, -4641, -300, -5179, -1572, -395, -4681, 715, -954, -657, 3406, -1742, 1623, 2625, -2221, 3057, 460, -2407, 1397, -3166, 621, 2460, -2595, 2823, 2026, 128, 4764, 134, 2034, 2626, -3489, 1359, -287, -4215, -440, -4091, -2363, 1164, -3680, 1894, 1692, -1326, 3841, -215, 120, 2249, -4073, 207, 801, -3618, 1139, -1308, -675, 3102, -1293, 3116, 3164, -744, 4523, 1002, 68, 3233]
829C233n998J809J232m542L809j877l21M176m828L630K151n105M396j770j788
844a793M211n050J340K586m846M055n21j391N234m603K266L800n693L333j36k902
860a10L364m554J86K783n503L120L46l112M963l360P34M290n232K651L69l907
876b972L491l781j84M278m727L101K515l112N154k238n47M285n066J899J758m890
892a036K653k048j476L896m796J840K594m907M233q92k819M075l212N21K014l574
908b934L873j657k658N855m195j28M472l629L061k42j745M070l466L04L078n095
924a036K919L28l801L813l047j393L277m982K666J108l988M936j646j739L581
939I96l763J517J127l795N201j759j738N689k391Q30J684k790L845k842k079M732
$$ y = [3233, -2765, -956, 276, -4266, -457, -2334, -2655, 1521, -3307, 323, 2474, -2631, 1765, -5, -1793, 2418, -2632, -1292, 1294, -3552, 503, -18, -1409, 3825, -778, 1488, 5288, -405, 2928, 2792, -110, 3254, -1300, -1114, 1669, -3834, -714, -368, -3480, 1483, -1877, -1143, 3147, -2085, 566, 935, -2972, 519, -3262, -3446, 832, -3895, -794, 1721, -1391, 3763, 1525, 978, 5263, 197, 2096, 3854, -1036, 1617, -431, -1907, 1989, -2807, -967, 1627, -3280, 953, 61, -2758, 1317, -1895, -1374, 640, -2934, 939, -718, -3376, 2479, -1716, -1844, 2628, -1001, 2060, 1818, 73, 4143, 677, 981, 4059, -1036, 1883, 2211, -1590, 2223, -824, -2217, 1060, -3922, -1256, -148, -4136, 800, -846, -2585, 996, -2767, -1250, -123, -3918, 1283, -476, -2214, 3475, 1084, 1914, 3598, 808, 4653, 1811, -268, 4464]
955D464n026k78L320m240K113l09k520L174l548J274K493n382M196O13m537M108
971h5o69r46K276l027M491l32l890O381k612k648L925k679J615j78k590N342l441
988I33j956N022m855J49J114l343K741k160n68L999m952K324K809m395L626P3
1004E61j505K972k213K010Q22n073M233r79l729M752k022o7K850k453K993j833
1020A319k750M489m479p39M347m030R13O96j761K607l887Q56M136n110L412L371
1036C390m250K559j486l84J589m678L459J112m440N008J87k637L586k003J099
1051B111k13l428M569k684k847N383l707j489J455j556J805j587J35N731n552
1066a874K252M495o181O61J859k552J989l822J843K746m894L624J924k832L007
$$ y = [4464, -562, -840, 2480, -1760, 353, 44, -2476, 698, -2850, -1576, 917, -4465, -269, 344, -4193, -85, -754, -1700, 576, -2451, 2040, 1708, -2182, 4199, 1587, -1061, 2864, 185, 1800, 1622, -968, 4374, 933, -1023, 3999, -856, -707, 407, -2936, -195, -2355, -2923, 1076, -3876, -1552, 1257, -3138, 488, 561, -944, 2028, -185, 1825, 2647, -2426, 1807, 828, -2901, 1851, -171, -238, 2612, 159, 3152, 1319, -1431, 3058, -1421, -2160, 2187, -1843, -930, -234, -1995, 612, -3275, -2419, 1717, -3393, 19, 3390, -860, 1699, 213, -171, 1418, -3260, 199, 1311, -3129, 1879, 2066, -571, 3015, 1012, 2111, 1898, -1530, 3039, 355, -2492, 2891, -816, -2305, -850, -2406, -601, -2188, -2053, 3678, -1874, 378, 4873, -1308, -647, 1212, -1340, 649, -3173, -1330, 1416, -3478, 146, 2070, -762, 2245]
1081B245j333n53K911l077K613k67m059K910k637k530L594k589K302K68j122M039
1097B715l370k42M859m574n05K498l338O23j339P01K583l571K010L120m095L734
1113A809J882k215K438k186P73m7n251L305p68l925M615j011n61J967j582K690
1129A933j150k414M211l296j811L477l664N17O07k152L252j595Q34M392l153K235
1145B223K761l698K236j226j922J063l305J860L92m451M360N51k590K867j308
1160a87O99O82k817L416k219l198M003k915j263K057k141K899L06l61M803k615
1176A149P64L495m076J403j71l195K191k333m00J875l208K649O30l018L695p65
1192F85j113K090k580J180l56m059K952j759j664L944j715J400K300j375L841
$$ y = [2245, 912, 359, 3270, 193, 2806, 2539, -1520, 1390, -1247, -3777, -183, -2772, -470, -202, -1324, 2715, -655, -897, 3962, -612, -1117, 1381, -1957, -1334, -2673, -1972, 611, -2960, -950, 2170, -1925, 1809, 3691, 1476, 3914, 1728, 2501, 2454, -2797, 508, -260, -4185, 430, -581, -1142, 825, -757, 1933, 783, -1631, 2580, -716, -2527, 950, -2714, -2197, -1590, -3742, -490, -2085, -1251, 3141, -12, 2223, 4984, 1286, 3522, 2296, 374, 1437, -1868, -8, 384, -4067, 293, 844, -1746, 1121, -187, 512, 1194, -1623, 1793, -426, -3624, 379, -2536, -3799, -1742, -3883, -984, -678, -1039, 3764, 1149, 1913, 5408, 1332, 2735, 2564, -631, 1560, -773, -1173, 702, -2506, 143, 773, -2245, 1450, 685, -428, 1662, -918, 262, -94, -4153, -1201, -2960, -4624, -680, -2395, -995, 1305, -70, 3771]
1207C771j213r66L115l632L08J747l826J562q26j841K744k980J594J898l442L245
1223A258L59k770K474k367n53J126l513J993j79k325L999q73L61L344j894K341
1239B781P18k095K868k266j864K676l542L12Q40k476K500j214l86L199l090J101
1255F2J813l322J875j505j190J460k795O73K219k922L117K05m74L539j532O56
1271A879K278k873J460n67k033K023l223L12J994k846J396Q47j931K996j688r6
1287g2J729l363J243R2k584K192j903n18K899k792K173J994j979L234m04o00K356
1304C697k798R61P90l404K066j100k061K956k420Q16J767k276K495o55j682K459
1320A611k919j05R90k768J802k6j669L051j299L21K715j997K442J37j932K616
$$ y = [3771, 2558, 1592, 4707, 1075, 1383, 3130, -696, 866, 40, -1801, 943, -2037, -443, 1455, -1987, 1258, 1617, -1153, 1321, -1046, -1599, -473, -3986, -1993, -2172, -4497, -498, -1371, -1010, 2334, 440, 2781, 3499, 1404, 4272, 2006, 142, 2818, -724, -412, 428, -2048, 452, -762, -1148, 2051, -1039, 62, 1875, -1447, 428, -1077, -2267, -807, -3602, -2929, -710, -3632, -515, -310, -784, 2755, 1223, 1879, 4157, 1284, 2744, 2177, 144, 2167, -1056, -744, 1250, -1596, -200, 647, -1284, 1712, 24, -72, 1657, -1706, -463, -371, -2955, -763, -2666, -3184, -285, -3077, -904, 1090, -889, 2345, 1941, 1341, 3697, 899, 1860, 2650, -754, 1312, 212, -1849, 1107, -1313, -497, 1270, -1006, 1489, 834, -848, 1611, -1308, -1413, -423, -3191, -1389, -1415, -3084, -33, -1332, -1011, 1704, -293, 2149, 2286, 354, 2970]
1336B970k216o67K204l212J275O75k478K764j214r40K764k490J176L28k240K410
1352A109j872j460K224k968R77J362k443K844n06o29L165k052J094J564k287J997
1368B119r38j687K419k178K87J169k505K479k42j894K874j955j39J426k640J290
1384a15J45k534K231j728l22K173k192K007M04j630L066j087m96K355k326J352
1400A303K22k313K373j179r26K449k646J303R04k615K692p62j630K109k241N11
1416d46J89j918K216j176j503L141j936R0J861j818K231m66j122K386j940L93
1432A82J733k571J704K16j724K179j715M2J679k592J664K35k186K035j285q01
1448a205J568k168J389j14j845K648j061q26K219j591O78J041j584K249j727l29
$$ y = [2970, 754, 87, 2291, -921, 354, 1029, -1449, 1315, 101, -839, 1925, -565, 611, 939, -1301, 1109, -763, -2223, 1, -2967, -1990, -628, -3071, -227, -733, -1362, 1803, -249, 845, 2409, 122, 2119, 1181, -506, 1913, -265, 22, 1191, -1314, 1165, 923, -971, 1903, -52, -191, 1235, -1405, -115, 30, -2504, -273, -2001, -2323, -150, -2342, -335, 69, -1561, 1505, 418, -78, 2277, -49, 1303, 1525, -788, 1585, 406, -520, 1929, -717, 586, 1490, -1125, 1567, 805, -825, 1284, -957, -446, -257, -2175, 41, -1135, -2638, 503, -1433, -1343, 518, -1300, 931, 465, -657, 1729, -211, 182, 1915, -656, 1048, 1264, -460, 1719, 4, 46, 1725, -867, 797, 1032, -1154, 881, -404, -1205, 363, -1805, -416, -530, -2375, 273, -788, -1614, 605, -986, -308, 733, -851, 1398, -329, -658]
1464f58K758k335N86J804k107J415p57p68J853k386Q13J392k736J665k17j650
1480a328J983j826j10J431k436K165k16j944K592q62n63J553j524J503L42j475
1496g15K962j816o26K375j934L85M91j358J763j839J21J944k967J115J254k530
1512a375J330j71p38J258j853J093M73k544K417m57j355K452j137O48R65j304
1528b98J928q42q41K265k129l4J712j922R59k60j064J738j681m8J874k868J645
1545A34P02k039J249j198L16R38k413J593Q61k028K441m41o12J723j489J551j75
1562A113j708K422r82j032J959j728j18R29j691J581p45q68K239k099L97J331
1578A000k245R98k64j166J479j608P72J399k377K073M52j486J795l60O6J083k065
$$ y = [-658, 2100, -235, 351, 2155, 48, 1463, 706, -62, 1791, -595, 218, 1610, -1126, 539, 322, -1328, 655, -1171, -1281, 150, -2286, -121, -337, -2281, 311, -551, -1114, 439, -1085, 418, 760, -715, 2247, 431, -195, 2180, 246, 631, 1122, -236, 1527, -312, -191, 1753, -1214, -99, 1155, -1375, -45, -216, -954, 304, -1549, -456, 17, -2527, -110, -567, -1922, 530, -607, 41, 1006, -298, 1630, 788, -53, 2212, 83, 49, 1761, -161, 798, 538, -526, 1212, -469, -517, 1357, -1511, 134, 836, -1203, 46, -1152, -836, 102, -2311, -718, 143, -1885, 556, 115, -497, 1226, -263, 1288, 1113, -595, 1827, 845, -187, 1772, 44, -74, 855, -836, 745, 0, -868, 1371, -728, -331, 1000, -1245, -247, -511, -1677, -198, -1806, -1034, 365, -2012, 61, 513, -973, 822, 462, 528, 1611, -454]
1595d54J852n8k031K317j259r51J669j513Q27M7q77K016j580o50J747k278j66
1612a342J278j441P49m83J0J441j680R30J463j932J686J35p73J334r77K37N61
1629A196j839J616m22j081J833j121J12J001j423J010n25j479J979j689l62J068
1645a26j066L67P5j181K486j836M68J911j856R66P88j087J191q26m36J380k014
1662g96J353M29j647J969n30j071J564j220L08J6j435J480q79j165K023j834j11
1679a546J259j507J600m80l93K197j533K28J357j679R17L43r21J618j697N07J125
1696A395j905J298K98j474J579r74p6Q87j735R44n6j822J557r39p05J577j046
1713a197N70M38q98J473o53k33J723j488J60J270j471J214k42r09J499j181N22
$$ y = [-454, 1398, 1340, -691, 1626, 367, -584, 1085, -428, 399, 446, -431, 1585, 5, -645, 1102, -1176, -1342, -64, -1505, -756, -1239, -1229, 212, -1468, -538, 925, -1007, 679, 814, 41, 1375, 398, 635, 1196, -643, 973, 551, -530, 1303, 182, 294, 1295, -128, 882, 357, -1122, 857, -832, -1194, -126, -1192, -825, -750, -1931, 555, -1281, -813, 1098, -758, 208, 996, -91, 1100, 274, -162, 1218, -796, 557, 986, -661, 1308, 778, -293, 1271, 51, 359, 375, -1060, 420, -459, -1624, 399, -1435, -1546, -287, -1794, -194, -674, -1067, 1130, -403, -175, 1182, -497, 420, 763, -158, 1460, -237, 270, 1395, -510, 788, 1086, -388, 1191, 217, 141, 1028, -707, 237, 181, -1641, -84, -1023, -1728, -151, -1197, -627, -189, -1087, 386, -267, -500, 1223, -265, -105, 1165, -306, 908, 666, -243, 1256, 75, 597]
1730E97P56j730J367m1j483J492j500L37M01j793J332o6j265J544o56j35J018
1747A75j176J152j7j176J796p59m35J442j617J042M71j208J586r11k61J527j653
1764b2Q98k12j419J584q08r27J350j359L92O37j528J626m27j175J552j198N47
1781d89Q18j600J588N31j255J389r08K60P02j076J363l45r95J382j073l18J258
1798A232j596N14J19r78Q73n89l90J110j679J112O2j329J686l99q29J930j717
1815h68Q63P85j376J639n12o27J321j055O01L17j474J073j44m43R71r84J54L49
1833E90j523J188l91j145J707j551O9J033j412J362m19o07J494r06J69J093j277
1850e26J009J12j108J450p18l23J234j179P11K26j083J391j087n08J414j510L34
$$ y = [597, 1353, -377, 990, 949, -534, 958, -542, -205, 196, -1597, -265, -331, -1596, -52, -708, -843, 175, -1001, 151, 134, -1042, 754, -5, -440, 1002, -615, 427, 898, -310, 1276, 365, 104, 1631, -22, 876, 664, -755, 829, 21, -906, 444, -915, -523, 114, -1414, 212, -215, -1390, 162, -1036, -489, 329, -1271, 317, 848, -407, 982, 74, 334, 1036, -40, 1323, 978, -17, 1365, 292, -26, 1232, -364, 150, 269, -709, 164, -425, -815, 295, -1384, -272, -210, -1539, 147, -252, -1081, 849, -868, -5, 780, -596, 1043, 531, -96, 1225, 170, 771, 1088, -386, 687, 543, 100, 1071, 87, 241, 590, -933, 255, -136, -1281, 426, -1125, -1056, -23, -1435, -73, -492, -1099, 395, -511, -342, 751, -526, 483, 595, -513, 937, 219, -104, 1130, -49, 662, 888, -195, 1196, 109, -399, 1015, -495, -161]
1867a61N62j308P43n01m37J145r60L76N55j569J782l89m12J616j302K01R10j069
1885b18R02j57o39J385j585O15J018j682R43j62q61J197j078n25J452j630R82
1902d3j75j152J427r61O5R63j044N01O55j190J401l88k79J078j235O38M00q73
1920b12J259o94l34J315r71M1N97j233P49o37l91J063j226K85O55j561J199n14
1938f10p99J631q54O9R47j142Q74J30o51J213q64P1R07j316J095K45j046J286
1956A186q57J23O38j349R49j97j490J491o61o19J155j441P15M2r38R80m13k58
1974i44J272j159R59N44j417J217j36n85J096r29N79O53j152Q03k24n79J021j074
1992e5R6Q26j468O82M0j117J587j506K30J028k134K976j315j160K106j221k7J191
$$ y = [-161, 401, -907, -164, -665, -1102, 43, -917, -541, 14, -1555, 227, -162, -574, 1042, -260, -59, 851, -218, 684, 527, -112, 1273, -312, 303, 1321, -361, 582, 420, -441, 756, -322, -847, 605, -1025, -43, -218, -1370, 57, -904, -839, 124, -920, -419, 236, -954, 447, 59, -220, 858, -377, 261, 661, -212, 1047, 353, 19, 1334, 363, 404, 1001, -232, 517, -120, -511, 552, -674, -389, 266, -1295, -96, -610, -1409, 222, -632, -563, 384, -758, 116, 246, -405, 808, -56, 15, 922, -394, 701, 946, -100, 1186, 329, 452, 1090, -259, 690, 493, -997, 494, -167, -786, 369, -1072, -357, -315, -1253, -273, -686, -944, 328, -831, 128, 672, -745, 472, 336, -249, 847, -82, 497, 1150, -2, 801, 577, -2, 1019, -55, 41, 867, -601, 81, 121, -996, 591, -915, -685, 343, -1791, 1185, -130, -1290, 816, -405, -432, 759]
2010G59j243R39K79p93R41q10kQ36j147P95N58j445J266l40n60P78j415O94p4
2029A6r83P70j57l77Q63j026M60M03j063J350l00n92J325j147l0J016j095J270
2047G03J85r78J143p66m60J703j618L92K81o46P25o46l94J098k154J240K03j064
2065a053J255m93m94O74q79L23O44j078J615n13r74J464o99M69J51n80Q67m26
2083B73L32N70n52o22O78r68N63k06j051J369j293L50J495j724M63L12q62O97
2101a76n92k53J177j308J611m22p41J558j310o2J279j146M23K20p51J016j24k52
2119A47N21o76L32J045k179J626j025j118J095q00M85L81j550O60k2L06J001n42
2137c13m25J183j503J541K2r16J335j597J020M57j216J764j056n31R50m70o20
$$ y = [759, -484, 455, 734, -59, 882, 72, 70, 906, -241, 554, 1112, -333, 933, 593, 33, 811, -604, 90, 16, -967, -197, -354, -731, 132, -894, -434, -31, -1094, 256, -44, -636, 689, -458, -488, 528, -567, 703, 888, -90, 1053, 287, -173, 1530, -88, 304, 585, -61, 664, 18, -376, 722, -1432, -192, 11, -1053, 202, -291, -785, -111, -990, -667, -23, -1101, 514, 1, -973, 491, -208, 261, 412, -168, 699, 273, 605, 1175, 623, 1, 679, -289, 274, 68, -983, 386, -907, -557, 938, -786, -323, -11, -873, -176, -768, -1021, 156, -1152, 459, 37, -704, 854, -456, -518, 761, -385, 38, 258, -493, 523, 399, 147, 668, -8, 324, 1369, -810, 816, -209, -1327, -232, -1032, -547, -166, -1716, -1056, -1078, -772, 229, -313, -738, 445, -1058, 483, 505, -411, 924, -673, 347, 804, -412, 1352, 296, -235, 715, 245, -375]
2154c75J386j573Q57k70p39J236j000QM39j093J153l15n88R38l71k2J060r67L68
2173A32M7m99R34m61l22J200r81M10O10j402J123n00m96J042j281N22j3r30J135
2192B70o94o62J331j142KR64r27N15K12m45Q59p88L98R09j435Q93K56j052J484
2211I48q60J8J008j229O03J99j118J171p49l26P46q37K94J81j285J241j046j00
2229a141J267r50N29K28r05J339k88l62N95o59K02O41o67P56O7n25J150q32M88
2248I33M70j041K92l14n45L51r63M48O90q34K31O09j786J697r48k4QJ165j484
2267a045J310q17P94N8l50J41j431J541J55o09J113m7p8P46j643K95L92p14k91
2286d80K20n20J590j069J11m99L38q3r7n9Q80r29l1P10j076P23J13K2N37l41l24
$$ y = [-375, 1011, -562, 295, 25, -714, 522, -478, -470, -31, -1124, 29, -286, -874, 64, -307, -329, 731, -236, 132, 179, -320, 614, 153, -169, 1031, 50, 460, 1070, -332, 791, 291, -205, 837, -444, 78, 65, -865, 270, -424, -1086, 245, -897, -895, 69, -858, -343, -131, -576, 283, -505, -107, 802, -633, 260, 516, -536, 948, 88, 106, 1114, -115, 488, 687, -431, 740, -9, -335, 411, -426, -132, 49, -1236, 5, -1041, -1141, 126, -824, -295, -67, -972, 367, 79, -283, 312, -347, -145, 496, -171, 585, 652, 127, 1277, 445, 933, 1403, 362, 654, 340, -205, 146, -817, -369, 321, -513, -282, 327, -1459, 238, -710, -734, -726, 439, -1045, 265, -552, 242, 300, -50, 91, -1340, 201, 356, -253, 860, 813, 735, 1481, -162, 133, 525, -189, -480, -260, -780, 810, -259, -148, -647, -309, -392, -489, -548, 332, -597, -628, 82, -994, -271, -158, -136, 401, 60, -264]
2307b64J385j472J022J29l58J95l55o23Q60o35L33q3r90Q22j045K71P49p26L25
2326d60N25j045Q23m11J08P27r09N49M48p38J208l53m92Q47n43K53M80o87L55
2345F85k24l97O02j124K7O10j100Q23r6o04J047q94LQ05q26P53l19m34J024o56
2365b95j68O67q04Q19K12n17R61o45K05P05j089L37N06j156R52p36m08M49q64
2384h69N17N55r87R11n87l65J020r93M88K42p48P87o5k25O73p03L69O43j017J160
2404H06l02l79R93p91j12P20j344N87N4p25O49l53j05M40j069J138n06m32P81
2423E0m67k0L37Jp75K18J43K77R14q50O94k23J0J159j540J007o99K98m9m94N7
2444D8M28j180J276o50o8R81j296J96O94j270J261k35r55P84m98L57l51K02N4
$$ y = [-264, 1121, -351, 671, 800, 442, 637, 282, -341, 519, -116, 217, 134, -856, -34, -1079, -808, -59, -785, -460, 65, -980, -157, -568, -460, 267, -642, -93, 355, -383, 825, 472, -20, 827, 284, 537, 1017, 330, 685, 461, 64, 666, -458, -431, 179, -921, -98, -194, -798, 249, -645, -642, 163, -663, 90, -229, -663, 361, -295, -463, 204, -600, 219, 431, -86, 875, 230, 435, 1140, 51, 388, 894, -262, 690, -46, -454, -5, -869, -352, 203, -784, 127, -460, -825, 195, -798, -310, -68, -816, -29, -94, -319, 354, -349, 20, 663, -354, 806, 504, 125, 1118, 327, 215, 935, -409, 178, 232, -493, 156, -197, -302, 138, -931, 207, -299, -731, 50, -417, -437, -100, -99, -874, -656, -513, -236, 678, -172, 522, 299, 309, 1468, -72, 935, 236, 534, 485, -9, 48, 476, -704, 572, -78, -146, 835, -461, -265, 429, -841, 420, 185, -770, 14, -484, -127, -478, -276, -222]
2463b22M01q01P53l96N96L79j161R74M76r28K39m28L23P6q27J377n75n54M32j15
2483A9o94Q46o65M91J71j225J003k84m22K02O34k23P70r26Q74j11k4J17r04O49
2503B98N33j002P09k85p75J137n68n37J040n70k35K51n96N82r0l98M02n74O42
2522c6j85l62Q60l56N7J71m98P95J54r74J073o14k41J032j001L89K58o97N47k58
2542A14l42N25q79K50P76j334J258n35o09J035p82K01j73l69O80j58J21K49J31
2561A59o7M39q44Q40k88k97O32n25j8K4p3j15M29l20J85m02m5O82p23Q2K48m50
2583d47M24o67J5O00n58J80L26k54O90l77k80P47m65K28L53n42N68l36j59Q58
2603I04r02JO52p77K39j16k91Q59p15l45N83p09K03J82m9K75l63J30K34o37P67
$$ y = [-222, 179, -622, 131, -265, 331, 710, -451, 523, 999, 71, 310, -118, 205, 281, -546, 831, 256, -298, 134, 19, -675, 171, -494, -3, 168, -1057, -54, -338, -760, -558, 76, -147, 623, -303, 571, 460, 436, 553, -351, 298, 831, -171, 538, 253, -522, 615, 47, -490, 550, -20, -255, -4, -600, -18, -108, -506, -104, -678, -36, -221, -583, 277, -79, -22, 149, -349, 446, 600, -374, 699, 85, -156, 876, -125, 264, 522, -175, 372, 114, -228, 297, -582, -332, 444, -890, 368, -167, -776, 259, -523, -322, -495, -864, -184, -342, -221, 28, 159, 92, 531, -313, 527, 239, -58, 574, 49, 31, 55, -18, -133, 296, -24, 161, -241, -286, 396, -327, -245, 3, -447, -23, -690, -675, -75, -633, -453, -127, -381, 309, -68, -348, 399, -66, 162, 515, -27, 541, 205, 46, 904, 2, 3, 655, -122, 117, 1, -290, 569, -146, -491, 92, -617, -414, -232, -281, -6, -369, -239, -5, -642, 125]
2624A25J38q36Q28j06k58O59m07L55R0n08N05m30j28N91o12K84l8q32N64k33j07
2645c56M20o30L1M64n16M90l8k76K67j98K42K65m30O93K65q41N43m56K62L81o91
2666a09Q54m77l72P77r09L60K73o59K05K64n76L91m45k59Q01p01J46L74j089J306
2686A55k34l9J85n23L2L95p33K36J103p50o36J007O39M31k172Q21L32m10J54J30
2706A23k69m93J151n76m04j088J021L01J000k61j027R06l41l62L65j077P84M24
2724A77K72p47Q71n81P47l06l44P58p59K68O07j740J150k4r80P10m26J76M2r5
2744b24L35j038O81K5k81K30O51r29M12k24O67O04r52L96M5o25Q24L11o60J20
2764C68j69O6J89j78p95J132n93L76m29J34q26N6R55j8p08r2J13O5km50J395r1
$$ y = [125, 263, -573, 255, 149, -109, 550, 143, 498, 588, 80, 585, 155, 27, 618, 6, 290, 252, -580, -16, -249, -356, 64, -566, -535, -71, -587, -97, -135, -411, -144, -342, -100, 165, -265, 428, 693, -148, 395, -61, 201, 582, -109, 745, 268, -104, 673, -236, 124, 397, -262, -57, 207, -369, 22, -423, -682, 119, -582, -436, -62, -1151, 155, -79, -118, 67, -456, -424, -29, -762, -526, 577, -173, -809, 198, 837, 1268, -904, -83, 249, -161, -7, 123, -146, -639, 512, -64, -468, -1556, -535, -234, 766, 505, -522, 384, 43, -319, 46, -1031, -247, 177, 449, -298, 573, -8, 739, 433, 89, 847, 88, 356, 963, -777, 373, 349, -631, 79, -347, -171, -129, -224, 111, -927, -246, -221, -502, -272, 379, -550, -138, -362, 305, 909, -43, 353, 398, -227, 597, 908, 248, 368, 199, 265, 454, 276, -519, 613, 20, 396, -33, 101, -725, -669, 286, 268, -440, -532, -419, -354, -356, -806, 589, 498]
2786D98q93P52o25L58J13k24K21L36p32K91M51o75M74m73m3Q62q38N57p74l70
2806g34P27k08q3j85q8N68n12K47J53l7j72O78m71J69J64j86N8j8K04L95o31L19
2828C57r5r4K84l78j19N12q78P15m1p00M76l52k01L18l39J97J50l74N52k40l58
$$ y = [498, -395, 357, -268, 90, 203, -21, 200, 536, -196, 95, 546, -129, 345, -128, -171, 691, -147, 410, -364, -734, -7, -215, -298, -483, -571, -3, -515, -268, -115, -152, -324, 354, -117, 52, 216, 30, 88, 70, 274, 669, 38, 357, 262, 168, 452, 74, -45, 467, -411, 304, 263, -437, 39, -313, -514, -196, -535, -338, -188, -562, -10, -250, -608]
$$ [...]
8191a10
##END NTUPLES=NMR FID
##END=
