##TITLE=1H_Pr 4631-Am
 CDCl3,8 sc, 
 30.9.2021
##JCAMPDX= 6.0         $$ Bruker NMR JCAMP-DX V2.0
##DATA TYPE= NMR FID
##DATA CLASS= NTUPLES
##ORIGIN= UXNMR, Bruker Analytische Messtechnik GmbH
##OWNER= root
$$ XWIN-NMR		Version 3.5
$$ Thu Sep 30 09:26:25 2021 Russian Standard Time (UT+4h)  she@DPX200
##.OBSERVE FREQUENCY= 200.1313468511
##.OBSERVE NUCLEUS= ^1H
##.DELAY= (6, 6)
##.ACQUISITION MODE= SIMULTANEOUS
##.ACQUISITION SCHEME= undefined
##.AVERAGES= 8
##.DIGITISER RES= 18
##SPECTROMETER/DATA SYSTEM= spect
##.PULSE SEQUENCE= zg30
##.SOLVENT NAME= D2O
##.SHIFT REFERENCE= (INTERNAL, D2O, 0, 15.7039)
##AUDIT TRAIL= $$ (NUMBER, WHEN, WHO, WHERE, WHAT)
$$ ##TITLE= Audit trail, XWIN-NMR		Version 3.5
$$ ##JCAMPDX= 5.01
$$ ##ORIGIN= Bruker BioSpin GmbH
$$ ##OWNER= she
$$ F:/spectra/data/she/nmr/H-F/1/audita.txt
$$ ##AUDIT TRAIL=  $$ (NUMBER, WHEN, WHO, WHERE, WHAT)
(   1,<2021-09-30 09:25:05.35 +0400>,<she>,<DPX200>,
      <created by zg, POWCHK disabled, PULCHK disabled
       configuration hash MD5:
       00 E9 B6 7A A2 85 ED C7 34 08 36 98 17 FE 4E 26
       data hash MD5: 16K
       01 99 55 7E 4C 12 F0 4F 7B 19 78 8A 0D E3 B9 7F>)
$$ ##END=
$$ 
$$ hash MD5
$$ DE 7C 3D 33 5E 25 CF EA D6 7F 0B BE 29 A9 28 75
##$RELAX= 
##$RELAX= 
##$RELAX= 
##$RELAX= 
##$RELAX= 
##$RELAX= 
$$ Bruker specific parameters
$$ --------------------------
##$DU= <F:/spectra>
##$EXPNO= 1
##$NAME= <H-F>
##$PROCNO= 1
##$TYPE= <nmr>
##$USER= <she>
##$AMP= (0..31)
100 100 100 100 100 100 100 100 100 100 100 100 100 100 100 100 100 100 
100 100 100 100 100 100 100 100 100 100 100 100 100 100 
##$AQSEQ= 0
##$AQ_mod= 1
##$AUNM= <au_zg>
##$AUTOPOS= <>
##$BF1= 200.13
##$BF2= 200.13
##$BF3= 200.13
##$BF4= 200.13
##$BF5= 200.13
##$BF6= 200.13
##$BF7= 200.13
##$BF8= 200.13
##$BYTORDA= 1
##$CFDGTYP= 0
##$CFRGTYP= 5
##$CHEMSTR= <none>
##$CNST= (0..31)
1 1 145 1 1 1 1 1 1 1 1 1 1 1 1 1 1 1 1 1 1 1 1 1 1 1 1 1 1 1 1 1 
##$CPDPRG= <>
##$CPDPRG1= <>
##$CPDPRG2= <>
##$CPDPRG3= <>
##$CPDPRG4= <mlev>
##$CPDPRG5= <mlev>
##$CPDPRG6= <mlev>
##$CPDPRG7= <mlev>
##$CPDPRG8= <mlev>
##$CPDPRGB= <>
##$CPDPRGT= <>
##$D= (0..31)
0 1.2 0 0 0 0 0 0 0 0.06 0 0.03 0 0 0 0 0.0002 0 0 0 0 0 0 0 0 0 0 0 0 
0 0 0 
##$DATE= 1632979504
##$DBL= (0..7)
120 120 120 120 120 120 120 120 
##$DBP= (0..7)
150 150 150 150 150 150 150 150 
##$DBP07= 0
##$DBPNAM0= <>
##$DBPNAM1= <>
##$DBPNAM2= <>
##$DBPNAM3= <>
##$DBPNAM4= <>
##$DBPNAM5= <>
##$DBPNAM6= <>
##$DBPNAM7= <>
##$DBPOAL= (0..7)
0.5 0.5 0.5 0.5 0.5 0.5 0.5 0.5 
##$DBPOFFS= (0..7)
0 0 0 0 0 0 0 0 
##$DE= 6
##$DECBNUC= <off>
##$DECIM= 32
##$DECNUC= <off>
##$DECSTAT= 4
##$DIGMOD= 1
##$DIGTYP= 9
##$DL= (0..7)
0 120 120 120 120 120 120 120 
##$DP= (0..7)
150 150 150 150 150 150 150 150 
##$DP07= 0
##$DPNAME0= <>
##$DPNAME1= <>
##$DPNAME2= <>
##$DPNAME3= <>
##$DPNAME4= <>
##$DPNAME5= <>
##$DPNAME6= <>
##$DPNAME7= <>
##$DPOAL= (0..7)
0.5 0.5 0.5 0.5 0.5 0.5 0.5 0.5 
##$DPOFFS= (0..7)
0 0 0 0 0 0 0 0 
##$DQDMODE= 0
##$DR= 18
##$DS= 0
##$DSLIST= <SSSSSSSSSSSSSSS>
$$ [...]
##$SUBNAM2= <"">
##$SUBNAM3= <"">
##$SUBNAM4= <"">
##$SUBNAM5= <"">
##$SUBNAM6= <"">
##$SUBNAM7= <"">
##$SUBNAM8= <"">
##$SUBNAM9= <"">
##$SW= 18.0517286264689
##$SWIBOX= (0..15)
0 0 2 0 0 0 0 0 0 0 0 0 0 0 0 0 
##$SW_h= 3612.71676300578
##$TD= 16384
##$TD0= 1
##$TE= 0
##$TE2= 300
##$TE3= 300
##$TEG= 300
##$TL= (0..7)
0 120 120 120 120 120 120 120 
##$TP= (0..7)
150 150 150 150 150 150 150 150 
##$TP07= 0
##$TPNAME0= <>
##$TPNAME1= <>
##$TPNAME2= <>
##$TPNAME3= <>
##$TPNAME4= <>
##$TPNAME5= <>
##$TPNAME6= <>
##$TPNAME7= <>
##$TPOAL= (0..7)
0.5 0.5 0.5 0.5 0.5 0.5 0.5 0.5 
##$TPOFFS= (0..7)
0 0 0 0 0 0 0 0 
##$TUNHIN= 0
##$TUNHOUT= 0
##$TUNXOUT= 0
##$USERA1= <user>
##$USERA2= <user>
##$USERA3= <user>
##$USERA4= <user>
##$USERA5= <user>
##$V9= 5
##$VALIST= <valist>
##$VCLIST= <CCCCCCCCCCCCCCC>
##$VD= 0
##$VDLIST= <DDDDDDDDDDDDDDD>
##$VPLIST= <PPPPPPPPPPPPPPP>
##$VTLIST= <TTTTTTTTTTTTTTT>
##$WBST= 1024
##$WBSW= 4
##$XGAIN= (0..3)
0 0 0 0 
##$XL= 0
##$YL= 0
##$YMAX_a= 153538
##$YMIN_a= -230206
##$ZGOPTNS= <>
##$ZL1= 120
##$ZL2= 120
##$ZL3= 120
##$ZL4= 120
##$ABSF1= 10
##$ABSF2= 0
##$ABSG= 5
##$ABSL= 3
##$ALPHA= 0
##$AQORDER= 0
##$ASSFAC= 0
##$ASSFACI= 0
##$ASSFACX= 0
##$ASSWID= 0
##$AUNMP= <proc_1d>
##$AZFE= 0.1
##$AZFW= 0.1
##$BCFW= 1
##$BC_mod= 2
##$BYTORDP= 1
##$COROFFS= 0
##$CY= 11.3945322036743
##$DATMOD= 1
##$DC= 2
##$DFILT= <>
##$DTYPP= 0
##$F1P= 2.36226072786647
##$F2P= -0.459571619588291
##$FCOR= 0.5
##$FTSIZE= 0
##$FT_mod= 4
##$GAMMA= 1
##$GB= 0.15
##$INTBC= 1
##$INTSCL= 1
##$ISEN= 128
##$LB= 0.24
##$LEV0= 0
##$LPBIN= 0
##$MAXI= 10000
##$MC2= 0
##$MEAN= 0
##$ME_mod= 0
##$MI= 1.114404
##$NCOEF= 0
##$NC_proc= 0
##$NLEV= 6
##$NOISF1= 3.799351
##$NOISF2= 2.8
##$NSP= 1
##$NTH_PI= 0
##$NZP= 0
##$OFFSET= 15.70392
##$PC= 1
##$PHC0= -14076.92
##$PHC1= 14.60085
##$PH_mod= 1
##$PKNL= yes
##$PPARMOD= 0
##$PSCAL= 0
##$PSIGN= 0
##$REVERSE= no
##$SF= 200.130013532006
##$SI= 16384
##$SIGF1= 3
##$SIGF2= 2
##$SINO= 400
##$SIOLD= 16384
##$SREGLST= <1H.CDCl3>
##$SSB= 0
##$STSI= 0
##$STSR= 0
##$SW_p= 3612.71676300578
##$SYMM= 0
##$S_DEV= 0
##$TDeff= 0
##$TDoff= 0
##$TI= <>
##$TILT= no
##$TM1= 0
##$TM2= 0
##$TOPLEV= 0
##$USERP1= <user>
##$USERP2= <user>
##$USERP3= <user>
##$USERP4= <user>
##$USERP5= <user>
##$WDW= 1
##$XDIM= 8192
##$YMAX_p= 0
##$YMIN_p= 0
$$ End of Bruker specific parameters
$$ ---------------------------------
##NTUPLES= NMR FID
##VAR_NAME=  TIME,          FID/REAL,        FID/IMAG
##SYMBOL=    X,             R,               I
##VAR_TYPE=  INDEPENDENT,   DEPENDENT,       DEPENDENT
##VAR_FORM=  AFFN,          ASDF,            ASDF
##VAR_DIM=   8192,          8192,            8192
##UNITS=     SECONDS,       ARBITRARY UNITS, ARBITRARY UNITS
##FACTOR=    0.0002768,     1,               1
##FIRST=     0,             0,               0
##LAST=      2.2672688,     0,               0
##MIN=       0,             -230206,         0
##MAX=       2.2672688,     153538,          0
$$ Real data points
##PAGE= N=1
##DATA TABLE= (X++(R..R)), XYDATA
0 0 0 0 0 0 0 0 0 0 0 0 0 4 -8 8 -8 8 -16 16 -17 24 -32 32 -40 48 -56 65 -78 88 -104 119 -135 153 -175 198
34 198 -224 252 -284 319 -356 396 -440 490 -543 603 -667 736 -812 898 -988 1089 -1199 1322
52 1322 -1457 1606 -1775 1964 -2179 2426 -2711 3049 -3452 3944 -4563 5366 -6452 8018 -10473
67 -10473 14923 -25540 109436 5900 -161523 69353 114700 10237 -32804 27722 -30255
78 -30255 -63088 25013 26841 -83734 -22997 61878 3692 -72179 -13464 72619 11111 -101544
90 -101544 -45838 35090 19285 -19016 -27363 -7610 4826 15106 52713 20362 -28430 4699
102 4699 28102 10756 -3671 -20525 -19229 -17495 548 31875 3100 -22124 2516 14710 20667
115 20667 8073 -7656 8823 -6948 -28238 -7882 -2059 -2364 -5740 -15842 1129 16385 24273
128 24273 16773 -17465 2038 34974 7887 -1767 3698 -5788 -992 16 405 2631 -899 5205
142 5205 -13846 -16615 20617 -3383 -39618 -10115 7183 -7758 -19183 -12119 4512 -2752 2933
155 2933 14636 -7947 2674 28789 5963 -11979 -5681 13368 20923 -14339 -20371 12049 13401
168 13401 -2663 -13640 -161 20307 -1031 -5937 11938 -4047 -3425 12472 2096 -8832 -8626
181 -8626 10482 13210 -19618 -12070 12996 -628 -9066 -4757 4710 4047 -16441 -416 17230 -7808
195 -7808 -8736 8563 5705 -1653 -4189 9705 7292 -12685 6379 13251 -9968 -3407 5237 -281
209 -281 -6606 -11797 2941 3332 -12922 -4670 -2064 -2860 3859 -3409 1004 3011 -5875 8623 9353
224 9353 -5552 -762 3237 7194 3444 -5603 7802 6640 -4312 7445 4602 -348 4621 -684
238 -684 1913 -2072 -8093 4477 -1018 -11333 -4099 -4408 863 -2237 -9442 2173 -1673 -6871 5998
253 5998 1106 -4274 -865 -812 8445 1678 -4006 7753 2724 1418 8154 102 2501 2550 -329 5720
269 5720 -4639 -6039 5348 -2537 -5993 -5357 -4309 5070 -4074 -9320 1858 -1496 68 2717 -4658
284 -4658 1538 1965 1183 6408 -3514 -543 8823 963 1396 1604 1398 7718 -947 -1495 6938 -2189 -802
301 -802 1130 -4025 -332 -5592 -4604 1417 -8243 -4409 937 -5675 -46 -711 -1859 3017 -3286 2230
317 2230 5388 -4658 1302 4236 782 3419 -1468 3206 7940 -1217 3463 4830 -683 4112 -714
332 -714 -2577 320 -5955 -1126 -1524 -8674 -581 -806 -3257 420 -3644 1605 3065 -5038 1775 917
348 917 -3537 2203 -1367 1022 3586 -1127 5771 4808 148 7263 2792 749 3614 -2384 755 -802
364 -802 -6501 483 -3206 -4611 895 -3949 -857 420 -4664 1686 -1490 -4153 1386 -3329 -1188
379 -1188 705 -3194 3360 2007 -234 7233 2859 2892 6897 896 3359 2334 -1610 2466 -3169 -3134
395 -3134 1192 -4537 -798 -672 -5509 1034 -1618 -3755 789 -4066 -1957 -395 -3226 1826 -1094
410 -1094 -1368 4715 -380 2454 6406 -561 3428 3632 516 3998 -1278 83 1750 -4223 554 434
426 434 -3381 1496 -3043 -2794 3441 -2447 -489 370 -4420 1373 803 -939 -527 -5146 1491 3405
442 3405 -4479 868 225 -1646 5041 466 -331 3860 1834 3311 271 261 5671 -1063 -1234 1539
458 1539 -4391 1807 3657 -5335 -2994 -814 1963 1731 -6571 -3551 -155 -2008 1023 -4706 -4601 3961
474 3961 -859 770 4230 -394 3392 5497 2317 1525 -720 4406 2503 -7111 185 2695 -2393
489 -2393 1218 -1975 -1164 5223 1667 569 -1507 -2969 2260 -1232 -3423 -3330 -8053 450 3340 -5924
505 -5924 -1532 2186 1016 4063 695 799 1920 -130 2868 -769 -150 5530 -1478 -61 6522 695
521 695 2969 4580 -1939 -1939 -1467 242 -3260 -10711 -4755 -3357 -6021 759 -3362 -4253 4160 1576 2907
538 2907 6529 1280 -332 1162 5503 4328 -5024 1660 5769 -3336 2844 6727 -1037 67 1070
553 1070 1419 -731 -4575 -544 -3919 -8209 -1535 -1756 -1554 -69 -5763 1132 6126 -578 446 302
569 302 -651 1825 47 879 -1239 -2336 5454 1954 -208 6547 1642 855 5650 141 -963 150
585 150 -947 -2716 -6298 -905 -374 -7872 -1453 1021 -4181 937 791 -1984 582 -486 1821 913
601 913 -2114 1874 1662 3479 4508 -2289 3048 7081 114 1587 1590 -2529 120 -4 -1229 -3784 -4511
618 -4511 1464 -2714 -4993 2994 -1279 -3720 1571 -1544 176 2602 -1428 -2486 -1916 3024 3932 -3322
634 -3322 -408 2376 -223 4908 2030 -1718 2795 403 216 2472 66 332 -1962 -1512 2098 -1546
650 -1546 293 591 -6282 -458 2898 -2588 -1676 -2229 -1409 702 -1241 1128 32 -1715 2380 68
666 68 1167 5144 -978 -528 3682 955 2152 1088 -1064 113 -554 2327 589 -4925 540 314
682 314 -3013 652 -1949 -2573 210 -2647 -749 29 -1520 393 -2143 -158 2434 -2006 1828 2605
698 2605 -1786 2564 2852 708 2220 622 1576 1757 -129 2551 -1202 -2183 2506 -845 -1834 -705
714 -705 -3513 192 226 -3570 -1153 -1681 -587 550 -2666 429 397 -1065 2645 -572 -880 3723 691
731 691 15 1431 1076 3400 384 -406 2354 -626 1099 1059 -3204 736 178 -2384 50 -2251 -1765
748 -1765 492 -2083 -739 -669 -1264 1106 -1929 -877 2152 -1741 245 1827 -678 2146 1360 891
764 891 2727 341 2410 2391 -710 1903 275 -1685 820 -2012 -816 202 -2623 -206 -603 -1805
780 -1805 458 -1567 -983 564 -2476 165 55 -1963 1314 -408 180 2315 -127 2173 2351 71
796 71 2678 889 121 2042 -1004 200 268 -2126 991 -106 -1424 1100 -1028 -203 768 -2304 -310
813 -310 -834 -2565 -5 -2067 -1745 713 -1763 969 1432 -313 2567 1087 859 2407 -197 1712
829 1712 1361 -1213 1424 -98 -488 1758 -847 309 686 -1373 790 -969 -2623 175 -2500 -2095
845 -2095 -583 -2912 -487 -592 -1412 1773 50 246 2112 -143 1719 1709 -317 2220 447 -130 2353
862 2353 -676 746 1600 -853 1313 -387 -887 1135 -1902 -1182 -383 -2738 -583 -1453 -2290 691 -1535
879 -1535 -600 978 -1735 709 1537 -332 1696 -153 588 2658 -596 886 1512 -300 2153 402
895 402 -153 1694 -465 575 657 -1963 -50 -821 -1869 242 -2442 -969 226 -2452 -198 -50 -1588
912 -1588 830 -623 111 1292 -806 1539 1024 -809 2306 784 503 2203 -533 894 1601 -538
928 -538 1323 -230 -811 634 -1467 -73 -234 -3154 18 -763 -2415 -32 -1223 -602 286 -1134 912
945 912 360 -616 1903 -369 181 1654 -932 1192 1367 -535 1687 1074 40 841 -414 1560 586
962 586 -1747 1191 -1222 -1519 1071 -1971 -1604 -52 -1731 406 -664 -1131 280 -1086 563 600 -1904
979 -1904 924 363 -1274 2152 413 -25 2385 393 1328 1666 749 1783 -445 -35 1447 -1858 -278
996 -278 25 -3264 -326 186 -1742 -1065 -1884 -212 19 -1345 722 -1004 -1428 1976 -719 107 2107
1013 2107 -816 1081 2333 868 1570 580 888 597 -1075 1960 542 -2962 643 -145 -1597 565
1029 565 -1431 -1388 -272 -1011 398 -919 -1530 -71 -2006 502 832 -2475 723 1460 -916 1843 1776
1046 1776 583 785 662 2483 787 -362 1621 -992 -458 2087 -1200 -579 -50 -2241 89 464
1062 464 -1023 -1417 -2002 127 -471 -2015 1005 -1035 -2367 2142 927 -513 1136 107 1126 1476
1078 1476 905 1682 -540 786 1678 -880 1602 596 -2312 820 467 -1050 208 -1101 -975 -1309
1094 -1309 -604 1015 -2059 -2099 888 -1871 213 1532 -1782 -640 603 634 1607 -30 539 325 -1
1111 -1 2658 793 -929 1728 -380 -80 2253 -817 -1025 290 -539 171 -706 -435 -522 -2859 483 954
1129 954 -2254 237 -588 -1865 1377 318 -126 89 -546 1170 947 728 1489 -975 982 2585 -920
1146 -920 785 1213 -1500 579 466 -317 -586 -1573 323 -829 -1359 1221 -1524 -2167 423 -1216 -324
1163 -324 562 -1448 -153 478 325 897 -265 775 1005 -427 2533 1234 -1150 1892 740 17 1173
1180 1173 -239 -160 -429 -599 928 -1233 -986 -132 -1927 -254 205 -1962 -253 -522 -1135 792 33
1197 33 -6 -102 -381 1723 -78 85 2274 -441 364 2163 -44 609 611 -106 885 -17 369 429 -1430 168
1217 168 -324 -1541 712 -1377 -1858 466 -1095 -721 -81 -924 264 -357 310 1384 -583 756 1880
1234 1880 -520 1405 1030 -331 1447 0 403 1020 -657 481 149 -946 953 -981 -695 281
1250 281 -1942 -195 217 -1769 -299 -592 -773 311 -608 464 372 -822 1048 564 -423 1369 73
1267 73 383 1086 -486 654 418 -413 1294 -442 310 592 -1037 697 -49 -1230 416 -714 -1079
1284 -1079 -146 -1429 -220 -577 -909 456 -285 -414 1006 -398 357 1000 -210 1106 672 52 1666
1301 1666 139 454 1354 -175 721 244 -773 876 -882 -649 457 -1436 -227 -559 -1290 79 -903
1318 -903 -848 426 -1164 -183 609 -670 706 276 -75 1276 -23 472 1087 -11 1565 479 211
1335 211 1258 -288 110 611 -683 283 -32 -1023 255 -1203 -883 46 -1439 -492 -128 -1186 95
1352 95 -704 -573 664 -772 255 675 -286 1020 629 141 1409 -49 798 1087 -558 821 297 -560
1370 -560 785 -639 -320 377 -1204 56 -353 -1134 -136 -1085 -632 10 -1414 111 111 -1095 557 -194
1388 -194 -246 950 -42 846 769 -352 1108 817 56 1363 -502 464 747 -699 690 -35 -765 549
1406 549 -537 -556 -33 -1437 -246 -445 -1241 225 -681 -716 754 -532 91 363 -516 1084 469 108
1424 108 1123 -60 740 940 -181 1229 379 -364 1022 -181 -434 383 -729 59 -534 -814 129 -1331
1442 -1331 -570 472 -1146 -12 -7 -1137 79 -177 -75 592 -142 504 580 -87 1418 39 -28 1289
1460 1289 -127 644 1042 -324 451 -85 -355 161 -917 -389 -179 -1323 152 -383 -1316 180 -714 -724
1478 -724 233 -536 195 133 -243 1240 -57 103 890 -555 670 1254 -208 764 511 -126 544 -176 152
1497 152 -315 -984 422 -405 -755 554 -1384 -741 278 -1098 -350 -113 -1149 -8 -184 394 246 -543
1515 -543 936 400 -142 1627 341 -393 1418 320 406 630 -119 235 -444 -237 841 -776 -248 -166
1533 -166 -1409 368 -62 -1532 -171 -451 -412 52 -488 181 -634 -453 1174 -641 79 1205 -399 566
1551 566 1517 114 719 109 652 484 95 462 13 -1308 719 -274 -870 348 -1073 -1294 241 -320
1569 -320 -418 -791 -619 -65 -721 464 274 -1039 480 870 -444 1072 298 -322 1018 656 862 57
1587 57 -90 849 -472 68 1013 -922 -677 736 -1080 -66 109 -967 -910 -687 -74 -147 -1235 421
1605 421 -570 -582 1452 41 -692 896 -282 390 1017 654 469 -49 713 1018 -154 996 379 -1376
1623 -1376 939 246 -1088 -109 -736 -863 -167 -215 172 -968 -651 677 -784 -46 533 -1168 326 1078
1641 1078 -259 648 339 374 464 314 1239 -76 -669 1054 28 -367 1374 -756 -550 96 -345 29
1659 29 -404 -858 -315 -875 276 11 -1343 73 -139 -484 861 -93 -619 442 94 349 461 97 728
1678 728 -206 716 990 -620 399 369 -742 447 405 -717 59 -519 19 -164 -361 326 -773 -815 796
1697 796 -860 -702 367 -607 87 193 115 494 -37 432 746 185 1072 377 -586 858 236 -45 909
1716 909 -286 -112 64 -337 279 -500 -535 -194 -1218 -299 -202 -1115 -83 -181 -737 162 -22 6 486 124
1736 124 843 524 99 1022 -110 469 1150 -323 -151 436 -322 225 89 -225 -25 -631 96 -65 -1208
1755 -1208 -43 -622 -883 218 -544 -467 405 -402 210 131 -176 326 -158 260 916 -360 658 443 -235
1774 -235 950 313 76 641 -366 382 392 -418 290 -540 -579 204 -753 -559 81 -903 -20 -211 -609 237
1794 237 -308 -86 362 -260 429 -53 -2 962 264 455 1084 -258 561 524 83 528 -86 -161 370 -742
1814 -742 37 -125 -1115 292 -341 -476 38 -641 -221 -75 -640 -43 67 -192 630 -113 194 664 92 566
1834 566 443 414 897 295 234 877 -298 519 -13 -463 325 -428 -441 387 -561 -241 -17 -988 -96 -159 -373
1855 -373 252 -429 -391 179 -205 471 332 -107 788 103 391 413 -270 677 247 -356 511 -146 -160 385 -775
1876 -775 0 -156 -584 83 -540 -521 -17 -768 -134 -37 -941 -49 -256 -479 685 -283 337 576 -191 597
1896 597 451 41 886 7 270 753 -210 624 172 -422 596 -199 -427 27 -830 -216 -316 -643 -73 -520
1916 -520 -467 151 -429 -106 365 -416 362 152 -233 923 -12 428 598 14 593 580 -71 391 -19 19 430
1937 430 -573 22 -194 -660 -21 -275 -550 -23 -823 -202 -331 -748 9 -196 -360 629 -390 -11 855
1956 855 -87 698 145 136 807 -193 387 737 -312 553 6 -449 635 -514 -247 189 -479 -226 -164 -760
1976 -760 -109 -605 -548 404 -833 -138 377 -671 394 481 -343 410 81 243 639 24 687 301 -245 710
1996 710 -180 4 754 -199 164 82 -295 179 -538 -726 52 -661 31 -249 -809 210 -321 -429 464 -459
2016 -459 -249 139 -64 663 208 141 567 -159 479 1068 -322 463 460 -488 549 182 74 223 -369 252
2036 252 -221 -711 370 -620 -547 408 -733 -527 -41 -570 118 174 68 360 -196 464 389 -221 885 146
2056 146 -267 904 420 316 357 -254 -5 82 20 405 -769 -181 181 -1009 76 -79 -1002 -52 -129 -11
2076 -11 406 -412 -35 180 204 786 230 -24 841 -247 401 905 -538 133 264 -103 377 -54 63 -54
2096 -54 -588 309 -1 -585 284 -494 -815 415 -378 -707 -336 -558 73 -158 162 414 -633 511 711
2115 711 -348 680 375 -165 650 325 258 241 -255 184 -202 100 474 -795 -270 537 -601 -192 15
2134 15 -1138 -455 -97 -110 -111 -256 254 254 -129 881 -185 -150 757 83 36 360 26 78 272 94 402 -442
2156 -442 262 -107 -642 495 145 -809 6 -84 -194 -189 -182 -305 -472 -291 603 -403 -434 337 -719 214 745
2177 745 -310 339 -4 -180 549 254 379 60 -2 846 154 198 609 -529 -314 300 -439 -299 -260 -697
2197 -697 -323 -189 -135 -228 -682 172 -23 -411 546 -161 -583 349 63 370 414 -19 248 36 316 794 33
2218 33 -10 502 -478 366 356 -536 -40 -326 -56 29 -440 -80 -293 -395 407 -496 -472 -9 -243 -99 182 -243
2240 -243 319 31 -91 679 297 612 369 -132 638 182 -71 626 -178 -382 175 -378 51 -42 -618 85
2260 85 -361 -268 -84 -906 -77 133 -610 264 -127 -97 487 174 614 227 229 302 117 150 625 -137 303 355 -358
2283 -358 124 -3 -310 151 -411 -213 -167 -540 46 -335 -461 392 -458 -201 590 -422 197 196 -55 507 7
2304 7 278 618 -145 327 406 -308 467 272 -209 392 -104 190 54 -409 240 -110 -290 -53 -657 -439 -66
2325 -66 -663 -73 218 -354 56 -301 277 444 -49 511 232 -115 520 -26 256 721 -356 432 403 -224
2345 -224 164 -197 -281 53 -506 -71 -191 -670 29 -135 -361 78 -539 -115 161 -554 163 28 -102 293
2365 293 53 474 625 -22 274 620 -111 580 -219 118 552 -90 -125 303 -197 234 -285 -498 -194 -425
2385 -425 -172 -185 -416 -12 -208 -551 368 -193 -39 260 -177 186 364 -145 420 174 248 942 93 357 245
2406 245 149 246 -55 -115 171 -316 -42 -146 -442 -7 -264 -361 -147 -591 -201 97 -174 50 -35 -307 320 -10
2428 -10 50 801 -407 371 451 -54 588 115 281 298 -269 115 -10 -184 -47 -13 -437 130 -453 -165 6
2449 6 -775 27 -305 -586 211 -366 -49 191 -281 369 246 -136 252 171 138 422 43 430 333 213 422 228
2471 228 -18 396 -50 27 250 -545 21 -176 -156 56 -618 -322 -95 -322 138 -26 -78 368 -49 -52 652 -157
2493 -157 358 155 -184 610 -4 104 510 -219 290 443 -282 421 -71 -455 152 -328 -320 -69 -226 27 -334
2514 -334 -228 90 -739 -286 123 -463 209 114 -11 294 -84 286 421 111 580 -45 -37 690 -87 80 379
2535 379 -223 -164 153 -269 -289 -71 -272 -223 -616 185 242 -744 358 181 -428 267 -100 -204 84 330 242
2556 242 265 -33 201 162 466 495 -10 121 457 -273 162 -211 -606 -143 18 138 29 -545 128 -456 -230
2577 -230 406 -420 -282 -196 -178 -6 372 29 263 -76 391 345 -271 260 -156 -75 855 142 -298 267 -142
2598 -142 -144 6 -136 36 -435 -290 82 -372 74 -125 -565 76 -107 -235 0 -114 -270 290 109 493 -54
2619 -54 -95 591 -121 227 737 -377 331 472 -107 185 -268 -200 50 -80 417 -203 -620 36 -434 -762 15
2640 15 -303 -544 -100 -354 -20 -51 31 69 -345 545 320 -216 103 109 -172 701 301 7 113 65 270 -16
2662 -16 153 -127 -243 -44 434 -389 -369 26 -503 31 41 -306 -54 -309 272 -66 -150 483 -64 -182 485
2683 485 0 -19 252 -230 48 297 97 400 -294 135 225 -254 450 19 -614 -60 -134 -406 -83 -524 -476
2704 -476 -213 -200 -42 -34 -34 224 -130 277 581 -286 199 429 110 444 -10 51 96 22 323 47 -151 366 -61
2727 -61 -340 391 -520 -528 -45 -249 168 -170 -236 -153 -540 189 332 -269 76 -25 -75 221 -28 44 475 225
2749 225 180 91 145 427 -115 -144 208 -365 13 155 -600 179 -22 -131 23 -418 47 -77 -301 117 -93
2770 -93 -505 160 -310 -304 310 1 151 125 96 287 -87 210 279 -146 427 23 46 516 306 -195 132 -479
2792 -479 -467 -4 -591 -243 -668 -146 124 -451 -32 -15 -333 57 128 -165 410 137 135 209 -6 140 294 -13
2814 -13 204 -123 308 271 -164 135 -76 -354 215 -125 -303 16 -467 -224 47 -452 285 -80 -73 18 -113 -174
2836 -174 -12 10 199 10 237 221 58 217 148 -167 218 -159 -120 103 -466 -70 171 -263 -195 -103 -322 -44
2858 -44 -402 -348 39 -280 -263 126 -50 8 -177 -201 159 -197 193 154 -191 304 171 -73 386 -81 42 247
2880 247 -408 133 -8 30 -23 -211 -26 120 -171 172 -126 -365 -140 -261 -35 276 -238 6 86 -228 156
2901 156 397 168 526 149 74 202 124 466 23 40 249 -108 1 -70 -246 124 -124 -107 63 -585 -271 152
2923 152 -518 -184 6 -376 134 117 -250 231 102 181 371 -52 364 373 25 389 27 255 280 -340 40 44
2945 44 -130 159 -224 -124 45 -246 -135 -144 -258 30 -460 -54 100 -183 45 237 -305 230 108 440 390
2966 390 -103 -85 273 -199 285 279 86 326 -167 -241 243 -205 255 -121 -341 -28 -458 -13 -8 -136 -155 -22
2988 -22 -170 31 -168 -21 212 -301 -60 90 -360 59 236 -152 526 -7 142 22 -73 165 64 -205 226
3009 226 -79 -92 95 -513 -90 -26 -303 -86 -211 -207 4 -174 28 -190 -199 366 -191 274 341 54 -65 403
3031 403 10 175 222 52 164 -150 77 44 1 387 -368 -473 42 -54 -364 94 -416 -37 -179 -291 -296 -457
3053 -457 -178 59 -100 91 257 -16 73 24 13 75 138 372 75 265 256 -264 -158 358 -221 -140 109 -197 -301
3076 -301 -383 -424 349 -232 61 -17 -310 334 -134 -166 143 -214 -127 278 96 204 124 -76 351 63 260 251 -351
3099 -351 -36 145 -55 24 -125 -229 -5 99 -242 -125 -215 -41 -80 -126 381 -431 98 464 -58 125 133 -232
3121 -232 119 248 -66 370 -69 129 252 -131 537 -362 -169 271 -58 75 331 -209 -63 -334 -78 224
3141 224 -446 43 16 -326 210 84 -274 164 -191 -14 390 45 185 -109 3 240 16 240 233 -97 137
3162 137 326 -110 194 -2 -67 154 -332 -10 -255 -533 324 -247 -235 187 -431 -149 239 101 10 -215 -69
3183 -69 216 -161 123 344 -303 212 353 113 488 154 67 126 49 -15 113 -241 122 -360 5 155 -471 -116
3205 -116 108 -404 -87 -12 -300 -42 -62 228 221 207 313 -112 264 520 262 -71 250 -118 13 318 -44 5
3227 5 -27 76 99 -146 -20 -461 -293 398 -297 -106 -11 -199 -130 84 -254 220 -94 -249 200 -253 74 555
3249 555 -222 111 182 -281 337 45 -242 -70 -169 281 59 -97 -79 -233 -282 25 -422 -275 -46 -563 -147
3270 -147 -66 -76 46 -163 164 273 -172 74 243 -128 126 63 96 87 -101 247 115 81 29 79 -65 173 -108
3293 -108 17 238 -340 -38 -219 -305 -6 -128 -15 87 -150 48 -216 -20 70 -326 46 167 -55 271 135
3314 135 -78 407 180 46 152 36 255 146 4 157 -163 -127 156 -323 -74 -114 -284 63 -343 -319 -282
3335 -282 -293 -84 -37 -167 -89 -154 -127 90 163 175 423 61 277 -23 -9 413 -77 -117 208 -118 220 -54 -264
3358 -264 -29 -397 -462 7 6 -50 -144 -142 -103 70 -402 -1 -4 49 120 -182 248 -59 -172 203 25 174 -13 -50
3382 -50 271 145 -188 0 -10 8 59 -337 -128 67 -161 180 175 -67 221 -118 83 89 -146 98 88 77 -91
3405 -91 -17 183 498 -9 246 159 -59 479 -167 -11 199 -307 171 250 -295 -105 -118 -193 129 -246 -157 -114 -261
3428 -261 -29 -235 -7 317 66 -135 171 -58 345 272 -15 266 -25 155 102 -103 407 -33 130 -87 -340
3449 -340 -53 -30 121 38 34 -163 49 -119 -225 72 -84 30 -40 -53 236 -14 34 41 -124 -94 144 -36 11 339
3473 339 80 341 -15 176 363 -67 263 -184 -40 84 -244 -165 85 -92 -121 77 -290 57 -6 94 8
3494 8 -356 -44 27 -173 147 -3 -150 295 -115 -11 136 -131 234 278 -83 173 -301 -64 159 -63 -90 -52
3516 -52 -169 188 -38 -228 -91 -309 -449 98 24 -39 55 -41 254 -155 199 128 -62 -180 75 -93 334 50
3538 50 102 301 274 144 19 -235 91 -201 -253 -100 -464 -7 66 -177 -43 84 -264 231 -226 100 -172 -163
3560 -163 277 -157 -98 269 201 172 334 -334 317 129 106 123 165 223 71 86 13 -220 -181 51 41 -259 -177 -172 -43
3585 -43 -50 -174 401 97 -219 178 -305 315 360 -371 220 89 -159 491 -347 19 59 -53 262 -137 -144 3
3607 3 8 -158 220 -528 48 -130 60 -13 -83 -93 189 -142 -5 11 83 223 -34 59 93 -113 169 548 32 334
3631 334 322 139 -96 -400 -14 -67 -167 342 -116 -418 -139 -355 -76 -284 -476 -392 -185 3 39 -391 -75
3652 -75 425 -215 94 -42 -162 -129 153 33 235 204 66 0 42 282 193 -79 130 275 -50 85 -333 -214
3674 -214 -271 -268 -221 -377 -286 -176 -162 -5 -185 -167 18 -270 -130 183 -93 -112 9 -28 -47 -72 10 260 -90 9
3698 9 18 -84 171 -175 -225 169 -8 -26 58 19 -23 -203 -483 78 -122 -180 107 -44 3 -187 -133 86 86 111 -17
3723 -17 -157 254 182 -91 130 -52 -328 435 -181 -79 204 -142 -42 -39 -377 141 -280 -165 242 7 38 -8
3745 -8 -224 133 10 -47 292 110 83 144 200 158 -52 30 263 1 141 175 -251 -129 88 29 103 -316 82 -265
3769 -265 -74 251 -101 -226 -47 -103 -94 154 -122 -21 165 -3 252 31 80 213 -344 369 287 -212 348 23
3791 23 79 169 -69 119 -1 -115 92 -189 -136 294 -66 -149 268 -197 -97 156 -13 29 11 37 207 -358 145
3814 145 258 -164 520 143 -196 157 121 80 -26 -61 44 93 -120 350 -268 239 56 -189 70 46 -182 -25
3836 -25 -13 -414 -24 -184 32 74 125 58 -237 178 306 173 280 182 195 234 24 -79 288 -18 53 171 -166
3859 -166 -200 -51 -245 232 -131 120 153 -265 226 -158 -164 -90 2 -222 -38 -142 -29 116 -269 210 263 137
3881 137 249 94 323 308 -69 -87 153 92 287 -274 87 -19 -345 32 97 -131 -183 25 -36 18 -84 135
3903 135 -31 -208 85 114 44 233 56 111 250 2 159 184 130 251 -187 130 -195 -308 71 -241 9 75
3925 75 -299 21 145 -314 -119 114 -71 96 -163 -32 -14 -294 162 134 -137 97 13 26 147 -152 172 321
3947 321 206 206 138 -2 -27 -60 99 174 57 139 77 -255 42 -1 -13 -17 -310 -68 41 -223 -42 -93 83 -58
3971 -58 -136 107 104 54 124 375 -23 267 -6 219 -16 -113 -81 -271 64 255 -8 152 15 -261 -116 -46 -172
3994 -172 119 -270 -64 -197 -180 147 160 104 271 67 -6 234 42 12 -49 -4 507 185 46 348 -246 4
4016 4 -138 -74 -123 -128 -246 8 -137 72 -62 -248 200 74 -178 89 28 -109 253 59 -154 -116 -23 334 -144
4039 -144 -103 325 142 77 154 -167 -59 48 -219 159 153 -306 70 153 -39 -54 -213 -20 -235 -8 -82 -203 225
4062 225 284 2 -50 8 187 54 86 281 232 58 232 -177 71 -41 170 -102 -37 39 61 73 129 71 -264 -63
4086 -63 252 -56 -48 -166 -66 50 -154 -248 110 -190 249 -217 209 230 -326 165 263 -120 323 190 -115 -142
4108 -142 195 195 417 -68 -169 -185 -116 -52 -435 -125 -355 -375 -16 26 61 174 74 160 135 -196 -1 220 31
4131 31 382 -183 -1 227 -7 230 119 -14 206 -150 -174 102 -251 -46 197 -196 108 9 -148 -202 -68
4152 -68 -155 -139 28 -7 6 -134 -110 -62 363 29 -104 -30 36 99 33 -137 -85 104 19 48 32 23 7 -58 -272 89
4178 89 170 -258 -369 -371 -30 87 78 -387 -177 0 191 -230 101 138 -271 101 136 -53 380 229 187 91 -55
4201 -55 179 60 181 22 134 48 -76 -387 226 -63 -211 -185 -79 97 200 -203 -17 3 -58 147 161 -5
4223 -5 294 182 86 331 -248 182 47 114 302 -123 85 -10 -63 271 350 -113 -4 36 -146 -245 -92 98 -4
4246 -4 -100 -72 -230 -6 198 -122 -353 43 -196 182 31 97 202 28 122 55 136 62 52 -368 181 160 -198 135
4270 135 83 10 -167 -130 -100 -38 -121 84 -77 -104 198 -299 66 13 -172 -26 85 124 47 136 141 89 23 37 -65
4295 -65 -48 223 -390 -132 72 185 -57 -74 -83 142 -40 -75 -153 -429 70 -137 -22 -29 -456 -23 42 81 51 -62
4319 -62 32 -89 82 71 279 64 10 10 -37 188 -55 72 211 -132 -11 -186 -100 -79 -161 -30 91 -238 -198 -258
4343 -258 81 -112 335 -100 111 82 356 171 -79 347 7 4 508 183 -91 279 -5 38 11 -94 48 -3
4365 -3 -221 127 129 -81 -391 -5 -127 -406 -193 -120 -251 -249 117 60 -31 -100 -50 51 -67 288 -21 -33 135 -254
4389 -254 -219 240 -88 100 -116 -193 141 -47 39 279 -224 -92 152 -296 55 15 -163 -131 249 -196 280 -2
4411 -2 21 94 96 -11 -110 -228 45 -29 12 36 -78 436 -156 -211 -48 -295 -19 70 -100 -43 20 -82 111 -181 -226
4436 -226 132 -60 253 -146 -190 -35 170 211 111 59 -74 127 -107 33 -51 -97 325 -143 -108 93 174 -24
4458 -24 -239 -215 173 -243 -87 14 -59 -125 -23 -224 -86 -38 -144 66 -196 5 62 -8 229 -48 143 150 9
4481 9 -43 107 -136 163 87 84 24 -121 -127 23 -51 -218 18 -158 76 225 -76 -83 -146 68 32 -172 0 61 14
4506 14 139 97 -108 194 -37 176 21 19 200 198 44 -139 -279 79 -9 2 -90 -215 -356 31 -98 70 -40
4529 -40 -133 18 -79 -232 -36 -267 227 242 -30 65 13 -241 277 49 40 283 -13 126 -167 103 279 -110 33
4552 33 -92 -181 29 -154 -162 121 -47 80 -206 -241 86 178 -80 280 -40 191 68 -193 108 18 217 -285
4574 -285 -3 115 -107 -214 22 112 27 134 -31 -345 90 149 -248 -104 -108 120 14 -188 -172 -224 -203 43 -328
4597 -328 223 58 -5 122 132 142 145 -136 -88 172 -372 130 74 -239 44 -215 -221 16 -15 -19 -258 -1 -41 -263
4621 -263 166 -70 -266 273 -71 112 229 210 17 254 -72 409 174 -164 -98 61 79 -85 76 -158 83
4642 83 -255 159 -21 37 -43 -262 -17 38 2 -44 -143 261 -172 -1 -60 -304 -210 -172 -40 -105 322 -96 39 -117
4666 -117 -130 257 139 -29 -27 -193 163 170 101 9 198 -294 211 -89 -49 -55 141 71 -66 -38 -252 89 -241 -158
4690 -158 103 -58 35 -86 -81 78 185 268 -120 0 289 21 41 313 263 180 -33 -12 -186 83 25 -37 4 191
4714 191 167 -178 -64 -296 -187 215 -118 55 2 -149 78 95 -223 49 180 399 -17 -180 33 31 354 -2
4736 -2 51 -30 -186 -8 364 96 -228 -31 -200 11 81 -164 46 -161 -247 59 -106 -165 -71 -234 0 -269 39
4759 39 93 60 -17 157 -81 123 140 -46 72 93 117 17 -73 -296 39 -14 123 127 59 141 120 22 -67 -273 43
4784 43 -74 87 -132 -54 -115 -149 157 -35 -43 -150 280 42 166 -30 35 -87 -108 19 123 -97 -314 46 82
4807 82 -308 -107 -201 -27 -74 141 24 -239 66 -46 199 103 143 -15 217 270 136 139 -65 -2 333 -5 101
4830 101 143 -36 46 -74 12 149 -107 23 17 -47 -42 51 67 68 -30 -260 -427 -88 90 -102 -82 205 -129 114 408
4855 408 167 193 283 126 -52 208 40 216 38 156 -31 -87 256 -131 115 133 44 -177 13 -44 32 -68
4877 -68 119 -242 -196 169 47 -345 49 162 -113 260 -33 38 -136 -204 108 202 116 11 -57 276 -221 -47
4899 -47 210 -194 -49 269 106 38 -93 -21 -207 -94 -260 189 105 261 58 57 176 168 96 -218 119 295 131
4922 131 -244 137 -185 200 -45 77 191 159 -246 -155 -259 130 -34 -82 -151 -133 -10 185 93 -196 130 76
4944 76 226 -93 -247 309 111 -139 466 185 204 -73 99 159 74 84 60 -10 -54 -367 -141 -147 51 -67 167
4967 167 197 43 -26 47 61 118 209 -56 -24 -138 27 -33 88 -167 -27 369 160 -129 206 -90 113 -75 11
4990 11 106 -16 -280 20 -24 -56 271 -21 47 -41 -155 173 -104 -182 -115 34 103 -83 -92 186 175 -217 -81 -21
5014 -21 207 110 284 310 -154 183 -88 -207 -132 179 -83 -215 100 0 45 -15 92 71 -157 -183 153 -25 -187
5037 -187 -162 31 137 -69 -236 -19 131 276 108 84 52 -79 81 -159 51 -15 -111 -55 81 65 -53 197
5059 197 30 -16 130 -356 -86 48 -8 65 -17 50 138 -107 -148 65 -48 3 -44 -78 -179 63 141 44 94 123 20
5084 20 -43 261 48 359 -37 -149 -51 -160 -129 -46 -9 -346 4 -414 -6 87 -131 192 -376 -7 26 -143 197
5107 197 -72 -207 -29 -22 330 280 -63 -78 -248 52 247 202 64 70 -149 -80 100 114 8 -190 57 -77 114
5130 114 256 -39 -72 182 -21 160 241 183 -157 -12 159 282 58 121 135 -35 97 -170 161 -261 -48 7
5152 7 33 -219 -109 186 -197 21 34 -101 142 -210 -160 -32 -15 -256 18 134 -206 2 -44 -55 -397 54 63
5175 63 -402 134 221 -153 -246 187 40 226 -21 -122 -192 -461 129 -336 -47 177 -77 70 132 -18 -98 29
5197 29 187 64 169 38 237 25 -34 -51 229 175 -299 223 47 -39 30 23 5 45 86 -56 332 -61 -2 -208
5221 -208 -236 115 -115 -335 102 -68 -84 -61 -17 -123 -82 -59 85 6 -57 -26 64 53 -110 206 -131 42 15 -85
5245 -85 -58 -58 -334 -183 18 -107 -71 179 -169 296 54 -20 -246 -117 -82 244 25 -3 82 -91 229 138 -435
5268 -435 67 -250 152 -45 -198 72 -221 -48 24 -127 20 80 -122 39 -21 -249 -159 -164 -121 -104 107 -193 -76
5291 -76 180 28 113 117 124 -72 -26 107 -129 -13 8 0 188 8 -216 65 46 -135 -262 -82 61 -36 -247 35
5315 35 -47 -250 -215 -96 83 30 -205 260 68 -205 48 -283 -93 116 -57 138 33 228 40 -216 -92
5336 -92 -68 -192 -66 60 -121 118 -233 88 -36 -114 42 101 -100 -41 -109 53 -123 -221 151 -33 -13 15 101
5359 101 43 235 -62 204 490 -48 132 59 109 58 -134 -319 14 -192 -99 166 -50 -30 -89 56 -110 -139 -64
5382 -64 126 -298 -131 -145 40 -147 14 -102 11 -108 45 -16 -49 169 -338 -193 156 -222 77 -92 -135 -219
5404 -219 -99 -258 72 65 -71 101 40 90 42 9 107 -128 9 14 -157 63 64 296 -4 -340 -144 133 -92 24
5428 24 -152 124 236 199 -11 46 31 15 -129 -68 -216 -153 -79 -55 -103 -119 13 -20 -84 -24 -222 152 240 -39 230
5453 230 -15 180 -76 -2 -106 -172 167 -275 -148 -4 -55 -147 131 -97 -161 -222 165 -91 -90 32 20 -120 50
5476 50 -25 -83 123 14 -154 95 -51 248 -2 -162 -12 -114 11 -220 117 102 17 -113 237 50 207 64
5498 64 -74 -46 -79 -3 -179 -141 -99 -50 -159 284 -82 -58 194 -190 -137 -15 211 90 -134 -131 154 -153 -34 246
5522 246 83 -169 28 -5 -128 247 13 89 97 148 190 -107 -117 -202 -212 74 -23 -160 12 -204 -105 -80 104 63
5546 63 256 250 41 91 87 261 -17 31 -161 -200 189 125 -6 49 -42 18 -220 -88 226 -271 6 -323 104 40
5570 40 91 -52 -9 64 52 22 -89 -40 267 87 269 145 -32 205 -26 180 354 105 -36 61 -232 98 -134
5593 -134 166 -132 -57 175 173 -54 153 0 159 130 239 -46 -44 -151 52 34 -47 -274 133 34 181 2 304
5616 304 13 -187 -17 142 66 47 45 162 -133 -94 -95 -69 -6 -42 161 48 -67 -99 142 19 -20 81 -49 -273
5640 -273 -18 -183 81 128 -164 -92 65 294 -163 -53 126 180 -56 120 -42 -263 -129 202 -92 150 -38
5661 -38 -4 -19 29 32 -208 70 -120 -57 -108 200 -121 -88 135 81 -15 -6 265 246 117 148 -7 -144 123 14 11 -7
5687 -7 60 151 8 1 -249 -191 -208 -94 -162 -213 -207 -68 -3 -36 -133 -44 12 -131 18 -230 207 -48 119 -20 157 384
5713 384 124 -95 -181 -1 -18 183 -43 -114 122 -109 -30 155 50 131 -37 -223 -113 -226 -140 278 12 -87
5735 -87 156 30 11 -137 321 170 97 11 -27 123 2 -105 -72 294 -171 145 -66 114 27 -258 -14 -140
5757 -140 -88 -89 84 -117 -156 -31 155 -238 44 104 -122 161 416 52 128 61 -222 20 5 29 -30 -14 -122 -134
5781 -134 -187 148 207 -146 -24 -35 -2 265 -70 164 9 -122 -25 70 -158 70 313 168 4 -298 -125 242
5803 242 216 103 319 257 38 151 177 250 273 69 77 -117 47 180 42 81 -7 98 230 -494 -138 -154 -1
5826 -1 -78 81 71 219 302 95 7 28 15 -122 60 80 -77 -6 -24 92 -60 87 -219 23 -163 -311 161 0
5850 0 58 39 6 172 252 81 180 20 198 8 267 -10 157 185 148 45 -3 -37 -4 103 -55 303 32 308
5874 308 -67 93 -54 72 -257 124 -70 -64 176 91 -71 125 -23 -31 183 -141 121 -176 71 207 145 -80
5896 -80 154 110 -16 47 318 10 -23 -112 -248 115 34 -128 -107 93 71 -124 -329 -86 -65 155 -247 -111 -8
5919 -8 137 49 -354 -186 23 -119 221 -34 -112 121 -26 18 80 -164 222 36 189 -95 278 86 252 -143
5941 -143 -159 -72 -77 210 -7 101 16 21 -31 104 46 168 58 -31 170 195 55 70 24 -106 -65 -94 -39 -155 -257
5966 -257 141 43 -61 196 87 22 -108 262 -97 88 35 -38 -79 51 58 213 47 62 -27 10 -96 257 171 68
5990 68 28 -162 97 114 44 -71 -98 -142 -125 58 -213 48 83 6 97 -90 31 -103 249 47 58 95 71 -344
6014 -344 2 -87 107 115 -181 -91 -34 129 178 -60 75 157 73 29 -59 -164 117 154 -53 18 4 -142 92 172 97
6039 97 -198 98 -149 70 -106 150 -130 -89 -424 92 169 -289 98 -1 77 207 -86 -219 -75 18 -117 176
6061 176 50 19 -63 -17 -76 69 3 -22 294 -63 -123 -88 -11 97 73 -3 -62 -127 13 -163 170 -69 -4 -94 -59
6086 -59 38 50 -187 -37 142 -87 33 -10 -54 29 155 -162 -32 -71 118 -98 -132 116 -182 -233 -107 249 -5
6109 -5 -263 -82 151 11 23 209 -57 5 72 -39 279 43 -178 -141 -27 70 -259 -50 110 143 -208 -55 -130
6132 -130 -23 202 113 -101 -320 6 160 -24 75 239 61 157 177 21 160 -19 177 32 26 14 -131 348
6154 348 -55 97 104 47 177 -140 -184 -108 73 157 -33 44 107 -135 -13 -197 71 249 -252 -200 -24 -44 154
6177 154 -100 -182 37 110 121 37 118 142 -24 -1 118 172 25 137 -52 120 -47 -92 10 -19 117 -77 -155 -104
6201 -104 -204 -148 -96 -72 144 106 144 19 -141 211 5 127 131 161 345 123 -43 58 12 -251 93 20 35 -43
6225 -43 20 38 115 292 -82 -77 -31 -247 164 -190 -116 95 10 119 -16 75 -82 49 80 -52 -29 183 -70 -128
6249 -128 279 0 99 -44 -30 -141 -67 -4 32 69 -83 -109 107 -10 -206 -146 -33 -238 -69 -73 49 12 95 -34
6273 -34 -94 145 -48 171 -187 161 48 -153 175 -72 -116 185 -187 15 -86 -104 -185 -85 -150 -115 -39 -54 143
6296 143 -10 35 111 127 7 -129 40 4 49 40 -37 204 207 -177 22 -171 81 33 -108 41 62 311 50 -40
6320 -40 53 -32 -129 -74 256 -105 -116 12 6 107 -55 -296 -107 -140 115 177 124 125 207 -147 -49 -42 163 15 -5 174
6346 174 -15 65 283 -117 -10 -144 -214 138 -274 -302 157 186 -140 -24 -203 0 -158 -138 -159 115 -62 -47
6368 -47 53 -42 -40 -71 -10 -173 7 -21 164 -63 81 -494 166 204 31 391 -61 -165 -456 -43 -48 -124 -112 229
6392 229 -122 36 120 59 15 -63 -113 35 89 -174 158 -91 28 133 65 159 -3 153 -32 -50 108 19 -288
6415 -288 -159 -20 -229 29 185 135 -75 -65 -50 53 282 -125 62 -175 110 -54 105 103 57 206 264 143
6437 143 80 -257 114 51 -18 39 -173 -64 300 127 246 -261 59 -136 -193 -185 175 228 130 14 -194 34 152
6460 152 -15 -93 -5 2 -106 53 -140 288 51 -23 93 -42 194 -310 -96 -76 -33 -151 85 356 20 -57 -137
6483 -137 -60 -280 -80 61 -54 16 -194 -99 197 -124 -175 -110 -47 164 84 145 58 -277 -45 102 262 114 -31
6506 -31 -425 213 -38 39 83 137 161 87 109 -93 -150 -92 -254 224 200 -89 105 80 -195 -181 -46 -39 -2 -84 40
6531 40 112 -70 -142 63 114 -18 162 64 136 332 -210 -222 47 -104 -41 -233 -82 108 -178 103 -206 -110 122
6554 122 -175 111 310 -62 74 -301 -9 322 63 -122 231 99 144 -29 71 255 -126 -116 117 -300 94
6575 94 -8 -150 -11 -196 94 289 -235 77 -66 65 -122 42 -102 2 85 -14 51 -63 202 118 231 -123
6597 -123 -19 216 -28 1 59 -176 230 152 -175 20 124 76 12 -139 -99 -13 -307 75 87 253 194 151 -49
6620 -49 76 -49 16 155 45 87 -75 -1 109 227 173 71 -193 -95 36 48 138 115 87 -70 -244 -34 10 106
6644 106 -156 -6 -59 145 -235 315 38 -102 -146 -135 -36 114 39 214 -43 -101 53 318 192 -63 81 -182
6666 -182 22 -101 151 -85 -157 -190 55 -115 -75 178 -55 -41 -87 -36 55 -65 -10 142 -67 -42 -42 37 -96 222
6690 222 -33 352 -23 -57 -147 -27 4 -24 -298 -32 -147 -98 -165 -49 22 118 -285 31 71 -19 -116 -142 30 194
6714 194 297 229 -129 68 80 -118 129 -127 173 -130 -103 94 5 19 169 -12 -31 -6 -35 2 113 -76 152
6737 152 54 11 -334 -197 47 91 62 0 -37 94 -17 -64 103 -1 68 89 -205 -10 33 22 136 -133 252 335
6761 335 45 -173 122 -84 166 -367 5 -119 -48 -117 126 -232 78 5 369 166 -32 -46 182 -165 -49
6782 -49 123 -49 213 -73 -84 -80 125 -44 252 32 16 -85 -20 164 -54 -125 22 -168 -175 132 104 267 100
6805 100 -70 181 -91 -66 33 -24 123 56 18 89 -223 -197 233 372 -158 95 56 -129 122 113 54 -115 178 -51
6829 -51 -282 228 -255 -93 -62 -230 -258 297 6 -49 -80 92 22 -64 62 -90 -190 -42 153 52 -41 120 -159
6852 -159 151 -204 -22 -85 -184 65 -354 -244 -41 61 -67 19 -109 184 168 186 -177 52 -147 78 15 137
6874 137 -71 -90 103 117 44 24 92 -19 361 -28 -109 -1 -14 38 180 52 -118 -156 -182 -52 -183 -163 -259 -86
6898 -86 -173 -41 51 24 107 20 -210 0 322 291 -124 277 63 39 -175 57 -34 65 197 -114 368 20 101 -3
6922 -3 101 -113 -238 -35 -222 -193 64 35 333 158 -135 36 135 -168 -120 -165 15 154 21 -45 -257 -116 26
6945 26 288 90 -25 -127 -92 -93 -90 35 8 117 226 -136 54 122 70 -119 -142 36 -28 -9 159 26 29 86 210
6970 210 40 -186 16 -2 -26 -143 4 186 11 108 91 -31 256 -41 59 179 -26 -129 -42 106 218 -258
6992 -258 -42 -216 151 -158 -116 6 284 27 5 37 327 -70 62 -89 130 209 82 164 129 142 87 -198 85
7015 85 -320 112 24 48 49 1 -222 110 -56 44 -68 -68 96 265 65 98 -45 154 196 -57 116 -46 124
7038 124 -18 -223 54 362 -19 401 -237 -67 -78 -272 80 -204 73 -77 -49 243 147 12 115 -225 25
7059 25 -45 76 -148 -26 106 63 81 149 2 -228 39 244 105 -174 37 -116 15 136 -40 -140 -68 56
7081 56 -63 12 126 -164 103 17 112 -137 -226 -29 -122 -73 -71 192 168 -38 307 -136 -131 44 -21 -148 -86 -149 133
7106 133 85 111 -166 158 -144 -91 -47 18 -164 -190 -227 -218 -124 -153 107 41 40 27 418 12 89 -196 -60 255 78
7131 78 64 -35 111 8 190 -194 -13 104 63 3 -188 -154 58 -167 -58 -343 -177 184 -98 34 235 8
7153 8 -57 -77 -49 319 -10 24 12 -236 365 -204 40 44 -48 76 4 -1 -69 -294 -60 108 -25 87 -150 -303 -46
7178 -46 -59 -69 -196 26 194 48 95 34 26 76 199 78 45 125 174 -14 -37 -389 -162 223 -64 -41 -98 -20 -105
7203 -105 -124 58 -57 -195 150 170 -49 53 -10 152 -96 -88 298 -60 27 -121 -19 -286 68 47 189 126 21
7226 21 -31 124 7 147 0 -89 -33 -116 187 26 87 183 3 -57 5 72 46 -36 -150 -51 29 -66 -4 79 -87 -109
7252 -109 -258 -29 235 29 -7 -15 147 2 35 22 111 110 -19 54 -186 270 -108 -6 -70 -160 -37 -191 96 -52
7276 -52 -76 16 -16 -63 32 391 -72 -184 206 -172 -3 -105 -174 0 -80 37 -123 55 38 -67 189 -120 -227
7299 -227 98 -24 112 -310 -39 240 -171 10 -236 -356 77 33 -40 -233 -130 138 -71 107 88 66 -250
7320 -250 181 -71 20 53 -61 13 56 -88 -76 79 -165 145 173 31 -51 -55 -102 -58 210 92 -137 -134 110 -9
7344 -9 -103 316 -103 26 -1 -134 137 26 -24 61 -74 93 0 -209 -42 103 -58 25 -73 16 76 -27 362 -88
7368 -88 241 -45 111 65 55 -49 49 219 -30 -97 34 -177 -83 -75 87 115 -101 127 134 7 105 33 9 3 -51 -162
7394 -162 -139 247 -277 -17 37 37 7 -85 17 -81 142 25 -101 100 -120 -268 239 -42 -184 -19 133 107 32
7417 32 -88 -84 -19 108 -83 19 170 104 242 -19 82 -15 26 -139 108 62 219 34 389 -29 54 -395 230
7440 230 59 138 97 -70 -229 88 -241 94 -56 20 -155 -122 12 -108 -37 72 -149 -171 87 203 -169 -100
7462 -100 2 -23 -68 -71 47 80 -116 66 -97 106 228 111 84 7 -76 -14 76 -39 -174 -76 132 -292 100 219
7486 219 -148 1 71 -32 -26 -87 7 -31 -51 64 56 -10 120 -142 78 -214 206 -123 36 -23 -81 -179 -2 59 -171
7511 -171 257 -258 -11 -2 21 54 352 -130 101 294 -17 41 178 -151 -85 -159 79 -101 -75 95 110 -5 225
7534 225 -9 150 -25 -7 -68 -205 -130 162 -110 -180 112 -172 -116 -264 194 -173 -12 -275 -162 -78 -87 5 -31
7557 -31 299 108 -169 -86 21 148 21 -9 119 104 -24 170 6 38 143 102 230 115 -149 -122 -188 -117 -167
7580 -167 -308 247 130 -176 -41 -29 102 4 -91 -26 -162 -168 -8 209 -28 -55 91 -196 -39 28 24 -42 -142 14
7604 14 110 77 5 -227 -37 -207 -279 95 -53 115 -79 -156 -125 7 -72 169 -165 -118 -86 -70 240 -50 36 -45
7628 -45 -208 13 -174 -101 126 19 -73 55 174 -172 136 -145 2 296 65 -245 -13 84 196 -73 -110 -12
7650 -12 -270 84 -168 -90 -18 -263 57 60 -68 -186 67 -182 9 73 -394 127 98 -7 318 134 111 -164 46
7673 46 164 -112 172 69 -297 -53 20 9 55 23 38 59 -2 -176 349 -18 -171 122 -119 200 -27 -31 121
7696 121 95 58 105 -51 -182 -102 -122 59 137 156 51 -108 -175 95 -130 -253 149 110 -74 85 -161 -235 -165 13
7720 13 -152 54 -177 191 -166 -73 -200 -66 -118 -207 -101 109 -2 34 53 -11 281 91 35 -56 181 -204 -129
7743 -129 241 -340 -36 123 -106 -34 -108 -14 5 30 -3 1 20 -173 -101 -75 -96 -282 -91 179 -112 -60 176 40
7767 40 -187 214 93 135 -85 101 -209 68 -139 -28 -137 16 -155 5 -272 18 -27 -117 -55 89 -29 77
7789 77 -55 -171 -127 -67 157 140 -96 -102 63 -113 -149 25 12 -83 18 -97 142 -279 -265 -136 137 240 -33
7812 -33 152 -41 -90 50 -19 -87 -106 51 58 175 -78 -49 84 69 93 -109 8 83 -89 85 233 62 49 98
7836 98 157 -250 -65 -124 -250 165 -55 -179 -60 2 62 188 -150 169 249 56 145 248 -72 -191 -28 -99 78
7859 78 256 71 -144 -115 -38 138 -90 -189 -25 -44 43 62 182 139 126 -44 151 15 -31 8 -163 -217 62 48
7883 48 203 10 50 139 -96 78 -76 -139 117 126 143 40 203 -61 138 -90 -44 4 -54 44 42 113 52 151 -19
7908 -19 12 51 -288 86 -57 -155 -29 25 -98 -142 -139 129 48 -197 -112 -107 35 77 40 8 308 -154 396 -23 100
7933 100 -148 -12 -16 131 -85 -356 21 75 4 -121 -113 38 267 -250 271 -66 16 47 288 14 85 -109 -23
7956 -23 74 -51 -149 101 63 161 -88 -232 -345 -363 228 19 30 -70 220 47 -64 -9 -198 25 -188 195 -112
7979 -112 -35 -10 143 99 -86 33 17 314 133 45 -66 -196 -35 -204 17 -144 -152 -87 -10 -109 -114 68 -357 131
8003 131 -211 -191 34 115 11 -14 40 326 -120 -44 -3 170 -22 169 254 -84 -165 -74 93 -46 211 180 -199
8026 -199 -67 63 -76 -34 -197 -57 -47 96 51 -84 180 -20 207 -4 -30 -275 -258 -2 -1 13 182 -457 -77
8049 -77 70 -43 -85 -274 -168 -117 -6 -191 27 93 -174 -91 -196 -44 -35 -140 37 -5 11 -218 -32 150 -184
8072 -184 161 -210 -77 270 -177 105 213 192 169 -120 -157 305 -39 57 -167 111 -130 -61 122 177 377 341
8094 341 39 49 -19 -103 38 29 157 -21 186 -168 -130 -3 19 117 -129 259 38 101 -26 42 72 -11 115 -168
8118 -168 220 157 107 120 26 -124 -27 -155 173 -163 257 53 -5 -137 -187 310 14 -81 -246 66 278 80 267
8141 267 73 -45 91 -242 73 -232 86 -32 -18 -181 -178 -29 -93 -75 -397 -34 23 105 -3 -90 199 33 146
8164 146 70 108 216 329 178 -184 72 107 95 -7 -28 -89 -106 -157 152 -132 -152 -67 -190 -123 -68 -208 18 23 155
8189 155 -15 133
8191A33
$$ Imaginary data points
##PAGE= N=2
##DATA TABLE= (X++(I..I)), XYDATA
0 0 0 0 0 0 0 0 0 0 0 0 0 0 0 0 8 -8 8 -8 8 -14 16 -16 21 -24 29 -32 39 -45 48 -56 64 -73 85 -95 108 -120
36 -120 135 -151 168 -188 209 -231 256 -284 314 -346 381 -421 463 -510 563 -620 684 -755 837
55 837 -926 1030 -1152 1292 -1461 1668 -1923 2252 -2693 3312 -4248 5815 -8916 17313 -86582
70 -86582 -230206 52170 153538 12987 -36121 45540 27306 -24413 36820 49970 -66794
81 -66794 -37057 59331 -345 -73891 -8294 72993 18389 -85621 -25337 69835 25487 -41087
93 -41087 -46094 -22737 -5043 -7027 12786 -240 -38963 6123 51607 26394 9539 2991 5328
106 5328 11710 11867 22484 -6181 -39465 -5740 17297 14088 10069 -1347 15590 16711 -8039
119 -8039 8428 14318 -5672 -14096 -26560 -17240 -2548 -8633 -13926 -31474 -13745 29371 6483
132 6483 -14139 4327 -137 444 5465 1050 3264 -405 3337 -571 -5866 26142 16518 -24423
146 -24423 3910 26855 -984 -16219 -11275 1477 -5385 -12874 743 -11816 -10183 20587 4163
159 4163 -14906 3583 20098 22092 -6989 -17438 16925 17604 -7663 -13727 -1431 16753 -354
172 -354 -14808 8012 1357 -7048 11475 3234 -9703 -3869 9040 12279 -15662 -14553 16742 3547
186 3547 -13287 -3732 1990 1522 -14476 -7644 14178 -8406 -17305 5851 3145 -6648 -5648 4475
200 4475 7834 -9946 2080 18363 -4610 -2351 14089 6041 735 -330 9022 12109 -7342 -3852
214 -3852 5150 -2354 1041 -3818 -6461 1101 -7027 -123 6820 -9565 -5404 3945 2496 530 -8523
229 -8523 143 5681 -8456 187 5330 -3538 3683 2928 1984 4657 -1270 8090 7568 -6908 522
244 522 3052 170 129 -9200 -1233 1576 -8813 1374 1367 -9062 -2892 -1421 1830 -570 -9934 1907
260 1907 2514 -4364 4499 795 -70 6419 2088 7074 3963 -1955 10441 5558 -3705 2049 907
275 907 5432 -232 -10228 1443 1253 -4319 128 -6413 -4142 839 -4337 -90 -4575 -6489 5517
290 5517 -987 -4940 807 -948 4345 312 -3979 7785 2678 -306 6571 1501 3410 3127 -268
305 -268 6224 -1152 -4148 4180 -3609 -3269 -451 -5339 -553 -2957 -3602 3440 -5663 -3621 4019 -2897
321 -2897 -1506 -2460 -2376 4922 -2957 -1884 6013 -51 4257 5247 998 6341 2555 2210 5536 -3968
337 -3968 25 2884 -4572 -1329 -2928 -2416 2462 -5137 -1694 2814 -4695 -581 -1616 -4528 182
352 182 -4959 -2363 1055 -4926 2323 3688 -603 5555 3419 3725 6425 -368 3894 3516 -2802 2553
368 2553 -874 -2499 2036 -3131 267 2111 -4029 1437 -562 -3638 393 -5374 -3140 -1011 -7190
383 -7190 -563 -1100 -4111 3338 137 1195 5806 1458 5019 3784 96 5674 810 -341 3471
398 3471 -2570 1397 2485 -3360 1858 -881 -2784 1331 -3408 -1589 -1727 -6045 -290 -3045 -4519
413 -4519 2440 -3092 -1872 3882 -446 2921 2199 337 4869 516 1354 4431 -1723 1632 935 -2803
429 -2803 4051 -58 -2616 1926 -2525 649 2926 -2020 -324 -2688 -139 4127 -5224 -3257 1074
444 1074 -4121 667 -883 -5244 1014 -257 -639 289 -937 4793 1379 -2093 4553 415 1358 6164
460 6164 -3294 -2434 3827 3072 2679 -3480 -2077 4401 314 208 -2768 -6080 2033 -1687 -6275 -400
476 -400 -4445 -2695 2448 -1012 -141 946 4045 5425 -3508 740 6990 -1869 -1225 -942 -2854 3982
492 3982 1638 -1662 823 241 5574 4272 -974 1047 -2420 396 4184 -7460 -6557 243 -3133
507 -3133 -1245 -2356 -3241 977 -838 782 154 -2703 2759 -1507 -4438 4478 112 -522 5272 1343
523 1343 2054 6731 7238 5234 -1767 1037 4317 -3086 -1836 -3754 -9602 -2083 -2483 -5438 95 -2722
539 -2722 -3664 703 3779 3074 -4689 -1321 6261 -3123 -1585 6003 -1459 -745 4697 4439 4018 1247
555 1247 3853 3729 -3093 1231 1757 -3560 -2651 -6513 -3583 3596 -3323 -4274 325 -816 1351 534
571 534 -1103 -1194 -3887 1455 426 -5407 1619 1108 -2214 4996 3311 1032 5583 4627 3028 841
587 841 2827 4428 -4127 -2040 2957 -4549 -2380 643 -4001 -1613 -809 -1121 -783 -4426 -1491 290
603 290 -1915 95 -4393 -1880 6217 -497 -546 4556 692 3152 4637 1917 733 -935 2815 910
619 910 -4296 1782 438 -5309 691 -102 -1838 2415 -2013 -2935 -713 978 2216 -4903 -3647 2171
635 2171 -1400 697 1519 -3487 1326 2257 -152 2926 1321 523 807 73 3725 1285 -299 2664
651 2664 -2845 234 5515 -1533 -2287 -276 -1301 199 -1252 -1984 -1372 -3920 -367 -513 -2653 2010
667 2010 -2373 -3850 2911 984 447 1600 -956 1395 2262 2730 2779 -2420 1483 4213 -1581 1433
683 1433 1398 -2126 1408 -349 -1208 828 -1680 -750 -1487 -2038 1095 -2895 -2163 1194 -3556 -1128 2168
700 2168 -1776 -201 461 31 2276 330 2019 1680 -910 3767 2234 -1019 1952 -268 915 2513
716 2513 -2462 -602 324 -1163 345 -2747 -1708 444 -2725 -341 -1091 -3788 1416 -496 -2840 501
732 501 -246 1123 620 -1407 2613 1455 1002 2902 -598 1678 3496 -278 1505 631 -1099 1841
748 1841 -700 -1107 444 -1786 518 -1273 -2446 1535 -2118 -2489 419 -2356 -1218 -194 -2201 462
764 462 -741 -32 2362 -801 1679 2802 391 2571 1524 -333 2533 -225 81 1320 -1423 615
780 615 -49 -1484 1404 -1804 -801 1020 -2227 -507 -661 -2768 -38 -1878 -1988 1126 -1699 608
796 608 1592 -509 2502 1001 90 2535 -464 1075 1845 -1332 945 515 -410 2271 -425 632 1809
813 1809 -1053 837 -236 -2597 242 -2315 -2318 -521 -3251 -761 -335 -2175 921 -225 -38 1848
829 1848 -914 1290 1637 -733 1947 737 -450 2208 187 1220 2144 -374 2160 1096 -902 1421
845 1421 -1247 -1257 -202 -2898 -741 -1016 -2757 84 -1358 -1090 1166 -1414 752 785 -1302 1788 234
862 234 -411 2149 -190 1089 1696 -81 2744 994 -179 2403 2 449 967 -1809 51 -805 -2326
879 -2326 275 -1928 -1547 455 -2086 -262 -449 -1231 1218 -1060 -928 1595 -839 874 1371 -810
895 -810 1756 584 565 2123 -185 1407 2483 -396 1383 -28 -667 1544 -1483 -1084 431 -2127
911 -2127 -430 -465 -1922 98 -1569 -737 478 -2218 95 651 -1440 1225 -299 -303 2068 -303 952
928 952 1660 69 2311 702 464 1955 -1005 694 1845 -1809 72 -488 -1366 -134 -1543 -1031 -87
945 -87 -2058 456 -356 -1567 1027 -1033 -677 1464 -1496 130 1233 -806 729 355 1261 1972 -932
962 -932 1360 1804 -729 2498 269 -1609 1316 -181 -18 245 -1916 -45 -588 -1038 533 -2190 -889
979 -889 674 -2266 -72 13 -2545 268 -232 -720 1039 37 1091 679 255 3319 675 600 2497
996 2497 -937 507 2392 -1243 -716 -576 -442 522 -1512 -575 -408 -2177 852 -737 -2538 365 -1860
1013 -1860 -1531 987 -725 -304 587 289 1593 -22 1843 2321 -1383 1280 2654 -410 1096 375
1029 375 -857 1046 103 344 42 -1426 440 -720 -477 870 -3021 -1604 810 -2623 -819 315
1045 315 -1828 -367 -185 1252 940 -1121 1441 713 -147 3189 630 -373 1913 -81 999 2111
1061 2111 -489 -87 -621 759 545 -2014 40 -531 -3305 716 176 -2687 -306 -1048 -873 454 -393
1078 -393 331 -832 -178 2251 -88 694 1972 -1240 1054 2545 -537 811 861 -222 416 275 1163
1095 1163 -655 -2082 1488 -763 -1302 1270 -2241 -1971 669 -769 -686 -662 -1235 117 -709 1005 610
1112 610 -1922 1097 912 -492 2267 457 -724 1453 810 802 1011 181 549 -1156 328 1622 -1975
1129 -1975 -507 160 -2455 357 360 -1963 -939 -1273 -26 414 -1080 527 -1008 -386 2793 -431 -303
1146 -303 2210 -741 722 1988 356 487 -283 955 1243 -683 1345 213 -1828 1271 73 -1159
1162 -1159 523 -1583 -1302 194 -1024 -643 -1239 -923 227 -1413 715 958 -2335 1104 1438 -306
1178 -306 1284 701 8 806 520 1616 334 -563 1365 -275 -160 1207 -1549 -502 293 -1441 106
1195 106 -246 -1518 -838 -1258 99 -419 -1765 905 -320 -1396 1560 82 -569 1043 -73 1083
1211 1083 630 -93 1201 -198 902 1563 -675 967 719 -1240 1162 -63 -980 297 -1243 -724
1227 -724 -642 -910 -23 -1875 -1242 1175 -927 -446 607 -838 764 748 -207 1206 273 637 1303 -5
1245 -5 1315 909 -360 1703 -391 -253 1296 -754 -493 252 -807 -144 -941 -776 -17 -1703 -249 23
1263 23 -1600 419 -199 -786 1081 -460 -112 756 -673 773 579 -232 1283 120 586 1629 -382
1280 -382 895 924 -682 655 -32 -421 291 -1420 -178 -495 -1378 229 -1027 -1253 -62 -1077 -257
1297 -257 127 -857 591 143 -196 1370 -281 715 1220 -182 1586 894 81 1658 286 215 782 -691
1315 -691 471 6 -838 633 -668 -765 347 -1221 -421 -387 -1501 348 -550 -1276 482 -972 -173 674
1333 674 -538 921 347 -218 1481 58 463 1202 -298 805 520 81 983 -332 -337 523 -790 -307
1351 -307 -199 -1072 38 -1001 -1169 156 -1009 -602 -228 -1095 347 -181 -382 1029 -310 168 1223
1368 1223 -6 910 726 24 1372 -232 405 1016 -363 303 302 -736 513 -640 -655 154 -1450 -490
1386 -490 -331 -1350 73 -574 -765 296 -853 63 382 -731 672 195 -24 1207 20 528 1057
1403 1057 -79 1124 582 -245 750 -95 291 496 -802 249 185 -1125 311 -814 -1098 -119 -1099 -233
1421 -233 -53 -818 402 -380 -281 875 -564 537 841 -564 1205 732 169 883 477 420 902 -221
1439 -221 1013 53 -468 607 -664 -583 198 -1155 -353 68 -894 -53 -834 -681 -35 -1128 111 111 -1003
1458 -1003 871 97 -243 1263 47 234 757 106 1087 185 -64 871 -216 285 544 -984 197 26
1476 26 -1105 295 -590 -1009 -259 -1081 -140 -597 -1016 132 -666 -382 974 -476 -8 829 -350 973
1494 973 915 461 476 -122 809 898 -175 925 327 -869 1020 -179 -517 253 -920 25 -191 -561 -353
1513 -353 -1236 -474 197 -1112 38 174 -1319 678 628 -583 557 163 140 459 442 1394 33 -310 1332
1532 1332 -241 569 1082 -580 -77 396 -278 209 -425 -588 -606 -1317 431 -628 -1591 413 -842 -718
1550 -718 760 -436 -290 310 246 896 493 552 875 -653 1189 857 -509 719 422 -366 686 174
1568 174 -390 -257 -535 107 -289 -443 192 -1345 -672 758 -1234 -200 -63 -1081 80 564 222 112
1586 112 -323 651 473 42 1759 86 -378 1588 256 272 1036 -401 -195 160 373 122 -1024 -12
1604 -12 -411 -1282 345 -149 -1582 206 -294 -720 450 -521 -339 -166 421 1145 -106 220 787 -462
1622 -462 1147 1752 -739 471 706 -181 763 422 91 -617 -518 645 -473 -1036 239 -1063 -958 845
1640 845 -1042 -717 -258 -601 58 -66 280 -52 -778 991 497 -348 1362 271 -417 1314 424 381 285
1659 285 -223 274 -172 286 428 -1025 -137 307 -1219 107 -154 -1308 -141 -80 -532 46 -767 63 -293
1678 -293 -48 1235 -481 -341 1043 -200 457 1042 -242 324 686 322 618 23 250 -1 -598 414
1696 414 -300 -863 296 -617 -794 260 -401 -464 -525 -336 162 -532 46 210 -937 602 772 -217 940
1715 940 164 -205 1114 273 422 394 -217 715 -150 -88 636 -1001 -241 458 -752 -212 -307 -1098 -83 -487
1735 -487 -136 -92 -1154 28 23 -358 575 -406 -159 849 134 354 802 54 557 351 359 574 -244 586 266
1756 266 -506 117 -433 -870 29 -777 -417 -7 -743 -271 -570 -650 283 -620 -462 636 -368 211 285 -233
1776 -233 646 198 304 836 -5 683 274 -133 1010 -120 -193 398 -572 69 169 -484 -76 -196 -671 -240
1796 -240 -883 -376 -35 -790 207 -48 -418 553 -58 -272 663 -288 415 651 66 894 259 14 735 -166
1816 -166 523 424 -359 520 -265 -359 356 -526 -372 89 -999 -81 -381 -583 394 -678 -231 351 -476 389
1836 389 273 -55 929 66 186 744 -234 612 558 -306 652 301 1 491 -538 173 19 -926 -22 -466
1856 -466 -414 235 -699 -494 164 -984 65 6 -514 433 -447 128 613 -257 682 445 117 793 210 173
1876 173 1013 -64 282 588 -214 730 -68 -446 381 -739 -230 -85 -663 142 -456 -686 -25 -518 -194
1895 -194 169 -676 193 4 -290 761 101 114 816 30 445 441 89 470 214 199 575 -226 178 -48 -673
1916 -673 182 -556 -503 1 -801 -203 -171 -754 -181 -433 -632 283 -343 58 234 -81 467 155 127 1000 -21
1937 -21 105 1065 -402 428 377 -388 611 -55 -227 609 -382 -2 72 -856 -32 -555 -832 46 -864 -247 -47
1958 -47 -712 -71 -75 -250 647 -84 304 702 -242 555 431 27 902 254 181 733 -138 -28 105 -394 458
1979 458 -497 -620 90 -592 -212 237 -658 -431 -293 -611 281 -723 3 -22 -561 554 193 -168 734 52
1999 52 178 595 110 313 196 12 494 -278 230 415 -755 146 -3 -728 -117 -488 -925 -215 -468 -285
2019 -285 -220 -556 9 -103 -142 750 -38 -64 609 9 545 524 -213 229 90 502 503 -302 510 -192 -416 659
2041 659 -45 -717 160 -478 -376 -75 -539 -296 -528 -200 310 -580 153 267 -789 481 499 -127 406 207
2061 207 136 826 98 188 -223 -93 901 -15 -23 287 -707 -185 229 -620 -312 -724 -553 -389 -634 82 -93
2082 -93 -700 321 -352 -254 778 -156 -67 428 280 466 234 -175 259 -30 785 528 -490 555 323 -447
2102 -447 474 -34 -546 -39 -406 -189 -96 -578 -388 -869 -308 391 -830 -319 203 -698 387 351 -307 -165
2122 -165 128 650 444 187 1034 -159 -49 981 -115 -56 874 -484 3 375 -464 -283 -609 -448 -2
2141 -2 -423 -156 -341 -1068 408 -7 -565 340 -241 -368 379 312 413 -444 -276 621 -418 468 631 -682
2161 -682 491 718 -50 386 241 -456 -1 -103 152 -119 -728 312 -556 -450 390 -721 -365 -158 -582
2180 -582 -74 -167 -90 -71 -58 375 217 -267 637 299 -53 849 24 -299 552 -158 320 179 -96 66 -710
2201 -710 -282 0 -863 -24 126 -991 133 148 -481 17 -406 -97 393 34 691 -141 -154 902 -109
2220 -109 531 524 -430 10 512 73 277 -51 175 238 -442 459 -35 -812 395 -442 -551 185 -599 -466 -306
2241 -306 -518 86 -509 -236 342 -133 515 563 -290 696 381 7 703 279 282 597 -91 318 92 -257 397
2262 397 -354 -246 276 -765 -610 -216 -552 -227 -361 -266 24 -391 -10 488 -333 538 146 196 834 404
2282 404 295 514 -152 381 554 -55 552 -172 -138 168 -359 229 -172 -371 161 -150 -594 193 -560 -335
2302 -335 14 -399 138 -134 -126 335 -447 151 432 -338 390 170 -72 675 165 516 690 -318 419 184
2322 184 -299 308 -192 -128 132 -546 -126 -53 -528 -57 -346 -259 363 -295 -150 148 -389 277 -161 -30 494
2343 494 -142 249 242 -74 260 81 7 522 5 -84 187 -398 120 -18 -453 14 -226 -166 19 -493 -81 147
2365 147 -328 157 -126 -259 184 -175 118 69 -183 322 -32 -7 449 152 310 456 -89 579 52 -90 299
2386 299 -351 6 225 -331 -113 -286 -515 197 -407 -127 255 -320 50 204 -366 288 -4 44 275 -331
2406 -331 485 575 89 562 102 162 589 210 46 312 -140 128 132 -640 142 -378 -125 -136 -657 73 -268 -462
2428 -462 84 -546 -262 5 -213 200 253 -86 230 121 -66 482 36 203 223 -247 462 -7 -236 158 -91
2449 -91 16 370 -653 225 -276 -524 194 -810 -369 -139 -551 -112 -92 -474 121 175 9 412 -270 243
2469 243 138 102 347 -165 1 493 -61 409 591 -374 411 85 -83 175 -342 -262 4 -337 16 -77 -791
2490 -791 180 -296 160 380 -286 132 -11 -31 241 87 -186 443 -184 170 454 -395 420 133 -171 62
2510 62 -29 -266 67 -525 139 -291 -506 182 -469 -139 372 -778 38 30 -375 165 -29 -422 73 -421 543
2531 543 294 -395 858 44 52 804 -106 120 300 -34 173 -9 -268 -26 -448 -58 468 -459 -39 67
2551 67 -588 49 -50 -74 -256 -562 400 171 -199 479 -194 16 611 -84 169 440 103 377 273 145 306
2572 306 -272 307 -126 -273 381 -288 -311 163 -423 -134 -243 -605 -280 -290 -245 -177 -455 -239 228 -244 462
2593 462 93 -168 801 151 152 729 315 13 -94 198 482 -253 -189 249 -436 -172 543 -523 -47 -228 -207
2614 -207 244 -119 171 -523 -437 421 -29 -332 305 -246 -137 301 -77 116 188 -305 375 65 419 389 -234
2635 -234 377 380 -346 352 -151 -330 17 -50 -258 -396 -486 1 -244 93 352 -663 -137 330 -371 105 299
2656 299 -277 167 148 424 489 -210 327 198 -165 608 -146 -180 701 -167 39 325 -241 -299 -249 -415 38 -182
2678 -182 42 -56 -590 110 161 -199 300 -67 8 395 -170 201 -225 260 235 -504 488 469 -503 360 516 20
2700 20 69 18 -326 33 129 248 -259 -486 -68 -524 -180 80 -516 -469 371 -572 230 42 -284 131 183 245
2722 245 434 -4 420 134 -155 667 -47 -408 474 -223 86 145 -444 -187 -347 -41 111 -327 -406 -247 -417
2743 -417 0 -147 -425 95 -147 277 284 -112 451 21 120 627 17 234 403 16 279 489 -70 160 130
2764 130 -170 -85 -472 -164 -293 -237 75 -297 -274 111 -204 -309 103 75 56 -150 118 373 -202 419 359 -152
2786 -152 531 272 -27 222 -95 -141 50 -241 -75 144 -263 -39 -447 -289 173 -530 -58 195 -410 127
2806 127 290 -413 179 -369 204 145 -131 152 -99 -29 440 183 79 -39 219 70 159 -147 316 -126 44
2827 44 135 -222 -140 -7 -511 -145 -177 -364 76 -395 -316 11 -381 96 -144 -289 585 -200 108 295 -292 338
2849 338 191 132 291 -119 21 337 -281 1 70 -277 -132 -233 -460 67 -440 112 -125 -360 138 38 -576
2870 -576 109 -73 -226 -78 -435 319 121 -219 279 -138 76 217 -387 76 167 -16 198 12 -157 233
2890 233 -430 -88 21 -54 156 -290 -479 -12 -95 -158 -29 -194 50 -110 -275 43 -130 141 217 -388 427
2911 427 118 162 419 -29 150 346 -104 29 66 -54 172 348 -431 141 -67 -289 -4 -403 241 -287 -410
2932 -410 244 -252 -127 136 -145 552 211 -102 453 154 -40 675 123 244 204 -417 429 62 2 257 -137
2953 -137 -74 127 -351 123 -205 -283 -4 -628 -126 -196 -330 367 91 -211 30 -283 -135 293 -101 318 158
2974 158 154 578 35 217 137 105 137 -16 3 14 -128 -195 92 -278 -160 -140 -377 -71 -156 -57 117 -180 125 191
2998 191 -390 157 160 -317 267 -22 116 -17 -137 685 -17 -12 586 -21 88 94 -140 -2 32 48 -84 -84 -104 414
3022 414 -341 -203 -99 -323 357 -217 -168 -24 -187 -30 229 -19 268 133 207 323 301 130 51 -89 395
3043 395 440 -41 244 -125 -219 245 -84 -187 -349 -257 215 -202 -329 36 -217 -29 -34 -175 181 -17 -137 399
3065 399 -1 186 151 -11 461 105 123 624 202 130 341 24 5 -4 2 -50 9 49 74 -535 -59 -258 -339 216
3089 216 -58 -53 81 -113 43 -70 -91 228 -115 167 182 -195 179 281 -122 192 220 109 132 -59 -144 64
3111 64 -94 176 -502 -158 32 -385 -134 -157 -419 -172 93 -309 -107 -345 72 -50 -287 320 -42 -366 60
3132 60 343 -49 259 -221 237 100 164 254 6 43 172 -128 -192 291 -463 -262 -91 -477 258 50 -126 203
3154 203 -407 76 -158 -171 -72 -45 -22 387 -179 -156 639 19 425 234 -15 165 -6 195 343 -89 383 -8
3176 -8 -91 186 -126 -320 -384 -431 -420 121 -203 35 -60 -552 201 -73 239 38 -230 467 -12 81 78 -300 -40
3199 -40 159 -260 387 -177 -27 482 -8 -51 150 -383 -198 29 -47 -29 -561 -191 -57 -206 68 -32 -512
3220 -512 289 -112 -33 341 211 -34 -1 -72 346 95 248 192 -296 342 169 -53 134 -147 -280 110 -124
3241 -124 159 -312 -19 -101 -229 -149 111 -143 6 189 -17 -70 429 -500 114 101 -132 468 -132 53 216
3262 216 3 307 -241 -28 529 -7 53 250 -74 18 -131 -81 180 -183 -51 4 -440 154 61 -252 128 -23
3284 -23 -238 234 -107 -24 406 118 415 50 160 339 -256 29 227 -372 17 274 -85 170 -224 -20 -211
3305 -211 -149 115 -152 -191 80 -199 -85 114 -205 -341 -138 47 92 11 -8 209 -105 113 219 -19 204 51
3327 51 -151 240 309 91 -17 -183 259 -96 -320 -14 -107 -51 -85 -131 58 -263 -417 282 147 -111 224 -96
3349 -96 151 126 39 401 171 372 438 64 -55 188 -145 101 -125 166 89 -90 -8 51 -328 27 -176 -486
3371 -486 -298 -150 103 -58 -144 274 82 -347 92 -59 325 439 -156 52 20 109 172 212 109 156 -233 -27
3393 -27 11 -178 140 -371 -101 46 -278 -154 252 -294 -243 -81 -135 48 -178 11 248 -262 -22 114 193 328
3415 328 -128 22 281 -83 95 238 67 182 10 31 381 -96 169 -87 -388 -47 -131 13 121 -94 -31
3436 -31 159 -362 -14 -113 20 382 -158 36 311 14 263 268 -66 224 -52 268 388 88 179 369 -182 110
3458 110 -111 -256 185 -214 181 52 -241 -105 9 -38 255 -228 23 135 -168 -50 -144 -192 264 -171 -63
3479 -63 100 174 -142 173 47 171 -98 -120 269 -306 -201 -6 -283 191 -192 -475 -131 25 -282 50 -116
3500 -116 -40 -297 -123 207 -217 105 272 -148 338 135 -149 379 28 224 -31 -49 186 -75 -25 6 -140
3521 -140 -33 328 -189 -205 -53 -394 -108 -375 -488 29 -184 -365 28 -418 179 -23 -112 24 6 91 -66
3542 -66 56 -57 -121 114 9 -140 -47 258 -156 115 83 -271 69 -142 -48 40 -173 -109 2 -185 212 -261
3564 -261 -231 26 6 6 353 -91 35 166 52 341 296 101 204 -308 59 306 -144 235 -14 107 -80 -301
3586 -301 -3 -53 -9 115 -240 -156 294 -183 -282 226 -71 113 -125 27 51 -24 42 12 -4 273 37 160 389
3609 389 47 -210 407 -144 -128 -22 -29 -19 -223 -23 -32 -451 -146 47 -310 347 -235 -176 10 -43 26 78 -46
3632 -46 161 -59 23 450 46 14 363 57 363 398 -75 3 165 85 175 -210 251 -148 -352 224 -360 -227
3654 -227 2 -233 -250 -116 -212 -49 -224 -27 -72 91 209 241 -86 359 -18 -13 445 108 -176 228 155 12
3676 12 226 12 -85 -286 -32 -197 -387 -191 206 -250 -133 69 -273 101 88 -45 60 -92 165 -58 188
3697 188 511 -177 126 107 -97 60 -7 -156 -33 -82 -1 52 -155 6 -189 -199 -53 -163 -424 196 -155 82
3719 82 28 -248 135 -308 54 243 -131 279 130 86 357 21 79 202 106 216 163 61 49 38 -107 189 -144
3742 -144 -185 110 -280 34 -112 -359 -273 -303 -195 -53 -113 55 105 -159 78 -50 161 130 101 -295 179 203 201
3765 201 22 -23 174 -262 283 86 -195 39 -174 -291 110 127 -282 125 -307 121 77 45 146 -71 178
3786 178 91 -329 330 105 -253 -1 324 -207 100 -40 254 49 -160 8 31 -22 234 31 -4 298 -261
3807 -261 25 -129 -38 27 -439 -20 -112 -114 -94 -198 72 -48 1 -201 204 -71 171 94 -152 82 -81 314 247
3830 247 22 41 -133 -20 51 316 79 58 -35 119 -52 -142 14 -93 -364 -107 -189 41 172 5 140 480
3852 480 103 40 250 -103 38 -7 155 -163 90 173 -16 -59 55 -11 -243 -97 -229 92 -255 -267 329 -221
3874 -221 -25 -124 -130 -21 -87 -76 345 -291 52 196 -60 -6 115 102 469 10 44 22 -95 78 204 -82 226
3897 226 5 37 210 8 -61 90 -43 125 220 -239 -97 -270 -252 47 -124 -179 203 -168 72 -117 102 38
3919 38 -187 347 -255 -28 154 -199 340 12 64 70 144 -34 -83 2 -121 -209 39 -74 -357 67 6 -112 -147
3942 -147 -36 22 -284 189 12 -177 182 -84 343 127 15 186 -299 106 126 -130 359 43 -212 -174 -72
3963 -72 53 -200 -339 57 -70 -357 -55 -173 96 114 -27 170 -114 -151 -14 -220 19 -7 74 -171 154 109
3985 109 -34 -100 85 173 178 188 202 -271 55 -132 -41 317 65 -34 -193 -440 127 201 -156 44 -120 -120 28 -32
4009 -32 -10 -3 -2 214 197 199 131 -45 -129 -130 8 209 -29 -127 147 -26 51 -146 -362 -83 18 -5 -41 -180 -118 -33
4035 -33 -93 -77 -37 -194 136 -67 132 33 -255 205 269 42 171 229 246 103 200 177 -17 -74 163 -188 -223 228
4059 228 -274 93 -102 -155 49 -168 65 -179 -394 261 85 -27 20 -177 76 237 -42 -92 101 110 152 273
4081 273 -112 58 58 -50 -95 93 74 -238 -56 -74 132 -238 -203 142 -165 -27 -42 -279 -88 35 39 135 96 269
4105 269 92 113 91 132 137 -78 -196 268 -79 251 23 -274 117 -105 -97 66 170 -199 -62 60 -88 -320
4127 -320 33 0 -68 -45 386 -113 258 -89 -76 332 127 107 -19 44 122 23 269 214 158 -146 249 104 -5
4150 -5 107 -11 111 -70 -211 -106 -263 -126 -297 -113 280 104 -24 6 -34 129 -152 234 -39 95 30 287
4172 287 42 20 301 121 267 81 -138 -153 371 0 17 -169 -383 -325 -164 78 -220 -431 132 67 -247 112
4194 112 -227 -156 140 -189 88 135 66 -71 20 338 81 -182 178 49 -111 275 -152 72 -74 -206 -68
4215 -68 -131 -52 -9 -137 90 74 -195 11 312 25 115 -97 -67 -36 -57 70 -11 13 201 -260 32 296 -176 83
4239 83 75 -81 83 209 4 251 -115 -68 109 -316 174 -16 -390 -108 34 37 65 -29 -115 -35 -42 -131 46 -18 -106
4264 -106 -4 246 154 -112 11 52 -71 268 230 -215 -71 40 130 -185 -280 -294 -202 -83 -30 -255 -35 -107 -220
4287 -220 -53 -362 -91 -195 -167 15 28 -151 266 45 3 71 143 -187 -1 83 -63 -127 27 304 -78 -286
4309 -286 27 -311 -3 -38 -121 26 -383 120 145 -382 -178 3 -90 69 -127 56 -29 -49 -21 -119 -58 110 84
4332 84 210 -60 -131 268 -92 -164 351 -103 -166 90 -72 81 96 36 -29 -25 -23 -73 18 -43 128 -80 54 202 15
4357 15 238 -126 85 -32 63 253 8 174 295 -73 -27 -14 38 116 -174 3 -22 -166 -196 224 -79 -6 -129
4380 -129 -228 -98 -16 54 215 -102 4 317 -208 90 57 47 122 1 114 139 -18 23 152 -34 -80 176 2
4403 2 -58 -11 47 71 100 170 -128 -9 287 -64 -362 60 87 270 -98 -364 90 -48 23 184 -204 47 -64
4426 -64 -158 159 11 -15 -135 37 5 -51 -307 170 198 -59 -108 -290 -109 -75 -213 -58 -223 -335 183 -471 217
4449 217 182 85 -134 -28 134 -87 -36 67 -59 58 106 187 87 168 -168 -159 -29 -138 -248 232 -31 -114 121
4472 121 -292 -42 -243 -3 -273 -37 362 -24 -35 235 -19 143 71 233 367 -57 -155 346 -28 236 -54
4493 -54 -152 11 150 -6 88 -195 0 123 -22 55 -149 -231 167 -89 -153 -62 -118 93 -150 -190 -59 -134 225
4516 225 134 -176 104 180 13 42 -60 -323 199 -13 186 86 30 77 -148 -309 -52 -390 -137 -35 -289 -257
4538 -257 -4 205 176 -60 312 126 -93 18 22 -75 -24 10 -8 -92 188 73 201 22 192 -64 -69 183 -131
4561 -131 98 1 -75 7 -86 -145 -5 -196 -117 31 181 215 -72 -11 265 -119 -265 -207 -48 -191 93 -116 153
4584 153 15 25 264 -218 44 -51 -129 102 221 -53 28 -112 -33 -152 -233 161 -288 -173 -41 -92 128 128 -147
4607 -147 431 -111 -181 170 135 178 417 -189 27 347 -87 383 -162 -27 180 -110 142 76 -102 -184 166 -180
4629 -180 38 -303 -99 67 -20 113 7 -51 169 -104 53 -94 57 37 -121 -146 -40 29 -248 355 -256 397
4651 397 -377 -45 -5 53 -5 67 -126 48 -7 -80 65 -98 -204 362 55 105 24 -134 -45 36 -193 152 -28
4674 -28 116 156 -153 -7 61 216 45 -80 -97 63 -103 175 -54 -271 -1 122 -260 -165 -164 114 137 80 -279
4697 -279 84 -242 24 -198 -154 8 -58 -84 74 117 277 -69 -32 35 16 188 -131 -24 125 15 -91 60
4719 60 -123 -168 118 6 -65 -262 -216 242 -123 -10 -10 -227 -151 14 -62 190 264 185 106 78 -34 -4 -81 197 -54
4744 -54 58 245 -283 209 -4 74 -248 41 -131 14 -188 133 -61 -350 -141 -330 -151 185 -108 28 310
4765 310 -78 138 -62 -56 201 95 82 57 -30 -62 -76 60 -89 215 -233 -56 -196 -6 -37 -111 130 -13 -163
4788 -163 -221 115 -81 -189 -119 277 -196 -64 78 -8 22 151 185 -252 55 231 123 -115 -141 -282 -14 -225
4810 -225 -262 -256 -176 60 89 275 69 -32 -136 -87 116 -26 -130 65 -206 129 -308 -69 -5 48 65 -162 -26
4833 -26 289 307 30 166 41 -81 158 -42 -26 -166 -24 -121 -140 29 -25 92 -192 362 -132 180 -64 -149
4855 -149 39 84 -328 80 -306 66 178 79 123 -5 30 -126 -23 134 71 -2 -56 87 -15 19 -19 -111 -127 104
4879 104 114 171 -270 84 -42 127 195 44 -104 137 -69 254 219 102 26 84 -39 118 202 39 147 -17
4901 -17 291 -115 -77 351 -111 -86 216 182 113 -210 -168 -3 -139 -51 53 -40 293 6 -125 -24 109 61 73
4924 73 -105 65 136 -226 -119 -198 107 255 4 -100 -7 38 120 -6 -93 33 -29 -108 -84 -245 137 -87 -48 -219
4948 -219 48 -149 -20 -171 -93 43 -40 -78 181 328 128 10 294 -310 186 -51 48 186 -66 81 83 97
4970 97 -112 -185 -138 -35 -202 -116 -178 -144 35 -105 21 -171 140 -85 -188 274 -141 -100 -8 140 -163 13 -208
4993 -208 233 -114 -99 -199 189 -34 -72 -71 53 101 85 96 301 66 -18 -11 82 -90 96 116 -23 -58 -61 -65 -11 -128
5019 -128 219 21 -101 105 -66 232 133 -11 90 230 -232 270 148 -143 -13 -207 -160 38 -40 -161 -12
5040 -12 -164 -119 -3 -47 -52 -195 -50 -46 176 138 245 -34 -97 104 41 124 -18 264 58 -13 -10 -150 -75 70 -230
5065 -230 21 -135 -30 34 -87 61 -2 -130 -229 -115 -186 147 -16 184 -184 70 -61 158 190 290 -10 261
5087 261 243 -102 161 85 107 73 -49 -96 28 -345 -208 -274 -141 -97 -88 -403 -81 -91 -185 -13 -221 62 -224 68
5111 68 -124 -188 -92 -122 -26 -267 86 -201 78 -44 -306 -308 119 110 155 -179 133 -20 -138 62 -109 81 68 -178
5135 -178 -142 -218 42 105 -107 146 168 160 -28 94 6 171 -109 -207 205 42 129 -14 65 269 83 34 -242 -25
5159 -25 78 147 -105 -194 -64 -333 26 -77 60 92 -89 78 105 -148 34 9 -138 147 22 -46 -33 47 39 -301
5183 -301 -54 262 -50 244 -201 78 -16 134 -49 47 -14 102 117 -202 -91 -185 -171 -42 12 -66 -87 -186 81
5206 81 -60 -55 56 -44 -117 249 -71 -128 99 210 99 51 -79 26 -37 -222 124 112 -29 -2 -158 -174 207
5229 207 -217 135 -190 221 87 -30 193 105 -191 -67 -75 58 -10 -59 170 445 48 -120 -138 73 116 82 38
5252 38 -111 -398 222 -79 92 2 -71 139 130 35 -297 -165 51 66 -41 40 -28 10 -56 -7 228 -89 67 271
5276 271 -82 150 201 7 -217 14 -298 66 153 -234 35 -87 265 -130 -184 132 -54 -254 311 -120 66
5297 66 -34 275 -52 275 -233 -58 158 -113 354 280 -100 171 59 132 107 -71 195 -94 75 -28 -264
5318 -264 -154 -27 -184 -214 -133 -114 -108 -7 -109 54 -106 236 135 -164 4 -64 121 -144 60 -180 272 -15
5340 -15 143 32 3 66 -74 2 -294 -113 57 94 21 88 23 -96 -54 -169 25 -234 -199 168 -102 5 86 -105
5364 -105 247 -73 -86 178 -4 89 -34 508 -141 117 -43 40 -168 -13 -110 -189 327 5 -404 41 122 -183
5386 -183 -84 194 -175 -110 116 83 87 -29 121 -99 33 159 34 195 268 -90 64 -91 206 53 111 209 50
5409 50 -28 -19 -8 -304 149 -224 23 -74 107 -44 -138 -232 -218 -110 -260 -36 129 61 101 5 21 170 -107 224
5433 224 -174 56 98 18 -82 43 128 76 93 -155 184 175 -80 -181 -231 126 7 -163 -193 8 -183 24 -134
5456 -134 139 6 165 -164 199 -353 -316 -155 408 398 62 174 201 -275 171 -269 -201 -12 -42 133 -122 34
5478 34 -74 -220 -251 14 -46 7 -110 -154 -44 -187 -55 143 -119 4 -8 116 -246 25 118 296 1 -127
5500 -127 -120 90 59 -217 -39 302 37 53 -63 -65 69 -213 119 290 -152 -22 169 -114 -82 -75 -144 75 -65
5523 -65 12 181 -116 283 -37 177 -9 221 -111 52 114 64 -213 -120 -88 1 167 -210 -132 -158 -139 -154 -134 -112
5547 -112 -108 -38 -186 74 11 -23 -76 131 155 -17 115 80 266 37 193 14 -48 194 -58 249 -70 -5 -128
5570 -128 212 -66 138 121 139 -153 -217 185 -164 11 210 -129 247 26 149 -9 11 64 137 185 36 31 -81
5593 -81 18 -72 8 155 212 -36 -102 -6 -46 48 25 6 -96 55 17 -26 -146 9 -147 154 -48 -42 70 -18 -96 306
5619 306 110 116 -122 81 121 -19 5 -309 -45 -144 -11 -147 174 13 35 18 53 148 -67 -278 208 -250 -220
5642 -220 62 -32 -60 -193 40 97 169 350 75 -81 274 203 -152 42 138 172 143 -284 -6 239 -22 266 -208
5665 -208 110 -102 -140 -15 -51 -117 -86 -114 -100 -134 2 59 -26 -198 -110 136 -114 89 -5 45 391 -115 10 -35
5689 -35 -34 143 55 9 -122 -65 -69 -180 48 87 -119 -302 160 -151 -145 188 -28 168 -28 21 287 106 -9 224
5713 224 -26 292 147 92 -27 75 73 103 -48 -246 -60 -212 230 -86 -54 -11 -74 68 -149 -145 -126 91 -46
5736 -46 10 -292 -146 -59 -34 -72 -19 -119 -150 9 60 290 159 -58 -60 -97 -14 114 -126 -170 -99 -104 -10 -162 -274 263
5762 263 -53 141 -208 -34 -89 -263 -38 168 -132 17 -26 29 -60 -353 -30 265 -58 -243 67 203 22
5783 22 73 -49 17 15 167 140 -24 115 -260 174 -149 -127 -45 56 53 297 -1 -79 -147 144 9 -83 -74 -119 -203 223
5809 223 26 92 181 -47 101 -39 56 9 18 -24 -111 34 -51 -347 50 -142 84 75 -42 142 -150 -184 51 -97
5833 -97 114 124 -152 -92 -65 -39 -54 199 327 83 26 -81 -195 123 -1 -78 143 15 81 57 -53 159 137 -57
5857 -57 -49 -244 -31 201 -195 -200 41 29 22 -9 51 -18 278 167 45 -104 -92 -43 26 311 -155 221 -96 -53 -160
5882 -160 -16 -34 432 72 -218 101 160 -96 -264 99 219 -63 -124 153 52 110 -364 -91 145 -95 -170 103
5904 103 49 -20 145 24 256 287 90 251 69 122 257 -139 -104 -111 -238 59 69 -174 -51 -218 3 -230 -46
5927 -46 -40 -195 83 136 -52 27 -110 27 42 -77 42 75 -53 -51 -81 48 89 -135 -30 -136 85 -65 -67 -79 -3
5952 -3 109 -25 144 54 -177 99 -174 85 -26 -9 49 -106 -218 -102 -63 78 265 4 79 -131 91 -12
5974 -12 -106 141 -163 76 31 -100 -82 52 -189 -223 365 103 36 -8 -361 235 36 -186 -97 -30 100 77 94 -126
5998 -126 61 54 316 32 -158 -361 -160 309 138 -147 -148 -20 56 -124 -230 -11 -95 15 -22 23 32 -137 127
6021 127 -383 -62 47 -101 16 95 168 104 15 239 73 -148 -339 -185 16 -43 168 -63 -96 -102 281 54 150
6044 150 -19 -14 -6 -177 -262 95 7 108 -174 -182 -64 -246 -42 -41 62 69 56 15 -10 185 211 -29 32 41 84 142 -229
6071 -229 -53 -40 99 102 65 70 -437 205 55 -156 16 -189 19 -211 103 13 121 23 38 -107 144 -59 136
6094 136 171 70 21 -49 -11 118 25 118 212 -40 -12 -155 236 -220 82 -108 -55 21 205 119 -185 -21 9 -154
6118 -154 126 53 -13 -125 -265 135 -71 -240 -9 -19 -223 19 192 -8 -81 76 144 83 209 29 13 47 -123
6141 -123 50 17 140 -6 -5 -121 67 120 13 -150 -49 200 -336 -148 -131 38 211 23 223 -81 -60 137
6163 137 -112 153 30 178 63 -187 -208 42 23 86 -168 -95 9 -167 -200 -90 -112 -250 -8 227 194 195 313
6186 313 22 44 -31 12 117 -41 30 -33 122 -198 -250 35 18 162 -72 194 -347 150 -63 -121 -102 -212 201
6209 201 37 201 -69 -134 14 34 131 181 -45 49 -35 239 34 98 610 126 -93 199 -92 34 139 -235
6231 -235 -202 -159 -206 -35 -237 51 52 -296 13 117 -343 207 -87 -239 16 126 108 296 169 -63 19 51 246
6254 246 42 251 -42 142 50 -27 21 153 38 -183 -138 -323 107 -94 23 -64 -144 -160 -124 -124 -83 293 -223 -103
6278 -103 106 -106 104 335 123 64 -40 -58 115 106 108 -26 138 143 -106 79 4 -98 -228 -6 -255 -339 59
6301 59 -150 166 -35 -115 -17 164 -20 58 -53 69 -205 -100 3 111 95 -13 1 77 138 235 38 82 51 -281
6325 -281 -239 -99 -92 -26 114 30 168 -1 76 -218 -171 -215 -183 7 256 174 170 128 7 -6 198 79 -51 -47 -65 5
6351 5 48 -58 72 10 21 75 55 -223 246 -184 79 206 -109 113 -186 -89 -35 41 54 122 -60 59 96 -118
6375 -118 386 189 -32 -456 -51 874 -113 1 10 -489 174 -48 -236 -149 -63 -144 95 -170 -41 59 -106 -54
6397 -54 -21 60 -150 -81 -103 -22 -11 -187 -12 -6 -64 -8 170 4 -85 169 79 106 26 151 87 222 -352 -146 -4
6422 -4 -14 -116 -246 -3 -40 1 137 84 -2 -30 -199 53 52 116 21 40 -4 129 -60 116 218 36 -37 88 -93
6447 -93 52 -234 -93 -6 39 198 -7 14 163 23 24 -32 -237 -132 59 314 133 109 94 101 -148 -116 155 4
6471 4 134 -52 387 107 183 -117 -6 -146 -300 23 -202 59 -221 27 -33 -6 -137 63 -124 -117 87 -163
6493 -163 -25 -43 -96 35 63 113 -73 -32 -98 132 109 78 101 -290 218 -8 131 22 -113 330 233 5 119
6516 119 162 177 -217 -64 37 12 68 65 -154 134 69 -83 -211 212 252 149 -11 -77 154 -73 18 -77 -98 282
6540 282 -80 132 109 10 75 -70 -226 -91 -32 -81 70 -67 -126 -47 3 170 21 6 113 110 229 -11 -13 -64 240
6565 240 -62 98 -63 44 25 -142 127 -6 38 147 -133 -260 -190 97 297 -90 82 -4 124 -140 36
6586 36 -135 -89 46 -1 95 -85 -370 -47 38 -73 -168 -94 20 -206 17 -67 17 104 86 -76 46 -304 -15 -39
6610 -39 149 -97 -136 -49 180 -142 -53 -72 123 131 78 -140 -103 245 156 -84 66 18 -95 80 67 -97 248 -94
6634 -94 -250 -182 381 124 109 -19 27 -160 113 -47 17 -148 92 -150 56 72 -59 -84 14 -12 -110 -32 -131 -99
6658 -99 53 -51 84 -13 -31 58 -28 54 271 -187 226 -2 93 67 299 196 104 243 174 47 -301 -289 -205 -115
6682 -115 48 -37 65 49 -17 -62 210 -3 -135 46 91 24 -57 -118 -57 23 90 -51 -122 76 -55 28 207 85
6706 85 9 -93 -70 -11 28 -55 -74 53 38 -211 229 -183 -146 -43 -23 38 31 47 -270 3 331 223 -126 58 145
6731 145 -47 126 -196 135 -16 -142 -128 86 -29 14 99 7 44 32 -225 83 -183 35 -15 -42 282 -16 101
6754 101 -58 -162 87 174 -45 -170 159 19 19 90 107 212 64 -129 -55 -76 -57 -44 11 56 -135 6 -99 -187
6778 -187 202 -77 -12 259 -96 -23 -15 -133 273 -104 -134 -58 24 -224 -160 40 24 167 -35 -185 33 56 -68
6801 -68 55 -60 156 190 -34 -27 -45 136 -134 174 87 -375 115 -113 53 183 -172 80 27 11 331 -18 -52
6824 -52 129 71 -157 356 47 -22 -339 45 220 31 -404 -12 -220 60 363 -191 170 -131 -236 12 51
6845 51 -87 -139 -94 -197 79 -213 -153 309 248 119 206 3 -30 105 125 132 -62 52 61 19 159 81 -89 11 47
6870 47 56 -14 -230 -254 -51 -351 162 57 -134 69 29 -23 121 -151 -66 4 66 -47 39 -85 3 -13 10 -122 -284
6895 -284 -102 -167 145 -32 -103 -191 -7 317 -74 74 21 -112 176 -39 -128 -22 -110 -101 232 100 -77 -461 106
6918 106 -113 94 -48 -60 -163 99 182 1 -96 10 23 228 -206 -56 -120 -90 -347 5 166 247 124 80 146
6941 146 122 41 95 145 102 136 -56 -160 196 -88 13 124 66 267 -86 -10 -254 134 88 -66 -56 -21 -133 41
6965 41 -44 -230 32 -133 -110 -40 -82 25 -88 -108 34 -114 -102 194 -83 200 93 -80 109 -106 -59 -72 111
6988 111 149 155 -23 50 23 325 101 -306 16 218 -39 52 27 104 265 -26 85 15 -267 36 -231 -154 -184 -179
7012 -179 -207 -83 -302 -5 249 -178 249 -280 28 223 35 -76 177 -235 41 147 107 44 121 40 55 -15
7034 -15 115 13 -118 108 64 -16 -6 -84 -141 -165 -78 118 -8 -33 65 -226 90 -27 145 156 -178 -20 46 -171
7058 -171 -276 92 -80 -6 76 280 -50 49 -56 249 49 -354 -46 -97 -183 -37 -28 183 61 49 -76 -59 122
7081 122 -376 195 -20 66 -110 12 -95 -15 -30 -58 122 -99 -82 102 -206 131 -156 146 55 143 -172 -101 214
7104 214 65 -161 115 -183 27 122 -7 11 31 -94 66 -51 -45 6 -386 -49 75 0 -66 -207 106 -10 -191
7127 -191 44 63 72 92 -14 -33 -209 2 -44 -169 -19 64 439 5 -78 107 -87 -77 26 -150 -59 7 128 -12
7151 -12 40 -68 -358 162 16 -37 -290 -40 -157 108 -97 94 105 213 -96 -155 24 61 157 94 2 110 -193
7174 -193 -162 -267 60 -134 -164 266 -169 162 39 -53 75 91 -47 -67 172 128 -1 1 145 -65 -181 180 -194
7197 -194 201 28 133 322 -67 158 -207 -100 31 -18 291 -256 -15 28 120 231 240 -39 81 -253 -32 -134
7219 -134 -77 11 -209 -9 -316 81 -78 143 121 44 131 -121 -203 93 -8 -32 76 -46 -185 146 300 -31
7241 -31 -25 -83 -81 -78 -183 79 19 -58 137 169 142 87 119 -14 55 302 114 78 306 -157 141 27 -208 104 -306
7266 -306 -53 -215 -12 130 -85 291 -61 34 107 -95 42 -5 138 157 -46 98 -81 -232 177 -54 -3 -127
7288 -127 82 -199 40 82 26 268 -156 101 119 -53 -45 102 -8 172 180 -113 -144 292 185 112 236 76 68 -3
7312 -3 14 147 -22 117 61 -121 -106 33 -22 43 1 24 105 54 17 -100 183 106 -30 22 -86 255 -184 16 201
7337 201 -246 154 125 57 -176 -63 100 -136 -102 38 -33 -81 -95 70 -9 12 -13 335 15 -222 109 174 -27
7360 -27 -4 23 77 133 -46 -287 -66 34 -77 83 -207 181 -25 85 -68 -17 165 -95 -160 -154 -12 -107 -91 -143
7384 -143 -97 -1 -231 -26 126 -47 38 44 -267 104 105 75 -216 56 -180 63 -110 -57 12 -69 -80 -64 -184 196
7408 196 -9 -10 19 -221 -6 -160 -236 -102 -26 -63 -202 116 -24 45 -166 219 44 41 79 -175 -27 21 34 91
7432 91 158 -140 14 161 -178 -287 -248 175 -39 -77 -234 43 -8 -208 39 -150 -108 -35 -31 -93 60 183 461
7455 461 -27 174 -67 -17 -120 -51 28 207 474 92 92 -170 -48 142 50 93 16 38 -66 140 -204 85 190
7478 190 -11 102 -165 -16 -50 83 339 77 67 -204 -88 -11 150 109 218 139 154 -175 91 115 41 -47 -33
7501 -33 -19 -201 -1 66 169 -239 -85 115 -202 -198 336 -44 126 16 -79 7 -59 19 -95 120 92 347 178
7524 178 295 19 -191 0 174 -256 -124 241 11 137 -26 -50 -56 -220 261 -12 -116 224 -207 -82 11
7545 11 149 219 -276 -2 182 205 -31 18 151 -216 -180 35 6 100 125 217 -267 110 60 67 -69 44 -26 154
7569 154 150 -11 -106 -24 -91 -209 14 91 65 -103 30 109 -6 -11 86 -25 102 -120 210 232 -216 327 93 -105
7593 -105 -138 -161 -124 52 -66 -184 7 282 110 -27 -270 60 -83 26 13 77 132 -143 400 260 -34 -106
7615 -106 81 -69 -99 -231 22 57 51 113 135 -162 108 -148 -61 -149 -124 -296 -48 -93 180 -136 -11 -56 -64 -31 -39
7640 -39 -73 158 -218 -24 -173 120 -22 -37 279 -47 353 -5 126 -9 158 -62 -86 162 -73 -180 68
7661 68 -171 -58 21 324 -151 16 28 -112 296 17 56 -23 133 27 199 -222 -187 13 35 120 -19 -235 258
7684 258 286 61 -24 -218 182 97 -43 -29 58 150 135 83 -42 65 -96 21 -72 -238 171 25 72 55 151 47
7708 47 209 -29 -18 -61 93 -22 -141 -4 210 -41 214 -67 -87 75 35 -11 -106 361 -76 76 -277 -95
7730 -95 81 42 -50 -452 65 65 -152 32 247 -17 31 23 46 -62 -133 -102 -95 -91 137 -140 -115 -229 -20 72 76 97 71
7757 71 75 214 104 -179 141 10 90 330 133 -27 177 -70 -120 146 113 10 -75 27 -35 -56 51 -321 67
7780 67 59 107 -189 -201 17 1 -150 -90 184 42 65 15 22 71 -41 -137 -32 30 50 -24 -57 11 245 -75 -242 75
7806 75 69 -49 49 61 -76 -46 -153 50 -145 -99 38 -43 162 -201 129 -201 -78 98 222 -50 65 145 5
7829 5 17 53 45 -155 4 -86 126 248 38 114 -77 145 -198 87 -40 -40 -43 64 254 -32 -182 132 -124 -363
7853 -363 -37 29 -55 60 126 -69 -38 110 83 1 -57 18 -300 -147 -10 19 133 120 -114 67 102 154 -145 85
7877 85 354 65 36 333 -11 132 -6 -63 64 -8 -91 -340 -64 -229 -67 -141 -61 -345 -228 2 -87 39 130
7900 130 -38 97 220 -96 90 -45 -37 31 -39 12 -6 -146 -260 158 70 -54 -221 49 32 -116 -134 269 -29
7923 -29 -16 -244 15 250 -123 -139 -35 -53 11 -11 2 162 -50 31 206 -49 17 -81 203 342 -278 -83 -195
7946 -195 -179 -38 23 78 146 173 103 89 -397 32 7 -222 32 142 189 230 227 -169 -44 -151 213 104 -81 -72 -81
7971 -81 86 190 -254 117 112 7 89 57 -182 34 -37 -15 192 -4 -47 113 -10 -37 37 -162 -37 -239 77
7994 77 26 -26 -8 -230 232 148 -107 13 248 -224 74 -279 104 153 -146 118 71 -40 -193 -77 165 -28
8016 -28 146 -225 -2 123 -26 87 -158 -137 -118 -43 -141 -87 155 48 58 71 -190 6 53 -2 -185 -23 -43 136
8040 136 68 270 -398 -71 53 285 59 21 -90 -44 -40 168 -50 18 -115 86 175 111 21 90 149 -31 -39 68
8064 68 55 -7 127 -15 -1 13 80 -56 -99 -258 -62 -149 -48 170 -33 152 -174 49 -114 -134 -20 64 -12 -430
8088 -430 -47 -237 214 -40 140 -36 121 166 241 -11 20 99 -23 -239 -92 -106 -187 -56 -228 -212 -63 72
8110 72 54 -130 119 -11 -43 -161 -105 -166 253 -117 125 -138 131 -40 170 224 -267 -144 -188 111 -261 -45
8132 -45 -168 -158 130 72 82 -195 -173 52 -38 233 28 16 241 138 193 -146 40 -130 -86 -130 -189 -15 -274 -295
8156 -295 -78 97 103 82 -28 201 71 -198 -144 28 -127 -144 115 10 -272 112 -64 -51 -51 103 72 240 122
8179 122 148 -326 131 110 -27 -148 132 107 -129 -58 -58 -82
8191h2
##END NTUPLES=NMR FID
##END=
