##TITLE=1H_Pr 4626-Am
 CDCl3,8 sc, 
 27.10.2021
##JCAMPDX= 6.0         $$ Bruker NMR JCAMP-DX V2.0
##DATA TYPE= NMR FID
##DATA CLASS= NTUPLES
##ORIGIN= UXNMR, Bruker Analytische Messtechnik GmbH
##OWNER= root
$$ XWIN-NMR		Version 3.5
$$ Wed Oct 27 12:00:32 2021 Russian Standard Time (UT+4h)  she@DPX200
##.OBSERVE FREQUENCY= 200.1313468511
##.OBSERVE NUCLEUS= ^1H
##.DELAY= (6, 6)
##.ACQUISITION MODE= SIMULTANEOUS
##.ACQUISITION SCHEME= undefined
##.AVERAGES= 8
##.DIGITISER RES= 18
##SPECTROMETER/DATA SYSTEM= spect
##.PULSE SEQUENCE= zg30
##.SOLVENT NAME= CDCl3
##.SHIFT REFERENCE= (INTERNAL, CDCl3, 0, 15.7039)
##AUDIT TRAIL= $$ (NUMBER, WHEN, WHO, WHERE, WHAT)
$$ ##TITLE= Audit trail, XWIN-NMR		Version 3.5
$$ ##JCAMPDX= 5.01
$$ ##ORIGIN= Bruker BioSpin GmbH
$$ ##OWNER= she
$$ F:/spectra/data/she/nmr/H-F/1/audita.txt
$$ ##AUDIT TRAIL=  $$ (NUMBER, WHEN, WHO, WHERE, WHAT)
(   1,<2021-10-27 11:59:29.79 +0400>,<she>,<DPX200>,
      <created by zg, POWCHK disabled, PULCHK disabled
       configuration hash MD5:
       00 E9 B6 7A A2 85 ED C7 34 08 36 98 17 FE 4E 26
       data hash MD5: 16K
       81 53 8A 48 57 4E 11 F9 81 48 B3 03 5B F9 B9 2B>)
$$ ##END=
$$ 
$$ hash MD5
$$ 6E AD 77 20 3E B3 33 73 36 F2 A1 86 5C A0 42 69
##$RELAX= 
##$RELAX= 
##$RELAX= 
##$RELAX= 
##$RELAX= 
##$RELAX= 
$$ Bruker specific parameters
$$ --------------------------
##$DU= <F:/spectra>
##$EXPNO= 1
##$NAME= <H-F>
##$PROCNO= 1
##$TYPE= <nmr>
##$USER= <she>
##$AMP= (0..31)
100 100 100 100 100 100 100 100 100 100 100 100 100 100 100 100 100 100 
100 100 100 100 100 100 100 100 100 100 100 100 100 100 
##$AQSEQ= 0
##$AQ_mod= 1
##$AUNM= <au_zg>
##$AUTOPOS= <>
##$BF1= 200.13
##$BF2= 200.13
##$BF3= 200.13
##$BF4= 200.13
##$BF5= 200.13
##$BF6= 200.13
##$BF7= 200.13
##$BF8= 200.13
##$BYTORDA= 1
##$CFDGTYP= 0
##$CFRGTYP= 5
##$CHEMSTR= <none>
##$CNST= (0..31)
1 1 145 1 1 1 1 1 1 1 1 1 1 1 1 1 1 1 1 1 1 1 1 1 1 1 1 1 1 1 1 1 
##$CPDPRG= <>
##$CPDPRG1= <>
##$CPDPRG2= <>
##$CPDPRG3= <>
##$CPDPRG4= <mlev>
##$CPDPRG5= <mlev>
##$CPDPRG6= <mlev>
##$CPDPRG7= <mlev>
##$CPDPRG8= <mlev>
##$CPDPRGB= <>
##$CPDPRGT= <>
##$D= (0..31)
0 1.2 0 0 0 0 0 0 0 0.06 0 0.03 0 0 0 0 0.0002 0 0 0 0 0 0 0 0 0 0 0 0 
0 0 0 
##$DATE= 1635321569
##$DBL= (0..7)
120 120 120 120 120 120 120 120 
##$DBP= (0..7)
150 150 150 150 150 150 150 150 
##$DBP07= 0
##$DBPNAM0= <>
##$DBPNAM1= <>
##$DBPNAM2= <>
##$DBPNAM3= <>
##$DBPNAM4= <>
##$DBPNAM5= <>
##$DBPNAM6= <>
##$DBPNAM7= <>
##$DBPOAL= (0..7)
0.5 0.5 0.5 0.5 0.5 0.5 0.5 0.5 
##$DBPOFFS= (0..7)
0 0 0 0 0 0 0 0 
##$DE= 6
##$DECBNUC= <off>
##$DECIM= 32
##$DECNUC= <off>
##$DECSTAT= 4
##$DIGMOD= 1
##$DIGTYP= 9
##$DL= (0..7)
0 120 120 120 120 120 120 120 
##$DP= (0..7)
150 150 150 150 150 150 150 150 
##$DP07= 0
##$DPNAME0= <>
##$DPNAME1= <>
##$DPNAME2= <>
##$DPNAME3= <>
##$DPNAME4= <>
##$DPNAME5= <>
##$DPNAME6= <>
##$DPNAME7= <>
##$DPOAL= (0..7)
0.5 0.5 0.5 0.5 0.5 0.5 0.5 0.5 
##$DPOFFS= (0..7)
0 0 0 0 0 0 0 0 
##$DQDMODE= 0
##$DR= 18
##$DS= 0
##$DSLIST= <SSSSSSSSSSSSSSS>
$$ [...]
##$SUBNAM2= <"">
##$SUBNAM3= <"">
##$SUBNAM4= <"">
##$SUBNAM5= <"">
##$SUBNAM6= <"">
##$SUBNAM7= <"">
##$SUBNAM8= <"">
##$SUBNAM9= <"">
##$SW= 18.0517286264689
##$SWIBOX= (0..15)
0 0 2 0 0 0 0 0 0 0 0 0 0 0 0 0 
##$SW_h= 3612.71676300578
##$TD= 16384
##$TD0= 1
##$TE= 0
##$TE2= 300
##$TE3= 300
##$TEG= 300
##$TL= (0..7)
0 120 120 120 120 120 120 120 
##$TP= (0..7)
150 150 150 150 150 150 150 150 
##$TP07= 0
##$TPNAME0= <>
##$TPNAME1= <>
##$TPNAME2= <>
##$TPNAME3= <>
##$TPNAME4= <>
##$TPNAME5= <>
##$TPNAME6= <>
##$TPNAME7= <>
##$TPOAL= (0..7)
0.5 0.5 0.5 0.5 0.5 0.5 0.5 0.5 
##$TPOFFS= (0..7)
0 0 0 0 0 0 0 0 
##$TUNHIN= 0
##$TUNHOUT= 0
##$TUNXOUT= 0
##$USERA1= <user>
##$USERA2= <user>
##$USERA3= <user>
##$USERA4= <user>
##$USERA5= <user>
##$V9= 5
##$VALIST= <valist>
##$VCLIST= <CCCCCCCCCCCCCCC>
##$VD= 0
##$VDLIST= <DDDDDDDDDDDDDDD>
##$VPLIST= <PPPPPPPPPPPPPPP>
##$VTLIST= <TTTTTTTTTTTTTTT>
##$WBST= 1024
##$WBSW= 4
##$XGAIN= (0..3)
0 0 0 0 
##$XL= 0
##$YL= 0
##$YMAX_a= 170410
##$YMIN_a= -243481
##$ZGOPTNS= <>
##$ZL1= 120
##$ZL2= 120
##$ZL3= 120
##$ZL4= 120
##$ABSF1= 10
##$ABSF2= 0
##$ABSG= 5
##$ABSL= 3
##$ALPHA= 0
##$AQORDER= 0
##$ASSFAC= 0
##$ASSFACI= 0
##$ASSFACX= 0
##$ASSWID= 0
##$AUNMP= <proc_1d>
##$AZFE= 0.1
##$AZFW= 0.1
##$BCFW= 1
##$BC_mod= 2
##$BYTORDP= 1
##$COROFFS= 0
##$CY= 11.3945322036743
##$DATMOD= 1
##$DC= 2
##$DFILT= <>
##$DTYPP= 0
##$F1P= 2.36226072786647
##$F2P= -0.459571619588291
##$FCOR= 0.5
##$FTSIZE= 0
##$FT_mod= 4
##$GAMMA= 1
##$GB= 0.15
##$INTBC= 1
##$INTSCL= 1
##$ISEN= 128
##$LB= 0.24
##$LEV0= 0
##$LPBIN= 0
##$MAXI= 10000
##$MC2= 0
##$MEAN= 0
##$ME_mod= 0
##$MI= 1.114404
##$NCOEF= 0
##$NC_proc= 0
##$NLEV= 6
##$NOISF1= 3.799351
##$NOISF2= 2.8
##$NSP= 1
##$NTH_PI= 0
##$NZP= 0
##$OFFSET= 15.70392
##$PC= 1
##$PHC0= -15163.65
##$PHC1= 25.40082
##$PH_mod= 1
##$PKNL= yes
##$PPARMOD= 0
##$PSCAL= 0
##$PSIGN= 0
##$REVERSE= no
##$SF= 200.130013532006
##$SI= 16384
##$SIGF1= 3
##$SIGF2= 2
##$SINO= 400
##$SIOLD= 16384
##$SREGLST= <1H.CDCl3>
##$SSB= 0
##$STSI= 0
##$STSR= 0
##$SW_p= 3612.71676300578
##$SYMM= 0
##$S_DEV= 0
##$TDeff= 0
##$TDoff= 0
##$TI= <>
##$TILT= no
##$TM1= 0
##$TM2= 0
##$TOPLEV= 0
##$USERP1= <user>
##$USERP2= <user>
##$USERP3= <user>
##$USERP4= <user>
##$USERP5= <user>
##$WDW= 1
##$XDIM= 8192
##$YMAX_p= 0
##$YMIN_p= 0
$$ End of Bruker specific parameters
$$ ---------------------------------
##NTUPLES= NMR FID
##VAR_NAME=  TIME,          FID/REAL,        FID/IMAG
##SYMBOL=    X,             R,               I
##VAR_TYPE=  INDEPENDENT,   DEPENDENT,       DEPENDENT
##VAR_FORM=  AFFN,          ASDF,            ASDF
##VAR_DIM=   8192,          8192,            8192
##UNITS=     SECONDS,       ARBITRARY UNITS, ARBITRARY UNITS
##FACTOR=    0.0002768,     1,               1
##FIRST=     0,             0,               0
##LAST=      2.2672688,     0,               0
##MIN=       0,             -243481,         0
##MAX=       2.2672688,     170410,          0
$$ Real data points
##PAGE= N=1
##DATA TABLE= (X++(R..R)), XYDATA
$$ [...]
1878C83n17m4J13J25m83l2M42m42J48M20j91j44K34J4j72K44k10l9K99K14Kl73
1900iO30k19l47J40M15o51r1K50j11j71k0j79o1M57m1m78L0N35k66J10Q1j42m2
1923a80J10L70l70N2K97j1j30L27l1j82J69j82k49K35J65l71k23M57k97k74J54
1944a64j9j65J55K40l15j1L06j76J09j55K14l8M1J42l96N82j6n46L53J82p5J60
1966D08l31l21M13K81k21j29k55J06k5K79m71k85M14N3j89J83j42k39L37M63k16
1987A13l30N18k27l06M99M06n65j11N65o51J71P09p91o88R51J2k55J55k07p62
2007g94M67J051p47o62O13n9l27R18l71r01N04J035r84R7J000j103l07J505k19
2026G16j181P89K60j456J123J183j372r33J020o5o15J148l43j823Q33J777j544
$$ plain form
1878 383 -134 -178 -65 60 -423 -455 -13 -455 -307 113 -78 -222 12 26 -146 98 -112 -151 148 362 364 -9
1900 -9 621 402 55 195 610 -41 -132 118 7 -164 -184 -363 -424 33 -8 -486 -456 79 -187 -77 4 -138 -180
1923 -180 -70 300 -70 -18 279 268 138 465 434 252 421 239 -10 225 390 19 -204 253 -44 -318 -164
1944 -164 -183 -348 -193 47 -268 -279 27 -149 -40 -195 19 -19 22 164 -232 350 334 -212 141 323 248 408
1966 408 77 -244 169 450 229 100 -155 -49 -74 205 -266 -551 -137 -84 -273 -90 -232 -471 -134 329 113
1987 113 -217 301 74 -232 267 673 108 -3 562 -89 82 791 0 -688 263 275 20 175 -32 -794
2007 -794 -327 724 -23 -685 -72 -131 -458 460 89 -812 -308 727 -257 -160 840 -263 -570 935 716
2026 716 -465 324 584 -872 251 1434 62 -871 149 84 -531 617 274 -1549 -716 1061 -483
2043d83k17P00n28l62J913l60j924Q55J162j001J58J331j517q17J972Qj379J073
2061E84K1j918J141J814j519j134J383n89q83J920m9k546R33J827j363p5J097
2078F44j367n59K257K67k213R87O32j352Q85J476j812q48J699j51r96J396q1k242
2096a378R87J741j541j77R06j247n21K462l66k218N35J243q11L10J310j977p86
2113a528K716m27j341J126j43j638J604J388j845n66J390o65n21J481m07k024
2129a400Q86J419j144M45M13j675n08K408k52j668P11L88j033J538P90k033l38
2146a053J562k50l64P66m38j409J506R99j357j90O04j029M6J851p57j329P11L22
2164A91o02Q61L80j761m2J542n61m26O38q70n18J474O75j448J24Q04p95K72J225
$$ plain form
2043 -483 -700 0 -528 -890 1023 663 -1261 -406 756 -245 -87 1244 -273 -1090 882 890 -489 584
2061 584 605 -1313 -172 1642 123 -1011 372 -217 -1100 820 771 -1775 -842 985 -378 -453 644
2078 644 -723 -1282 975 1242 -971 16 648 -704 181 1657 -155 -1003 696 545 -451 945 864 -1378
2096 -1378 -391 1350 -191 -368 538 -709 -1230 1232 866 -1352 -817 426 -385 -75 1235 -742 -1528
2113 -1528 1188 761 -580 546 403 -1235 369 1757 -88 -654 736 71 -450 1031 624 -1400
2129 -1400 -514 905 -239 206 619 -1056 -1564 844 592 -1076 -365 23 -1010 528 1318 -715 -1053
2146 -1053 509 259 -105 661 223 -1186 320 1319 -38 -228 376 -653 -607 1244 487 -842 -131 191
2164 191 -411 450 830 -931 -973 569 8 -418 220 -650 -1168 306 981 -467 -343 461 -334 -62 1163
2183A163j227p01J136L38o74M45j33j002N01R00m87o66N92p97j05J270j30j178
2201g55J82P81o90M11M16p31l87R80M41p50L73p9o66O58P88j019k12N55j53k81
2221a38J107m99j119O32N01q29J15M00p26j86J158r8r31M49J39o85Q20O96j128
2240c22k80Q21Q2n74O57j60q43J020M75j119L48L55k85m24O35m22n78P23L2o13
2260d72P19q0p38J39M93j46l84L00j02k8M40L49o85R2M47n18Q4O22k22p03O56
2281B63J60n91K61J19k94j29M72m81j78M75l02l13N42J47n26K41K03l74k2J86
2301a41J07k73M69O5l07K23M10l76n20M48K83m71J15L06k97K08j12l35J83M0j74
2322a49j91L83l04r3L55Q4k77K66r8j32m5L43M4j99k06J24K00K31l18M1J46r1
$$ plain form
2183 1163 -64 -765 371 709 35 480 347 -655 -154 746 259 -407 185 -612 -717 553 423 -755
2201 -755 -573 208 -482 -71 345 -386 -773 207 648 -102 271 192 -474 184 972 -47 -259 296 143 -138
2221 -138 969 470 -649 -17 484 -345 -230 170 -556 -742 416 318 -613 -164 -25 -710 110 806 -322
2240 -322 -602 219 301 -273 384 224 -619 401 876 -243 105 460 175 -249 386 -36 -614 109 141 -472
2260 -472 247 167 -571 -432 61 -85 -469 -169 -271 -299 141 490 -195 -103 344 -174 -90 532 310 -393 263
2281 263 423 -168 93 212 -82 -211 261 -220 -398 77 -225 -538 4 151 -375 -134 69 -305 -327 -141
2301 -141 -34 -307 162 227 -80 143 553 177 -343 105 388 -83 32 338 41 249 137 -198 -15 25 -149
2322 -149 -340 43 -261 -354 1 85 -192 74 -24 -156 -201 142 186 -13 -219 -95 105 336 18 59 205 114
2344A14K03l66L22j62n3M9m4n6q1j8k11l2L13q6j13M8l29L24J51JK9k28L58j76
2368d3K12k31K25J13r6L4J18j43j84J52k63J03j05P5Q5j50J07n42M61k02K02k77
2390c49L12l40K10Q1l0k30O01k63M1N0K5k30R2L37j82J38j20j38o5J05J18n8l58
2413b53K92L3j67J93k57q9J59o0Q3M8m4p8R1j71N8J37N3K0j27J1o5M16j99K94
2437C78k35J99k30J92l0k14j14J35j44pl6j26N0J43J17k92j2J15k29O1N41k84
2459b2j69L75j00j77L69J33m09k52K95K41j52M5R5l62o5R42q36j17K72k90k15
2480c99O35n78p8K85J95l77J26O82p38r1K26J55j77K95pn12K74P60p27j07K88
2501A30K43l64M10p6p04L06N13o71O3M84n58n83J008K65j088M44O20q88o8Q13
$$ plain form
2344 114 317 -49 273 111 58 107 63 7 -74 -92 -303 -335 -22 -108 -221 -173 -502 -178 -27 -26 3 -225 133 -43
2368 -43 169 -62 163 276 180 214 332 189 5 157 -106 -3 -108 -33 52 -98 9 -533 -72 -274 -72 -349
2390 -349 -37 -377 -167 -86 -116 -346 255 -8 33 83 108 -122 -30 307 125 263 143 5 -60 45 163 105 -253
2413 -253 39 72 -95 98 -159 -248 -89 -149 -66 -18 -62 -140 -49 -220 -162 -25 28 48 -79 -68 -133 283 84 378
2437 378 143 342 112 304 274 60 -54 81 -63 -70 -106 -232 -182 -39 78 -214 -226 -111 -340 -279 262 -22
2459 -22 -191 184 84 -93 276 409 0 -252 43 284 132 177 272 -90 -155 787 -49 -166 106 -184 -399
2480 -399 236 -342 -420 -135 60 -317 -191 491 -247 -338 -112 43 -134 161 154 -358 -84 676 -51 -158 130
2501 130 373 9 419 343 -361 -55 458 -213 -150 334 -224 -807 201 466 -622 -178 442 -446 -514 299
2521B99k75m19P20j43l52O22O6j311P94Q12m76o05N37j89n53Q34K74q74pN31k83
2542Bl36O68o49n51J002K54q76M31L10j037M32J130q32o11J130n61l61J141j40
2561E46j123N69P88m68k74M60p25k81J217l0j068K24N21p62L09O61r43m85R12
2580D8r5l80N85K81j260L09J099o20j7L16o14p0R31K30j301K33O97m86L96L44
2600F26r52l02J184k16m54K84j99r16P76P83q59m67P54m84J55R19m17r97N67N61
2620C46m39L13J27r18M2J319m46p18M39J17l12P52Q1j088j32Q42m11K31K69o47
2640b33m15O55M48p63M24j88o39N95Q41n14o73N02pp7M77j61q34R9R79j83j19
2661B14L10p30m35J201k5o12J31j36m93N18O89j314OP26j47j52N90m9j209P77
$$ plain form
2521 299 24 -395 325 182 -170 452 518 -793 1 813 337 -268 269 80 -473 361 635 -239 -246 285 2
2542 2 -334 334 -315 -866 136 390 -486 -55 255 -782 -350 780 -52 -663 467 -94 -455 686 546
2561 546 -577 -8 780 312 38 498 -227 -508 709 679 -389 -165 356 -406 -97 564 -379 -864 48
2580 48 -47 -427 158 439 -821 -512 587 -33 -50 266 -348 -418 513 743 -558 -325 372 -114 282 626
2600 626 -326 -628 556 340 -114 170 -29 -945 -169 614 -245 -712 42 -442 -287 632 215 -782 -215 346
2620 346 -93 220 347 -571 -529 790 344 -374 65 182 -130 622 703 -385 -517 325 -86 145 414 -233
2640 -233 -648 7 455 -308 116 -72 -711 -116 725 211 -462 40 33 -44 433 272 -562 -463 516 333 214
2661 214 524 -206 -641 560 535 -77 54 -82 -575 -57 632 -682 -676 50 -97 -249 341 292 -917 -140
2681a40Q69o58K5K0m96R0R37l09o13N19k19j60L45M00r59k24J264n72l97M74k47
2702e1o15O94M15r03j67N01j95j51Q35Q8j142O02M24k24j5L12n69r4N49K40r08
2723c74N51Q8p97P04L77r09K5N48j42l36N47k81n33M56K50l64o1N25m76q7O12
2744C23p2n60K36K22l03L10L61p24j29P86l98l13K68l8m87Q60Qn14j50L58j76
2765a32JK26j27p20R50j12m15M52n3k27j69O56k84j44L67J08o06L33J92k77n9
2786d0M01k83n2L15k92k13K95J58k81j37m9M5qL13n08m2J96J01j97L05Q9m77N25
2809A64j80J72j38M8j41J16J66j57l3J0N6Oj86L67j73k13O8Q3k12L09M9k92n9
2832a70K93p9k06J57j36K11P6k3j56M6M63l79KJ40r5K08l06J98o1L5k1m26L46
$$ plain form
2681 -140 729 71 96 116 -380 -290 647 338 -275 244 25 -135 210 610 -349 -573 691 119 -278 196 -51
2702 -51 -666 28 443 -460 -627 -126 -321 -472 363 451 -691 -89 335 111 96 408 -161 -255 294 534 -374
2723 -374 177 265 -532 172 549 -360 -335 213 71 -265 282 1 -532 -76 174 -190 -251 274 -202 -289 323
2744 323 251 -309 -73 149 -154 156 517 -207 -336 450 52 -261 7 -31 -518 342 350 -164 -314 44 -132
2765 -132 -131 95 -32 -752 198 86 -329 123 70 -157 -326 330 46 -98 269 377 -229 104 296 19 -40
2786 -40 361 78 26 341 49 -164 131 289 8 -129 -178 -133 -141 172 -336 -378 -182 -81 -278 27 116 -361 164
2809 164 -16 156 18 66 -75 41 207 50 17 27 83 89 -97 270 97 -116 -48 35 -177 132 181 -111 -170
2832 -170 123 44 -162 -5 -141 70 146 123 -33 13 476 97 99 239 144 352 46 244 183 218 197 -229 117
2855A17K6j44J9n9k54L17k40k6J51o1p5K48k53K07L2mJ6J07k92L87r6O2j11j03
2879b9J8L51m65K99m1J3j75M0M8q4q6n0J90j22j10p0K74j47j29j48N88l95J37
2902i3L5j8P7k23N16k38K7J30Q5r9k05J47Q7j64K5q3K6J00k02M5o2K17k08KJ06
2927C0m9k77M9J64k3l8J84n6j93M58p9j08K4P7j53R7L13j95n27M95P3k85oQ8j71
2952a08K36l27J63Pk23K46j20K92j17k92Q9M52l14j83L72k71j0K62j05j10J3K86
2974B38m6l10O18k54l25J03K36k08j58J61l28L9M25j95l69J77K67l30K06K11n75
2995d17J8M11J02j35J6O9l08M23N8l80J45K26m9k49L76l84n1K71J36n58K07M85
3017D12o06n0N91j75m06J05k78J76N4M31m58J46K58k26K73J28m11K1K36J0j54
$$ plain form
2855 117 143 -1 18 -41 -295 22 -218 -244 -93 -154 -229 19 -234 -27 5 1 17 124 -168 219 123 185 74 -29
2879 -29 -11 340 -125 174 133 146 -29 11 59 -25 -111 -161 29 -93 -203 -273 1 -146 -275 -423 165 -230 -93
2902 -93 -58 -76 1 -222 294 56 83 213 298 199 -6 141 228 64 89 6 32 132 -70 -25 -87 130 -78 -76 30
2927 30 -19 -296 -247 -83 -106 -144 40 -16 -209 249 170 62 86 163 10 107 420 225 -302 193 266 -19 -25 63 -108
2952 -108 128 -199 -36 -29 -252 -6 -126 166 49 -243 -154 298 -16 -199 173 -98 -108 154 49 -61 -48 238
2974 238 192 -118 500 246 -79 24 260 52 -106 55 -273 -234 191 -4 -373 -196 71 -259 -53 158 -417
2995 -417 -399 12 114 -21 -5 64 -244 179 237 -143 2 228 179 -70 306 -78 -129 142 278 -280 -73 412
3017 412 -194 -244 347 172 -234 -129 -407 -231 -177 254 -204 -58 200 -26 247 375 -36 -15 221 231 77
3038G7k2K08l85J36K59k08j33K14k63m21O83J69n96m2J89J70J61k13m86J98K26
3059g9K43l98J89J86l64L40L14l06k72M22m04K68J67j24m09L47L5j25k05L74m88
3080b89J01M87k75k18N7Q1JM03k98j87j98N75j32k25M06p9k04J16K27n29Q7L80
3102B87k52m2O47p59j75L62J5k18J68L07o78M32K90n37J2L22o04L1Q04j7r63L02
3124b66M55j75OL08l88k09O32l9l87K28k45l42M82K08j36l95M89r8l66O28j45
3145B45o99K20K96k55N4L67m94l1N66j36p23O99P7l03K82L93n33l08P38m36j77
3166a58O18m25m16M23N24q68K49L00l62l14P17k50o17N09o8K08p0O47r80l86J128
3187D09j55l79K29J8m16L99N78q96j11M47j18k42O54m99m89N99K57m65L02K03
$$ plain form
3038 77 55 263 -122 14 273 65 -68 146 -117 -538 145 314 -282 -324 -135 35 196 -17 -503 -305 -79
3059 -79 164 -234 -45 141 -223 117 431 125 -147 275 -129 139 306 182 -227 120 155 30 -175 199 -289
3080 -289 -188 299 24 -194 -137 -56 -55 348 50 -137 -335 240 108 -117 289 210 6 122 349 -180 -93 287
3102 287 35 -7 640 -119 -294 68 83 -135 33 340 -338 94 384 -153 -141 181 -423 -392 412 395 -568 -266
3124 -266 189 14 20 328 -60 -269 363 324 -63 165 -80 -422 60 268 132 -263 226 128 -238 390 245
3145 245 -454 -234 62 -193 -139 228 -266 -297 269 133 -590 109 186 -117 165 558 25 -283 455 19 -158
3166 -158 460 35 -381 42 566 -302 -53 247 -115 -429 288 38 -579 -70 -138 70 0 647 -333 -719 409
3187 409 254 -125 104 122 -294 105 683 -213 -324 123 5 -237 417 -82 -571 28 285 -180 122 325
3207C25o71J13N26l61l67M25O2m50N05L71n68q5L65k66j30M60j67n19N44L39n21
3228g0K30J44o26K44M42l70j87J39P1k16L07k74j22r1O00k79j12M2J3l60L76K79
3250A80l16l7O2l4K12J55j30m00N64O1j29j59j06j86J98N31m49j22K81j83l13
3271c20K96N9l75K49M0J83j94K99l84o4K11K32j34q5J19K10k18R0o5l35M52k07
3293E9j54K80j06l11J59J24N3j62J35l31J44J23n4m06L67J05M3r4O1n7M1m5R9
3316G3j17R6lp2J05J28o9k18L13j43j37j9R4k4N1n1j45O2n8J44k27J53K08l50
3340b06L44j70k4J10P5l76L89k31J01q9L44j65N9M0j6l58J70K73j0k30k7Q7J21
3363B11k80O8k15j19M30k94K37j37k2J02K7j63r1J92J14k35L08q9k8lj08J93K3
$$ plain form
3207 325 -346 -233 293 -68 -435 -10 52 -398 107 478 -90 -175 190 -76 -206 254 87 -432 112 451 -70
3228 -70 160 304 -322 -78 364 -6 -193 -54 17 -199 108 -166 -288 -379 221 -58 -170 -128 -115 -475 -99 180
3250 180 -136 -173 -111 -145 67 222 92 -308 256 317 188 29 -77 -263 -65 466 17 -105 176 -7 -320
3271 -320 -24 35 -340 -91 -51 132 -62 237 -147 -211 0 232 98 13 132 342 124 214 149 -186 266 59
3293 59 -95 185 79 -232 -73 51 104 -58 77 -254 -110 13 -41 -447 -80 25 68 -26 35 -22 19 -26 73
3316 73 -44 52 49 -23 82 210 141 -77 236 93 -44 -63 31 7 58 7 -138 -76 -134 10 -217 -64 144 -206
3340 -206 138 -32 -56 54 129 -247 142 -89 12 -77 267 102 161 201 185 -173 -3 270 260 30 3 90 211
3363 211 -69 -1 -216 -335 95 -199 38 -99 -121 -19 8 -155 -246 -54 60 -175 133 44 16 13 -95 98 121
3386A21K4K6k15J31N7j36k69J04J41k33K57R1k99J20J1j00J89Q1l60J89J04PJ35
3409A76j50L4r4K5q1K65k5j19k05K67K50l19j03J04pk31L67j31o0j25L58l42O1
3432h5N4L2j22l3J24Q8N7j94j65L83R1k34J5M3J45m54L97J74l00j22k6L0J00N7
3456E5J02l17K9L21k49Q9K05m72J35K55j77K6o1J59j53N3K89m21k8J77K93k84
3478B6j75K20K5M8j49n7K90r0l26J66j04l4J17j34K72nm7k63L93k31K06J9k79
3501a12J46r3j88J64K08Q0k02J85q5j43J70l01J85nJ8L2k76L26k50J95j39j25
3523b10J16j10J14M1k90K97J92n9J7j63L63k41p1M8K13k24k00L18j01j56K18r
3545A03k47k6J57j84R7J47J32k82K61r5m13J62L46j08p8l0K7l20M72J44j92j89
$$ plain form
3386 121 145 171 -44 87 144 8 -261 -157 -16 -249 8 99 -200 -80 -69 -169 20 101 -259 -70 34 41 176
3409 176 26 60 -34 -9 -90 175 150 31 -174 93 343 24 -79 25 18 -213 154 23 -37 -162 196 -146 -85
3432 -85 -31 1 -121 -154 -30 58 115 -79 -244 139 230 -4 11 54 199 -255 142 316 16 -106 -132 -102 -2 55
3456 55 157 -160 -131 190 -59 30 235 -237 -102 153 -24 2 -59 100 -53 0 289 -132 -160 17 310 26
3478 26 -149 71 96 144 -5 -62 228 138 -188 -22 -126 -160 -43 -177 95 90 43 -220 173 -58 148 167 -112
3501 -112 34 -59 -247 -83 125 205 3 188 103 -40 130 -171 14 9 27 59 -217 109 -141 54 -85 -210
3523 -210 -94 -204 -90 -49 -339 -42 150 91 108 -55 308 67 -4 44 257 33 -167 151 50 -106 112 103
3545 103 -144 -170 -13 -197 -100 47 179 -103 158 63 -350 -188 158 50 -28 -58 -31 -351 121 265 73 -116
3567a16R3j25m1L21j22J78o8l78J35K37K93n49J19J37k05J48lj33j66L17j79p
3589a14J08n8j01n0O50o83R1M97k40j56n2L08k48J46L29j29j72qr2j58J57L8k36
3612a73K96K5k77J32J78l50l1L19P4o09M28J2k24L57O0j31j43j9L5J82k52L89
3634B78m70k34O97nj40J21l86j24L94L2l17K22l9k10L09L03n99j93M52j32k25
3655b66L26l3l01J11M83k43k52M53m30R9K37K8k88Q1J48j33K36k4l50n6K16M0
3677H2j81L46m05l68O63K87n41j72M87m08l3M55l40j02K87J47o6Q1K52n97K13
3698H7J98j00K0k41N1k16R6M47o02K5J41k8J74p9l3k42L76j9j50j0M6O2QJ48O0
3723B19l69J23j09o3L05Nl69Q2L79l18N2K77k92o8K74O0j68j39J69j26J24K37
$$ plain form
3567 -116 -23 -148 -189 132 10 188 120 -258 -123 114 407 -142 -23 114 -91 57 54 -79 -245 72 -107 -114
3589 -114 -6 -64 -165 -215 435 -248 -157 340 100 -56 -108 200 -48 98 427 298 126 118 26 -132 25 63 -173
3612 -173 123 148 -129 3 181 -169 -200 119 193 -416 12 24 -200 157 217 86 -57 -76 -41 141 -111 278
3634 278 -192 -426 271 266 126 247 -139 -263 131 163 -154 68 29 -181 128 431 -168 -361 91 -41 -266
3655 -266 60 27 -274 -163 320 77 -175 278 -152 -53 184 212 -76 5 153 20 256 232 -118 -174 42 82
3677 82 -99 247 -158 -526 137 424 -117 -289 198 -210 -243 212 -128 -230 57 204 138 219 471 -126 87
3698 87 285 185 205 -36 15 -201 -105 342 -260 -235 -94 -122 52 -27 -60 -302 74 55 -95 -105 -59 3 11 159 219
3723 219 -150 -27 -136 -199 106 111 -258 -176 203 -115 -63 214 -78 -146 128 188 20 -119 50 -76 48 285
3745B85k26M3k28O6J35O7k2k86L08R9j4k40J47j58L7L14k20l12J49J23k35J99
3767C1L75k71k62M42k54q1J20j03j82J40O2m6q9Q5K5j09l2L40j67J00J57j90K44
3790C35n73K73Q7K05l55n2J18J72k53P8L60o44J16R0L1j60M06j64l68K74M2Q3
3812A01k8q7j98J46L26j56k37K19K3J02m5J09j91k49K08m0L5mj80Q6O6j05p9J16
3836f2R5J7l1o9r4j14J78J83l94J52K54k65N3N0P4l55N48j28k06J94k5N9j31J42
3860A25k40L29j58p7r3K63K9M9k66R1p0J23J24Pp6k5k35j9K45j77J6L3O1Rk31
3885a63J6K04Q2P1k01J25j59nj7OP5M9J21l09K88j4q0l14P0K49l11J74M1J22k62
3910a42J87PQ2k05n4K16j21K16j00j08J59k83J52j0J9kN1j8l7R2p7j55P2K8k20
$$ plain form
3745 285 59 102 -126 -60 75 142 120 -166 142 241 227 -13 134 -24 13 327 107 -205 -56 67 -168 31
3767 31 406 135 -127 315 61 -20 100 -3 -185 -45 17 -29 -118 -33 -8 -117 -149 191 24 124 281 91 335
3790 335 -238 35 122 327 -28 -80 38 210 -43 35 395 -249 -133 -43 -12 -172 234 70 -298 -24 18 101
3812 101 73 -14 -212 -66 260 104 -133 86 109 211 166 275 84 -165 43 3 38 34 -146 -60 6 -99 -178 -62
3836 -62 33 50 19 -50 -144 -258 -80 103 -291 -139 115 -150 -97 -47 27 -328 220 92 -114 80 55 114 -17 125
3860 125 -115 214 56 -21 -114 149 178 227 -39 52 -18 105 229 236 160 135 -100 -119 126 -51 -35 -2 59 68 -163
3885 -163 -147 57 139 210 9 134 -25 -30 -47 -41 34 83 204 -105 183 169 89 -225 -155 94 -217 -43 -2 120 -142
3910 -142 45 52 134 -71 -125 91 -30 186 86 -22 137 -146 6 -4 15 13 64 46 9 101 24 -131 -59 -31 -251
3935b51M38l06p2K51O2r2l64L85P1n71M58LJ83j51j49J21J07k0j09P2K67k42M70
3958E61m33k75K60J8n2o0J41j63J76k30j6L32l06N8n6j50L9J97m6J69j78J85p7
3981I4KOk83M35k0Q4m34j67L52O3n7l85N39k27L3p9J34j98j42K77j59O5J96q9
4005D0J19j58j79o8M61j80K2J92km35M19j39k10P0j9J86k12Q0l5J28k6k68K28
4028A4p4j13K56k73J87L1o2J89j98M2p4R5K20m75K66P8l10K40J1M5k84N71k76
4051A06j08j0k4j55M28l10k93M58j38o5l8K75j8l38K77m6k08J63K47q0j66j23
4073a66n5j01L60K20j46o2p5L5K14n3j60n9L33j20k73O3J25j46m2L26l37O1K24
4096A66k5m20L22Q3k82K80jk20M1J24j0j25L49n2k95P4J04m4k88O17l97n9K14
$$ plain form
3935 -251 187 -119 -191 60 122 30 -334 51 122 -449 9 12 195 44 -105 16 123 103 -6 66 333 91 561
3958 561 128 -147 113 131 79 19 160 -3 173 -57 -73 259 -47 11 -45 -195 -156 41 -5 164 -14 171 94
3981 94 96 102 -181 254 234 318 -116 -283 69 132 75 -310 229 2 35 -44 90 -108 -250 27 -132 -67 129 40
4005 40 159 1 -178 -246 215 35 57 249 247 -188 231 92 -118 -48 -67 119 -93 -13 -48 80 54 -214 14
4028 14 -60 -173 83 -190 -3 28 -34 155 -43 -1 -75 20 240 -235 31 109 -201 39 50 95 -189 382 106
4051 106 -2 -12 -36 -191 237 -73 -366 92 -46 -111 -149 126 108 -230 47 1 -207 -44 203 123 -43 -166
4073 -166 -221 -322 38 258 112 50 -25 10 224 171 11 -48 285 165 -108 -45 80 -66 -108 218 -119 -58 166
4096 166 141 -279 43 126 -156 124 123 -97 -56 68 58 -67 282 230 -65 9 113 69 -219 398 1 -58 156
4119A56l7l9n0o7l31M66m9j63J43j73l6J22Q9j81Q0J63l03K44J99M3r5l02K36
4142A15l9j68J56j91K0L39Km92J84K24l52J32J25J66m55M36m15Q2P2J7j16k0J58
4165b0l3p8K31k11l02N10K14m58Q2Q7k24J41Q4M0k50J76m3k2Q5K73l48l5L29j34
4189I4k64K41k7j89K39k9p5r9J59j88L29j39J37m47L68J39k18kJ01k36J2K54j35
4212B5l40K40Q4Q7l75K82k08p6M08K8k6Jj55k13L37K9l28L62k19K3j53K68j55
4235g4J82J05j24p7p6J97k67J11l7j8P5L08k94j45J87O4m06M26j45J35j6j85L25
4258B51k85j46L49j63J36J06l24L40j21j34R6j14J04P6m4j69k51L52K4j22k43
4279b82L56l02O3M28m41Q8q7L62j51J35J12j24m06K52j4j27L23j02q6o4J13M5
$$ plain form
4119 156 119 80 30 -37 -368 98 49 -114 29 -144 -180 -58 31 -150 -70 93 -210 34 233 276 181 -121 115
4142 115 76 -92 64 -127 -107 232 234 -258 -74 150 -202 -70 55 221 -234 202 -213 -131 -59 -42 -158 -178 -20
4165 -20 -53 -131 100 -111 -413 97 311 -147 -65 22 -202 -61 23 63 -187 -11 -54 -76 9 282 -66 -101 228 94
4189 94 -170 71 44 -145 94 65 -10 -109 50 -138 191 52 189 -258 110 249 31 29 130 -106 -94 160 25
4212 25 -315 -75 9 96 -279 3 -205 -281 127 155 129 130 -25 -238 99 128 -200 162 -57 -34 -187 81 -74
4235 -74 108 213 89 12 -64 133 -134 -23 -60 -78 -3 305 11 -134 53 117 -289 137 -8 127 111 -74 251
4258 251 -34 -180 169 6 142 248 -76 264 143 9 105 -9 95 171 127 -42 -293 59 83 -39 -282
4279 -282 74 -228 -165 263 -178 -90 -177 185 34 169 281 157 -249 3 -11 -138 185 83 -3 -67 46 91
4301I1j24K25l46K89l35K53O6K06l25MR2m9k3j76N9Rr3J83K5Kj96J74L0r3kmJ35
4328G7Q6j39r0L67k16k94L03M5k95L18l1O8k84j2J19j26J91j86jK59k92Q3P6o1
4352c5L9j5k3o3M8J06K31j58q9J2j46J45p5L5l2o1K22k70K37j49j09J28j97M10
4376A91k66M0K21j69J62j83j6j88R4JK20q2J1K5M5l00L05j13L9m1jQ2l1j11J35
4401G0L6j95r4K08j29J41r0Q6j18K15l09L9J40k45K13j42J55J70k95p6N19l82
4423h3J22l3j84M03l4l83R3J93j42o1K42l8J7J22l07K1J23j47J73J23k90n1j16
4446b37O9L75k16j30J38Q1P8r2K44n29K57ll7RK5N1k83J88pr4K95kj42K8k16O0
4472i0J89k80J08J89k10R4L1O7j00R0p7J6P9l19K9L65J6j14K3k64J94j36J41j36
$$ plain form
4301 91 -33 192 -154 135 -200 53 119 325 0 4 96 47 24 -152 -93 -84 -177 6 31 33 -163 11 41 -52 -54 -58 77
4328 77 163 24 -66 301 85 -209 94 139 -156 162 131 199 -85 -97 22 -104 87 -99 -100 159 -133 -50 26 -35
4352 -35 4 -11 -34 -97 -49 57 288 130 41 53 -93 52 -23 12 -20 -81 141 -129 108 -41 -150 -22 -219 191
4376 191 -75 -35 186 17 179 -4 -20 -208 -114 -113 107 25 36 61 106 -194 111 -2 37 -4 -5 77 46 -65 70
4401 70 106 -89 -183 25 -104 37 -53 33 -85 130 -179 -140 0 -245 -32 -174 -19 151 -144 -220 299 -83
4423 -83 39 6 -178 225 191 -192 -99 94 -48 -109 133 95 112 234 -73 -52 71 -76 97 220 -70 -121 -237
4446 -237 -168 207 -9 -139 -1 80 158 66 310 -219 38 35 -2 7 32 83 -200 -12 -19 -113 182 180 38 66 -150 -90
4472 -90 99 -181 -73 116 -94 0 31 98 -2 88 11 27 106 -213 -184 181 197 83 106 -158 36 -100 41 -95
4496i5Q0N0o2K58j49r4P4k15l6J29J31n9Q3j39Q4J10J04j21j57O1P5N2k40J87
4520A11n0k01J32K17k54J98j92Q2M4k21N1J53o9J4j12L0k50J91L61l48o2L96m83
4543b62L99p1J89j63r4j29OJ34n5J98l35L22J5k54j7J08M7k8Q3k13J09J50Q3m3
4567A79j4l57J92j76K57j07KK81j76k48K17P1k89L72l58j5J87M4l1R7m4n2J53
4590A85P0l47n6Q8R4j50K68j23k1k06J67J16m1n9L70n28m6Q8N5j10K13j44J20
4613CJ80q4N7j65J76l02M42jk34j00j52J97R8l09K04j00J0l1O6j0pK5j63K64M
4638F8J45m52L56j62M5j29K70k13n5K11k6R8j91r6r5L97m3R0l09N1q3k6J06k5
4662f8R5k5l5L8J58j77pk78K12K09J01k94P7q1J27O4j36j80J77L11j95l14M72
$$ plain form
4496 -95 -15 35 -27 231 82 -12 62 -153 -189 -60 71 12 95 -44 40 150 254 133 -24 37 112 164 -76 111
4520 111 61 -140 -8 209 -45 153 -39 43 87 -134 -83 70 1 15 -97 -67 -317 -126 235 -113 -175 221 -262
4543 -262 137 66 255 92 -2 -131 -125 9 -46 152 -183 139 154 -100 -117 -9 38 10 93 -120 -11 139 222 179
4567 179 165 -192 0 -176 81 -26 -24 257 81 -167 50 121 -168 204 -154 -169 18 62 31 128 84 32 185
4590 185 255 -92 -148 -60 34 -116 152 29 8 -198 -31 85 44 -15 355 -173 -219 -131 -76 -186 27 -117 3
4613 3 183 99 156 -9 167 -135 307 306 72 -28 -180 17 115 -194 10 -90 -80 -111 -45 -55 -62 -37 -200 64 68
4638 68 213 -239 117 -45 0 -129 141 -72 -127 84 58 156 -35 -131 -226 171 128 218 -91 -40 -123 -149 -43 -68
4662 -68 27 2 -33 5 163 -14 -21 -299 -87 122 223 -71 6 -75 52 116 -20 -200 -23 288 93 -221 251
4685B51pl19J14J33k7j76R4km3p5j2j6j09Q8N3k0J7Q8J10k24O4j11J42k10L12
4710A15l01J61K9K6k42L38l1k79L37k01K40k76J3O9Q2o5r4J73n1O6l46Q1K09j03
4734e0L6J3r5RL34l96q6J79J35j66o5L45k11k6J99o5j15K55k29k48M62k69J94
4757A40r1k09P8J65j51n6K70k52K76p4m9n6K6RPk05N6J71j30L18j94N3l5p3P7
4782G1o5K9J9j70k02K74K20r9k2J21m70L92J79o98N58j67p2K77O7l19J81k46N3
4805h9M6L60m50K2L9K62qj25n9J7o6J51k1l01K03p9J5J31j68K13l98N49j69j09
4829c4J21J52l52J23j13R4J18k23P4O3J98l1m9k61K63P7n4l05J37P9k03K17K52
4852C43k87r3O2Mm8j40j09J80R2j80K53j47Q6l9J9m0q7K82n6m4J29k70j30L66
$$ plain form
4685 251 244 -75 39 172 145 -31 63 61 18 -57 -69 -85 -194 -106 -53 -73 -56 32 142 -82 -18 -129 13 -197 115
4710 115 -186 -25 4 30 -212 126 95 -184 153 -48 192 -84 -71 -2 80 15 -79 94 43 109 -237 -156 53 -50
4734 -50 -14 -1 -96 -87 247 -149 -235 -56 79 -87 -152 193 -18 -44 155 90 -25 230 1 -247 215 -54 140
4757 140 49 -160 -82 83 -68 -124 146 -106 170 96 47 -9 17 26 33 -172 -116 55 -75 243 49 102 67 -6 71
4782 71 6 35 54 -116 -318 -44 176 77 55 176 -294 98 277 -421 137 -30 -102 175 242 -77 104 -142 -89
4805 -89 -43 317 -133 -111 -72 190 182 57 -2 15 -51 100 79 -222 -19 -98 -83 48 -120 93 -305 244 75 -34
4829 -34 87 239 -113 10 -103 -9 109 -114 -40 23 221 190 141 -120 143 220 166 -139 -2 77 -126 91 343
4852 343 56 -37 25 29 -19 -159 -268 -88 4 -176 77 -70 16 -23 -4 -44 -131 151 95 51 180 -90 -220 146
4876A46n4j95q9L78%l86J59K92l23n1J14j25J23j30J75Q0m56J91Q5R5L2k67J93
4899a3q3J75M3M3p9PM4p2j38J7M0r5k44M59J32j16m0M3j91p9J42m0J89o0l14J93
4925c7l5J70l40J23r5J71n5J14j56K32k33J63j09N5j0j49M40l21L51k89Q8l12
4947b34J86K4l5j06J57Q4j70J65R5k96R8q8J63j56J68m3Q1j53j3J3PJ99l90M55
4971B11k21j8J13j6j09j16K53m17M18p6j51K52j40j20J16L3j94J61r0J89P3j79
4993b8m4L61j64j9k0o2O5j54Q6J5j8J40k96LN5jJ87K09k67Nj28L52q9j78pm3j58
5020a98L41J13n07K27j09KJ64l9j41K4l3J77l5J00P6n20L32J42j38k05K42K95
5042C10k95O1o6J38k34L51l72K43K8k16Q7j10O8K38j67m4J3J68j38K27m65M1J42
$$ plain form
4876 146 92 -103 -192 186 186 -200 -41 251 -72 -123 -9 -134 -11 -141 34 114 -342 -151 -66 29 61 -206 -13
4899 -13 -96 79 122 165 86 93 137 65 -73 -56 -16 -111 -355 104 236 120 80 123 -68 -147 -5 -45 144 84 -230 -37
4925 -37 -72 98 -242 -119 -214 -43 -98 16 -140 92 -141 22 -87 -32 -42 -191 249 -72 279 -10 78 -234
4947 -234 -48 -24 -59 -165 -8 76 -94 71 166 -130 -32 -120 43 -113 55 12 93 -60 -73 -60 -53 146 -244 211
4971 211 -10 -28 85 69 -40 -156 97 -320 98 22 -129 123 -17 -137 -21 12 -182 -21 -111 78 151 -28
4993 -28 -72 289 125 106 86 24 89 -65 21 36 18 158 -138 -135 -80 -81 106 315 48 53 -75 277 188 10 3 -40 -198
5020 -198 143 256 -251 -24 -133 -131 33 -6 -147 -123 -156 21 -14 86 162 -358 -26 116 -22 -227 15 310
5042 310 15 76 10 148 -86 265 -107 136 164 -52 35 -75 -7 231 64 20 33 201 63 290 -175 -134 8
5065HK0j32J77r4k22J57R8p6K28l73K3M43l62n4K65k06R6p8J52O7o3j14j64K49
5089D5n9J6J9K35J21n52J82M1J16j2l33J98j47qM3P6j19J19J05k15J85M6k66K68
5113A04j35Q6k0k8k1J3j8L72q5j02l1k83P2K62m35%K58j31J65j02nm9L34k21j02
5138a02KJ02k73K75J25j89J7q2L07kJ25l3k86K99m21K89j79lJ7J70j6q4j20K31
5162A69j09j46J19j57P9j95N2K7O1J12L5j8r7R8J74j25j00r6J61M3O0o5j54j32
5186b04J98p3J25p4K22k18k44K09J19J8K4j55K5j42L55o9k38J34n1N3q7K24j81
5209c0Q6K0oJ18k17L30l06J09q7k12L92j24j49J10p8k6R7N6N3k04j2J17N4r4Q6
5234H3j51m40N29j4M5k2K2N4l0k34J71j01K5K62m82M25O1l87o9R5L03k9J92j54
$$ plain form
5065 8 28 -104 73 -21 -243 -86 12 -64 164 -209 -186 257 -105 -159 106 -100 -4 -82 70 137 74 -40 -204 45
5089 45 -14 2 21 256 377 -175 7 48 164 152 -181 17 -130 -138 -95 -19 -138 -19 86 -129 56 102 -164 104
5113 104 -31 55 35 7 -14 -1 -19 353 268 166 135 -148 -76 186 -249 -249 9 -122 43 -59 -64 -113 221 0 -102
5138 -102 -100 2 -271 4 129 -60 -43 -125 182 180 305 272 -14 285 -136 153 -26 -29 -12 158 142 58 -62 169
5162 169 60 -86 33 -124 -45 -240 -188 -161 -100 12 47 29 -68 30 204 79 -21 -117 44 87 147 82 -72 -204
5186 -204 -6 -79 46 -28 194 -24 -268 -59 60 78 102 -53 -28 -170 185 116 -122 12 -39 14 -73 151 -30
5209 -30 56 76 70 188 -29 301 -5 104 17 -195 197 73 -76 34 -44 -70 27 83 136 -68 -80 37 91 -3 83
5234 83 -68 -508 21 7 52 30 52 106 76 -158 13 -88 -63 199 -283 142 203 -184 -253 -158 145 116 308 154
5258A54L6k64m1K4O6J68j77o1J67P9j47k05J38K20O7j7q1k35O4M7P3j19N8j36
5282a22K31N3j48J37k6n9J02kl75K31o7j2m7K1n9L03j92J45l47K70N9q2j22K78
5306A70j80J01k67J51J31j84J21m7k22lQ0K98j99K46j07j63r5J62K49l42J05M2
5328D7j00m5n1K80j27J34n1K6j52q7K43p6p1J22j02L53k75j16k1j27J30k3j61
5351b50Q7P5O6Nn3K19k71K43j40L3p5J53l16L37r8q8K83q3p4l5j94L54k47J36
5375F7K14j81O2nk06p4L5O4J80l1R7k95q1P4o6J92oql4K77k40j25M72n08J46J5
5401C5r7K7J01J76k97K37j81j28j78L17KM9rL2rl10L13j48R9j47J14k48M07l33
5425a76L19k01R2m3J5l48K36R8N0N1l95R2K60l3N7j46Q5J3k70M18J15k79L3j5
$$ plain form
5258 154 190 -74 -115 -91 -25 143 -34 -95 72 151 4 -201 -63 157 224 207 126 -109 -45 2 75 -44 14 -122
5282 -122 109 162 14 151 125 66 168 166 -209 22 -45 -57 -104 -83 -142 161 -31 114 -233 37 96 14 -108 170
5306 170 -10 91 -176 -25 106 -78 43 -4 -226 -229 -149 149 -50 196 89 -74 -169 -7 242 -100 5 47
5328 47 -53 -98 -149 131 4 138 87 113 -39 -126 117 41 -30 92 -10 343 68 -48 -69 -196 -66 -89 -250
5351 -250 -163 -88 -22 -17 -70 149 -122 121 -19 14 -61 92 -224 113 15 -73 210 127 53 18 -176 178 -69 67
5375 67 281 100 162 157 -49 -123 -88 -24 156 125 222 -73 -154 -80 -146 46 40 32 -2 275 35 -90 382 -126 20 35
5401 35 -62 -35 66 242 -55 182 1 -127 -305 12 14 63 54 86 77 -233 80 -68 31 -116 -2 -250 157 -176
5425 -176 143 -58 34 -9 6 -342 -106 -8 42 93 -302 -210 50 17 74 -72 13 26 -244 174 289 10 43 28
5449B8J85j8o1k16J86k31Q7K83k97L5J07p8j65rJ9K07M3k70L67q1k75K25j03J94
5473A62k22J13j86J0J49j7j89O3L4nJ6K10Oj64l4K21k9k79P1q3L06l29K61j75
5497i0J00J55k80N8K60j67j00q1L20l41J31n1J11j93J96o8Q0JJ77j76K07l34L32
5520B47j92Nj85J65m2k24K95K51k74k05L38j41R1P3m00J50k18R3n5K73P6l46J75
5543e0J05j33r6J74j00K49k80k7L10j48j81Q5m6OQ0M3j32K83l11J09J73l62J43
5566a06K08k22M8J06k20o2M9K00Rj5K5j6q7J11N2J50p5l76K00J23j42L4J96j29
5590F1k95K41J58k4k55j38M49m30L78l40N7K64l03J97L4LJ62k54O5J4K72k79n3
5613a6k17K45J35l64Q3j8J81j5j28P8P2j09r1K0K14J73m74O6J58j7J99j23J27
$$ plain form
5449 28 213 195 134 -82 104 -127 -40 243 -54 -19 88 10 -155 -164 -145 62 105 -165 202 121 -154 71 -32 162
5473 162 -60 53 -133 -123 26 9 -180 -117 -83 -88 -72 138 144 -20 -54 167 138 -141 -70 -153 153 -176 85 -90
5497 -90 10 165 -115 -57 203 36 -64 -145 175 -166 -35 -86 25 -168 28 -40 40 41 218 42 249 -85 247
5520 247 55 60 -125 40 -2 -226 69 320 46 -159 179 38 129 202 -198 -48 -266 -173 -228 45 121 -225 -50
5543 -50 55 -78 -174 0 -100 149 -131 -158 152 4 -177 -92 -138 -132 -52 -9 -141 142 -169 -60 113 -249 -106
5566 -106 102 -120 -72 34 -186 -248 -199 1 10 -5 20 4 -83 28 80 230 155 -221 -21 102 -40 -6 190 61
5590 61 -234 7 165 141 -114 -252 197 -233 145 -195 -138 126 -177 20 54 57 219 -35 30 44 316 37 -16
5613 -16 -233 12 147 -217 -134 -152 29 14 -114 -36 36 -73 -164 -144 70 243 -231 -165 -7 -24 175 52 179
5636A79k35J81K5J45l93o1K8J97k12P3QK71m5j85k3J3K89l91J67l0M1n8n6j7L08
5661B19K2l45J57L5j66O9K9KJ01M4k06M3q6K05q6j74J13J2L4M4q4q6K63K3j62
5686B0m8K1j1J99j38O5k86R2L03j83J63j13K22l16j3j94L27k39Q2qk5O8k0K03
5710A71j04o6k12J00J12o9n7K26k32n5L05J94l09k2j91QK89k20j5K67k1j41R5
5733E3k01O4pJ75j64M9K36m89O54k70p9k39o8K07J71j32o0J52k7p2j12kM92m43
5757a12j28L13n5j35j53L42l30J70L50k78J41r4k5Q0k90K95r5m8K8l9P1j60K84
5780A32l11N6L1M8k90L50k29J63L22l08K2J16r3l1Q0j97K39j56O1o8j22J49L85
5803C49l13o9M7K92m01J20o8J89p8r9k31L78k13K93J4j95OJ67k94M7Kj63L85k89
$$ plain form
5636 179 -56 125 150 295 -98 -159 -131 66 -146 -73 -65 206 161 -24 -47 -34 255 -136 31 1 42 -16 -72 -89 219
5661 219 241 -104 53 88 -78 -9 20 22 123 167 -39 4 -82 123 37 -137 -24 -12 22 66 -18 -104 159 182 20
5686 20 -28 -7 -18 181 43 108 -178 -86 217 34 197 84 306 -10 -23 -217 110 -129 -47 -55 -80 -12 -32 171
5710 171 67 1 -211 -111 1 -68 -125 101 -131 -186 119 313 4 -18 -209 -201 88 -132 -147 120 99 -42 53
5733 53 -148 -84 -91 84 -80 -31 205 -284 370 100 21 -218 -286 -79 92 -40 -100 52 25 -47 -159 -161 331 -112
5757 -112 -240 73 18 -117 -270 72 -258 -88 262 -16 125 31 6 86 -204 91 -4 -52 -24 -63 8 -152 132
5780 132 -179 -123 -92 -44 -334 16 -213 -50 272 -36 -14 102 9 -22 58 -139 100 -56 5 -63 -185 -36 349
5803 349 36 -33 14 306 -95 25 -43 146 68 -31 -262 116 -97 196 210 15 21 188 -106 -59 -57 -220 165 -124
5827a24J90j48L7K34j90J23K84m43J64j44j81K29J50j22k99M31k14Q9J45rj47
5848E5l2Q1mm6k40K33J15k16K32j08j56K48j8k85j8J9K02l10K67J28k20M2l1p2
5872a34K58j73J87J4k81M5J59k25J63J70k62J14N8j97J25L0j3o3q7L7j6J37j20
5895g4R3k38K67M8k33j22M81j77k62L39j99M1O1j98M39k29j54L25k18j6l7r3M62
5918C06o38L55j71J06P2mK29l43j03O5J93M6k24J58j06p8lJ76q5j77M51l64J28
5941a1O3J66j68o2j4j41J15J73j12r8K50J72m41K66m5j77M8j21R4O0L2m1J24p0
5965F2q1J7R6n5l4M7j90K7J8L65j66o5o6k9jJ33j65o8J39J36k44%j21M37j27k8
5991C7k9j77J61J56j91jR9o1Q3k96J83j46J19L90l77J28K6j04r3L46k42k2n0O0
$$ plain form
5827 -124 66 -82 -45 189 -1 122 406 -37 127 -17 -198 31 181 59 -240 191 -23 66 211 202 55
5848 55 23 104 100 54 -186 47 162 -54 178 70 -86 162 144 -141 -159 -140 62 -248 19 147 -73 -31 -62 -134
5872 -134 124 -49 138 152 -129 -84 75 -150 13 183 -79 35 93 -104 21 51 38 -25 -112 -75 -91 46 -74
5895 -74 19 -219 48 96 -137 -259 222 45 -217 122 -77 -36 25 -173 266 37 -117 208 -10 -26 -63 -156 306
5918 306 -332 23 -148 -42 30 26 255 -88 -191 -126 67 113 -111 47 -59 -137 -140 36 -49 -226 225 -139 -11
5941 -11 52 218 50 -12 -26 -167 -52 121 9 -89 161 333 -108 158 113 -64 -16 -137 -43 17 49 8 132 62
5965 62 -19 -2 94 39 5 52 -138 -111 -93 272 106 41 -25 -54 -55 78 -87 -155 -16 120 -124 -124 -245 192 65 37
5991 37 8 -169 -8 148 -43 -44 55 -6 77 -219 -36 -182 -63 327 -50 78 104 0 -93 253 11 -11 -61 -1
6015aP0j07R9m6j21K00k17J46j4J01j00j09M4k51L66Q3R0k52j20jL05L5j79j03
6039h2K34j58j4J87k06J59j50j07p5L63k58K3K3k0k5J1K24q2Mj49p9M55m04L5
6063i1j1J10p5j54J76n4j59K82j37J30p9R9j3q5J04j51K90k00k17n6N09k05n2
6086c9n5K26j80J96j47K8L1l5j27J32R7k55P9k01M93k01j93R0M82p14L85o3m8
6109a9J30j1R0k69K95k30Q5m0j35o3J90j36J9K92l12J19P6j77K01k00J7N0J56
6132A28O4q5j94O3J15n8m8j37M07k33n6j46M47k85k54L48j87J04j41J79pP6k43
6155a43J37j8o3J74k24K06O8n8pJ45k41K23k10L0J52o0k01K50r7j51J66j23J74
6178A29j65P2k15K67k23NL18j82J09J25l81p2K19j17J00M8j1q3rK06J1k20o8l9
$$ plain form
6015 -1 69 -38 61 15 -106 94 -123 23 9 110 10 -99 -55 -306 60 143 233 -19 -139 -140 165 200 21 -82
6039 -82 152 -6 -20 167 -39 120 -30 -137 -212 151 -107 -84 -61 -81 -106 -95 129 47 51 -98 -177 278 -126 -91
6063 -91 -102 8 -67 -221 -45 -99 -258 24 -113 17 -62 37 24 -61 43 -108 182 -18 -235 -291 218 13 -39
6086 -39 -94 132 -48 148 1 29 60 25 -102 30 127 -128 -49 -250 243 42 -151 -61 421 -293 92 29 -19
6109 -19 111 100 190 -79 216 -14 71 31 -104 -167 23 -113 -94 198 -114 5 81 -96 105 -95 -78 -28 128
6132 128 192 107 -87 -24 91 33 -15 -152 255 22 -34 -180 267 -18 -272 76 -111 -7 -148 31 24 100 -143
6155 -143 -6 -24 -87 87 -137 69 137 79 72 217 -24 199 -11 19 171 111 -90 160 63 -88 78 -45 129
6178 129 -36 36 -179 88 -135 -130 188 6 115 240 -141 -213 6 -111 -11 37 26 -57 -66 140 151 -69 -137 -176
6202a76K29L7q2j37J41O6Q0k53J09K02l00M8K95k67k24M89l12J49k09J48j46J48
6224C5j91p4K90k10K01p0J3K46l57J86lj50P1oJ6k14N36n28K08K44l27mn1J56
6248A7o0R2J5j32L8j45J44l0q4K32k13L0J98k9m2n0R6K21k55j82M3J49l13O4P5
6273a21L46l11j11L96J7j88P4n3l0l3k6j35K17l1j82Q7m0J4K0J67q3L61m25L3
6297c7J19j14J86j6J19j54M1q5mn5j66J36k46L02J13o9K5O3l31J7J74Q9j53k11
6321b57K70j2R2l04L85k67J38j49J1N2k58L42K1k0r2J65j15O7n5L9qJ51K5J07
6345C28k75N6k18J44J1l4l2J66l1j68J80j6n6p3O4j71JK38k1j13J01j39L3J5J93
6370A83j85m5L4k2K12k91mj7R0KM52l81k35K61k58P6oL41k62J96k98J58Q1Q8m08
$$ plain form
6202 -176 53 90 8 -129 12 78 158 -95 14 216 -84 -36 259 -8 -232 257 -55 94 -115 33 -113 35
6224 35 -156 -230 60 -150 51 -19 -6 240 -117 69 66 -84 -13 -19 -3 -217 319 -209 -1 243 -84 -88 -139 17
6248 17 -43 49 64 -68 -30 -175 -31 -61 -145 87 -126 -96 102 73 31 -19 77 298 43 -139 -96 53 -260 -196 -121
6273 -121 225 -86 -197 199 216 28 102 49 19 -14 -40 -175 42 11 -171 -84 -124 -110 -90 77 -6 355 -70 -37
6297 -37 82 -32 154 138 257 103 144 59 55 0 -166 -30 -276 26 139 70 95 158 -173 -156 18 107 -46 -257
6321 -257 13 1 93 -211 174 -93 45 -104 -93 -41 -299 43 64 44 -48 117 2 69 14 53 45 196 221 328
6345 328 53 109 -109 35 46 12 -20 146 115 -53 127 111 55 -18 46 -125 -124 114 93 -20 81 -58 -25 -10 183
6370 183 -2 -47 -13 -35 177 -114 -118 -135 -45 -43 409 28 -207 54 -204 -128 -134 207 -55 141 -157 1 82 170 -238
6395b38J00J76p5o3n3L10j31K6j31K4r2L83j02P8l56R0k0J92J5q7j22J26k17J45
6419b2J04J49m15M16k81J85j66J4o5P3kR1j16M8J46l62J97P8Rl0j01j7J54J34
6443B21j76j13J2r9pJ93j32m2L17l50K10M1n4k24J33N9J28R5p0j92J70r4r8ml8
6468a14K40j92j02M09m06J90K62m63K48k6O9m5j25m0O3n5j29J39L6JP1l7j22J32
6492Dj09j17K60J8J77k28p1p1J2J23n2j25qK59nj48N1j5o2J37j43K50j9k84K92
6517A26j50O0M9k44O6L17j53k06JJ02K34k16m3Q1j84K98m7m05K85J97j45l7QL9
6541C3j66K60l29P7J77L31k56o8q7m8qm3k30K50J93n4K65r4k82J51j20j42M79
6564B89m56J39J20l6O4k43j6k19L44L7J08l05J14J54L8j79K00M8r4o6J60k02J2
$$ plain form
6395 -238 -138 38 -37 -100 -153 157 26 52 -79 -55 -147 236 134 212 -144 -54 -74 118 133 46 -76 50 -167 -22
6419 -22 82 231 -184 232 -49 136 -30 -16 -81 -8 -10 81 -35 13 159 -203 -6 72 81 51 -50 -67 87 221
6443 221 45 -68 -56 -155 -162 31 -101 -143 174 -176 34 75 21 -203 -70 -11 117 212 142 -50 120 26 -72 -76 -114
6468 -114 126 -66 -168 241 -165 25 287 -176 72 46 115 70 -55 -95 -32 -87 -216 -77 -41 -40 31 -6 -128 4
6492 4 -105 -222 38 56 233 5 -66 -137 -125 -2 -54 -179 -187 72 67 -81 -30 -45 -107 30 -113 137 118 -166 126
6517 126 -24 36 85 -159 -93 224 71 -135 -134 -32 202 -14 -57 24 -160 138 91 -314 -29 168 23 -14 -6 33
6541 33 -133 127 -202 -125 52 383 127 59 -28 -76 -84 -127 -357 -107 86 32 297 203 -79 72 -48 -190 289
6564 289 -167 -28 92 56 120 -123 -139 -358 -14 23 131 -174 -60 94 132 -47 153 201 107 41 201 -1 11
6587A1l58L05J87l70q2K97J9Q3k31L38k21q1J68L8j40J17n7K1N1j13L07l27J91
6610A53jk41j55M25k26N8j27K48k05q4J58j4J48k41r8J59J06o6j9j23J68RM5j92
6634a15J70q2l2J58m1k15J82j0n0J63j98M7k2K79m8j67J93Lk74K4l4L9Mk02K67
6659C9q2O5m0R7j98k00J00k4J52n1R4L2J40l05L10q8l7J36j47R1m3Q8l18O9L95
6684B75l66J07M2k0l5J15q0n1M0j60L8J76q5n0o9J09O9j47P5j19Q1k58M38k53
6708a28K00N1J08j28j32K99j56j1k49qk6q2K62J67l05L81l51mK88o7k87j18L49
6731E3J23nk17O0K19k86R0q3J14J57m9q7o8O3L7j75K43k23K25k34M17m57k5J6
6755i2J22L26l13j43j03J26j57L40L1j01j15PL16o6kO4m64K09k3j32l1K87k59
$$ plain form
6587 11 -347 -42 145 -225 -307 -10 9 92 -139 199 -22 -103 65 103 -37 80 23 44 95 -18 289 -38 153
6610 153 152 -89 -244 181 -45 13 -114 134 -71 -155 3 -11 137 -104 -202 -43 63 -3 -22 -145 23 32 77 -115
6634 -115 55 -27 -59 99 58 -157 25 15 -35 128 -70 -23 -45 234 186 19 212 215 -59 -35 -69 -30 -26 -228 39
6659 39 -43 22 -18 79 -119 -319 -219 -243 -91 -142 -48 -16 124 -181 129 41 4 140 -7 84 41 129 -189 -120 275
6684 275 -91 16 58 38 3 118 38 -13 27 -133 -95 81 -4 -54 -123 -14 55 -92 -17 -136 -55 -313 125 -128
6708 -128 72 123 231 103 -29 270 114 103 -146 -154 -180 -262 0 167 -138 243 -108 -112 176 109 -178 -296 53
6731 53 176 171 -46 14 233 -53 37 -46 68 225 176 89 21 84 121 -54 189 -34 191 -43 374 -83 -108 -92
6755 -92 30 356 43 -100 -203 -77 -234 106 137 36 -79 -72 244 178 176 240 -224 -15 -38 -170 -201 86 -173
6778a73K7O1M2j6J51O4j18K8k17K64k63J03m4J10lJ46q2P3j5n7j54Q4M1j66L17
6803B03l48L68o0r9J05k0j26J9%Jkj1o0R7m4J9k64R6O4J37q2j5R2k55K19J14m9
6830I9j24j33M2K97O5j76j06j6nJ60l38L15j94J76R0j08q4j42L17r1O6k20p6K30
6854D4r9K9n6k6J44L15j68j62Qq9J20j88J30O0Pj22m3K32j65k11M72k37q1R2p4
6879f8J35k46L43k41q8J4Q9ON8K4j61L86k94L5j14J75p4O1O8j12q4N58o49K92
6903A13Nk38N6J34O8l39J95K05j10q4J21j56p8J39p8J52J82k75K7Km22L34M1J31
6927A25j40n7J81O2j13J14k19J42m9k42L57k62l1J65N7j07j16L41k47j09K44l58
6949b62K99j51J12j23pJ53J39k50J60M1m32L12r8L21p3O4k12j06J99J19Pm39K54
$$ plain form
6778 -173 -146 -85 -43 -59 92 156 38 66 -151 113 -150 -47 -91 19 16 162 80 153 138 81 -73 11 52 -114 203
6803 203 -145 223 163 64 169 149 23 42 42 43 41 30 -30 67 23 42 -222 -126 -62 75 -7 -22 70 -185 34 148 99
6830 99 -25 -158 -116 181 246 70 -36 -52 -57 103 -235 80 -114 62 152 44 -40 -182 135 44 110 -110 -186 44
6854 44 -55 -26 -82 -108 36 351 183 21 29 -60 60 -128 2 62 69 -53 -96 136 -29 -240 232 -5 -86 6 -68
6879 -68 67 -179 164 -77 -165 -151 -62 -56 2 26 -135 251 -43 -8 -122 53 -21 40 108 -4 -88 470 -179 113
6903 113 118 -120 -64 70 138 -201 -6 199 89 5 126 -30 -108 31 -47 105 287 12 39 41 -381 -47 -6 125
6927 125 -15 -72 109 171 58 172 -47 95 46 -196 161 -101 -132 33 90 -17 -133 208 -39 -148 96 -262
6949 -262 37 -114 -2 -125 -132 21 160 -90 70 111 -321 -9 -107 214 141 205 -7 -113 86 205 212 -227 27
6972B7K09k36r8J96p3j67J92M7j35k87K32r9J42J09R9l67J26J10p1M3k88J71J87
6995F9k21J70l13L02p5K22j88k20K52Q7m0Mk41K10j39L14j6k20P9O4j50O7j22
7018a05K7j20M06p4j94M62m07J22o3l36K34K90m07K04l03J22O6j80M01j78J97
7039A64j03o4P0j09N4Q4j52j9n4j11J69J64j28j01L41l22K47j56J0J08j24j06
7061a38K5L7K7P9J23j78o8K47o4j95P9L98n48j85K48J87l1Qj90L23l6j46j29m5
7085a72j4M12k72o9K53r3N1j15r2O0Pq9L71o22L56j25K56j39Q7%J62m28L84j01
7109F8j55J95p2p2n3j13Q4K04q0Q7J86k75M1J53j23p2O3K8k1J20l10J65J02j29
7133B1k72K75j1n6k24J66p5L1K35P3q7J27k39l7m7J79n3Q4l0k05L97m04M2J93
$$ plain form
6972 27 236 0 -98 98 25 -142 50 97 -38 -325 -93 -192 -50 59 158 -209 -83 27 -44 -1 -289 -118 69
6995 69 -152 18 -295 7 -68 154 -34 -254 -2 85 45 49 -192 18 -121 193 177 -43 36 100 -50 17 -105
7018 -105 -78 -198 208 134 -60 402 -5 117 54 -282 -48 242 -165 39 -264 -142 -76 -256 145 -33 164
7039 164 61 -3 67 -42 12 96 -56 -75 -129 -240 -71 93 -35 -136 205 -117 130 -26 -16 92 -32 -138
7061 -138 -113 -76 -49 30 153 -25 -93 154 90 -105 -26 372 -176 -361 -113 74 43 51 -139 184 148 2 -127 -172
7085 -172 -186 226 -46 -115 138 45 96 -19 -111 -51 -44 -133 238 -384 -28 -153 103 -36 51 51 213 -215 169 68
7109 68 -87 108 36 -36 -89 -202 -118 86 6 93 279 4 45 198 75 3 66 94 73 193 -117 48 150 21
7133 21 -251 24 13 -43 -267 -101 -176 -145 90 163 76 203 -36 -73 -120 59 6 90 60 -145 252 -152 -110 83
7157H3J02j80q6jJ31l4j27p7K47r2J22l37K06J78q4j26j14J34J58L5j19p1J00
7180D8kK14l0j90J2q1K9J18k9k26J34L2L2o7N2k29Q9J48R7j21r2J56k54R6L0J66
7206A32l24L56j18L6l78J74M13j85j05l4q5L06n2p9J48k18j18J47m1q0M4K26j58
7229Gk98M68N0k91K35o9k54J18j3R2lj57L59j13R1l29j6O2j28J22mK74l70M12
7253B45l20J0J21j45j26K76L5l6J53l15o6L29l10J48j01J59r3k1J46J20r7p5j3
7276B4p1R7j5K61k36Jj30N2k2L0R6k69Q5K14r2Nj28J54j74j27R2J42p9N3J00k27
7302a64l7J56r1q6J06J45o4J45O4o7q1J39p1rl79K06o1P5J06J29k39m1J99J3j66
7327g3n6o5N0j15R4J4L75k66o2j72J99J66j01j65j80K36J33mj00oJ59R8k10k13
$$ plain form
7157 83 185 5 -81 -82 49 15 -112 -189 58 -34 88 -249 -43 135 51 -75 -189 -55 103 138 19 -52 48
7180 48 46 260 230 40 52 -29 0 118 89 -137 -3 29 61 -6 46 -183 -94 54 151 30 -62 94 -160 -64 -34 132
7206 132 -192 164 46 82 -296 -122 291 106 1 -33 -118 188 136 57 205 -13 -131 16 -25 -105 -61 165 7
7229 7 -291 177 227 -64 171 102 -152 -34 -47 45 42 -115 244 131 222 -107 -123 -61 -189 -67 -71 203 -167 245
7253 245 -75 -65 56 -89 -215 61 96 60 213 -102 -168 161 -149 -1 -102 57 -36 -57 89 209 112 37 24
7276 24 -47 50 35 296 60 61 -69 -17 -39 -9 87 -182 -97 117 25 30 -98 56 -118 -245 -153 -11 -90 -37 63 -164
7302 -164 -201 -45 -136 -222 -116 29 -35 110 174 107 26 165 94 85 -294 -88 -149 -74 32 161 -78 -119 80 93 -73
7327 -73 -129 -194 -144 -259 -165 -151 224 -42 -104 -276 -77 89 -12 -177 -357 -121 12 8 -92 -98 61 159 -51 -264
7351b64J03K81j43n0J36L9j56j3p7J44J2J08J20k50J5l4O1j39L1J6J38p6P8k60
7375a80K23N0n9j8r5K4J85r5j58M9K69m5l36K73k55J77o7K42j08r0ql7o9J64R5
7400A31m0j97J27Q8k58L80j11j07m5K1o8K32k07q1K67j17J14j70K82k47j22K83
7422A55k10L4O9M1m6q5Jk4O5o1K36k70K43n1m8Nj20R2qJ72l62J01J18J68l18r
7448a12q0K98l58rL52k43L36l40J80j98J39k13J38J72J02j02p4J49j36q1R0J17
7470A27J00k53K22j39r9K5j76L89kjNk31k03J80J9j36J73Q7k13K63o6J10j38k1
7494B2r6j6K9j70K61J6M7J16j72J18j23N0K6q8j52K42kk11J78q1K2j41K82k19
7518f2OJ32k09K76J20r3j52m5m3K21j52j84J69P8J25j58k3Mj08J59p9m5M9j38
$$ plain form
7351 -264 -161 120 -23 -73 63 102 -54 -67 -144 0 12 120 240 -10 5 -29 32 -107 -76 -60 78 2 80 -180
7375 -180 43 93 34 16 -79 -55 130 35 -123 -74 195 150 -186 87 -168 9 -58 184 76 -14 -22 -59 -128 36 131
7400 131 91 -106 21 109 -149 231 120 13 -32 -11 -79 153 -54 -135 132 15 129 -41 241 -6 -128 155
7422 155 -55 -21 48 89 43 -42 -41 -65 0 -61 175 -95 148 97 49 54 -66 26 18 190 -172 -71 47 215 -103 -112
7448 -112 -192 106 -252 -261 91 -152 184 -156 24 -174 -35 -248 -110 62 164 62 -12 137 1 -80 10 127
7470 127 227 -26 196 57 -42 -17 -193 196 194 193 198 -33 -236 -56 -37 -173 0 87 -126 137 71 181 43 22
7494 22 -74 -90 -61 -231 30 46 93 209 37 155 32 82 108 20 -132 110 108 -103 75 -6 16 -125 157 -62
7518 -62 -56 76 -133 143 263 170 18 -27 -70 151 -1 -185 -16 62 187 29 6 10 -98 61 -18 -63 -14 -152
7542a52J16J94q5j09J45j50L2J11P5l11R9Q9j66Q8J59Q5j91Q8j61l4J42p3j54
7565a63L28k34Nn1j19J54m0J82L0j18O3j64j4K09k00J23k34J73q3P8J85j99J44
7588E5j12J3j45J68J00j30J23j02J13j5j13L33m13j29K33k7J44k94K30r0J19N0
7610A11r5j79J73K23l68K14q0ql9j58j64L40o6J7J46N0j90L8J1K09j30j48L9J75
7634A21n7n7N2J86j2m94J42K38n3k45J24MQ5j05J0J79n3p9nL80k68j28R2q0L12
7659B89k82k67K82N2o2J96j30j67J35j17K37o8L5k18J43R1K8n0j20K8m8k58M95
7682B24m03M10k54k3k3j1J78j36r5J53j51lJ37k93J24K73j78K24j40q7O7R3j54
7705f8m9K89j80o0j5j87L96l45P3q4K57k3k83L64j02J32n5J13j1j67J80j92j91
$$ plain form
7542 -152 -36 158 73 -36 109 -41 -9 102 177 -134 -35 54 -112 -24 135 220 29 117 -44 -78 64 -9 -163
7565 -163 165 -69 -64 -115 -234 -80 -120 62 92 -26 37 -127 -141 68 -132 -9 -243 -70 -153 -75 110 -89 55
7588 55 -57 -44 -189 -21 79 -51 72 -30 83 68 -45 288 -125 -254 -21 -48 96 -198 32 -58 61 111
7610 111 16 -163 10 233 -135 79 -1 -9 -48 -206 -370 -30 -96 -79 67 117 -73 -35 -24 185 55 -93 -54 121
7634 121 64 7 59 245 233 -261 -119 119 66 -179 -55 -51 34 -71 -61 118 65 -14 -19 361 93 -35 57 -23 289
7659 289 7 -260 22 74 12 208 78 -89 46 -71 166 98 133 -85 58 149 177 127 7 35 -13 -271 224
7682 224 -179 231 -23 -46 -69 -80 98 -38 -133 20 -131 -134 3 -290 -166 107 -71 153 13 -74 -7 86 -68
7705 -68 -117 172 -8 -68 -83 -270 126 -219 -146 -230 27 4 -279 85 -17 115 60 173 162 -5 175 -17 -208
7728b08J82N1j07P3P4J00j35J11K7k94K27o0p4j75N6j6J51K84l62K45q9k65J49
7751e5jM08n34K15R5l51K26j89K27J36l70R9P9M8m7J33R0k36r2J06J08k59J54
7774a0j69PN9J93J52k18k10J33R4J00l26R6M5J26k91K30n0K81l04R2j6q6K26l45
7798a91J32J17r5Q0k88L72L8N8k4k09P8K22l18K32k75m7L55m01J30L1o4q3K45
7821I5m7rM8P4l14m3L77k86L09m07J02n3J77j68J75k48K82L3K0j62n9J77J19j38
7845E4K01l76J66k14J34l3J59j15K09l39K15j07n7n7l8K36k84M05k28J43k28J11
7867d3j67O01k65L1r9k63Q2J21M00l54j13j57M75l01R9M9l93J45J81K29j78l4
7889D6J44k75L49q8l6j36k4J3l19M17j25j21onM53q6l95K19k28K26J2k94J57J22
$$ plain form
7728 -208 -26 25 -82 -9 65 165 30 141 168 -126 101 41 -33 -208 -152 -168 -17 267 -95 150 61 -204 -55
7751 -55 -56 352 -182 33 128 -223 3 -186 41 177 -193 -94 -15 33 -14 119 209 -27 -119 -13 95 -164 -10
7774 -10 -179 -172 -113 80 232 14 -196 -63 31 131 -195 -99 -54 72 -219 11 -39 242 -62 30 14 -72 154 -191
7798 -191 -59 58 -37 43 -245 127 165 223 199 -10 68 290 -28 204 -71 -118 237 -164 -34 -3 -67 -150 95
7821 95 48 39 87 161 -153 -196 181 -105 204 -203 -101 -154 23 -145 30 -218 64 97 117 -45 -104 73 192 54
7845 54 255 -121 45 -169 -35 -68 91 -24 185 -154 61 -46 -103 -160 -198 38 -246 159 -69 74 -154 -43
7867 -43 -210 391 126 157 58 -205 -123 -2 398 44 -69 -226 249 -52 47 96 -297 -152 29 258 80 46
7889 46 190 -85 264 176 140 4 -20 -7 -326 91 -34 -155 -161 -166 287 201 -194 25 -203 23 35 -259 -102 20
7913B0k39J95j6Oll0O7P4j19n8K36j19J01j10M3J86l25K75k42J14K0m2RJ27l8
7938A32J07k16J4K72n15J43N5K0k77L47n5P5l09M75l43K85j68Nj02J9r2J20J1
7961Cj02L01j48M6J3ON2k59K4R2j24K75k18K12l63l3J62q1J79m4K20k86l1R8m5
7986e1k0jJ36l08J91J29Lj20k9J01L84j75l58K16o9j05K40j73q5j08O7J37J17
8009A19k02J70k22K97j96O2o8Oj00K07l27MK27L2J26j61J39l1l02K51J24r3k45
8032a83K5qK49KK9J9n4N6l16J7L87k8J52l68j98K36j32K35J94k17k03R6j47R1
8056f6lJ10k7J0P1n2n8O6q6J39j54n5j98L18N7j7j76K18k34K05L64n11K03k80
8080a56m2M38l37N6J15k02J52K77l17k01K45j28k6L19k25q1J64K21k84J13j46
$$ plain form
7913 20 -219 -24 -40 -34 -37 -67 0 74 -45 -103 133 14 115 5 48 234 -91 184 -58 56 76 34 43 170 132
7938 132 239 23 37 309 -206 -63 -8 12 -265 82 27 102 -207 268 -75 210 42 47 -55 -36 -128 -8 3
7961 3 -99 202 54 100 113 119 171 -88 -64 28 -96 179 -39 173 -190 -223 -61 -142 37 -7 213 -73 -104 -6 -51
7986 -51 -71 -72 64 -244 -53 76 79 -41 -70 31 415 240 -118 98 29 -76 164 -9 -94 -202 -135 2 119
8009 119 -83 87 -135 162 -34 28 -40 -34 -134 73 -254 -250 -23 9 135 -26 113 82 -220 31 155 62 -183
8032 -183 -158 -166 83 85 114 133 79 135 -181 -164 223 195 347 -21 -219 17 -115 120 314 97 -106 -10 -157 -66
8056 -66 -69 41 14 24 95 43 -15 51 -35 104 -50 -105 -303 15 72 55 -121 97 -137 68 432 -79 124 -156
8080 -156 -198 240 -97 -41 74 -128 24 301 -16 -217 28 -100 -126 193 -32 -113 51 272 -12 101 -45
8101d5p5J01j30J49JJ84j76K78l02L74m56K74j09M5j92k36K38JJ34r2j8q0K03
8124G1j41Np1J3O3O5K62p6j33p2jJ77k42K0k3K7L73k31O2l00P5q1K09q5K92k91
8150c3n9J59j83P4J83k39l9K23k70J12JN3K20j5m17J98M1n5J04o3j35J68j26K6
8174g2j2N4P3n0K27j55k98K00k04K14o6j30R0p7K28Ok48
$$ plain form
8101 -45 -120 -19 -149 0 1 185 9 287 -15 359 -97 177 68 113 -79 -315 -77 -76 58 -34 -52 -132 71
8124 71 -70 -65 -136 -123 -60 5 267 191 58 -14 -15 162 -80 -60 -83 -56 317 86 148 -152 -77 -158 51 -34 258 -33
8150 -33 -92 67 -116 -42 141 -98 -137 86 -184 -72 -71 -18 202 187 -230 -32 9 -46 58 -5 -140 28 -98 -72
8174 -72 -84 -30 43 -7 220 65 -233 -33 -237 -23 -89 -219 -129 -206 22 28 -220
8191b20
$$ Imaginary data points
##PAGE= N=2
##DATA TABLE= (X++(I..I)), XYDATA
0@%%%%%%%%%%%%%%Qj6J6j6J6k4L2l2M0m8N6o4P2q8J00j10J24j45J67j86K09k37
36a26K66k98L35l70M10m58N07n62O22o86P57q36R21j013J117j231J356j495J653
55H69j833K036k270K544k868L258l739M351n155O263p892J0521j5437K7581j09806
70i1577j51904L13904R9987j61251j4722M9543p6157L9785Q7147q5699o6866J00098
82D2288J1765p6130N225J7562k97L5645n3618p6810R1445P3138j21129l2511J29173
95D5746J276p7798M6374r10p0574Q4702P2670j36339o2629J08665J3560m5959
107b1216N7110J42q9603L6307P8135n3711k7143M8182l8697l6873P1559K1363
119D5555n3165M319J1243l0617K0929K7509n2856j5447N1836j1804j9156M5983
$$ plain form
0 0 0 0 0 0 0 0 0 0 0 0 0 0 0 0 8 -8 8 -8 8 -16 16 -16 24 -24 32 -32 40 -48 52 -58 66 -79 88 -98 111 -126
36 -126 140 -158 177 -193 217 -241 266 -296 326 -360 397 -439 482 -531 586 -645 711 -784 869
55 869 -964 1072 -1198 1346 -1522 1736 -2003 2348 -2807 3456 -4436 6085 -9352 18229 -91577
70 -91577 -243481 70423 170410 9159 -5563 43980 -32177 7608 94755 9056 -57810 42288
82 42288 54053 -22077 -16852 710 413 36058 -17560 -94370 -2925 70213 -50916 -83427 45746
95 45746 47022 -30776 15598 14688 -55886 28816 101486 -34853 -97482 11183 24743 -21216
107 -21216 35894 36036 -53567 -17260 60875 7164 -19979 28203 -10494 -47367 24192 45555
119 45555 -7610 -3291 7952 -22665 -1736 25773 -27083 -42530 9306 -2498 -21654 24329
131B4329j8657n6647N6421N9291n9174l8537L6913R71r101L4033j7432n2161L0399
144i352M3127k4326j2961J1109j5152j826J8120j5821o524L4554p903m3545K3420
157g080M2928k6488l1802N940J147J1005K2077k0733l0883K1552L3413m145j5396
170A535r149m080K2777J7637k5836j2545K1090k214j3150J4718L686k0800k29
183f560J0851r378k582Q986j4208j0077K1576Q943j2141j252J958j8R633J504
197G235j3955J061J1139n053J83J5939o278j6356Q223O441p821N516N34j7979
211a1171J487K0764l841j6323O673N870r050M010N449j0536j029P763o157j269
225g360R474l719o555R733N645p358J733J742r709P535J5076j2922j2559J4259
$$ plain form
131 24329 5672 -50975 5446 64737 5563 -32974 3939 4910 -4191 29842 12410 -39751 -9352
144 -9352 33775 9449 -3512 7597 -7555 -9381 8739 -7082 -13606 20948 13045 -30500 -7080
157 -7080 35848 9360 -22442 -16502 -15355 -4350 17727 -3006 -33889 -12337 21076 16931 1535
170 1535 -7614 -11694 11083 28720 2884 -9661 11429 9215 -3935 10783 14469 -6331 -6560
183 -6560 4291 -5087 -7669 1317 -12891 -22968 -1392 7551 -4590 -5842 -3884 -3902 5731 7235
197 7235 -6720 -5659 5480 427 610 16549 10271 -6085 2138 8579 758 6274 6808 -11171
211 -11171 -9684 11080 7239 -9084 -2411 3459 -5591 -1581 3868 -6668 -7697 66 -6091 -7360
225 -7360 2114 -1605 -8160 1573 7218 -140 1593 3335 -6374 1161 16237 3315 -9244 5015
239E015P972q752j556J125p013J368P014q803o124J0745K36r508K548M327j211
254b617K208j284n946L933Q818l888p389O059M492l706K807J406n019L630M566
269H070n221m008M227J581m291J73K832m407j361K900j953j347O72k171k49J855
285b698j28l89O3J403l53J078K368j297J18L723j063k276J926J208m77j437L01
302B070J430o41o48J19j172m55o97j035m20j741L9Q92j743K74J317m56L27M62
320b078K96P83p31J006J479L16J233M5L79J799j10j020m05j286M56j39k323j38
338d38J42O00P7j852J00K82j469j23q87o28N96M20J299K42j03K297O89j409J203
357A038M54o08k26Q54J521o80L99J365j330j66K60k607r24K77j377j69M08n68
$$ plain form
239 5015 12987 4235 2679 3804 -3209 -1841 5173 -3630 -9754 991 1227 -8281 -5733 -1406 -2617
254 -2617 -409 -1693 -7639 -3706 5112 1224 -6165 -106 4386 680 3487 4893 -126 3504 8070
269 8070 2849 -1159 3068 4649 358 531 3363 -1044 -2405 495 -1458 -2805 -2133 -4304 -4553 -2698
285 -2698 -2826 -3215 -3152 -1749 -2102 -1024 1344 47 165 3888 2825 549 2475 3683 3206 1769 2070
302 2070 3500 2859 2211 2330 1158 703 6 -1029 -1449 -3190 -3151 -2259 -4002 -3728 -2411 -2867 -2540 -2078
320 -2078 -1782 -999 -1730 -724 755 1071 2304 2349 2728 4527 4417 3397 2992 1706 2162 2023 -300 -438
338 -438 -296 304 381 -1471 -1371 -1089 -2558 -2681 -3568 -4196 -3600 -3180 -1881 -1639 -1742 555 1244 -165 1038
357 1038 1492 884 658 1512 3033 2353 2752 4117 2787 2621 2881 274 -650 -373 -1750 -1919 -1511 -2079
375b079p0R84P55k064k23J420k049j010K462j99M73J945K86P65J985N91k167q42
393I63J555J20j266R26j366r00L860Kl330l24o18j510j31K65k962o37L092K77
411a984q69L169r0l181K522J363k808J298J539l031J208N904j71l182K277j45
427C819l125M318O44r480K63O616k659j993L736l841m892P469K758r594J20M947
443h94n226J525R048n595m819R340Q92n840O933K466j2907J326J2190o002n577
458c140Q490n066p030J4139L178j7010N58R643o824j05R842j0822r528J8212L796
473H333j5754O587O517j5423L632J6733j1483j0451J4810p71j1691J5525P351
486A3915k1253J434J6890r004l602J2995j3297j3186K2718P959k1555R93J1162
$$ plain form
375 -2079 -2149 -1165 -410 -2474 -2697 -1277 -3326 -4336 -1874 -2073 -1600 345 631 1396 3381 3972 1805 963
393 963 2518 2638 1372 2298 932 32 3892 3894 564 240 -378 -1888 -2019 -1754 -4716 -5353 -2261 -1984
411 -1984 -2853 316 226 -2955 -433 930 -1878 -580 959 -2072 -864 5040 4869 1687 3964 3819
427 3819 694 5012 5656 -3824 -3561 3055 396 -1597 2139 -1702 -6594 875 3633 -5961 -5841 -894
443 -894 -6120 -4595 4453 -1142 -5961 3379 4271 -1569 5364 7830 -5077 -3751 8439 2437 -3140
458 -3140 5350 284 -6746 7393 10571 -6439 -5881 3762 -3062 -3167 6675 -4147 -13675 4537 8333
473 8333 -7421 -834 5683 -9740 -6108 10625 -858 -11309 3501 2730 -8961 6564 13915
486 13915 -7338 -5904 10986 1982 -1620 11375 -1922 -15108 7610 15569 -5986 -4993 6169
499F169j3823L259J9295j8220j7610K2246N695j6750J0415P262k0180M779K2604
512A5141j3669j2166J8559n156j6619K1380R973k5289K021J7066j3438j91K0084
525A7696j6342k2399K3514J2575k0692L029P271j8251P188K4940j8005j9962J8825
538f13M440j3890J3498O284k3717N076K4113j2797r031J8823r055j8093K0706
551E744J1049k0659M71J0150j3292L434K1760j5171k2324J6527R838j1933O579
564B173J262k0398Q586K4329j1732j5858J2038O29r217J4517M104k1014K769J5687
578G875q718j055J3297j0147j2446J4598O814j1113L078J527j4636P205J9911
591A6190j0884j5135P462K081k470J0204l744j8691M957J6435l919n527L888o378
$$ plain form
499 6169 -7654 -4395 14900 -3320 -20930 1316 7011 -9739 676 7938 -12242 -7463 15141
512 15141 1472 -10694 7865 2709 -13910 7470 17443 -7846 -5825 11241 -2197 -2388 17696
525 17696 1354 -21045 2469 15044 -5648 -2619 4652 -13599 -6411 18529 524 -19438 -613
538 -613 3827 -10063 3435 9719 -13998 -8922 15191 2394 -6637 12186 3131 -14962 5744
551 5744 16793 -3866 -3395 6755 -6537 -3103 18657 3486 -18838 -2311 7527 -4406 2173
564 2173 3435 -16963 -8377 15952 4220 -11638 400 1029 -8188 6329 10433 -10581 -7812 7875
578 7875 -843 -1898 11399 1252 -11194 3404 10218 -895 2183 3710 -10926 -3721 16190
591 16190 5306 -9829 -2367 -286 -2756 7448 3704 -14987 -10030 6405 2486 -3041 847 -5531
605e531j266J4959l43j2809L519M124n786N756P554r899n813P985N95j919O637
620G763n281j3352P946J0152n512l325n45o020M986J2395n802j2544L896N535
634B92j704M647l79j0981L592J0758l822k640M943n128m686R753L055q404Q86
649A82K214o618M476R948r732q713P598J843k855N178l457j1032O404J1407o524
664C19n098N016l677q56J0934j909j1156M833O024n625K717N880q776m085J0641
679E182l39p276N727m02r269N774Q270q488m142O228l210k281Q354j778j0662
694h312M789P017n773R40M267p327q92J1232j931q172M943K494n778M057N672
709G226p820l006Q078k340m357N833j131p494L689N405n401j274L834m194k015
$$ plain form
605 -5531 -6797 8162 7819 -4990 -1471 2653 -3133 2623 10177 278 -5535 2450 3045 1126 7763
620 7763 2482 -10870 -2924 7228 1716 -1609 -2154 -8174 -3188 9207 3405 -9139 -5243 292
634 292 -1412 3235 2856 -8125 -4533 6225 2403 -237 4706 -422 -5108 4645 7700 -704 182
649 182 2396 -4222 254 10202 470 -8243 -645 1198 -1657 3521 64 -10968 -4564 6843 319
664 319 -4779 237 -3440 -4296 6638 4729 -6427 -1594 4430 -1195 1522 7402 -1374 -5459 5182
679 5182 4843 -2433 3294 2892 -6377 -603 7667 -821 -4963 1265 -1945 -4226 4128 2350 -8312
694 -8312 -3523 3494 -2279 -1339 2928 -4399 -5291 5941 4010 -4162 781 3275 -2503 1554 7226
709 7226 -594 -3600 4478 2138 -2219 3614 2483 -5011 -1322 4083 -1318 -2592 1242 -2952 -4967
724d967P578j335p009L904L345m047K373L161n237r57O521r41m166L730N95m185
740a637L141L291m678r21L602k354k230M026q38m441J582K805k994L76J953l128
756b445m39L771j197k364K232N13j977J936J883k417j49K780p03j589J944l46
772A433j852J816R46j985L0R53p57p86Q88l98j623P55L5j303O09P59j453M88J004
791d41l52j44K21L41l13N73R34p01M73P31m1K56K63o38k82K46m61l82k85K04l30
812a28m43M32n49k70J27m72k2L12l33n9L08K39L16J01M15K96O9M19l7l15M71R2
834I69j63M33m63N70j13m61j6m14k61j57m37j01r7l53K96k64j67N61j78j68Mp6
856a056N17rK09L83K62M37J36j79O84j4m90K69j81j46j95L5j52o01K36K46q91
$$ plain form
724 -4967 2611 1276 -5733 -1829 1516 -2531 -158 3003 -2234 -3191 3330 2389 -1777 1953 2548 -1637
740 -1637 1504 4795 117 -804 2798 444 -1786 2240 1402 -3039 -1457 1348 -1646 -1270 683 -2445
756 -2445 -2884 887 -310 -2674 -442 71 -1906 30 1913 -504 -653 2127 1424 -165 1779 1433
772 1433 -419 1397 2343 358 388 1341 584 -202 686 288 -1335 -580 -545 -1848 -1239 -480 -1933 -1445 -441
791 -441 -793 -937 -716 -375 -688 -115 819 118 591 1322 1281 1537 1800 1162 880 1126 665 283 -2 202 -128
812 -128 -571 -139 -688 -958 -831 -1303 -1325 -1013 -1346 -1405 -1097 -858 -542 -441 -26 270 339 758 721 406 877 969
834 969 806 1239 776 1346 1233 772 756 342 81 -76 -513 -614 -711 -1064 -768 -1032 -1199 -638 -816 -984 -980 -1056
856 -1056 -539 -548 -339 44 306 743 879 700 1384 1370 880 1149 968 822 627 662 510 -91 145 391 -500
877e00m56L60m32k18K99l43pP30K29o32K36P37j69m22P03R2l99J327K21j092O28
898H92O00p44lO80j071r14J452J5k128P88J534k445k29J977r60j198J203j20j886
917b557J914J627k524l4K829q29q31K332j414k018L132J550l668J83L092k415
933C69j012L615j989l254L273J81l646J629K417l667n03L678j275k347L647q66
949B50m402L925L585n019q53M310j971o19M208k032n044N023L102n044N5L507
965B981m066o30N759k764m899M873Q28n710K721M214n999j621N906k417k509N642
981B309j799o196N505N210o014q90M137l485j9O939l226p115N223L938n236J329
997F10K507n852OP098l056n248M436O78n383L837M225o330j321N211k680j156
$$ plain form
877 -500 -956 -596 -1028 -1246 -947 -1290 -1297 -567 -338 -970 -734 3 -166 -588 115 207 -192 1135 1356 264 892
898 892 1492 748 745 1425 354 -560 892 907 -1221 -433 1101 -1344 -1573 404 -556 -1754 -551 -671 -2557
917 -2557 -643 984 -1540 -1574 1255 426 -405 1927 513 -1505 1627 3177 -491 -308 2784 369
933 369 -643 2972 983 -2271 1002 1183 -2463 -834 1583 -2084 -2587 1091 -184 -2531 1116 250
949 250 -4152 -227 3358 -1661 -2514 1796 -175 -794 3414 1382 -3662 1361 4463 -581 -526 2981
965 2981 -1085 -1715 4044 1280 -3619 1254 2082 -3628 -907 3307 -2692 -4313 1593 -824 -3333 2309
981 2309 510 -5686 -181 5029 -985 -1875 2262 -1223 -1242 5697 2471 -4644 579 4517 -719 610
997 610 3117 -2735 -2729 4369 1313 -3935 501 1179 -4204 -367 3858 -2472 -3793 1418 -1262 -2418
1013b418O221k906o678M795N340l951l32K079m695Q72Q032l669o619L801K483
1028B355k694K521Q75o529O40O129k345l675L753j369m269M789K857n017K16K188
1044D25l334J696N606k960n765L330K823j418K895j463o304K922O907k506m094
1059a240J373j161j54N079j254o022J337L257k177R40K441m699j869M522L05j830
1075a152K183j708l953L904N024l549k235J430j948K157N794l897o498L780L211
1090B543j451J117o23n437J681O561k803m266K459r53k359N388J043o374Q58L258
1106F42k826J155N006m532m800N860K638l511K009r4n877L610P346m770m815L527
1122E68j68j571N158q73q319K925N991l607j457L794m641k672P210L14o154K374
$$ plain form
1013 -2418 3803 897 -5781 -986 4354 403 71 2150 -2545 -1673 6359 2690 -3929 -128 2355
1028 2355 -339 2182 3057 -3472 -2832 3297 952 -2723 1030 -339 -4608 181 3038 -1979 -1763 425
1044 425 -2909 -1213 4393 1433 -4332 -1002 1821 403 3298 1835 -4469 -1547 5360 2854 -1240
1059 -1240 133 -1028 -1182 3897 2643 -3379 -2042 1215 -962 -22 2419 -2280 -4149 373 678 -1152
1075 -1152 1031 -677 -4630 -726 4298 749 -1486 -56 -2004 153 5947 2050 -4448 -668 2543
1090 2543 1092 2209 1586 -3851 -2170 4391 1588 -2678 -219 -1172 -3531 1857 2900 -3474 -2616 642
1106 642 -2184 -1029 3977 -555 -5355 505 3143 -368 1641 1547 -4330 -720 6626 1856 -2959 568
1122 568 400 -1171 3987 3114 -5205 -2280 3711 104 -1353 2441 -2200 -4872 2338 2652 -3502 -1128
1138a128K302m848K697O191n530m196N865k8k755N125p80p674L373O858m279k544
1154a351L424l432j756P296p49p693K499M021m129R75M313n844k312O293K53m714
1170b906L615R51n805K909N958m665k601M400j792k038N620l62o693K261M703
1185C555l532j54K755m096j797N988j97n104J788J582l153J499L737m378k214
1200c721M660m28k490L290m6m514K536L586l185m99K621k024j398M513k81m204
1216a584J537K130k561P57J841l327r72L522l99k247J136K83k464J563K215k796
1232a366m46K300j386j08K305o70k258J708J607j784N26J138j784m32K597m39
1248A508k083R37K05j248J315P26k264k00J488o86q41J305l32j558J509N68j278
$$ plain form
1138 -1128 1174 -3674 -977 5214 -316 -4512 1353 1325 -1430 3695 2915 -4759 -1386 5472 1193 -1351
1154 -1351 2073 -1359 -3115 4181 3432 -4261 -1762 2259 -1870 -895 3418 -2426 -4738 1555 1808 -2906
1170 -2906 709 1660 -4145 -1236 4722 57 -2544 1856 64 -1974 3646 3284 -3409 -1148 3555
1185 3555 23 -131 2624 -1472 -3269 2719 2522 -2582 -794 788 -2365 -866 2871 -1507 -3721
1200 -3721 939 511 -1979 1311 1265 -3249 -713 2873 -312 -811 1810 -214 -1612 2901 2620 -1584
1216 -1584 -47 2083 -478 279 2120 -1207 -2179 1343 944 -1303 -167 116 -2348 -785 1430 -1366
1232 -1366 -1812 488 -898 -1006 1299 629 -1629 79 1686 -98 428 1566 -218 -650 1947 1508
1248 1508 -575 362 567 -681 634 1360 -904 -1104 384 -302 -1143 162 -170 -1728 -219 349 -929
1265i29J95R68p66J10J186m45o29Q80K19o47O41P62j665K33J129r03j88L41k43
1284B49q27P98r7p69O2O73o79l55Q66o36k06O44n4m5J96K10l52K36L46J3n03J027
1306G97l93j41N07q2o33N46K24p94J13O7O0l43K1j0n73M3L29o05K00K82l97L04
1328d78R5P2q0K49L27j85L67J4n2K93J26l63K05l5m31J66K25j01j93M7k52k38
1350b22j42J66m18l3L79k36j57J53Q9J0M00m92K6L62K02Q2k43M91k23j05O29j69
1372E49j4J19o5n25K7J26j76k46K07j2n84K51K84n27R6J41m1j15K25o7j41N12
1394B4L42o00J10P42o37K85M93k06l81K77L56r70K33J018r87p71J151l96l99N36
1414B20l89j092O94P55q06l74J048m12n90J234j33j249R85J007j194n0J337n77
$$ plain form
1265 -929 -734 234 -532 -422 764 319 -310 570 789 142 783 1545 -120 113 1242 339 151 492 249
1284 249 -578 220 123 -646 -584 89 -590 -945 -79 -715 -921 -277 -331 -376 -180 30 -322 -86 260 273 -230 797
1306 797 404 263 770 688 55 601 825 31 144 211 271 -72 -51 -61 -634 -591 -262 -867 -667 -385 -782 -478
1328 -478 -383 -311 -391 -142 185 0 367 381 329 622 748 385 590 555 124 290 515 414 221 268 16 -222
1350 -222 -364 -198 -616 -649 -270 -506 -663 -510 -421 -411 -11 -503 -477 -115 87 169 -74 417 194 89 718 549
1372 549 535 654 589 64 91 217 41 -205 2 -10 -594 -343 -59 -586 -490 -349 -390 -505 -280 -347 -488 24
1394 24 366 -234 -124 618 -19 266 759 553 172 449 805 -165 68 1086 99 -672 479 83 -316 220
1414 220 -169 -1261 -567 188 -618 -992 56 -356 -946 288 155 -1094 -109 898 -296 -346 991 414
1432D14o38R92m2j146J348j2j530P25J628j735p81J452q85m58J194m80j636Q65
1450g25J392j214n40J185q09m64K200k88j835J253Q21j394N82J254j327n73J441
1467I59j89j177J153Q0j658L98J683j333m56O28m58n25J670m61k121Q46J235o32
1485c58LQ31j566k14K492m34j595J133K45p67Q67Q45j475l90J194r14p0J536r94
1504C69j637J175N14n12J27j91j528P57J930o14j866M17M90j4J622o96k080R20
1522h17J678o72J12O59j517n5J915j0j381P54k00j438J450R54j490q71P92o49
1540g86N23J775j357l026K011K148j373k6K25k399J366L190j520k315J430N15
1556C81r04K007N53l353N27K511j271q22K593k288k219L049J171k588L60Q06k446
$$ plain form
1432 414 -224 768 726 -420 928 916 -614 111 1739 4 -777 675 -210 -668 526 46 -1590 -725
1450 -725 667 -547 -1087 98 -711 -1175 1025 737 -1098 155 976 -418 164 1418 91 -482 959
1467 959 770 -407 746 826 -832 -434 1249 -84 -540 88 -370 -895 775 314 -1807 -961 274 -358
1485 -358 -355 476 -1090 -1304 1188 754 -841 292 537 -230 637 1482 7 -383 811 -103 -173 1363 369
1504 369 -1268 -93 421 -91 36 -155 -1683 -926 1004 390 -1476 -1059 -569 -583 1039 343 -1737 -817
1522 -817 861 189 301 960 -557 -612 1303 1293 -88 666 466 -972 478 1432 -58 -929 -137 -786
1540 -786 -263 1512 155 -2871 -860 1288 -85 -111 114 -2285 -919 2271 751 -1564 -134 381
1556 381 -523 1484 2037 -1316 -789 1722 451 -371 2222 -66 -2285 764 1935 -653 -293 513 -1933
1573a933R63L513k546k990K440R13j408K169j9m075J324M131j609k164K090j103
1589c04j693L849R25m471J118K404k332K72L073k773k802L338P86k410J563N35
1605A078m154J357M772k600l021K800p74j183L696Q4m990J410M052k318q96K600
1621A913k519j821M458L70l698J248J675l017Q82L767l174k812L197L85k417K767
1637A204L7m315J329L828k133j443K379j963j298M448K4m230J154K633k060M38
1653C2K655k973j811L592M74k885J569O49l185J822K554k569j764K274p43j246
1669a555L176n17l490R77K457j555J47J659k616o86L404O4k256O41R38j671J531
1686F48J876k574j099K080N5j522J453l30k392J636J489j425n80R23j090m83K365
$$ plain form
1573 -1933 -970 2543 -3 -2993 -553 360 -1048 1121 1102 -2973 -1649 2482 873 -1291 799 -304
1589 -304 -1997 1852 2777 -1694 -576 1828 -504 -232 2841 68 -2734 604 1390 -1020 543 1078
1605 1078 -3076 -1719 3053 453 -2568 232 -542 -1725 1971 2055 -2935 -1525 2527 209 -687 1913
1621 1913 -606 -2427 2031 2401 -1297 -49 1626 -1391 -509 3258 84 -2728 469 854 -1563 1204
1637 1204 1241 -3074 -1745 2083 -50 -1493 886 -1077 -2375 2073 2097 -2133 -979 1654 -406 32
1653 32 2687 -286 -2097 1495 1969 -916 653 1302 -1883 -61 2493 -76 -1840 434 -309 -1555
1669 -1555 1621 1104 -2386 -1409 1048 -507 -360 1299 -1317 -2003 1401 1465 -791 -150 788 -883 648
1686 648 2524 -50 -1149 931 986 -536 917 587 -1805 -169 1320 -105 -685 238 -852 -1335 1030
1703A030o04k058Q15J096j161J091R48k187j79K319m61o67N02j81j203J416J105
1720A621j744q0J012r96j48J824j231j355R74N78r35N37K04j412J52J469m72q95
1738h97P40k72m70J271L69j434K88R60n15J08Q05r06o63J160K41q85M16K34j005
1757d55L22Q38o05p04N11km86N38L36r91J82N68o07J53P75p22k89J072K05r72
1777c33M10K52l60K92N59p59j87M85K6m76M53k20m23J70M29l39n34P23m16l68
1797f16P41l01l03K47K34k94J92J6j56J18Q3L40l63L04P6P7Q5j49nl48M72m07
1819D3k1K77j01l48k7j3j79Q5K54n5m34L79j96K43J99r3j29K26r8l6Q5J74j08
1842A27j33K20L20k91J23M4m44J98Qj0l19J10K10m06K6l8j83J12K05j94m0K27
$$ plain form
1703 1030 426 -1632 -817 279 -882 209 1157 -1030 -1209 1110 649 -18 484 303 -900 516 1621
1720 1621 -123 -203 809 -187 -335 1489 258 -1097 -123 455 -480 57 261 -1151 -999 470 -2 -897
1738 -897 -157 -429 -899 372 741 -693 -405 555 40 148 953 47 -616 544 785 -100 316 550 -455
1757 -455 -133 705 100 -604 -93 -95 -581 -43 293 -698 -516 52 -555 -402 373 -349 -638 434 639 -333
1777 -333 77 329 -31 261 820 61 -126 359 385 -91 362 142 -281 -111 318 -21 -555 168 -248 -616
1797 -616 125 -176 -479 -232 2 -292 -100 -84 -240 -122 -39 301 -62 242 318 395 480 331 326 -22 450 43
1819 43 22 299 198 -150 -177 -190 -369 -284 -30 -85 -519 -140 -336 -93 106 13 -116 110 12 -24 61 235 127
1842 127 -6 214 534 243 366 410 -34 164 172 162 -157 -47 163 -243 -217 -255 -438 -326 -121 -315 -355 -128
1864a28Q8O4j56J91j33j09L75m7j50L96j32m05M29J27l63K60J27n40L15l3o8l47
1886b39L16m7m10K50Q1j73j05K14k19n0L35p1j65M88p6l70L53J56q5q4L65r3l59
1909A2K14N3j52j15J46j07j87L33k53Q0n3j46l9l13L78j31j5K7j69K2M59J31j87
1932a2q6R3J20J37J72r9l73M93k33r5J96j64l76M74O0o27K61r1N2r8J08l88K23
1955b53K56j82M8K5r9q0o8M48j25m8K0j70L44L24K87m99q4J55J6J06l14l94L87
1978A00L55k81j80k2j78m6K87l38j03k1K02k52L09K01m05L34L14o20Q4P41n25
1999d4m76J004K49n18l4j24m50N93O84p24q95J114r9n26O10o9j023J84J087o78
2019a35o82R55k93o01R71N33j495L01Q53q84L81J215r89j072J275O52j083N61
$$ plain form
1864 -128 -40 24 -132 59 -74 -183 192 145 -5 391 259 -146 283 410 47 307 434 -106 209 176 108 -239
1886 -239 77 30 -380 -130 -49 -222 -327 -113 -332 -382 -47 -118 -283 205 129 -241 112 268 183 99 464 371 12
1909 12 226 279 127 12 158 51 -136 197 -56 24 -29 -175 -214 -527 -149 -280 -295 -268 -437 -415 44 175 -12
1932 -12 -98 -5 115 252 424 325 -48 445 212 117 313 149 -227 247 307 -320 -59 -150 -98 -196 -88 -476 -253
1955 -253 3 -179 -131 -106 -205 -285 -353 95 -30 -78 -58 -228 116 440 727 228 144 299 315 421 107 -287 100
1978 100 455 174 -6 -28 -206 -252 35 -303 -406 -427 -225 -477 -168 33 -372 -38 276 -344 -260 481 -44
1999 -44 -520 484 733 215 181 57 -393 200 884 160 -735 379 280 -246 364 295 -728 -544 543 -135
2019 -135 -817 138 -155 -756 215 748 -747 -446 407 -477 -96 1119 130 -942 333 985 -98 463
2037D63J67j449M10K073j277j327J198k17o53J160K16k076L94J803r52q18J851
2054I66j410q45J823N08j844N98P79j433J55K385j170j597J409P8o66J062L86
2071A184k385L94K228j414q65J156p37q27K173K95k833N57J971j543L5J617j258
2088b52j244J943L84j395P27L40j789J029K052j373j363J450p8j571K361ok688
2105a473M59J931q74m92R89r96j148K288K49j894K77R75j315P47J712j641r34
2122a140J284K84q79J271k1j962R64J626j136n90J055j166l33J962k71j808L04
2139e56Q38o05L81O30j535o38K033k47o76O25l93n87N70J359j477m38J110n77
2157a83J00J168k80j978J040P29m92M49L18j505l18J755o4j430L36P9m61R55L58
$$ plain form
2037 463 630 -819 -409 1664 387 -940 258 41 -612 548 764 -1312 -918 885 -67 -885 966
2054 966 -444 -1289 534 1042 -802 -204 575 -858 -703 1682 512 -1085 324 402 -264 798 1184
2071 1184 -1201 -807 1421 7 -858 298 -439 -1266 907 1202 -1631 -1074 897 -646 -611 1006 -252
2088 -252 -1496 447 831 -564 163 503 -1286 -257 1795 422 -941 509 431 -1140 1221 1215 -1473
2105 -1473 -1014 917 43 -449 540 -456 -1604 684 933 -961 -684 291 -1024 -277 1435 -206 -1140
2122 -1140 144 428 -451 820 799 -1163 -199 1427 291 -299 756 -410 -743 1219 948 -860 -556
2139 -556 282 -323 58 688 -847 -1485 548 301 -375 250 -143 -730 -160 1199 -278 -716 394 -183
2157 -183 -83 1085 805 -1173 -133 596 104 553 871 -634 -952 803 739 -691 -355 -276 -737 218 576
2176E76j322j06R99j36l62R59q25r21J229P41r83M69j45p77M08J301o91p87K64
2195a09K97l62R34Q1j553L07Q64l36m97P32o06n45J006M36j330R3O79n03K74J021
2215H83r90o81J013K74o25O65O5j229M66R61m85l22L91o41k37J226n77q87L58
2234c72O06n48L51L74q49l89J008K86j015P08M1r12R10M21o64l04N31j21j69O42
2254E35m2p49K94N63p39J45K51l61l63J002m61l90L48n1l67L57M25o99k84N43
2274d3P3l46M77n7n95N75K29j98k05K55j65j97N31j79k80M53J71n13K47K91m73
2295E1j88M73l09l65K97J13m87L41J19k74r6L96l35O0K74j42m00P00J02l04QL43
2317C77j06j26K34j1n99K00L05k73Q2j49n3j52K29o5k31K36J1j89M86l27q0j40
$$ plain form
2176 576 -746 -852 147 11 -351 608 -217 -1138 91 832 -151 318 173 -604 -196 1105 414 -373 -109
2195 -109 188 -174 760 841 -712 -405 459 123 -374 358 -248 -793 213 649 -681 -588 91 -412 -138 883
2215 883 -107 -788 225 499 -126 539 604 -625 -159 802 317 -5 386 -255 -492 734 157 -730 -372
2234 -372 234 -314 37 411 -438 -827 181 467 -548 160 201 -711 199 620 -44 -348 183 62 -107 535
2254 535 493 -256 38 601 -138 7 258 -103 -466 536 75 -315 33 -18 -385 -28 397 -302 -586 -43
2274 -43 30 -316 161 104 -491 84 313 115 -90 165 0 -197 334 155 -125 328 499 -14 233 524 51
2295 51 -137 336 27 -338 -41 72 -415 -74 45 -229 -325 71 -264 -204 70 -72 -472 228 330 26 34 377
2317 377 271 145 379 368 -231 -31 274 1 83 -66 -119 -271 -42 -107 -338 -102 -91 -280 206 -121 -201 -341
2339c41L83k11k1L59j92J60J8K1J6J70j10l3k4l1J04j97j61L4P2J75N2m36k5J24
2363i4J32n90J37L00r6K88k63J70l0j8K56l22L06J7j41m3L31l28K05K56k63k89
2385g9M19k34k16J41J59k47j61K87l08J95j71J07J77n18N60R0n20L76j24J12q1
2406c6J52m70K37R4M39m05o2P9k3L91l54K32j87J43j10j42J56k23l11M42j10n7
2428a25m5J34p4m00M60J6n0N8n0K11m81M95J59l12L1J52K3k21J23J24k04J68J3
2451B05j82L19j08k14o3J37n1k29J9M5l4J4L26m77R8R6K38l38L35J08m58L44L60
2474D90l56m70O67l17R9Q3L4k60R5M47n79j57M02k56m50L55M81o56q5N87k88p8
2496b12O35n85m76M50K62m21O03K87r09N06N79p44m0K41K22o49N78K19p37o6M60
$$ plain form
2339 -341 42 -169 -190 169 -23 137 155 176 192 362 252 219 195 164 268 71 -90 -56 16 191 243 -193 -218 -94
2363 -94 38 -552 -415 -115 -211 77 -186 -16 -46 -64 192 -130 176 193 52 9 340 12 217 473 210 -79
2385 -79 340 106 -110 31 190 -57 -218 69 -239 -44 -215 -108 69 -449 111 201 -319 57 -67 45 -36
2406 -36 116 -354 -117 -23 416 11 -51 28 5 396 42 274 87 230 120 -22 134 -89 -400 42 -68 -125
2428 -125 -170 -36 -110 -510 -50 -34 -84 -26 -76 135 -346 149 308 -4 27 179 202 -19 104 228 24 192 205
2451 205 23 342 234 20 -43 94 43 -186 -167 -122 -156 -142 184 -293 -195 -99 139 -199 136 244 -214 130 490
2474 490 134 -336 331 14 113 196 230 -30 65 512 -67 -224 178 -78 -528 -173 308 -348 -433 154 -134 -212
2496 -212 423 -162 -638 -188 74 -347 256 543 -366 140 719 -25 -65 176 398 -251 327 546 -191 -257 203
2517B03k29k46N65k38p87O33M50o14L28J73q13L15Q78n07o30P65q4n97Q49J45
2537E59r73O0R00l67l76P16p42m91Q60L21o42o6P86j117L04O32l03r91Q71J20
2557F1m80O15J74j200J93J148j98p79N59j13m52J053J26r74K30Q64n99j74O50
2576G04p29n24P49J64o93N13k1r46K50J174o41m93N04k06k31Q43j7j180K46O27
2596I3j32J6P02r73l81J366j40r97L65L67n97M91M39q39k14M90K6k09M07k39q68
2617h27M06R60p05L0L11q44J66J086l2q37J24K18j40N69N29j341k49J214j43l91
2637A04M58m68o07R67L35j175K47J97m95P8J043m10j138Q30J13k86L29P1o58j61
2657f26J346n19m85L72j53n66J195K51j049K8N29n60L55O23r07l60R52M8o81L14
$$ plain form
2517 203 -26 -272 293 55 -732 -99 351 -263 65 238 -575 -260 618 111 -519 246 162 -435 414 559
2537 559 -414 -354 546 179 -197 519 -223 -714 146 467 -175 -241 545 -572 -268 364 61 -930 -59 61
2557 61 -419 196 370 -830 -637 511 313 -466 93 -20 -472 581 707 -267 -37 827 228 54 704
2576 704 -25 -549 200 364 -329 184 163 -783 -533 641 0 -493 11 -195 -426 417 400 -780 -534 93
2596 93 -39 -23 679 -294 -675 691 551 -446 -81 286 -311 180 619 -220 -434 56 82 -127 280 41 -827
2617 -827 -421 539 -166 -136 175 -669 -503 583 551 -286 -162 56 -84 485 1014 -327 -576 638 495 104
2637 104 562 94 -513 454 789 -386 -139 58 -437 -359 684 274 -864 -34 79 -207 122 193 -465 -626
2657 -626 720 201 -284 88 -65 -631 564 815 -234 -206 323 -237 118 741 -166 -526 426 474 -207 107
2677A07Q7p57K99Q38n32n44N60k15j55M98J48j008K93Q32m41%M93p02j46P88K74
2698G17r15n8M85m83L28N95p06m73O33K80n58N13l77p72L23O60k90l67O20m26
2718b71k84R10o0r60K68P99n93M54L63o95l20Q54k12l46K56n7l19N05M05n72m00
2739b75M64m68j23Q11j03q14K71P20n05k75M81o47J06Q51j18m35J23m2k14N53
2759C61R4m18l89O19m2j01L21l76l53K07K79k23J3R3k41R7L11m42j65J83J90l56
2781c38L34qj36k98Q01k37l60N59o6m23K79O5j30j71L43k92P0L60n29j35M70l
2803A55m25J80J59l90O1J91k1J31Ok10l23L51R9j14J22K8O1n5M27l17J86l42K52
2826B12k49J17j45k4K77J40o25Q6J07J48k23L7K65m62J67J37k19Q5J82j3J63k86
$$ plain form
2677 107 194 -563 -264 574 42 -502 58 -157 -312 186 334 -674 -381 451 10 10 503 -199 -345 443 717
2698 717 -198 -256 229 -254 74 669 -37 -510 123 403 -155 358 -19 -791 -468 192 -98 -465 155 -271
2718 -271 -555 355 295 -665 -397 402 -191 263 626 -69 -389 465 253 -93 163 106 -213 292 697 125 -275
2739 -275 189 -279 -402 409 306 -508 -237 483 -22 -297 184 -463 -357 494 376 -59 64 22 -192 361
2759 361 455 37 -352 267 225 124 445 69 -284 -77 202 -21 -8 85 -156 -59 252 -190 -355 -172 18 -338
2781 -338 -4 -12 -148 -446 355 118 -242 317 251 -172 107 172 42 -129 214 -78 -8 352 -177 -312 158 155
2803 155 -270 -90 69 -321 -260 -69 -90 41 47 -163 -486 -135 -36 -150 -28 0 61 6 433 116 302 -40 212
2826 212 -37 80 -65 -89 188 328 -297 -211 -104 44 -179 -142 123 -339 -172 -35 -254 -169 13 0 163 -123
2848a23J01K6J55O2l28J94j11K24N2oj26J37k80M8m7k04L06p3R6l34m0J2N0J14
2872i5L16m16K28k85K33p9M5J15k32J55j36L52m74M87q7Jl8m7K05r4N5j83N1K43
2896C20j91N3k49N9L0k66K20J04j34J90Km49J61o1K40k71N51j5j83p7R7k30K35
2919A36p1L2j59K0L1J55p4nj85P8L2oq4J53%l5p8J79k56k8j0R6j85L94j27k08
2945b05L29J17l0N9k47j96M35pp8J3l4j10k5J71q2k03K36ok52j99N63n20Q8J13
2969g0R8j58J7K70l8l53M04q1k60L31K23m88J19K36j37j89M31p7j55j39J59l32
2991a89L7K25n78K67N81r8m38M7L25m48L64L77r11J78N81k63NL53m0o00o5N99
3013C09j02j68L8L9k62M79J61p70J18J33r7R1K43m93j47N48k09k33K23L34p30
$$ plain form
2848 -123 -22 4 159 221 -107 87 -24 200 252 246 120 257 -23 25 -22 -226 80 7 103 -231 -271 -259 -209 -95
2872 -95 221 -195 33 -252 -19 -98 -53 62 -170 -15 -151 201 -273 214 127 128 90 43 248 154 209 26 77 320
2896 320 129 182 -67 -8 22 -244 -24 80 -54 136 138 -311 -150 -211 29 -242 309 294 111 34 131 -99 136
2919 136 65 97 -62 -42 -11 144 70 65 -120 -42 -10 -16 -100 53 53 18 -60 119 -137 -165 -175 -79 -264 130 3 -205
2945 -205 124 241 211 270 23 -173 262 255 177 190 156 46 21 192 110 -93 143 137 -115 -314 249 -271 -183 -70
2969 -70 28 -130 -113 157 119 -234 170 89 -171 160 383 -105 14 250 113 -76 355 278 123 -16 143 -189
2991 -189 -152 73 -505 -238 343 245 -193 -146 179 -269 95 472 -439 -261 320 57 62 415 375 -225 -290 309
3013 309 207 39 77 116 -146 333 494 -276 -158 -25 -122 -31 212 -281 -428 120 -89 -322 -99 235 -495
3034d95O38Mn14R1N79m33k22O75j08m04J85N2O0J01J41n12k10O38j49j98L84o20
3056c17r0O62j27m95n1N57r1Q3Q7n41j71O15K87n50K23p5l35L87J83j83j01K26
3078A83m1n2K17K84p69O2N45m85K12N0l90l80Q41j14k96J57O3n18M49K98o19N2
3100b51O30m51K44J55k36n13N33K16k34j47J81l90m7Q71m80l45Q3K35n26O53j53
3121B8m43J16J73p9J02J32q7m37N62K24l82J40J97k73l6O18l31q06N04K92l64
3142a50M34k4n49K13M68m70l3R9j35m13Q11O2o25k1M14k89L28J34n66r2O11J29
3164C36n16O71r9r84O16M19l53j53M87l61l00P78l26o92M71K99l10o6K50m90L4
3185b89M67n4k59K41R1m93J02P82r92JM24J38j62M24k90o74M92N15j13n78L95
$$ plain form
3034 -495 143 147 -367 -276 303 -130 -352 323 215 -189 -4 48 108 209 350 -162 -372 266 117 -81 303 -317
3056 -317 -407 255 128 -367 -418 139 48 131 218 -323 -494 121 408 -142 81 6 -329 58 241 58 -43 183
3078 183 142 90 307 591 -178 -116 429 -56 156 206 -184 -564 277 163 -133 24 87 -431 18 316 -303 -251
3100 -251 379 -72 172 327 91 -422 111 327 93 -54 127 -263 -310 561 81 -264 -181 54 -472 181 28
3121 28 -415 -299 -126 -205 -103 29 -58 -495 67 291 -91 49 246 -27 -63 555 224 -582 -78 214 -150
3142 -150 284 260 -289 -76 392 -78 -111 -12 -147 -560 251 313 -312 -333 81 -208 120 254 -312 -404 207 336
3164 336 -180 491 392 -592 24 443 90 -63 424 63 -237 541 215 -477 -6 293 -17 -83 167 -323 -289
3185 -289 178 124 -135 106 197 -296 -194 588 -404 -403 21 159 -3 421 131 -543 -51 464 351 -227 168
3206A68j98l36R89l84p49N36n3q1J89N1j50l46N89j2n27L64j4l80J61N45l68j50
3228a56M79l72r9M31j89k76K15K79m5j60J44j80j14K23j51j72K75jk92J94J04
3249A37l81p4N06j51J41K17k95o48N05L42l88J78j20k67J92N81k47m72L64J60
3269B80l23O4k2j28K4P4j50L01m4j55o3n5K46q7k32L71r5P9Kp7l04N02Kj75O9
3294A04j7l61K96N0m2k06K82k73n0M16q4j34k30K67l1m5J93m20J51J06J60k80
3316a48K62k02j50K19Q4n3p9K00k95K34J46lj4k14N17p21L49L0l74R2K30J88o32
3339c34J92J12p0J45L5j65n7L02j12L0l4P1k30j44J70L37k63K5Q2j02J96J6j4
3362A88j04n6pJ13n5k21lK43j50L7P4k57k8M07l36J19j22K04r9j19P3lj83M31
$$ plain form
3206 168 -30 -366 623 239 -510 26 -27 -108 81 132 -18 -364 225 213 -314 50 36 -344 -183 362 -6 -156
3228 -156 323 -49 -148 283 94 -182 33 312 267 107 251 71 -43 180 29 -143 132 131 -161 33 137
3249 137 -244 -318 188 37 178 395 100 -548 -43 299 -89 89 -31 -298 -106 475 228 -244 120 280
3269 280 -43 21 -1 -129 -105 -31 -181 120 76 -79 -142 -197 49 -38 -270 101 6 85 87 10 -294 208 210 35 104
3294 104 87 -274 22 72 30 -176 106 -167 -217 199 115 -19 -249 18 -13 -58 135 -285 -134 -28 132 -148
3316 -148 114 -88 -238 -19 65 12 -67 133 -162 72 218 215 201 -13 504 -217 132 162 -212 -120 110 298 -334
3339 -334 -142 -30 -100 45 80 -85 -142 160 48 78 44 115 -115 -259 -89 248 -15 10 92 -10 186 202 188
3362 188 84 28 21 134 79 -142 -145 98 -52 -15 59 -198 -226 181 -155 -36 -158 46 -53 -172 -99 -102 -285 146
3386A46R1Rq0j79RK2p1L59k88J59N4k50R9k7k01N2J12K6o2j6rJ03l6k22M4k7K37
3413E4j41P2K95k70K2j18K13k36J05J03j31J09K44n5k87j32M02m19L31j74j75
3434a88K06r3Q4j13K89k05j16K22r7r6J10J34j14j47R0k7K09j92K71j98l9L49
3456C39l41K51p5j12o4J71j41mo8q7Q3q8q6j18K13j3j55L40j59K2J8j6M8R0j04
3481e6J87o9j42P9L5J08j84n7J11J0rj05k8J83j46M5J49l31j9J4K28k45L0N04
3505B92l77r1K27K62l70o6J74j72O7k1J05j72J31k39K60P0L5j76J54k6k01J03
3527c1J98k10L7J4j22p6m9J81N0k9j43j30K20K56k15J94L4j98k4K03m7j18K50
3550B45k32P7L88l42l39L10M8j54j55J74K0%J43j88m0J13R4k33j05K34p4m6Q6
$$ plain form
3386 146 237 246 166 -13 -4 18 -53 306 18 177 231 -19 80 53 -148 -96 16 42 -20 -36 -45 58 22 -200 -156 -183 54
3413 54 -87 -15 280 10 32 -86 127 -109 -4 99 -32 77 321 266 -21 -153 249 -170 161 -13 -188
3434 -188 18 -75 9 -104 185 -20 -136 86 -11 -107 3 137 23 -124 -34 -61 148 -44 227 29 -10 339
3456 339 -2 249 174 62 -2 169 28 24 -44 -131 -48 -136 -222 -340 -127 -140 -295 45 -114 -92 -74 -90 -42 48 -56
3481 -56 131 62 -80 -1 34 142 -42 -99 12 22 13 -92 -120 63 -83 -38 111 -220 -239 -225 3 -242 -212 292
3505 292 -85 -176 51 313 -57 -123 51 -121 -54 -75 30 -142 -11 -250 10 80 115 -61 93 67 -134 -31
3527 -31 167 -43 -6 8 -114 -190 -239 -58 -8 -37 -180 -310 -90 166 -49 145 179 -19 -43 160 113 -5 245
3550 245 13 90 478 136 -203 107 155 1 -154 20 40 40 183 -5 -45 68 162 -71 -176 58 -16 -62 24
3573B4L1n8J39J73m51K17J69j48Q9r9l6k47J51L74l76K5l4J70k79J59j39j6R7
3596f5J66l41L34m7l14J60J89k61O5J43k15K7M33l72L9n8JJ87nJ82m72P7K48K53
3620C54l28L8J88n62J53L34k91l2N3L83k95q1J42n37P6M02J47k2O5r8l79N83N3
3643C46m85R0J31Jn2Q4k65j97K53M48n33K76j84m38O50K8m14J22L13j73j08M56
3665C49m8l88k17L76j69L7L02n6k80K88J68n32L05Ql60K38K27j08k47k2J16l35
3687c48K67K32m99K99pm0J14m1j61N1K93M1m16M42l04j8K49L28n55o8K45K5j15
3710A4J34j77r3L04L42m41j49o6K7J36pP0k77L55j8k23K18Mk69K3J81R2m5J3k90
3735a42J45N2K4L4k00J86K14k72J81l15k66J73J57N2K24l37n4P9J2O2k24M65l81
$$ plain form
3573 24 55 -3 136 309 -142 75 244 96 185 86 50 -197 -46 328 -48 -23 -57 113 -166 -7 -146 -162 -65
3596 -65 101 -240 94 47 -267 -107 82 -179 -114 29 -186 -159 274 -98 -59 -117 -116 71 66 248 -224 -147 101 354
3620 354 26 64 252 -310 -157 177 -114 -146 -93 290 -5 -86 56 -481 -405 -3 144 122 187 89 -290 293 346
3643 346 -139 -49 82 83 31 115 -150 -347 -94 354 -179 97 -87 -525 125 153 -261 -139 174 1 -107 349
3665 349 301 -87 -304 72 -97 -60 242 186 -94 194 362 -170 135 143 -217 21 248 140 -107 -129 -13 -348
3687 -348 -81 151 -348 -49 -56 -96 18 -23 -184 -133 160 201 -215 227 -77 -95 154 482 -73 -141 104 129 14
3710 14 148 -29 -122 182 524 83 -66 -132 -105 31 24 94 -183 172 154 -69 149 153 -116 -93 88 180 135 148 -142
3735 -142 3 55 79 113 -87 99 313 41 222 -93 -359 -186 -29 23 247 -90 -144 -65 -53 9 -215 250 -131
3758a31K0L20k76L4p0M42l52M8J04l18O5N50l00j79m1J81o4PK98l90j38J25J30
3781F5j90K17k97p5J05K79R7k96J49k21p7P8J54j15o0J39L23j72k4J38j60k4j17
3804h4K58j35OM7n6L6k84K69k06R5n0K37k86j72N00j42o3j06j50J07L5J45O2r5
3828c2Q2J6k54K36Q2J29l65J97J27l31J77m9K2J5j16N2o6N7Nk56M94j47k64K83
3852I4j07o4j68K34m3Q3k20M00o2k8j46k0K34q7J5k6J10k43n6J4O0j39J27J20
3876H2k18J9K85n16J24L90k35J64j41m1j3J64J13L2k05j78J72K2J17n54M78J41
3898B02N7j67K3k5l22J09Q9K5j71L05N9k45K49k92Q9K18j54R9k97J46k9j52J47
3921c7j2l7J73o6J50J73k59R0k01j38J18R9k59L04o0q8K40pl09L9L02l75K43R
$$ plain form
3758 -131 -111 209 -67 -33 -103 339 -13 35 139 -179 -114 436 136 -43 -84 97 33 40 338 -52 -190 -65 65
3781 65 -125 92 -205 -280 -175 104 201 -95 54 -167 -244 -166 -12 -127 -187 -48 275 103 79 217 57 33 -84
3804 -84 174 39 45 92 36 72 -212 57 -149 -54 -104 133 -153 -325 175 33 -30 -136 -286 -179 -144 1 63 -32
3828 -32 50 66 -188 48 130 259 -106 91 218 -113 64 15 37 52 -64 -12 -78 -21 -16 -272 222 75 -189 94
3852 94 -13 -77 -245 -11 -54 29 -191 209 147 119 -27 -47 187 100 115 89 199 -44 -100 -86 -26 -165 -38 82
3876 82 -136 -117 168 -348 -224 166 -69 95 -46 -87 -100 64 177 209 4 -174 -2 20 137 -417 61 202
3898 202 259 92 115 90 -232 -123 -34 -9 -180 125 184 -61 188 -104 -15 203 49 148 -149 -3 -32 -184 -37
3921 -37 -49 -86 87 21 171 344 85 175 -26 -164 -46 53 -206 98 38 -50 190 183 -126 -87 215 -160 83 92
3945I2l1n2K27k49J61l4j80K5j69J96Q0J24j52K0p7K55l3j93J32L4p0ok47M57
3969C10n01K95j68P6j65O0j2j56J31P5P1j67K33O8L7j04P7j64M7J86l93J21n8
3992a01J03J38q3j29J86L9j88j2j15J38O8j1L6p9J4j36M0K32k49p7KJ85k06K80
4016G5J17j71J7L0l62J39K32l49M41n6j07o6L8J39k71L7M2j51n3L57j10p1Q3J09
4040H9l33L45j46j98L16j28N5lr3J46k16K74O0m1p2p1J13j89j3l5J6M9J40j97
4064a32J26P7L6j45J92k34r4J16O1J08k02M08l55K5%J64k45P7j67J85R8J03l09
4087a07J90J09l36K5J77K55m77M34k78L3J60k04j75k0K63j09j82K43l25J76K59
4108A11n7j29R0J63j64J08p1j05k32L03J69l16L86j11k46J11j1m6K0p5NK30J14
$$ plain form
3945 92 61 9 236 -13 148 114 -66 -41 -210 -14 66 190 38 58 -19 236 203 10 142 176 106 100 -147 310
3969 310 -191 104 -64 12 -153 -93 -105 -261 -130 -55 16 -151 82 150 187 83 160 -4 43 229 -164 -43 -101
3992 -101 2 140 57 -72 114 153 -35 -47 -162 -24 44 33 69 -10 4 -132 -92 140 -109 -186 -184 1 -205 75
4016 75 192 21 38 68 -294 -155 77 -272 169 113 6 -60 -22 117 -154 -117 -75 -226 -279 78 -32 -103 -20 89
4040 89 -244 101 -45 -243 73 -55 0 -3 -96 50 -166 108 168 127 55 -16 97 -92 -105 -140 -124 -75 65 -132
4064 -132 -6 71 107 -38 154 -80 -174 -58 3 111 -91 317 -38 -13 -13 151 -94 -17 -184 1 99 202 -107
4087 -107 83 192 -144 -119 58 313 -164 270 -8 25 185 -19 -194 -214 49 -60 -242 1 -324 -148 111
4108 111 54 -75 15 178 14 122 51 -54 -286 17 186 -130 256 145 -101 10 -1 -47 -27 -102 -97 133 247
4131B47k95j75L36n1l53K07J34k06Q2Q6l7J50J05l92N5J06J23k75J53P0J43o5
4153A48n8J3R3j35J39k15jK0O6k66K6M02l05q0M4J18j73J67p6l1J40j29J86q7
4177Fj23j75M25r1j89R4J78k22K31kJ6k33LJ27k32M41j74k37K30j16lj49K24k46
4201b17J94K56j38mn6nk21J55L22l76j29M60k2j08O7l7l97K97L44l89j36R8j8
4224f0j67L67Ml94M10k53O3m3M8K82j90k3P7j58K50q7j83J33L7j66j14J03k1m2
4248a27K6J82l27J98R7J4k29K15l10J23K67j40J98n1o9j98P3J77q3j36K26j2m0
4271G4J33q3j99L1M30l41K3o2Q8j33J33J8q5J80j85l00K10J41p2j61R7M4k47J28
4295a38K56l50L86j02k09m2J90j09R1p7L6P4J5P8k40n9K58n4k09M39j74j82R3
$$ plain form
4131 247 -48 -223 113 62 -291 -84 50 -156 -74 12 -25 125 230 -162 -107 -1 122 -153 0 70 213 148
4153 148 90 103 196 61 200 -15 -16 4 70 -196 -170 232 -73 -153 -109 9 -164 3 -73 -104 36 -93 93 6
4177 6 -117 -292 133 42 -147 -53 125 -97 134 132 148 -85 -82 45 -187 254 80 -157 73 -43 -46 -195 29 -217
4201 -217 -23 233 95 91 35 30 -191 -36 286 -90 -219 241 219 111 178 141 -256 41 385 -4 -140 -42 -60
4224 -60 -227 140 144 -250 160 -93 -30 -73 -25 257 67 44 121 -37 213 126 -57 76 113 -53 -167 -64 -85 -127
4248 -127 -101 81 -246 -48 49 63 -166 49 -261 -138 129 -11 187 136 67 -131 -58 119 36 -100 126 114 74
4271 74 207 124 -75 -44 386 45 68 6 94 -39 94 112 27 207 22 -278 -68 73 1 -160 -63 -19 -266 -138
4295 -138 118 -232 154 52 -157 -199 -9 -118 -27 -104 -68 6 21 99 -141 -200 58 4 -205 234 60 -122 -29
4318b9k25L82J3k24R0k06L06j37N3j0k3j49K80j7j57J02l05K27j08J95K33j69
4340A22N2k53K51l7j80K03l7j68O5J45p8J14j08n7j01k4L04k84k77N00j53J8J09
4363A26j98P8n0Q6j65j44L52Qj72k6K20k00K30q7l2kl49L33l5L0kj4K2J80K3l22
4389a10J41J4oj79K60%l11K7M15j83O9J7j50K33O3l82J64k11K66j30k85L95ol92
4413b81J57J32O1j7J5j69R4J65j22M4N5l8n5k44J34o6j62L9K36J51j27p4m5P1
4437d6j71K43l0p5J59j19J2Q9o2j21Q5j89L62nl26P3Q8M7Q3j51J56j53K7p1p9
4462a74J05K3J13k8q7j6N17n38K51k02JOJ10j70NJ11j41R9M3k33J20R8j06K40
4486A47l2k32q4L44k04M3J25L2j49K0N0Q7k72J76j09K57n0l2j66k1K7o5K54r4
$$ plain form
4318 -29 -254 128 141 -83 7 -199 107 -30 23 13 -10 -159 121 104 -53 49 -256 -29 -137 58 291 122
4340 122 174 -79 172 135 -45 158 121 -47 18 163 85 199 91 34 -67 -91 213 -71 -348 152 -1 17 126
4363 126 -72 6 -44 42 -123 -267 85 93 -79 -105 115 -85 145 58 26 24 -325 8 -27 3 1 -13 9 189 212 -110
4389 -110 31 45 39 -140 120 120 -191 -164 251 68 137 154 4 237 300 -82 82 -129 137 7 -278 117 111 -281
4413 -281 -124 8 69 52 67 -102 -8 157 35 79 134 96 41 -203 -69 -135 -297 -258 -22 129 2 -72 -117 -46
4437 -46 -217 26 -4 -79 80 -39 -27 62 0 -121 -36 -225 137 132 -194 -121 -33 14 97 -54 102 -51 -24 -95 -174
4462 -174 -69 -46 67 39 -48 -64 453 -85 166 -36 -35 -29 81 -89 -84 27 -114 -15 28 -205 -85 13 -93 147
4486 147 115 -117 -201 143 -61 -18 107 139 -10 10 60 147 -125 51 -58 199 149 117 -49 -70 -43 -108 146 52
4510E2l17P0K29k69L09k47Q4L3m3K1L4K84k67J4k0N5%oO8j40J15K24l11j38j2
4535a78j7J31l1J22j32K24l37K87q6J2j93J82j6r3M44k31J41k93J41j29K04j81
4557b9K5L5k14K93j07r2K5J92k51K96k30l2m7J88%k45K47q9j96K45j25qJ08M3
4581C2j89L04k50NK37p7K27k15j80K51k03J1P7p8J25J3J40l14K85j70j78J08J04
4604F5j21K12k11j94K64Q6j55J02J16j58j82Q8l9K30J93k62o7N5m8j24M2K12k83
4627a79J00q9j6K45Q6q6l7M3J3k09n5J09J74l35M61j83Q1m0j1j4n6K94j25K2k32
4652c9k4M7J9J56j91P7n3oj14M6O9j75K2K97l50q4K50O5J83q6k14l1K68n2L08
4677C88m80K87j42q0N3j03J9r5J24K9k83M76j76j72J60J99j25r5J26m44M92l9
$$ plain form
4510 52 -265 -195 34 -235 74 -173 -89 -56 -99 -78 -44 240 -27 -13 -33 22 22 16 84 -56 59 283 -28 -166 -178
4535 -178 -195 -64 -95 27 -105 119 -218 69 -17 -5 -198 -16 -32 -125 319 88 229 -64 77 -52 152 -29
4557 -29 -4 31 -183 110 3 -89 -64 128 -123 173 -57 -89 -136 52 52 -193 54 -35 -231 14 -111 -119 -11 32
4581 32 -157 147 -103 -98 139 62 289 74 -106 145 -58 -47 30 -48 77 90 230 -84 201 31 -147 -39 65
4604 65 -56 156 -55 -249 15 101 -54 48 164 6 -176 -88 -127 103 296 34 -33 22 -26 -150 -108 104 -179
4627 -179 -79 -168 -184 61 147 61 24 67 80 -129 -184 -75 99 -236 225 42 123 83 72 58 2 296 171 193 -39
4652 -39 -63 -16 3 159 -32 45 -8 -14 -128 -82 -13 -188 -166 131 -219 -303 -53 12 195 109 -105 -136 132 80 388
4677 388 -92 195 53 -27 26 -77 -58 -153 -29 0 -283 193 17 -155 5 204 79 -16 110 -334 158 119
4699A19j95k14L54j88J55p0r0m2j3L66k6j08m19L13J76L0o3O6k04J15k15J64j5
4722dq6j9J03K25l28R1n1J55k6L5l86J96R8M4j51J29K72p67L52K53p8k26J05N4
4746a0O4K00l16j33L51L0k62j0J67r4j08J86n4l10O43l06m68M08K56k62k4j1q3
4769a46L8J25L14m32j81K40J05K7p6o1K8J54j28L32k44O9q3k15J76j27N1K93k45
4792A4j93M38l85m3K55M6j32m2j7J60k06J55N6l79M28k14j40K26r2p6J13K7K20
4815B19j36J14m7j75L05k58j34K03k39KJ20l6L41j38j68qJ22J34j87o6K9j13M38
4838C22m29L39j45R8PM6l55J8r2P9M8M8J22j5j29j32N7K2J30k0J31j71J54K6k86
4863a27J93J36k73J09j22k3L46k16O2J42l46R1k6O6j55o0K05pj08J56j22M3Q9
$$ plain form
4699 119 -76 -290 64 -124 31 -39 -129 -171 -184 182 156 48 -371 -58 118 148 85 151 -53 62 -153 11 -4
4722 -4 -90 -109 -6 219 -109 -18 -69 86 60 95 -291 -95 3 47 -104 25 297 -470 -118 135 57 -169 -64 -10
4746 -10 54 254 -62 -195 156 186 -76 -86 81 -13 -121 65 11 -299 344 38 -430 -22 234 -28 -52 -63 -146
4769 -146 -108 17 331 -101 -282 -42 63 90 14 -47 -19 135 7 339 95 164 81 -134 42 -85 -34 259 14
4792 14 -179 259 -126 -169 86 132 0 -42 -59 101 -105 50 106 -273 155 -59 -199 27 -65 -141 -28 -1 219
4815 219 83 197 150 -25 280 22 -112 91 -148 -146 -26 -62 279 141 -27 -35 87 221 34 -32 -3 -116 322
4838 322 -107 232 87 185 192 238 -117 -99 -191 -112 -64 -16 106 91 -38 -170 -113 -91 39 19 150 -21 133 159 -127
4863 -127 66 202 -71 38 -84 -107 239 23 85 227 -119 -28 -54 12 -143 -203 2 -5 -113 43 -79 -36 53
4886E3j65N2l0o0N9K79k24O5r5J46m9l8K7K58j56L7k3j22j94J00J1J40Mj77p5
4911a77L93m38o2O07j43j60o5q6J37k5p7J4R4j27J17j22O9O6q7J1O1J70k39K44
4935A75J35k46j6l0J72l52J18l70N24l37L99k05j10L30j81l30L28j41J45m14M3
4956c63J80L25m29L24J49l13Q8K37o3k42m8J30j5m9J50j65K08P7p7r5J74j30j09
4979e6j20K55j19L8n4K93j96j22J40l1kq8Jr6L32j9p1l2k3Rj55L87k29l56K24
5004i0j15K44Q2k21M0J38o8J08m0k23J70k32L5n2J12r8K83k3o4n5r2P8J7K74k56
5029d8J37mj24J16j33J33o4j09J22k42J66J54k27K80k15l5J83Pl19K39J36j09
5051D4k77K52k34O40l23k3Q3j56j1M4lR3j77R2PK69j94k35K03J61l28Q6j18j6
$$ plain form
4886 53 -112 -60 -90 -150 -91 188 -36 29 -66 80 31 -7 20 278 122 159 136 14 -180 -80 -69 71 75 -102 -177
4911 -177 216 -222 -284 323 180 20 -45 -131 6 -19 -96 -82 12 -115 2 -120 -51 15 -72 -61 0 170 -69 175
4935 175 310 64 48 18 190 -162 -44 -414 110 -227 172 -33 -143 187 6 -324 4 -137 8 -406 -363
4956 -363 -183 142 -287 37 186 -127 -39 198 135 -107 -155 -25 -40 -89 61 -104 104 181 104 9 183 53 -56
4979 -56 -176 79 -40 -2 -56 237 41 -81 59 28 26 -62 -61 -157 175 156 85 53 30 39 -116 271 42 -314 -90
5004 -90 -205 39 121 -100 -60 78 10 118 78 -145 25 -207 -172 -224 -112 -210 73 50 -14 -69 -161 -83 -66 208 -48
5029 -48 89 85 -39 77 -56 77 13 -96 26 -216 -50 104 -123 157 -58 -93 90 97 -222 17 153 44
5051 44 -233 19 -215 425 102 79 162 6 -5 39 36 129 -48 44 51 320 126 -109 94 255 -73 13 -105 -121
5075a21KJ01j9J11J6p0q2j7J10j04n4J50q3j14K9R3l0P1J74j51J06k12J49K4M6
5100A25k44K76k30Q0L0K6r3m0j8n6l6J45N5k03L40j86J77j26j3L17m62J96m2o4
5124d6L42m39L2n3J42o0J93k96K42j33L01k53R1J61m66L53k86J37j22K72k78R5
5146g1Q3P3pj28m7J47j23q6R7J86l60K71J54j62j21m3K43j21J84q0j26J26r7j51
5170a59J58K77l11q4J9O4L68k39k59K14j52J10ok5M6l7J48j30J10k51L72L2l24
5193e9L38k63j38q8K57j59K09k1j30J50l81M56j67j89J31j22J35K57j16j08N3
5214D5k40J57J35J22l59L18Lk70L93k63J92j47l44L89j33RM8j98M1J2J05j00M9
5237c6j20J10R6J53l67K61j85K25l33K27J55k95L11n18L28j40K94m3j28J34j99
$$ plain form
5075 -121 -119 -18 -37 74 90 20 -62 -79 31 -73 -127 23 -60 -174 -145 -52 -82 -11 163 12 118 -94 55 79 125
5100 125 -119 157 -73 7 37 63 -30 -70 -88 -144 -180 -35 20 -183 157 -29 148 22 9 326 -136 60 18 -46
5124 -46 296 -143 -111 -164 -22 -82 111 -185 57 -76 225 -28 63 224 -242 111 -175 -38 -160 112 -166 -71
5146 -71 12 85 78 -50 -97 50 -73 -159 -62 124 -236 35 189 27 -94 -137 106 -15 169 89 -37 89 -8 -159
5170 -159 -1 276 -35 -119 -100 -36 332 93 -166 48 -104 6 0 -25 21 -16 132 2 112 -139 233 265 -59
5193 -59 279 16 -122 -210 47 -112 97 76 -54 96 -285 171 4 -185 -54 -176 -41 216 100 -8 45
5214 45 -195 -38 97 219 -140 178 181 -89 304 41 233 86 -258 131 -2 7 55 -143 -102 -90 15 -85 -36
5237 -36 -156 -46 50 203 -164 97 -88 137 -196 31 186 -109 202 -316 12 -128 166 123 -5 129 -70
5258g0J61N5k13K23k18J32j20J30k2k68M34k05j08J07m2r0J53J7j12j58K44m1
5280a1J01j63J7L7K07J15m80J95k33K64j63J26Q0J19j38l8N5l76M27Jm61L94k63
5303a88K35m6j88J59K72k02M1q5j11K29m70L61P8k60O7J28k00J77j13K44k31J99
5325I6Q0l20K50k1j60J3L35m28J06l25J75J59l06L52k4R6q4Nl6n3M3j20r3N93
5349C33l98L5kR8K4J08k27j99K00L5Q1k63L00k6n9j40K30j08j88o8p8L59j26j2
5373i1k2p3j32M40k45P8q6K08k0k47O4L04k13K98j07k57J77J99k91q5L07K3l88
5396a59K54l19J52L2L6J96l51Q2J80j5k68K73j14k38J54J54m3J7q5m8K16q4R5
5419A17j69O4k0K39k59p1K69j38k7P7k32K07j01P7J7n8r2K02N7j92K34k51n3J72
$$ plain form
5258 -70 91 146 -67 156 -62 70 -50 80 58 -210 224 19 -89 18 -24 -114 39 56 -56 -214 30 -11
5280 -11 90 -73 -56 -19 188 303 -177 18 -215 49 -114 12 92 211 73 35 90 -286 141 142 -319 75 -188
5303 -188 47 1 -187 -28 244 42 83 -2 -113 116 -354 7 85 -175 -108 20 -180 -3 -116 128 -103 96
5325 96 176 -144 106 85 -75 -62 273 -155 -49 -374 -199 -40 -346 6 -18 78 -6 -1 -37 -90 -47 -167 -260 333
5349 333 -65 -30 -32 66 90 198 -29 -228 -28 7 88 -175 125 99 40 -100 130 22 -166 -234 -312 47 -79 -91
5373 -91 -113 -186 -318 122 -123 -45 -131 77 57 -190 -126 178 -35 263 156 -101 76 275 -16 -101 206 229 -159
5396 -159 95 -224 -72 -40 -4 192 -159 -77 103 88 -180 93 -21 -259 -105 49 6 23 -62 -110 106 22 117
5419 117 -52 12 -8 231 -28 -99 170 32 5 82 -150 57 -44 33 50 -8 -100 102 159 -33 201 -50 -103 69
5443F9j85lJ45kq2L8R0j15J39j69K41m53J02O1J36rl6r0K03no9K1j78P3L7J08
5469F7l8p2N4k9J6j89J22L8J56j15j04Q8r4J59j19M9r3K28k87J19J5R9l50K65
5493a5N8n5J11k42L3J01N0l27M19j16J11K5m9j63Q0M5r5J50l9k07k3K62j39p2
5517i7p2m1J71N4O3N5j55J89l16q6L39N8j30k7M6M6j12K85p3j71Q4j49J00J63
5541B24j23M9j08Q9j62O7OO9j64oO8j08K60m22O1L16l5j8j84P1K38k40L58m50
5565a44P9L49l50J10qK69j88j02j9N2j33L35j18J89k65Q8M6j91l8j9j0N1J29k17
5589a05j12M14j96M0k9J34L9l1j19q6R4J51j81n8l6j47K97m0Q2N9j23K5j51K27
5613A48l77M3L38m44M49k40K13j04j36K55j2k67M9J23O6k56L12q0J8J25j22j6
$$ plain form
5443 69 -116 -119 26 24 -58 -20 70 -45 94 -75 166 -287 -185 -124 12 3 -33 -123 80 75 6 27 -151 -78 -41 67
5469 67 29 -43 11 -18 -2 -191 -69 -31 125 10 -94 -6 -100 59 -60 -11 -104 124 -163 -44 -29 70 -280 -15
5493 -15 43 -12 99 -143 -110 -9 41 -286 133 17 128 153 104 -59 21 66 -29 121 82 -125 -148 114 -25 -97
5517 -97 -169 -210 -39 15 78 133 -22 167 -149 -235 104 162 32 5 51 97 -15 270 197 26 110 -39 61 224
5541 224 101 150 42 131 -31 36 42 111 -53 -59 9 -99 161 -261 -200 116 81 63 -121 -50 188 -52 306 -144
5565 -144 -65 284 -66 44 36 305 117 15 -4 48 -85 250 132 321 56 144 190 -1 -39 -58 -68 -17 112 -105
5589 -105 -217 197 1 41 12 146 185 154 35 -51 43 194 13 -45 -81 -228 69 29 111 170 47 72 -79 148
5613 148 -229 -186 152 -292 157 -83 130 26 -110 145 133 -134 -85 38 104 -152 160 80 98 223 101 85
5635H5j28J18P4j51J34j06N9l1J83m02J58j28M28k01k23L40n40L18K65j24j78
5656e0l18M29L4j26k42J4K83n1j95J44P2%n7m0L15k77n9J31JM6J15l65J91J04
5680I9k30L87k26j32K6j8K76j43J18n4j94j2K05p9j71P8J03J2o1R8k3p4Q5L0j1
5705H9Qj6j48J29j9K7k02K31k3J43l17K7J99k49L09k05R0J27k33nM0K32j69N5
5729A20k34J27J32j65k13R0K00%n7J33j76J67Lk37O8J20m7N8K6k39J32N9N0N4
5753A71l25L91l20Oj44K33ml4K09k73J92j27q9r5J58l6K9j78K75K65m13L18k49
5776d0j32N47l25j50K31j04r4J72j65k3R6J42o3k71J57L90n20K13o2k7j04K60
5798A28j02j7NK6N3j83Q4m2K32j86J53q4j80K57p5KN2J15l16L01k61j02J4J87
$$ plain form
5635 85 -43 75 149 -2 132 26 85 54 237 -165 -7 -135 293 92 -131 209 -331 -13 252 128 -50
5656 -50 -368 61 95 -31 -273 -259 24 -27 -222 -78 -6 -6 -63 -103 212 -65 -124 7 8 54 169 -196 -5 99
5680 99 -131 256 30 -102 -76 -94 182 39 157 103 -91 -103 102 23 -148 -70 33 45 -16 82 59 -15 70 100 89
5705 89 97 81 -67 62 43 70 -132 99 76 219 -98 -71 128 -121 188 -17 73 200 -33 -38 2 234 65 120
5729 120 -114 13 145 -20 -233 -143 57 57 0 133 -43 124 127 -110 -42 78 31 89 115 -124 8 67 117 171
5753 171 -154 237 -83 -77 -221 12 8 -26 183 -90 102 -25 -114 -209 -51 -87 -58 -236 39 304 -109 209 -40
5776 -40 -172 375 50 -100 131 27 -67 105 -60 -83 13 155 92 -179 -22 368 -152 61 -1 -28 -132 128
5798 128 26 9 14 40 93 -90 -6 -48 184 -2 151 67 -113 144 69 71 123 238 -78 223 -38 -140 -126 61
$$ [...]
8191b16
##END NTUPLES=NMR FID
##END=
