##TITLE=1H_Pr 4599-f2
 CDCl3, 8 sc, 
 29.4.2019
##JCAMPDX= 6.0         $$ Bruker NMR JCAMP-DX V2.0
##DATA TYPE= NMR FID
##DATA CLASS= NTUPLES
##ORIGIN= UXNMR, Bruker Analytische Messtechnik GmbH
##OWNER= root
$$ XWIN-NMR		Version 3.5
$$ Tue Apr 30 13:49:40 2019 Russian Standard Time (UT+4h)  she@DPX200
##.OBSERVE FREQUENCY= 200.1315
##.OBSERVE NUCLEUS= ^1H
##.DELAY= (6, 6)
##.ACQUISITION MODE= SIMULTANEOUS
##.ACQUISITION SCHEME= undefined
##.AVERAGES= 8
##.DIGITISER RES= 18
##SPECTROMETER/DATA SYSTEM= spect
##.PULSE SEQUENCE= zg30
##.SOLVENT NAME= CDCl3
##.SHIFT REFERENCE= (INTERNAL, CDCl3, 0, 15.7039)
##AUDIT TRAIL= $$ (NUMBER, WHEN, WHO, WHERE, WHAT)
$$ ##TITLE= Audit trail, XWIN-NMR		Version 3.5
$$ ##JCAMPDX= 5.01
$$ ##ORIGIN= Bruker BioSpin GmbH
$$ ##OWNER= she
$$ F:/spectra/data/she/nmr/H-F/1/audita.txt
$$ ##AUDIT TRAIL=  $$ (NUMBER, WHEN, WHO, WHERE, WHAT)
(   1,<2019-04-30 13:48:19.56 +0400>,<she>,<DPX200>,
      <created by zg, POWCHK disabled, PULCHK disabled
       configuration hash MD5:
       00 E9 B6 7A A2 85 ED C7 34 08 36 98 17 FE 4E 26
       data hash MD5: 16K
       A2 92 9A 55 9B AF 97 8A 94 BC AB 25 6E 6A E8 06>)
$$ ##END=
$$ 
$$ hash MD5
$$ E5 98 AF D7 72 C6 99 FB 49 4B 06 61 D9 52 8B D8
##$RELAX= 
##$RELAX= 
##$RELAX= 
##$RELAX= 
##$RELAX= 
##$RELAX= 
$$ Bruker specific parameters
$$ --------------------------
##$DU= <F:/spectra>
##$EXPNO= 1
##$NAME= <H-F>
##$PROCNO= 1
##$TYPE= <nmr>
##$USER= <she>
##$AMP= (0..31)
100 100 100 100 100 100 100 100 100 100 100 100 100 100 100 100 100 100 
100 100 100 100 100 100 100 100 100 100 100 100 100 100 
##$AQSEQ= 0
##$AQ_mod= 1
##$AUNM= <au_zg>
##$AUTOPOS= <>
##$BF1= 200.13
##$BF2= 200.13
##$BF3= 200.13
##$BF4= 200.13
##$BF5= 200.13
##$BF6= 200.13
##$BF7= 200.13
##$BF8= 200.13
##$BYTORDA= 1
##$CFDGTYP= 0
##$CFRGTYP= 5
##$CHEMSTR= <none>
##$CNST= (0..31)
1 1 145 1 1 1 1 1 1 1 1 1 1 1 1 1 1 1 1 1 1 1 1 1 1 1 1 1 1 1 1 1 
##$CPDPRG= <>
##$CPDPRG1= <>
##$CPDPRG2= <>
##$CPDPRG3= <>
##$CPDPRG4= <mlev>
##$CPDPRG5= <mlev>
##$CPDPRG6= <mlev>
##$CPDPRG7= <mlev>
##$CPDPRG8= <mlev>
##$CPDPRGB= <>
##$CPDPRGT= <>
##$D= (0..31)
0 1.2 0 0 0 0 0 0 0 0 0 0.03 0 0 0 0 0 0 0 0 0 0 0 0 0 0 0 0 0 0 0 0 
##$DATE= 1556617698
##$DBL= (0..7)
120 120 120 120 120 120 120 120 
##$DBP= (0..7)
150 150 150 150 150 150 150 150 
##$DBP07= 0
##$DBPNAM0= <>
##$DBPNAM1= <>
##$DBPNAM2= <>
##$DBPNAM3= <>
##$DBPNAM4= <>
##$DBPNAM5= <>
##$DBPNAM6= <>
##$DBPNAM7= <>
##$DBPOAL= (0..7)
0.5 0.5 0.5 0.5 0.5 0.5 0.5 0.5 
##$DBPOFFS= (0..7)
0 0 0 0 0 0 0 0 
##$DE= 6
##$DECBNUC= <off>
##$DECIM= 24
##$DECNUC= <off>
##$DECSTAT= 4
##$DIGMOD= 1
##$DIGTYP= 9
##$DL= (0..7)
0 120 120 120 120 120 120 120 
##$DP= (0..7)
150 150 150 150 150 150 150 150 
##$DP07= 0
##$DPNAME0= <>
##$DPNAME1= <>
##$DPNAME2= <>
##$DPNAME3= <>
##$DPNAME4= <>
##$DPNAME5= <>
##$DPNAME6= <>
##$DPNAME7= <>
##$DPOAL= (0..7)
0.5 0.5 0.5 0.5 0.5 0.5 0.5 0.5 
##$DPOFFS= (0..7)
0 0 0 0 0 0 0 0 
##$DQDMODE= 0
##$DR= 18
##$DS= 0
##$DSLIST= <SSSSSSSSSSSSSSS>
##$DSPFIRM= 0
$$ [...]
##$SUBNAM2= <"">
##$SUBNAM3= <"">
##$SUBNAM4= <"">
##$SUBNAM5= <"">
##$SUBNAM6= <"">
##$SUBNAM7= <"">
##$SUBNAM8= <"">
##$SUBNAM9= <"">
##$SW= 24.9337058887773
##$SWIBOX= (0..15)
0 0 2 0 0 0 0 0 0 0 0 0 0 0 0 0 
##$SW_h= 4990.01996007984
##$TD= 16384
##$TD0= 1
##$TE= 0
##$TE2= 300
##$TE3= 300
##$TEG= 300
##$TL= (0..7)
0 120 120 120 120 120 120 120 
##$TP= (0..7)
150 150 150 150 150 150 150 150 
##$TP07= 0
##$TPNAME0= <>
##$TPNAME1= <>
##$TPNAME2= <>
##$TPNAME3= <>
##$TPNAME4= <>
##$TPNAME5= <>
##$TPNAME6= <>
##$TPNAME7= <>
##$TPOAL= (0..7)
0.5 0.5 0.5 0.5 0.5 0.5 0.5 0.5 
##$TPOFFS= (0..7)
0 0 0 0 0 0 0 0 
##$TUNHIN= 0
##$TUNHOUT= 0
##$TUNXOUT= 0
##$USERA1= <user>
##$USERA2= <user>
##$USERA3= <user>
##$USERA4= <user>
##$USERA5= <user>
##$V9= 5
##$VALIST= <valist>
##$VCLIST= <CCCCCCCCCCCCCCC>
##$VD= 0
##$VDLIST= <DDDDDDDDDDDDDDD>
##$VPLIST= <PPPPPPPPPPPPPPP>
##$VTLIST= <TTTTTTTTTTTTTTT>
##$WBST= 1024
##$WBSW= 4
##$XGAIN= (0..3)
0 0 0 0 
##$XL= 0
##$YL= 0
##$YMAX_a= 174238
##$YMIN_a= -194438
##$ZGOPTNS= <>
##$ZL1= 120
##$ZL2= 120
##$ZL3= 120
##$ZL4= 120
##$ABSF1= 10
##$ABSF2= 0
##$ABSG= 5
##$ABSL= 3
##$ALPHA= 0
##$AQORDER= 0
##$ASSFAC= 0
##$ASSFACI= 0
##$ASSFACX= 0
##$ASSWID= 0
##$AUNMP= <proc_1d>
##$AZFE= 0.1
##$AZFW= 0.1
##$BCFW= 1
##$BC_mod= 2
##$BYTORDP= 1
##$COROFFS= 0
##$CY= 11.3945322036743
##$DATMOD= 1
##$DC= 2
##$DFILT= <>
##$DTYPP= 0
##$F1P= 18.9103706918063
##$F2P= -1.10871071338519
##$FCOR= 0.5
##$FTSIZE= 0
##$FT_mod= 4
##$GAMMA= 1
##$GB= 0.15
##$INTBC= 1
##$INTSCL= 1
##$ISEN= 128
##$LB= 0.24
##$LEV0= 0
##$LPBIN= 0
##$MAXI= 10000
##$MC2= 0
##$MEAN= 0
##$ME_mod= 0
##$MI= 1.114404
##$NCOEF= 0
##$NC_proc= 0
##$NLEV= 6
##$NOISF1= 3.799351
##$NOISF2= 2.8
##$NSP= 1
##$NTH_PI= 0
##$NZP= 0
##$OFFSET= 15.70392
##$PC= 1
##$PHC0= -8860.814
##$PHC1= 23.60026
##$PH_mod= 1
##$PKNL= yes
##$PPARMOD= 0
##$PSCAL= 0
##$PSIGN= 0
##$REVERSE= no
##$SF= 200.130013532006
##$SI= 16384
##$SIGF1= 3
##$SIGF2= 2
##$SINO= 400
##$SIOLD= 16384
##$SREGLST= <1H.CDCl3>
##$SSB= 0
##$STSI= 0
##$STSR= 0
##$SW_p= 3612.71676300578
##$SYMM= 0
##$S_DEV= 0
##$TDeff= 0
##$TDoff= 0
##$TI= <>
##$TILT= no
##$TM1= 0
##$TM2= 0
##$TOPLEV= 0
##$USERP1= <user>
##$USERP2= <user>
##$USERP3= <user>
##$USERP4= <user>
##$USERP5= <user>
##$WDW= 1
##$XDIM= 8192
##$YMAX_p= 0
##$YMIN_p= 0
$$ End of Bruker specific parameters
$$ ---------------------------------
##NTUPLES= NMR FID
##VAR_NAME=  TIME,          FID/REAL,        FID/IMAG
##SYMBOL=    X,             R,               I
##VAR_TYPE=  INDEPENDENT,   DEPENDENT,       DEPENDENT
##VAR_FORM=  AFFN,          ASDF,            ASDF
##VAR_DIM=   8192,          8192,            8192
##UNITS=     SECONDS,       ARBITRARY UNITS, ARBITRARY UNITS
##FACTOR=    0.0002004,     1,               1
##FIRST=     0,             0,               0
##LAST=      1.6414764,     0,               0
##MIN=       0,             -194438,         0
##MAX=       1.6414764,     174238,          0
$$ Real data points
##PAGE= N=1
##DATA TABLE= (X++(R..R)), XYDATA
0@%%%%%jPj4J6j6K4l2L3m1N6p2Q5r5J13j36J60j89K19k52K92l36L81m34M94n60
$$ 0 0 0 0 0 0 -1 6 -8 8 -8 16 -16 17 -24 32 -40 45 -50 63 -73 87 -102 117 -135 157 -179 202 -232 262 -298
30b98O34p13P98q94J001j118J245j383J535j703J888k089K309k557K834l141L486
$$ -298 336 -377 421 -473 528 -590 655 -728 807 -896 992 -1097 1212 -1345 1489 -1652 1834
47A834l875M320m834N435o148P007q071R433j1241J3769j7587K4101l8142J21749
$$ 1834 -2041 2279 -2555 2880 -3268 3739 -4332 5101 -6140 7629 -9958 14143 -23999 97750
61I7750j07406j08502K61900r1649j06412J77682j2975k45033J44651J64232k04564
$$ 97750 -9656 -118158 143742 52093 -54319 123363 110388 -134645 10006 174238 -30326
72c0326l9461K16646j29208j59773K11293N3114k18374Q6316J23895k06772o181
$$ -30326 -69787 146859 17651 -142122 69171 122285 -96089 -9773 114122 -92650 -98831
83i8831K59804j06477k04848J67700O9069j77987J03112J35372k20642m8337K48644
$$ -98831 160973 54496 -150352 17348 86417 -91570 11542 146914 -73728 -122065 126579
94A26579o2697j72964J66598M6062k15420Q3128J80216j71216o5639J97436q5835
$$ 126579 63882 -109082 57516 103578 -111842 -28714 151502 -19714 -85353 112083 26248
105B6248j68031J98448Q3755k31272K4666J61705j40037l9555K06906r2432k02840
$$ 26248 -141783 56665 140420 -90852 -66186 95519 -44518 -84073 122833 30401 -172439
116a72439J74392J09328j97171L1057J55581j61031p1092K21032l7408j86359
$$ -172439 1953 111281 -85890 -54833 100748 -60283 -131375 89657 52249 -134110
126a34110J42368Q1736k04412M6441J98356j41045j10657J80461k6149j55460
$$ -134110 8258 89994 -114418 -67977 130379 -10666 -121323 59138 32989 -122471
136a22471J60573Q5223k29256J1383K05837j07070j01469J72490l4756j78842
$$ -122471 38102 123325 -105931 -94548 111289 4219 -97250 75240 40484 -138358
146a38358J46347J16189j97521j226J79012j19143j04102J94496K18j87753J03731
$$ -138358 7989 124178 -73343 -74569 104443 -14700 -118802 75694 75912 -111841 -8110
157h110J06020j74823J6322J90072j23653j35620J78728K8543j65852R4708R6890
$$ -8110 97910 -76913 -60591 129481 5828 -129792 48936 77479 -88373 6335 103225
168A03225j81896j49J96479r5607j33581J58797J9501j71279R5014J21716j68610
$$ 103225 -78671 -78820 117659 22052 -111529 47268 66769 -104510 -9496 112220 -56390
179e6390k5940J75108q5299j20129J66936K7930j85321P0997J32449j42116k5684
$$ -56390 -82330 92778 7479 -112650 54286 82216 -103105 -32108 100341 -41775 -67459
190f7459J65723q5722j28478J63689M5895j76646N9447J27215j43247l4049J73495
$$ -67459 98264 12542 -115936 47753 93648 -82998 -23551 103664 -39583 -73632 99863
201I9863o8405j36607J44132M5078j71955O0182J35875j43298n4498J65906n2614
$$ 99863 31458 -105149 38983 84061 -87894 -27712 108163 -35135 -89633 76273 23659
212B3659j30701J38166M4977j76936N1909J46353j31071o1689J61406m5818j34485
$$ 23659 -107042 31124 76101 -100835 -48926 97427 -33644 -95333 66073 20255 -114230
223a14230J34875N9615j70395M0574J44148j22988o3329J64220l5289j40264J22348
$$ -114230 20645 80260 -90135 -49561 94587 -28401 -91730 72490 37201 -103063 19285
234A9285O7279j61292L4002J43646j20498p2054J61773k4063j43393J10253P1252
$$ 19285 86564 -74728 -40726 102920 -17578 -89632 72141 48078 -95315 14938 86190
245H6190j56772K3618J43154j11324p8583J54680j6180j43764J02331P8551j51061
$$ 86190 -70582 -46964 96190 -15134 -93717 60963 44783 -98981 3350 81901 -69160
256f9160J3922J43148j01169q2379J51038o807j43701R4514Q6512j44567M930
$$ -69160 -55238 87910 -13259 -95638 55400 48593 -95108 -594 85918 -58649 -53719
267e3719J43613r0417q7023J45538J283j43817Q6757R2207j40326m964J43300
$$ -53719 89894 -523 -87546 57992 59275 -84542 2215 94422 -45904 -50868 92432
278I2432q2994r2772J40934Q707j46233P7333R7199j36028j3329J43518p5896
$$ 92432 9438 -83334 57600 66307 -79926 -2593 94606 -41422 -54751 88767 12871
289A2871r9519J35540J7974j45463O9782J01178j33202k0658J46776o6580j05625
$$ 12871 -86648 48892 66866 -78597 -8815 92363 -40839 -61497 85279 18699 -86926
300h6926J29272K5864j45034O4203J07650j29202l0428J46154n7339j08622J24962
$$ -86926 42346 68210 -76824 -12621 95029 -34173 -64601 81553 24214 -84408 40554
311D0554L1724j45882N6057J12805j22741l7872J44024n1166j13466J20304M1488
$$ 40554 72278 -73604 -17547 95258 -27483 -65355 78669 27503 -85963 34341 75829
322G5829j45068M5260J15182j15718m3648J42510m3143j17420J12585M8348j40100
$$ 75829 -69239 -23979 91203 -24515 -68163 74347 31204 -86216 26369 74717 -65383
333f5383L7241J16513j08799n1925J40351l2863j19393J03950N5126j37534K8591
$$ -65383 -28142 88371 -20428 -72353 67998 35135 -84258 19692 74818 -62716 -34125
344c4125J20242j01750n9308J36105k3724j20220R6044O1096j34803K0721J22067
$$ -34125 86117 -15633 -74941 61164 37440 -82780 13264 74360 -60443 -39722 82345
355H2345r4050o5915J32403j4854j22611Q9996O7818j31832J0955J25008q5717
$$ 82345 -11705 -77620 54783 39929 -82682 7314 75132 -56700 -45745 79263 -6454
366f454p2117J28478p631j23957Q3854P4197j28828K485J26410p8620p7362J26016
$$ -6454 -78571 49907 42276 -81681 2173 76370 -52458 -49973 76437 -2183 -79545 46471
378D6471M87j27262P5904Q2482j24248o689J27090p1242q3475J23289R617j28904
$$ 46471 46958 -80304 -4400 78082 -46166 -52855 74235 2993 -80482 42807 52424 -76480
390g6480O7253Q7760j19614j3950J28165o4216r0118J18370J8954j29458N8754
$$ -76480 -9227 78533 -41081 -55031 73134 8918 -81200 37170 56124 -73334 -14580
401a4580R2767j14642k2871J28222n5271r4732J11827K6859j27454N0094R5777
$$ -14580 78187 -36455 -59326 68896 13625 -81107 30720 57579 -69875 -19781 75996
412G5996j08493k9623J26614m6090r8150J05223L4833j24584M1861R9259j00919
$$ 75996 -32497 -62120 64494 18404 -79746 25477 60310 -64274 -22413 76846 -24073
423b4073l7575J24681l6508j00639R7575M1366j21401L3083J01837r4683m4324
$$ -24073 -61648 63033 26525 -74114 23461 64827 -56574 -23491 78346 -16337 -60661
434f0661J20727k9098j02790R0459M7580j19873K4416J02809q7376n1177J17505
$$ -60661 60066 30968 -71822 18637 66217 -53656 -29240 73569 -13807 -64984 52521
445E2521k0979j05501Q3463N3211j16109J7329J05445q1574n6754J15021j2197
$$ 52521 31542 -73959 9504 62715 -53394 -36065 69380 -12194 -68948 46073 33876
456C3876j06295P8262N8524j13608R784J09452p3478o2808J11712o015j07437
$$ 33876 -72419 5843 64367 -49241 -39457 69995 -3483 -66291 45421 39406 -68031
467f8031P2673O5045j10787J018J08210o7694o5772J09346j50j11615O4068P0418
$$ -68031 4642 69687 -41100 -40082 68128 434 -65338 44008 43858 -67757 -3689 66729
479F6729j05129m478J07378o4298p2592J06322J0441j09277N4662P1301j01798
$$ 66729 -38400 -42878 64500 202 -72390 33932 44373 -64904 -10242 61059 -40739
490d0739q485J11106n5355p8749R8259J6492j04955N2358P6082r9990j9305J09817
$$ -40739 -49224 61882 6527 -72222 26037 42529 -62426 -10068 66014 -33976 -53281 56536
502E6536m3779p6942R2447J8044j07685M5939Q3540r0273k6828J01676m0619p7569
$$ 56536 12757 -64185 28262 46306 -61379 -15440 68100 -22173 -49001 52675 12056 -65513
514f5513R2597K6934j08635L3163Q2908q2157k7534J02663l6029q5575Q4482L5710
$$ -65513 27084 54018 -54617 -21454 61454 -20703 -48237 54426 18397 -67178 17304 53014
526E3014j00501K8859Q1879q2892l4993J05239k4156q5230P5187L4530j01355
$$ 53014 -47487 -18628 63251 -19641 -54634 50605 26449 -58781 16406 50936 -50419
537e0419K8293R0506p8177m5624R7868j8103q2627P5282L9142j04319J7030R1880
$$ -50419 -22126 68380 -9797 -55421 42447 24344 -58283 16999 56141 -48178 -31148 60732
549F0732o8059m4394R6374j8159r0121P2312M9810r6367J1011Q7807o9608m6492
$$ 60732 -7327 -51721 44653 26494 -63627 8685 58495 -37872 -26861 60946 -8662 -55154
561e5154J03205p487r4686N9517N1340r0417J2888R0558o9215n6941R7957J108
$$ -55154 48051 40564 -54122 5395 56735 -33682 -20794 69764 549 -56392 41565 42673
573D2673r0751N6816N1112r4533K829R4527n7668n8706R0460j117r4074N6786
$$ 42673 -48078 8738 59850 -34683 -31854 62673 5005 -53701 36759 35642 -58432 -1646
585a646O2023q9705q293Q7374n1543n4234R3476L098r8794M7889O8200q1091r500
$$ -1646 60377 -29328 -37621 49753 -1790 -56024 37452 40550 -58244 -10355 57845 -23246 -32746
598c2746Q7989m9366o0610Q9925J2966r3461M2742O5841q2987j5184R2805l9006
$$ -32746 55243 5877 -54733 35192 48158 -45303 -2561 63280 -19707 -34891 57914 18908
610A8908o6485P8343J3042r1829M3843P0720q5989k6898R2017l0607o7358P4720
$$ 18908 -47577 30766 43808 -48021 -4178 66542 -19447 -46345 45672 15065 -52293 22427
622B2427J5643r4120L8184P4974p9903k9530R2197k7542p2782P3476K6535r0767
$$ 22427 38070 -56050 -17866 57108 -22795 -52325 39872 12330 -60452 13024 39559 -51208
634e1208L2127P4759p8438k9984R7967k2285p9729O8073L3531q7249K6996P4883
$$ -51208 -19081 55678 -22760 -52744 45223 22938 -56791 11282 44813 -42436 -15440 59443
646E9443p6188l4711R7544j9126q4530O5337L9546q8138J7153P5446o9826l7387
$$ 59443 -16745 -51456 46088 26962 -57568 7769 47315 -40823 -23670 51776 -18050 -55437
658e5437R5927j7078q8916O2132M8189q5830Q901P7235o3025m1190R3261j0921
$$ -55437 40490 23412 -65504 -3372 44817 -41013 -32112 45123 -17902 -59092 34169 23248
670B3248q8342O0342N2481q6994J887Q3673n2964m5881Q5193q253q5228O0676
$$ 23248 -65094 -4752 47729 -39265 -37378 46295 -6669 -52550 32643 24390 -60838 -162
682a62N8030q9424q503Q4920m3747m7708Q0611n492q7991N5345O2507q5760j1698
$$ -162 57868 -31556 -40059 44861 1114 -46594 34017 28525 -59466 -4121 58386 -27374 -39072
695c9072Q5061m2688n6260Q0239P073q4872M5766N7944q4416j0515R4604l8255
$$ -39072 45989 3301 -52959 27280 34353 -50519 -4753 53191 -31225 -41740 52864 14609
707A4609o8212P1440J5262p8660M5109N9014q7721j8409R6738k9702o9078O9166
$$ 14609 -53603 17837 33099 -45561 -452 58562 -29159 -47568 49170 19468 -49610 19556
719A9556J7359q4647L7397O7762p7066k2807Q9338l3436p1948P6907L1236q8225
$$ 19556 36915 -47732 -10335 57427 -19639 -42446 46892 13456 -58492 18415 49651 -38574
731c8574K0241O5056o7212j6703R2757l4823q3703P0641M2977q0327J7224O3426
$$ -38574 -18333 46723 -20489 -37192 55565 20742 -62961 7680 50657 -29670 -12446 50980
743E0980p0201k6271R4530j9860q0887O1448L6034q5305J7984P8139o1535m1973
$$ 50980 -19221 -45492 49038 29178 -51709 9739 45773 -39532 -21548 56591 -4944 -46917
755d6917P8536j4884p0698O7796L9300r5516K124Q3327m4555l9280P3505j7910
$$ -46917 31619 16735 -53963 13833 53133 -42383 -40259 43068 -1487 -40767 32738 14828
767A4828p8088O5005N3109q5053l844P5691m7859m1775Q2306j482q1593M6859
$$ 14828 -63260 1745 54854 -30199 -34043 41648 -6211 -47986 34320 32838 -48755 -1896
779a896M7828p6498M697Q4099n1263o0514P4999J2501p0012M3188M2198q4899
$$ -1896 45932 -30566 -25869 58230 6967 -53547 21452 33953 -36059 7129 49327 -35572
791c5572k819R1434l7189o2501O5767P614p4251M5176N6964p9280j5319Q0257
$$ -35572 -38391 53043 15854 -46647 19120 26734 -47517 -2341 54623 -24657 -39976 40281
803D0281l5139n5449P6171J4484q6488L0062O1915o2617j0906P8133m1979o5129
$$ 40281 5142 -50307 25864 40348 -46140 -16078 45837 -16780 -27686 50447 8468 -56661
815e6661P7295K9602q0151K1755N5426o5929j3319Q6134k9773p1001O2864K5906
$$ -56661 20634 50236 -29915 -8160 47266 -18663 -31982 54152 24379 -46622 16242 42148
827D2148p6327K7772O4450o8404l0110P8234j8602n9989O2798K1543q6439K0545
$$ 42148 -34179 -6407 58043 -10361 -40471 37763 19161 -40828 21970 43513 -42926 -22381
839b2381P4602n4012l3449O8996k1487o2348O6241L3670q2915Q383O7626n0229
$$ -22381 52221 -1791 -35240 33756 12269 -50079 16162 49832 -33083 -24700 42926 -7303
851g303k8806P5819j6378p2358N3708L8444p1275J1107O6136n6513l9123P7709
$$ -7303 -36109 39710 23332 -49026 4682 43126 -28149 -17042 49094 -7419 -46542 31167
863C1167k485o7993M4602L2997p3452J1250P4211m9754m6468O9107j512o5440
$$ 31167 28682 -39311 5291 38288 -35164 -23914 50297 543 -45925 23182 21670 -43770
875d3770M8326L9729p6383J07P3100m2095m2036O9679k159p3557M3451M8734o7768
$$ -43770 4556 44285 -32098 -31991 41109 -986 -43022 26657 24498 -49059 -5608 43126 -24642
888b4642l639O7932m3500m4860P3818O597p5426L5482M7441o5309l362P2597m0490
$$ -24642 -28281 39651 -3849 -48709 25109 31706 -43720 -8238 39203 -26106 -29468 43129 2639
901B639n2585O8029J1989p0938L5138M8545o8163j0098P4570l1160n2438O3266
$$ 2639 -49946 18083 30072 -40866 -5728 42817 -25346 -35444 39126 7966 -44472 18794
913A8794J1003p2851L4067N5573o4216j6824P0693k8333n2216O4101J5383p4526
$$ 18794 29797 -43054 -8987 46586 -17630 -34454 36239 7906 -44310 19791 35174 -39352
925c9352K6645N6835n9238j7609P0962k7297n6756O0813K1488p1294K2125N6501
$$ -39352 -12707 44128 -15110 -32719 38243 10946 -45810 15003 36491 -34803 -12678 43823
937D3823n8774k1107P2963k1023n9653N5583K3786o9745K0377N9194n6758k6774
$$ 43823 -14951 -36058 36905 15882 -43771 11812 35598 -34147 -13770 45424 -11334 -38108
949c8108P1770j6033n9584N3412K6299p1396J6141O2693n2570k9990O9935j3898
$$ -38108 33662 17629 -41955 11457 37756 -33640 -17499 45194 -7376 -37366 32569 18671
961A8671o2131N2766L1007p0668J0717O3252m9776l2291P0398j0599o5313M9371
$$ 18671 -43460 9306 40313 -30355 -19638 43614 -6162 -38453 31945 21346 -43967 5404
973E404L5367o9907P608O5180m8650l6223P0422n842o6250M5290L8244o9564M481
$$ 5404 40771 -29136 -21528 43652 -4998 -41221 29201 23359 -42891 2399 40643 -28921 -24440
986b4440O7143m5108m1041O9504j941o7514M3220M1299o8704o43O9040m1060m3618
$$ -24440 42703 -2405 -43446 26058 24117 -43397 -177 41122 -27582 -28225 40815 -245 -43863
999d3863O7285J975o8641L9544M5351o6763m727O8902l7179m5892O5761O698p0074
$$ -43863 23422 25397 -43244 -3700 41651 -25112 -29839 39063 1884 -44008 21753 28451 -41623
1012d1623L5241M8544o3908r573O9663l3223m9357O3494J1406p0569L0807N1218
$$ -41623 -6382 42162 -21746 -31319 38344 5121 -44236 19258 30664 -39905 -9098 42120
1024D2120o1588j4044P0146k9007n3032O1060J5813p0573K6687N4145n9488j7674
$$ 42120 -19468 -33512 36634 7627 -45405 15655 31468 -39105 -12418 41727 -17761 -35435
1036c5435P0286k4812n5960N8806K0418p0152K2483N6630n6914k1898P1076k0412
$$ -35435 34851 10039 -45921 12885 33303 -36849 -14366 42264 -14650 -36548 34528 14116
1048A4116n8717N6005K4795p0188J8588N9767n5203k6520P1225j5868o1208N3107
$$ 14116 -44601 11404 36199 -33989 -15401 44366 -10837 -37357 33868 18000 -43208 9899
1060I899K8665p0631J4470O2144n1922l1053P0971j2078o3179N0358L2542p0284
$$ 9899 38564 -32067 -17597 44547 -7375 -38428 32543 20465 -42714 7644 40186 -30098
1072c0098J0327O4286m8713l4993O9833p293o4941M6953L6408o8805N204O6437
$$ -30098 -19771 44515 -4198 -39191 30642 23349 -41592 5361 41769 -27036 -21832 44605
1084D4605m5535l8508O8176k791o6092M3248L9728o7789R73O6781m0959m1346
$$ 44605 -930 -39438 28738 25947 -40145 3103 42831 -24958 -23985 42796 1837 -39509
1096c9509O6064J199o6887L8412M4362o4686m421O6890l6548m4309O4356O120
$$ -39509 26555 27754 -39133 -721 43641 -21045 -25466 41424 4876 -39433 24923 31043
1108C1043o7791L3964M6053o1478q169O7146l2757m8162O1177J1395o7342K9804
$$ 31043 -36748 -2784 43269 -18209 -26378 40768 8011 -40151 21026 32421 -34921 -5117
1120e117M8419o0669j2912O8214k7652n1217N7672J3969o7415K7071N1970n8289
$$ -5117 43302 -17367 -30279 37935 10283 -40934 16738 30707 -36708 -9637 42333 -15956
1132a5956j7793O7434k3843n2405N6377J8879o8803K2254N5121n4713k0270O7296
$$ -15956 -33749 33685 9842 -42563 13814 32693 -36110 -13856 41265 -13448 -33718 33578
1144C3578k0679n5555N4828K3332o7370J8002N5979n2613k4001O7708j6073n7658
$$ 33578 12899 -42656 12172 35504 -31866 -13864 42115 -10498 -34499 33209 17136 -40522
1156d0522N0009K5895o6649J4880N8620n0083k9440O5010j1741n7347M8228K8364
$$ -40522 9487 35382 -31267 -16387 42233 -7850 -37290 27720 15979 -41368 6860 35224
1168C5224o7511R438O0510m4239l0602O2879r609n9829M5826L4246o3000M231
$$ 35224 -32287 -22849 37661 -6578 -37180 25699 16090 -43739 2087 36333 -26667 -22436
1180b2436N8364m1717l2531O5219l517o1935L8273L6097n8816M162O0080m1794
$$ -22436 35928 -5789 -38320 26899 23382 -38553 -280 35817 -22999 -18837 41243 -551
1192e51l8999O2116L530n9302L4660L4957o0265j20O3238l4735m1298N6137L153
$$ -551 -39550 22566 26096 -33206 1454 36411 -23854 -23974 39264 4529 -36769 19368 22521
1205B2521n9780L5098M1451n9289p609N9569l0706l8670N8717N407o5114K8904
$$ 22521 -37259 -2161 39290 -19999 -27608 31961 1255 -37415 21302 26709 -38405 -9501
1217i501M6324n2634q102N7992l1874m3489N9476J2975o2678K4201M3265n3496
$$ -9501 36823 -15811 -23913 34079 2205 -41284 18192 31167 -31511 -7310 35955 -17541
1229a7541r073O3677k6737m8115N1788J3256n9533K6586M7704n6228j8720O1899
$$ -17541 -26614 37063 10326 -37789 13999 27255 -32278 -5692 42012 -14216 -32936 28963
1241B8963j8281m4196N0059J1290o4609K3364N4251m8849k2174N7247j9833m6281
$$ 28963 10682 -33514 16545 27835 -36774 -13410 40841 -8008 -30182 27065 7232 -39049
1253c9049N2783J9597o3852J4618N0248m6298j8703O2672j7170n4988M4087K5099
$$ -39049 13734 33331 -30521 -15903 34345 -11953 -30656 32016 14846 -40142 3945 29044
1265B9044n5336J6055M8220n1043k5457O5086o219n3546L7926K1461n6809J5609
$$ 29044 -26292 -10237 37983 -13060 -38517 26569 20350 -33196 4730 26191 -30618 -15009
1277a5009N5566m4742l1576N7646o647n0686M2583K8140o0760M228N3902l6510
$$ -15009 40557 -4185 -35761 21885 15238 -35448 7135 35275 -25485 -21257 32645 -3865
1289c865k6062N7945r967n9429L9965L7509n3552J04M8724l9678k7789O3354k251
$$ -3865 -29927 28018 18051 -41378 -1413 36096 -17456 -17352 31372 -8306 -36095 27259 25008
1302B5008o1738L2048L5869n3129K433N5948l7484l7143N6875K052n5163L6015
$$ 25008 -36730 -4682 31187 -21942 -19509 36439 -1045 -38188 18687 20739 -34424 1591
1314A591L5721o0698m793O1055k6548l6654N1205j932n7941L8317M4302n7987
$$ 1591 37312 -23386 -28179 32876 6328 -30326 20879 18947 -38994 -677 43625 -14362
1326a4362j2164N6260k5687l5484N5024L428o1764K8647M3921n2365r081N9391
$$ -14362 -26526 29734 4047 -31437 23587 27015 -34749 -6102 37819 -14546 -23627 35764
1338C5764k8702m5118N2057J3959n5927K4582L9195n6082j0108O5807k1021n0417
$$ 35764 7062 -38056 14001 27960 -27967 -3385 35810 -20272 -30380 35427 14406 -36011
1350c6011M5333J4586n3453K5268M3999n4154j7711O2558j6791m7728M6607J7793
$$ -36011 9322 23908 -29545 -4277 39722 -14432 -32143 30415 13624 -34104 12503 30296
1362C0296n8643J6738M8756m5595j8083N8981j9756n1735M8169K7030n8717R349
$$ 30296 -28347 -11609 37147 -8448 -26531 32450 12694 -39041 9128 36158 -22559 -13210
1374a3210M5838m2912j8153O0779j5566n6425M3592K9041n6560Q368N0294m2710
$$ -13210 32628 -10284 -28437 32342 16776 -39649 3943 32984 -23576 -15208 35086 -7624
1386g624k5700N8825r196n3056M2046K8219o0478N518N6845l6876l0417N4064
$$ -7624 -33324 25501 16305 -36751 5295 33514 -26964 -21446 35399 -1477 -31894 22170
1398B2170p494n2268M2749L2198o2029J41N7905l2951l2485N3984l636n5433L8399
$$ 22170 14676 -37592 5157 37355 -24674 -24533 33372 421 -32064 21920 18284 -37149 1250
1411A250L4967n8528j803N8502l2858l7609N4336L803n5797L2039L5963n6631
$$ 1250 36217 -22311 -24114 34388 1530 -36079 18257 22060 -33737 -1698 34265 -22366
1423b2366k890O0368l0966m1718N2509Q500n5126K8192L7396n3953o289O0119
$$ -22366 -25256 35112 4146 -37572 14937 23437 -31689 -3497 33899 -20054 -26343 33776
1435C3776k7572m3999N1455J2504n6259K3446M0581m9897r814N8161k4403m5001
$$ 33776 6204 -37795 13660 26164 -30095 -6649 33932 -15965 -25779 32382 7979 -37022
1447c7022N0109J5568n7906K0243M3688m6624j4605N6664k0502m5450M8748J7810
$$ -37022 13087 28655 -29251 -9008 34680 -11944 -26549 30115 9613 -35837 12911 30721
1459C0721n8798J5700M7560m3287j8253N4873j7549m6672M7101K1378n8913J1913
$$ 30721 -28077 -12377 35183 -8104 -26357 28516 10967 -35705 11396 32774 -26139 -14226
1471a4226M8954m1449k1163N5673j3883m8997M2984K4072n7178J0492N0704m0769
$$ -14226 34728 -6721 -27884 27789 13906 -35091 7893 31965 -25213 -14721 35983 -4786
1483d786k6552N5733p927m9107L9345K4746n6929P970N3619l7575l0249N3137
$$ -4786 -31338 24395 16468 -32639 6706 31452 -25477 -17507 36112 -1463 -31712 21425
1495B1425m397m9965L7226K8468n5125K988N3034l4787l0893N3421j480n3292
$$ 21425 17028 -32937 4289 32757 -22368 -19380 33654 -1133 -32026 21395 19915 -33377
1507c3377L2700L2508n1273J53N1503l3497l3855N3565L948n3450K7441L3162
$$ -33377 -677 31831 -19442 -19289 32214 -1283 -35138 18427 22375 -31075 -3634 29528
1519B9528m9562j564N3480k9793l7511M9446P110n1598K6438L5482m9499p378
$$ 29528 -20034 -21598 31882 2089 -35422 14024 21134 -30464 -4026 31456 -18043 -25421
1531b5421N3694k4076l7208M7107O916n2955K4339M0147m6239j1424N0925k1602
$$ -25421 28273 4197 -33011 14096 21012 -31943 -7604 32543 -13696 -25120 25805 4203
1543D203l7623M6747J1232n4168J9399M0875m3234j2200N1432k0243m0842M4384
$$ 4203 -33420 13327 24559 -29609 -10210 30665 -12569 -24769 26663 6420 -34422 9962
1555I962J5223n1932J7273M0751m3431j5246N3422j5623m2899M1183J6224n2035
$$ 9962 25185 -26747 -9474 31277 -12154 -27400 26022 10399 -32500 8683 24907 -27128
1567b7128J7027M3253m2183j8784N1846j2765m2483M0044J8139n2169J2740M5133
$$ -27128 -10101 33152 -9031 -27815 24031 11266 -31217 8827 26966 -25203 -12463 32670
1579C2670l8819k0696N1415j1556m4599L8837K1892n1067Q998M4829l6857k2436
$$ 32670 -6149 -26845 24570 13014 -31585 7252 29144 -21923 -12925 31904 -4953 -27389
1591b7389N1230p960m6440L5262K4252m9311O855M5706l4818k5248M9594l972
$$ -27389 23841 15881 -30559 4703 28955 -20356 -13501 32205 -2613 -27861 21733 17761
1603A7761m6699L2986K5970m9164L566M6967l1123k7821M7814k096m6845L0945
$$ 17761 -28938 4048 30018 -19146 -15580 31387 264 -27557 20257 18161 -28684 2261
1615B261K8644m8078N4M7473k8837k9582M6970P86m8406K8104L0966m6180k694
$$ 2261 30905 -17173 -17119 30354 1517 -28065 18905 19691 -28715 -611 30355 -15825 -18519
1628a8519M7817k6576l2013M6218L743m8216K5126L2625m5244n040M8706k4934
$$ -18519 29298 2722 -29291 16927 20670 -27546 -2420 30205 -15039 -20079 28627 3693
1640C693l3934M5493O476m8782K2770L4610m4051p637M9332k2677l5990M3845
$$ 3693 -30241 15252 21728 -27054 -4284 30326 -13725 -21362 27970 5293 -30697 13148
1652A3148R676m9427K0139L6972m3366j0303M9945j9757l8062M2399J1992m9582
$$ 13148 22824 -26603 -6464 30508 -12858 -23161 26784 7027 -31035 11364 23356 -26226
1664b6226J7917L9023m1835j3583M9527j6485l9695M0959J4873n0188J5106M0849
$$ -26226 -8309 30714 -11121 -24704 24823 8338 -31357 9602 24475 -25713 -10607 30242
1676C0242l9526j6415M9703j4088m1503L9046J8188m9680J2121M2131l7903j9028
$$ 30242 -9284 -25699 24004 9916 -31587 7459 25647 -24033 -11912 30219 -7684 -26712
1688b6712M9551j0673m2620L6362K0366m8899R422M3279l5376k2231M8589o785
$$ -26712 22839 12166 -30454 5908 26274 -22625 -13203 30076 -5300 -27531 21058 14273
1700A4273m3810L3711K2731m8196O652M5038l2996k5262M7482l995m4646L1411
$$ 14273 -29537 4174 26905 -21291 -14639 30399 -2597 -27859 19623 15628 -29018 2393
1712B393K6056m7696K532M5730k9663k7364M6642j415m5951K9401K8876m6676
$$ 2393 28449 -19247 -16715 29015 -648 -28012 18630 17215 -28736 665 29541 -17135
1724a7135m63M6158k7728k9608M6719J854m7955K6458L1118m4713l561M7326k5701
$$ -17135 -17598 28560 832 -28776 17943 19797 -28158 -1700 29418 -15295 -18856 28470 2769
1737B769l2272M4966N555m8151K3937L3257m4441n948M8170k2584l4947M3370
$$ 2769 -29503 15463 21018 -27133 -3196 30061 -14380 -20328 27842 5258 -29689 13681
1749A3681P791m8015K1590L5470m2774j0368M8453j8981l6399M1304J0839m8559
$$ 13681 21472 -26543 -4953 30517 -12257 -22625 25828 6847 -29552 11752 22591 -25968
1761b5968J8012L8349m0909j3543M8308j6528l8112L9402J4688m8495J4144L9179
$$ -25968 -7956 30393 -10516 -24059 24249 7721 -30391 9011 23699 -24796 -10652 28527
1773B8527l7936j5743M7614j3268m0269L7303J7816m7450J1601M0060l6223j8444
$$ 28527 -9409 -25152 22462 9194 -31075 6228 24044 -23406 -11805 28255 -7968 -26412
1785b6412M7045r018m1344L4265J9780m6804Q757M1802l3502k1607M5955o341
$$ -26412 20633 11615 -29729 4536 24316 -22488 -13731 28071 -5431 -27038 18917 12576
1797A2576m2159L2958K2327m6812M970M2963l0619k3664M5225m149m3782L0494
$$ 12576 -29583 3375 25702 -21110 -16140 26823 -3796 -27460 17765 13616 -30166 328
1809C28K5553m4875K360M2788k8969k5725M5570p67m4495K6835K7127m3162M32
$$ 328 25881 -18994 -16634 26154 -2815 -28540 17030 16263 -28232 -1397 25730 -17432 -17000
1822a7000M4316k7375k8772M4013K529m4100K5180K8264m3037k650M5890k4424
$$ -17000 27316 -59 -28831 15182 17711 -26389 -1209 27055 -15982 -18632 27258 2834
1834B834k9854M1355M192m4562K3353L1170m1638o125M4382k1073l1028M0882
$$ 2834 -27020 14335 18527 -26035 -2682 28488 -13150 -19275 25107 4034 -26994 13888
1846A3888O926m5451J9312L3340l8999q124M4208j8892l3193L8427J0753m4262
$$ 13888 20814 -24637 -5325 28015 -10984 -19108 25100 6208 -26985 11442 22195 -22067
1858b2067J6352L3883l7251j1408M4425j4805l4662L5753J1753m3255J4220L6119
$$ -22067 -5715 28168 -9083 -20491 23934 9129 -25533 10220 21973 -21282 -7062 29057
1870B9057l5248j5122M2867j2122l4818L5004J4053m4177J0743L7270l2400j6138
$$ 29057 -6191 -21313 21554 9432 -25386 9618 23671 -20506 -9763 27507 -4893 -21031
1882b1031M2141j0351l6805L2384J7560m1890Q278L6977l2164j8721M3816o387
$$ -21031 21110 10759 -26046 6338 23898 -17992 -9714 27263 -4901 -23622 20194 13807
1894A3807l7984K8148J8564m0869P958L8188l0907k1326M1530l655l7960K8172
$$ 13807 -24177 3971 22535 -18334 -10376 27812 -3095 -24421 17109 13454 -24506 3666
1906C666J9877m1850M626L9244k7609k1829M0513l253l9828K6669K4423l9749
$$ 3666 23543 -18307 -13681 25563 -2046 -23875 16638 13385 -26443 226 24649 -15100
1918a5100P14L7604k6114k2158M1917m43m1809K3024K5665l7429l9L8538k4799
$$ -15100 -14386 23218 -2896 -25054 16863 16420 -25389 -2365 23300 -14129 -14168 24370 -429
1931d29k5387L9692K140l9371K2051K5829l8716l781M0344j9316k6350L5507K395
$$ -429 -25816 13876 16016 -23355 -1304 24525 -14191 -17972 22372 3056 -23294 12213 14608
1944A4608m0330K2632K9741l7612q109L8329j7141k5200L6198M278m1458J7392
$$ 14608 -25722 -3090 26651 -10961 -19070 19259 2118 -23082 13116 17394 -24064 -6672
1956f672L1212l3714p673L8560j7566k9582L5055R811l8736J5461K8600l6072
$$ -6672 24540 -9174 -16847 21713 4147 -25435 9620 19431 -19305 -3844 24756 -11316
1968a1316q249M2702j3267l3198K9974J0358l6773J6984L0959l6734j3698M1503
$$ -11316 -19565 23137 9870 -23328 6646 17004 -19769 -2785 28174 -8560 -22258 19245
1980A9245r768l1193L0378J0855m0252J2089L4533l1230j3660L9230j2129l4401
$$ 19245 9477 -21716 8662 19517 -20735 -8646 25887 -5343 -19003 20227 8098 -26303
1992b6303L2742J7361l9390O587L1195k9684j1921M2284j0132l9339K8251K0130
$$ -26303 6439 23800 -15590 -9003 22192 -7492 -19413 22871 12739 -26600 1651 21781
2004B1781l6199P324L2086l1128j7349M1769m632l6496K6192J8098l9508N259
$$ 21781 -14418 -7094 24992 -6136 -23485 18284 13652 -22844 3348 21446 -18062 -12803
2016a2803L7627k5337k0722L5644n309l4730K9587K1831m1603j697L7385k0531
$$ -12803 24824 -513 -21235 14409 9100 -25630 3957 25788 -15815 -17512 19873 -658
2028f58j9361L6164n068l8236K5713K5824l6888k566L5932k2604k2669L7785K129
$$ -658 -20019 16145 11077 -27159 -1446 24378 -12510 -15076 20856 -1748 -24417 13368 15497
2041A5497l7854J9824K3474l7060l27M0526k0847k9246L3667N472l4431K0940
$$ 15497 -22357 -2533 20941 -16119 -16446 24080 3233 -26013 7654 13126 -21305 -365
2053c65K3556l9056n034M1653j5534k8467L2193M933l7813J9257K8813l4748p664
$$ -365 23191 -15865 -20899 20754 5220 -23247 8946 13879 -23934 -4677 24136 -10612 -18276
2066a8276L7747j6939k8291L5800R544m0162J2473K8832l0576o461L9043j7600
$$ -18276 19471 2532 -25759 10041 19585 -20577 -8104 20728 -9848 -16309 22734 5134
2078E134l3302L4007J4609l8041J1054K8328l2300r407M0981j2413l3319L0079
$$ 5134 -28168 5839 20448 -17593 -6539 21789 -10511 -19918 21063 8650 -24669 5410
2090E410J3138l7879J1097L3587l0493j5644L7619q901l1047L0997J4490m1333
$$ 5410 18548 -19331 -8234 25353 -5140 -20784 16835 7934 -23113 7884 22374 -18959
2102a8959O696L6136k5358j6243L5308q938l3002K9771J9076l9506L585L3960
$$ -18959 -12263 23873 -1485 -17728 17580 8642 -24360 5411 24487 -15019 -11434 22526
2114B2526k4436j8185L7645m324l5956K4938J9495l6300L648L5660k5573k1940
$$ 22526 -1910 -20095 17550 13226 -22730 2208 21703 -14597 -10949 24711 -862 -22802
2126b2802L7015L93l4492K2020J9342l6795J560L8654k2536k4320L4475J463l4617
$$ -22802 14213 14606 -19886 2134 21476 -15319 -13759 24895 2359 -21961 12514 13977 -20640
2139b0640K1325K2974l6121k247L6925j9568k4508L4816L225l7377J8472K5572
$$ -20640 685 23659 -12462 -14709 22216 2648 -21860 12956 16181 -21196 -2724 22848
2151B2848l3386l644L5589j9182k5923L5011O442l7333J5373K5918l2520n069
$$ 22848 -10538 -14182 21407 2225 -23698 11313 17755 -19578 -4205 21713 -10807 -15876
2163a5876L6888j6773k7618L2351Q148l6471J4362K8101l2514q525L6870j3317
$$ -15876 21012 4239 -23379 8972 17120 -19351 -4989 23112 -9402 -17927 18943 5626
2175E626k7597L0151Q838l7120J2862L0466k9859j1770L5534j1319k8274K9734
$$ 5626 -21971 8180 17018 -20102 -7240 23226 -6633 -18403 17131 5812 -22462 7272
2187G272J1225l7155J0164L0545k7488j3178L5227r048l0871K8417J3884l5649
$$ 7272 18497 -18658 -8494 22051 -5437 -18615 16612 7564 -23307 5110 18994 -16655
2199a6655P826L0339k6573j4312L5598o832l1201K4951J5565l4180O664L1029
$$ -16655 -8829 21510 -5063 -19375 16223 9391 -21810 3141 18706 -15474 -8810 22219
2211B2219k5857j6456L5331m480l1266K3058J6627l4094M172L2328k2929j8555
$$ 22219 -3638 -20094 15237 10757 -20509 2549 19176 -14918 -10746 21582 -1347 -19902
2223a9902L3881k839l1462K2024J8903l3505J169L2497k0928j9263L3095q24l3344
$$ -19902 13979 11140 -20322 1702 20605 -12900 -11731 20766 -162 -19425 13670 12846 -20498
2236b0498K0845K0808l2463q59L2404j9527k0510L2641J173l3265J8525K1394
$$ -20498 347 21155 -11308 -12167 20237 710 -19800 12841 14014 -19251 -726 20668
2248B0668l1215k338L3275j8061k2590L1502L262l3158J7180K2482l0540m355
$$ 20668 -10547 -12885 20390 2329 -20261 11241 14503 -18655 -1475 21007 -9533 -13888
2260a3888L3451j5453k3682K9879M870l2998J5130K3874k9499o254L3417j4422
$$ -13888 19563 4110 -19572 10307 15177 -17821 -2691 21183 -8316 -14570 18847 4425
2272D425k4444K8956O935l3248J2909K4841k8232p762L3034j2126k6108K7376
$$ 4425 -20019 8937 15872 -17376 -4467 20374 -7858 -15620 17414 5288 -20820 6556
2284F556R062l2443J0721K6080k7079j0165L3781j0298k6884K6048J0716l2374
$$ 6556 15618 -16825 -6104 19976 -7103 -17268 16513 6215 -20669 5379 16095 -16279
2296a6279R026K7176k5978j1087L2392q499k7539K5361J1975l2767P256K8083
$$ -16279 -7253 19923 -6055 -17142 15250 6751 -20788 4573 16548 -16219 -8963 19120
2308A9120k4366j3116L2057o446k8850K4106J3624l2342N943K8630k3392j4621
$$ 19120 -5246 -18362 13695 7249 -21601 2505 16129 -16213 -10270 18360 -5032 -19653
2320a9653L2210m874k9303K2901J5202l1947M063K9791k1862j6520L1827k824
$$ -19653 12557 7683 -21620 1281 16483 -15464 -11401 18390 -3472 -19992 11835 9011
2332I011k9978K1962J6506l1575K329L0196k0548j7624L1479j423l0511K0047
$$ 9011 -20967 995 17501 -14074 -11745 18451 -2097 -19721 11758 10335 -20176 -129
2344a29J8699l1336O05L0381j9075j9026L0986N61l0952J8226J9640l0156j223
$$ -129 18570 -12766 -12161 18220 -855 -19881 11105 11666 -19286 -1060 18580 -11576 -12799
2357a2799L1341j7780k0555L0352K163l1289J7091K1267l0017k978L1691j5489
$$ -12799 18542 762 -19793 10559 12722 -18567 -1476 19791 -10226 -13204 18487 2998
2369B998k2101K9296M212l2190J5656K2870k8260n676L1770j4344k3094K8819
$$ 2998 -19103 10193 14405 -17785 -2129 20741 -7519 -13195 18575 4231 -18863 9956
2381I956O341l3178J3173K4261k7337p035L2154j2377k5417K7662Q237l2002J1080
$$ 9956 16297 -16881 -3708 20553 -6784 -13819 18335 5958 -19459 8203 16440 -15562 -4482
2394d482K5530k6929r293L2851j0309k6127K5968J0067l2230R543K6667k6063
$$ -4482 21048 -5881 -15174 17677 7368 -18759 7209 17276 -14954 -5411 21256 -4807
2406d807j1363L2629q330k7105K4996J1552l3010Q310K7770k4941j2871L2215
$$ -4807 -16170 16459 8129 -18976 6020 17572 -15438 -7128 20642 -4299 -17170 15045
2418A5045o556k8336K3784J3640l2356N970K8738k3487j4702L2352m824k9488
$$ 15045 8489 -19847 3937 17577 -14779 -8809 19929 -3558 -18260 14092 9268 -20220
2430b0220K2536J5941l1680L544K9657k1754j6494L1791k448l0563K0819J7472
$$ -20220 2316 18257 -13423 -9879 19778 -1976 -18470 13321 10873 -19690 1129 18601
2442A8601l0945J569L0178k0075j8577L1206n52l0671J8626J9180l0404p91L0869
$$ 18601 -12344 -10775 19403 -672 -19249 11957 11405 -19266 -640 18540 -11864 -12655 18214
2455A8214j7551k0222K9393J698l0496J7045K0583k9475l204L1166j5276k1044
$$ 18214 663 -19559 9834 11532 -18964 -1919 18664 -10811 -14015 17151 1875 -19169
2467a9169K8884L387l0878J5036K2509k8088n298L1637j4059k2944K8325O168
$$ -19169 9715 13102 -17776 -2740 19769 -8319 -13617 18020 3961 -18983 9342 15510
2479A5510l1686J2899K3756k7685o808L2088j2762k4427K6595Q047l1360J1411
$$ 15510 -16176 -3277 20479 -7206 -14014 18074 5312 -19115 7480 15527 -15833 -4422
2491d422K4677k7200r272L2406r749k5348K5164R513l1705R800K6663k5088j1254
$$ -4422 20255 -6945 -16217 16189 6440 -18908 6256 15769 -15936 -6136 20527 -4561 -15815
2504a5815L1021q184k5906K5023J1446l1800P068K7344k3393j2186L1423p300
$$ -15815 15206 7022 -18884 6139 17585 -14215 -7147 20197 -3196 -15382 16041 8741
2516H741k7677K3149J4332l0986M836K7135k2796j3604L1314m212k8676K0398
$$ 8741 -18936 4213 18545 -12441 -7605 19530 -3266 -16870 14444 10232 -18444 1954
2528A954J5041k9829L736K8382k1379j6308K9906j754k8122J9556J6223l0309
$$ 1954 16995 -12834 -9098 19284 -2095 -18403 11503 9749 -18373 1183 17406 -12903
2540a2903J785K8981j8417j7330K9048r63k8988J8258J8718k8564j554K8694j6913
$$ -12903 -11118 17863 -554 -17884 11164 10201 -18787 -529 18189 -10375 -11929 16765 -148
2553a48j8411K9169J110l0305J5740K0107k7260k069K8495j6087k0008K8420K977
$$ -148 -18559 10610 11720 -18585 -2845 17262 -9998 -12067 16428 341 -19667 8753 11730
2566A1730k9437J4692K0269k7292m312K9921j3569k0934K6167M536k9570J4122
$$ 11730 -17707 -3015 17254 -10038 -14350 15571 2002 -18932 7235 11771 -17799 -3677
2578c677K1834k6601o506K9552j1801k1245K5963N484l0034J1878K2765k4895
$$ -3677 18157 -8444 -14950 14602 2801 -18444 7519 13003 -17031 -5153 17612 -7283
2590g283p220K9271j0975k2826K4393Q263k9114R893K3121k4459q623L0230q696
$$ -7283 -14503 14768 3793 -19033 5360 13623 -15491 -5598 17523 -6936 -15559 14671 5975
2603E975k4650K2947R372k8252R115K3953k3811j0858L0061o529k4847K1998J0762
$$ 5975 -18675 4272 13644 -14608 -5493 18460 -5351 -16209 13852 7323 -17524 4474 15236
2616A5236k8764P092K4878k1900j1451K8987n921k6142K1514J2915k8254M308
$$ 15236 -13528 -6436 18442 -3458 -14909 14078 8157 -17985 3529 16444 -11810 -7502
2628g502K5023k0480j2503K8932m422k6728J9728J4617k7770K571K5550j8552
$$ -7502 17521 -2959 -15462 13470 9048 -17680 2048 16665 -11105 -8534 17016 -1536
2640a536j4203K8025k533k7242J9295J5961k8073N73K7051j7097j5469K7422k074
$$ -1536 -15739 12286 9753 -17489 1806 17767 -10306 -9733 17318 221 -15248 12174 10100
2653A0100k7056J8134J7639k8071j022K7312j6262j6550K6878j43k7826J6541
$$ 10100 -16956 1178 18817 -9254 -10276 17036 774 -15776 11102 10959 -16867 -326
2665c26J8105k7874j391K8389j5576j8777K6230K142k7434J5949J8316k7955k948
$$ -326 17779 -10095 -11486 16903 1327 -17450 8780 10922 -16512 -563 17753 -10202 -13150
2678a3150K9528j3502k0073K5074L439k7735J4462K0082k6644m714K8836j2688
$$ -13150 16378 2876 -17197 7877 11316 -16419 -1957 18125 -8519 -13233 15603 2915
2690B915k1020K5620N839k8716J1391K0750k4642n068K9140j2351k3230K4972
$$ 2915 -18105 7515 13354 -15362 -3971 16779 -7863 -12931 16209 3858 -19372 5600
2702E600Q432k8496R556K1346k4268o793K9960j0034k4319K3438R451k8661Q947
$$ 5600 14032 -14464 -4908 16438 -7830 -14623 15337 5303 -19016 4422 13873 -14788 -5841
2715e841K3714k3222r873K8532p578k4090K3553J0684l0242O064K5224k0092j0930
$$ -5841 17873 -5349 -15222 13310 5732 -18358 5195 15879 -14363 -8299 16925 -3167 -14097
2728a4097K7701p283k4793K2309J3490k9930M245K5513j9867j2429K8614m712
$$ -14097 13604 6321 -18472 3837 17327 -12603 -8358 17155 -2712 -15141 13473 8761
2740H761k6406K0170J3969k8922M331K7016k0134j5735K8431j909k5538J9008
$$ 8761 -17645 2525 16494 -12428 -8097 18919 -1215 -16950 11481 9572 -15966 3042
2752C042J4079k9580K629K8659j7831j7235K7011q54k6388J8115J6615k8384k61
$$ 3042 17121 -12459 -9830 18829 998 -16237 10774 9920 -16468 1647 18262 -10122 -10383
2765a0383K8359j6986j7596K7972J057k9003J5417J8869k6745j014K8234j6735
$$ -10383 17976 990 -16606 11366 12423 -16580 -1163 17706 -9039 -10053 18181 1446
2777A446j9821K7996M178k9207J3329J9130k6063k867K9425j4158k1925K6163
$$ 1446 -18375 9621 13799 -15408 -2079 17051 -9012 -11879 17546 3388 -18537 7626
2789G626N538k8709J2504K1095k5484o290K9053j1405k1605K5355N811l0016J1255
$$ 7626 13164 -15545 -3041 18054 -7430 -13720 15333 3928 -17677 7678 13489 -16527 -5272
2802e272K3640k3874q230K7964j0130k2884K5275Q515l0425Q758K3784k2405r562
$$ -5272 18368 -5506 -13736 14228 4098 -18786 6489 15004 -15421 -6663 17121 -5284 -14846
2815a4846K9157q966k4010K3119J0079k9032P529K4253k2376j1264K8900n950
$$ -14846 14311 5345 -18665 4454 14533 -14499 -6970 17283 -5093 -16357 12543 6593
2827F593k4641K1019J0978k8685O562K5548k1111j3170K8343m321k5217K0162
$$ 6593 -18048 2971 13949 -14736 -8174 17374 -3737 -16907 11436 7115 -18102 2060
2839B060J3289k8699M036K6559j9827j4169K8159k988k6787J9036J5351k7875
$$ 2060 15349 -13350 -9314 17245 -2582 -16751 11408 8420 -18367 669 16020 -11855
2851a1855J975K6381j8748j5181K8498j113k7284J6906J6306k7060L13K7308j6942
$$ -11855 -9880 16501 -2247 -17428 11070 9957 -17327 -421 15885 -11175 -10862 16446 -496
2864d96j7203K7047J200k7705J5660J7926k6676j341K7481j4856j8254K5856K645
$$ -496 -17699 9348 10548 -17157 -1497 16429 -10247 -11588 15893 1037 -17217 8639 11284
2877A1284k7646J4285J9329k5404m021K7620j2805j9412K5155M272k7895J2475
$$ 11284 -16362 -2077 17252 -8152 -12173 15447 2642 -16770 8385 12657 -15238 -2763
2889b763K0266k4093n938K7634j1375k0472K4213N792k7538J0616K0849k3387
$$ -2763 17503 -6590 -12528 15106 3731 -16741 7472 13264 -14274 -3658 17191 -6196
2901f196o545K7774j0097k1918K3160P633k7536R215K2017k2668q290K8031q396
$$ -6196 -12741 15033 4936 -16982 6178 13811 -13725 -4510 17507 -5161 -13451 14580 6184
2914F184k2613K1929Q826k7153Q188K2588k2104r124K7120o826k2918K0867R854
$$ 6184 -16429 5500 14326 -12827 -4639 17949 -4155 -13279 13841 7015 -15903 4964 14818
2927A4818k7169O990K2988k0968j0703K7470n934k3680J9852J1768k6988M718
$$ 14818 -12351 -5361 17627 -3341 -14044 13426 7492 -16188 3664 15432 -11556 -6838
2939f838K4010j8997j2269K6567m188k4004J8652J3008k6520K791K4432j8157
$$ -6838 17172 -1825 -14094 12473 8285 -15719 2933 15941 -10579 -7788 16644 -1513
2951a513j3253K6288k681k4660J7268J4216k6553K004K4952j6586j5008K5543
$$ -1513 -14766 11522 8841 -15819 1449 15665 -10888 -8884 16068 -518 -15526 10017
2963A0017q16k5295J6406J5127k5706R9K5434j5213j6012K4780R31k5686J4928
$$ 10017 9201 -16094 312 15439 -10267 -10168 15266 53 -15959 8821 9752 -15934 -1006
2976a006J6592k4494j558K5433j4047j7451K4950K383k6204J3533J7713k4150
$$ -1006 15586 -8908 -10466 14967 920 -16531 8419 10802 -15402 -1869 15844 -8306
2988h306k876K6232j3280j8195K3756L776k6141J2337J8534k3556m378K6435j1798
$$ -8306 -11182 15050 1770 -16425 7331 11107 -15034 -2697 15837 -7719 -12097 14338 2540
3001B540j9185K2920N257k6278J1083J9619k3018n577K6433j0410k0289K3114
$$ 2540 -16645 6275 11532 -14746 -3663 15956 -7062 -12639 13794 3384 -16905 6209
3013F209O309k6352R775K0647k2119p013K6134q509k0974K1879Q096k6772P935
$$ 6209 12518 -13834 -4059 16588 -5531 -12544 13590 5081 -15893 5986 14082 -12690 -4755
3026d755K1860k1358q618K6635p697k2021K0824R268k6415O575K1898j9832j0012
$$ -4755 17105 -4253 -12871 13764 6067 -15954 4870 14138 -12277 -5702 16196 -3636 -13648
3039a3648K6281n819k3120J9786J0672k6028N249K2972j9373j1715K6127l716
$$ -13648 12633 6814 -16306 3480 14152 -11876 -6627 16345 -3028 -14743 11384 7668
3051G668k3572J8494J2057k5844L440K4152j7988j3054K5761k865k4213J7853
$$ 7668 -15904 2590 14647 -11197 -7757 16395 -1593 -14647 11114 8249 -15964 1889
3063A889J3297k6060K615K4093j7011j4120K5504j571k4962J6429J4847k5226
$$ 1889 15186 -10874 -8259 15834 -1177 -15297 10207 8636 -16326 103 14950 -10276
3075a0276L77K4907j5964j5000K4866J58k5714J5265J5986k4705j046K5851j4715
$$ -10276 -9899 15008 -956 -15956 8910 9068 -16646 -1381 14605 -10100 -11146 14705 -10
3088a0j7011K4729J609k5494J3871J7596k4682k676K6093j2912j8066K4396L021
$$ -10 -17021 7708 9317 -16177 -2306 15290 -9392 -12068 14025 1113 -16953 7443 10464
3101A0464k6141J2547J8997k3840m405K6269j1787j8637K3131M732k6474J0996
$$ 10464 -15677 -3130 15867 -7973 -12378 13891 2104 -16533 6598 11330 -15144 -4148
3113d148J9815k2775n940K6406j0040k0217K2414O637k6492R441K1125k1996p557
$$ -4148 15667 -7108 -13048 13358 3318 -16899 5515 12152 -14340 -4899 16226 -5770 -13327
3126a3327K6610q555k1096K1203Q253k6262Q332K1387k0735r123K6037o549k2320
$$ -13327 13283 4728 -16368 4835 13088 -13174 -4842 16545 -4190 -13313 12724 6175 -16145
3139a6145K0192J0124k5905N746K2371j9561j0459K6232m910k3641J9114J1687
$$ -16145 4047 14171 -11734 -5988 16383 -3178 -13637 12595 7685 -15956 3158 14845
3151A4845k5643M366K2585j8101j1908K5758l292k3651J7458J3088k5407K648
$$ 14845 -10798 -6432 16153 -1948 -13856 11902 8610 -15041 2417 15505 -9902 -7254
3163g254K3756j6806j3548K4918j855k4135J6743J3946k5477J239K4348j5924
$$ -7254 16502 -304 -13852 11066 9211 -14924 1819 15765 -9712 -8473 15875 -49
3175d9j4892K4911o12k4836J5451J5377k4040n34K4168j4729j5404K4228J049
$$ -49 -14941 9970 9358 -15478 -27 15350 -8690 -9224 14944 215 -15189 9039 10088
3188A0088k4622J3688J6276k3449k142K5246j3326j6906K2857K551k4480J2303
$$ 10088 -14534 -846 15430 -8019 -10161 15085 1759 -15147 7710 10261 -14219 -1916
3200a916J7880k3033m177K4967j1000j7939K1919M471k5324J0642J8933k1978
$$ -1916 15964 -7069 -11246 13721 2721 -15218 6701 11172 -14152 -3510 15423 -6555
3212f555n269K4223r589j8898K1504O351k5329R046J8994k0718o269K4992q375
$$ -6555 -11824 12399 2810 -16088 5416 11767 -13562 -4516 14478 -6240 -12509 12483 4108
3225D108k0033J9978P814k3963P482J9742k0244q269K5321o180k0494J8558Q397
$$ 4108 -15925 4053 11867 -12096 -4614 15128 -5116 -13385 11936 5756 -14738 3820 12217
3238A2217k4065O420K0888j8716j0224K4454n196k0435J7696J0224k4829N062
$$ 12217 -11848 -5428 15460 -3256 -13480 10974 5778 -14657 3039 13263 -11566 -6504
3250f504K1263j7437r959K3517m301k1670J6998J1735k3307K900K1143j6474j1101
$$ -6504 14759 -2678 -12637 10880 6579 -15091 1907 13642 -9665 -6765 14378 -2096 -13197
3263a3197K3932k525k2511J5841J2105k2701J799K2203j5310j2745K2982j424
$$ -13197 10735 8210 -14301 1540 13645 -9056 -7257 14946 -364 -13109 9873 8449
3275H449k1992J5202J3104k3222K29K2513j3402j3136K1928j035k2388J4220J4785
$$ 8449 -13543 1659 14763 -8459 -8230 14283 881 -12255 9673 8638 -13750 470 15255
3288A5255k2130j588K1771j2162j4125K1683J017k2918J2304J5300k1204k106
$$ 15255 -6875 -8463 13308 1146 -12979 8704 9721 -13197 -893 14407 -6797 -8903
3300h903K2833j1639j6090K0760L064k2179J0733J5475k1197l235K3491j0157
$$ -8903 13930 2291 -13799 6961 10025 -12154 -1421 14054 -7143 -10378 13113 2956
3312B956j6415J9067L989k1437R983J6260k0647m979K3362r109j7263J9441N402
$$ 2956 -13459 5608 9597 -11840 -1857 14403 -6244 -11223 12139 3030 -14233 5208 10610
3325A0610k2567Q288J7651j9282n663K2633q560j8208J9364P107k2565O219J7892
$$ 10610 -11957 -3669 13982 -5300 -10963 11670 3110 -15098 4266 11373 -11192 -4973 12919
3338A2919j7858o304K2358o842j8976J7488Q297k1825N418J8487j7612p925K2556
$$ 12919 -4939 -11243 11115 4273 -14703 2785 11082 -10743 -5325 13162 -4450 -12375 10181
3351A0181n461j9365J7463Q524k2255M556J9522j6268r393K1922m465j9340J6485
$$ 10181 4720 -14645 2818 11342 -10913 -6357 13165 -3103 -12496 9426 4961 -14379 2106
3364B106R882k2600L187J9931j4667j0472K1402l042j9948J5377J1337k2248K229
$$ 2106 11988 -10612 -7425 12506 -2161 -12633 8769 5727 -14221 1156 12493 -9755 -7526
3377g526K0566j4510j1728K1461j251k0284J4098J1996k1660N05K1807j3231j3678
$$ -7526 13040 -1470 -13198 8263 7012 -13272 826 12822 -8838 -8333 13474 243 -13435
3390a3435K0720N85k0291J2196J2863k0910k56K1667j2291j3854K0167J536k1020
$$ -13435 7285 7870 -12421 -225 12638 -8272 -8528 13139 848 -13006 7161 8697 -12323
3403a2323J1439J4126k0240k022K2036j1764j4652K0002L124k1651J0209J4873
$$ -12323 -884 13242 -6998 -9020 13016 1252 -13400 6602 9726 -11925 -1716 13157
3415A3157j9230l115K1884j0627j5582K0112L664k2023R369J6026j8964m010K1168
$$ 13157 -6073 -9188 12696 2069 -13513 6599 10263 -11760 -2391 13635 -5329 -9339 11829
3428A1829r053j6212J9290N279k2399Q191J6856j8200n630K1313q007j6910J8249
$$ 11829 2776 -13436 5854 11133 -11266 -3075 13781 -4419 -10049 11264 3257 -13653 4596
3441D596O055k1943P211J8148j7795p510K1939o583j7567J7483P380k2106N394
$$ 4596 10651 -11292 -4081 14067 -3728 -11238 10701 4118 -13449 4034 11414 -10692 -5298
3454e298J8762j6516q500K1393m402j8762J6248Q802k1624L982J8999j5239j0270
$$ -5298 13464 -3052 -11552 9841 5439 -13323 2925 11727 -9897 -5915 13084 -2155 -12425
3467a2425K1689l084j9461J4963J0175k1016K683J9702j4955j0845K1244j588
$$ -12425 9264 6180 -13281 1682 11857 -9159 -6476 13226 -1729 -12574 8670 7082
3479G082k0041J3851J1194k0634J585J9891j3911j1668K0525m00j9913J2448J2340
$$ 7082 -12959 892 12086 -8548 -6963 12928 -983 -12651 7874 7474 -12439 9 12349
3492A2349k0260J43K0125j1927j3061K0146O74k0506J1788J3218j9464j472K0286
$$ 12349 -7911 -7768 12357 430 -12631 7515 8189 -12317 -529 12689 -6775 -8247 12039
3505A2039j1077j3442J9391K041k0821J0010J4475j8891k884K0808r874j4334
$$ 12039 962 -12480 6911 8952 -11869 -1859 12616 -6275 -9159 11649 1775 -12559
3517a2559J8906L073k0826R557J5089j8624m185K0876q282j5521J8092M256k1049
$$ -12559 6347 9420 -11406 -1849 13240 -5384 -9569 11307 3025 -12496 5596 9852 -11197
3530a1197Q367J6101j7491n219K0171p185j5819J6695O097k0578O426J6335j6288
$$ -11197 -2830 13271 -4220 -9439 10732 3547 -12272 4423 10520 -10058 -3632 12703 -3585
3543c585o642K0358n738j6952J6058O900k0142N562J6660j5505p785K0297m398
$$ -3585 -10227 10131 4393 -12559 3499 10399 -9743 -4181 12479 -3026 -10811 9486 5088
3556E088j7345J5174P983j9926M105J7562j4529r036J9889l357j7627J3876R760
$$ 5088 -12257 2917 10900 -9026 -4921 12641 -1888 -10924 8965 5608 -12019 1857 11617
3569A1617j9656K462J7762j3512r628J9291j745j8421J2789J0601j9265J574J7926
$$ 11617 -8039 -5577 12185 -1327 -10955 8336 6591 -11830 959 11560 -7705 -6131 11795
3582A1795j2504j0737J9218j135j8505J2349J0815j9162O74J8508j1336j1612
$$ 11795 -709 -11446 7772 6637 -11868 481 11296 -7866 -7192 11316 -20 -11632
3594a1632J8630k28j8420J1453J1756j8303j187J9040j0449j2287J7898J537j9085
$$ -11632 6998 6770 -11650 -197 11559 -6744 -7931 11109 660 -11627 6271 7808 -11277
3607a1277J0268J2622j7536k156J8937r584j2935J7079K817j9093R124J3060j7130
$$ -11277 -1009 11613 -5923 -8079 10858 1274 -11661 5418 8235 -10858 -1734 11326 -5804
3620e804k867J8868q474j3672J6459L635j8570P957J3677j6122m567J9216p102
$$ -5804 -8671 10197 1723 -11949 4510 8145 -10425 -2468 11209 -4913 -9480 9736 2634
3633B634j4342J5821M980j9181O889J4780j5743n119J8803o185j4936J5420N353
$$ 2634 -11708 4113 9093 -10088 -3199 11581 -4162 -9281 9522 3337 -11599 3821 9174
3646I174j8484N324J5424j4666o193J8674n420j5619J4692O627j8180M370J5822
$$ 9174 -9310 -3986 11438 -3228 -9421 9253 3833 -11786 2906 9533 -8647 -4277 11545
3659A1545j4545p003J9050m077j6295J4010P293j8395L642J6178j3256q319J8253
$$ 11545 -3000 -10003 9047 4970 -11325 2685 9978 -8417 -4775 11403 -1853 -10172 8081
3672H081k976j5771J2335Q463j7772K267J6925j3017q759J7994j959j7009J2602
$$ 8081 5105 -10666 1669 10132 -7640 -5373 11552 -1465 -10224 7770 5811 -11198 1404
3685A404R189j7772J262J6795j1234r936J7806j000j7136J1512R670j7132O51
$$ 1404 10593 -7179 -5917 10878 -356 -10292 7514 6514 -10622 890 10560 -6572 -5921
3698e921J6593j0656j0590J7554m8j7111J0038J0688j6591p39J7305r814j1463
$$ -5921 10672 16 -10574 6980 6932 -10179 -141 10547 -6044 -6783 10522 708 -10755
3711a0755J6718J207j7958R931J1860j6994j536J7171q562j2666J6726K182j8241
$$ -10755 5963 7170 -10788 -857 11003 -5991 -7527 9644 1082 -11584 5142 7324 -10917
3724a0917Q718J3009j5970l136J7969q506j2600J6200L065j7753P106J3485j5411
$$ -10917 -2199 10810 -5160 -8296 9673 1167 -11433 4767 7832 -9921 -2815 10670 -4741
3737d741l812J7863p098j3900J5339M824j8258O441J3945j4841m815J8121o291
$$ -4741 -8553 9310 2212 -11688 3651 8475 -9783 -3342 10603 -4238 -9053 9068 2777
3750B777j4267J4824N197j7977N546J4635j4279n931J8011n204j5009J4441N964
$$ 2777 -11490 3334 8531 -9446 -3900 10735 -3544 -9475 8536 3332 -11677 2764 8728
3763H728j7472M212J5259j3582o968J8049m015j5734J3535P562j7706L526J5664
$$ 8728 -8744 -4532 10727 -2855 -9823 8226 4211 -11523 2012 9574 -8132 -4606 11058
3776A1058j3034q001J8279l255j5994J3067P974j7460K471J6398j2504q928J7631
$$ 11058 -1976 -9977 8302 5047 -10947 2120 10094 -7366 -4895 11503 -1001 -9929 7702
3789G702k001j5957J1625R389j7303J175J6710j1326r934J7103n63j6832J1042
$$ 7702 5701 -10256 1369 10758 -6545 -5370 11340 14 -9920 7183 6620 -10212 830
3802H30J0511j7309j29J7160j0365j0519J6796M45j7806J0548J1401j6670j116
$$ 830 11341 -5968 -6097 11063 698 -9821 6975 7420 -10386 162 11563 -5107 -6223
3815f223J6911r349j1539J6634J439j7497Q909J2200j6644k057J7698q657j2150
$$ -6223 10688 1339 -10200 6434 7873 -9624 -715 11485 -5159 -7216 10482 1825 -10325
3828a0325J5626K745j7551Q270J2558j6064l188J7904p274j3326J5430L342j7763
$$ -10325 5301 8046 -9505 -1235 11323 -4741 -7929 9975 2701 -10625 4805 8147 -9616
3841i616P074J3794j5322m116J7521o650j3736J4619N077j7482N598J3868j4387
$$ -9616 -2542 11252 -4070 -8186 9335 2685 -11051 3568 8645 -8837 -3239 10629 -3758
3854c758n324J7889n361j4848J4355N894j7654M572J4676j3526o323J7545m332
$$ -3758 -9082 8807 3446 -11402 2953 8847 -8807 -4235 10441 -3085 -9408 8137 3805
3867C805j5136J3073O983j7215L563J5483j3368p282J7370k894j5409J2410Q115
$$ 3805 -11331 1742 8725 -8490 -4927 10556 -2812 -10094 7276 4382 -11027 1383 9498
3880I498j7276K390J5359j1903q301J7402k102j6374J1977Q902j6681J478J5800
$$ 9498 -7778 -5388 9971 -1932 -10233 7169 5067 -11307 670 9572 -7109 -5631 10169
3893A0169j1112r418J6773p08j6222J0493R965j6591K50J6315r733j0483J6210
$$ 10169 -943 -10361 6412 5704 -10518 -25 9940 -6651 -6401 9914 181 -10302 5908
3906E908K26j6469J0361J0369j6274j190J6705q815j0773J5559J111j6891R046
$$ 5908 6134 -10335 26 10395 -5879 -7069 9636 821 -9952 5607 6718 -10173 -1127
3919a127J1333j5456j943J6802q228j1503J5031K720j6792P806J1782j5676k272
$$ -1127 10206 -5250 -7193 9609 1381 -10122 4909 7629 -9163 -1357 10425 -5251 -7523
3932g523J7092p258j2599J4606L180j6230O825J2500j4868l749J6845o125j2784
$$ -7523 9569 2311 -10288 4318 7498 -8732 -1907 10593 -4275 -8024 8821 2696 -10088
3945a0088J4159L843j6383O148J2891j3855m643J6906n915j3529J3797M994j6325
$$ -10088 4071 7914 -8469 -2321 10570 -3285 -7928 8978 3063 -10466 3331 8325 -8000
3958h000M583J3516j3573m999J6860m812j4147J3135O263j6513M009J3828j3103
$$ -8000 -3417 10099 -3474 -8473 8387 3575 -10572 2563 8826 -7687 -3678 10150 -2953
3971b953o045J6720l793j4083J2160O942j6782L290J4637j1700p414J5769k429
$$ -2953 -8998 7722 3929 -10154 2006 8948 -7834 -4544 10093 -1607 -9021 6748 4319
3984D319j4792J1893P879j6508K058J4738j0879p726J5992k432j5011J1156Q665
$$ 4319 -10473 1420 9299 -7209 -5151 9587 -1292 -9018 6974 4542 -10469 687 9352
3997I352j5743O91J5298j0254q998J5687n87j5482J0428Q838j5840Q55J5856j0179
$$ 9352 -6391 -5700 9598 -656 -9654 6033 5446 -10036 392 9230 -6610 -5755 10101 -78
4011g8r956J5241N24j5232R440R455j5612l44J6234q893j0328J4972Q84j5484
$$ -78 -10034 5207 5731 -9501 -61 9394 -6218 -6562 9672 779 -9549 5423 6307 -9177
4025i177Q567J0702j5127j726J6308q283j0822J4941J755j5764P490J0708j4020
$$ -9177 -610 10092 -5035 -6761 9547 1264 -9558 5383 7138 -8626 -1136 9572 -4448
4038d448j791J5780q017j1725J4877L455j6340O750J1647j4359k820J6507p130
$$ -4448 -6239 9541 1524 -10201 4676 8131 -8209 -1459 10188 -4171 -6991 9516 2386
4051B386j2117J4130L699j6112O145J2300j3516m233J6181n979j2606J3627M587
$$ 2386 -9731 4399 8098 -8014 -1869 10431 -3085 -7318 8863 2884 -9722 3905 8492
4064H492j6493N182J3130j2857n058J6002n063j2932J3174N347j6795M460J3704
$$ 8492 -8001 -2819 10311 -2546 -7604 8398 3335 -9597 3577 8924 -7871 -3411 10293
4077A0293j2552n679J5781l602j3640J1942O386j6320L465J4085j1830p051J6146
$$ 10293 -2259 -7938 7843 4241 -9399 2543 8929 -7391 -3926 10159 -1671 -8722 7424
4090G424k962j3819J1321O470j5567K307J5341j1728p921J5871k131j4421J1013
$$ 7424 4462 -9357 1964 8434 -7133 -4826 10515 -1213 -9134 6737 4606 -9815 1198
4103A198P840j5962J556J5368j0787q746J5962r32j5296R989Q843j5375Q98J4813
$$ 1198 9038 -6924 -5368 10000 -787 -9533 6429 5497 -9799 190 9033 -6342 -5444 9369
4117I369r688r527J5976m31j5517R012J0210j5206m03J5209q759j0471J5276J169
$$ 9369 -319 -9846 6130 5699 -9818 -806 9404 -5802 -6205 9004 245 -10226 5050 6219
4131F219j5747Q220J0640j4712j436J5894q437j0744J4679K235j6102P268J1761
$$ 6219 -9528 -1308 9332 -5380 -6816 9078 641 -10103 4576 6811 -9291 -2023 9738
4144I738j4497k642J5613o844j1624J4528L006j6484O861J2169j4191l032J5946
$$ 9738 -4759 -7401 8212 1368 -10256 4272 7278 -9206 -2345 9824 -4367 -7399 8547
4157H547o385j2217J3821L868j6252N833J3117j3678m864J6562n436j3116J3526
$$ 8547 2162 -10055 3766 7634 -8618 -2785 10332 -3346 -8210 8352 2916 -10200 3326
4170C326M883j6119M878J3486j3537n554J6548m307j3347J2313N779j6140M042
$$ 3326 8209 -7910 -3032 10454 -3083 -8637 7911 3604 -9743 2570 8349 -7791 -3749
4183c749J3873j2512o200J5914l409j3970J1669P270j6280L127J4550j1990p168
$$ -3749 10124 -2388 -8588 7326 3917 -10053 1616 8886 -7394 -4267 10283 -1707 -8875
4196h875J5815k228j4678J1138P881j5897J948J4779j1074p945J5871j121j5592
$$ -8875 6940 4712 -9966 1172 9053 -6844 -4896 9883 -1191 -9136 6735 5614 -9978
4209i978J0450Q611j5259Q94J5286j0406r220J5502m98j4826R647R457j5762j52
$$ -9978 472 9083 -6176 -5282 10004 -402 -9622 5880 5382 -9444 203 9660 -6102 -6254
4223f254J5503r146r858J5057O13j5606Q750J0552j5037j480J5840q266j0484
$$ -6254 9249 103 -9755 5302 5915 -9691 -941 9611 -5426 -6906 8934 668 -9816
4236i816J4463K032j6057P786J0979j4193k096J5540p420j1241J4261K715j5734
$$ -9816 4647 6679 -9378 -1592 9387 -4806 -6902 8638 1218 -10023 4238 6953 -8781
4249h781O767J1680j4166l279J6037o121j2116J3748L443j6070O269J2412j3506
$$ -8781 -2014 9666 -4500 -7779 8258 2137 -9979 3769 7212 -8858 -2589 9823 -3683
4262c683m031J5807n402j2419J2744M540j5870N372J2775j2909m726J5566m517
$$ -3683 -7714 8093 2691 -9728 3016 7556 -8314 -2942 9833 -3076 -7802 7764 3247
4275C247j3148J2458N525j5466L922J2790j1771n572J5582m030j2958J1552O604
$$ 3247 -9901 2557 8082 -7384 -3462 9328 -2443 -8015 7567 3537 -9421 2131 8735
4288H735j5821L282J3673j1494o595J5422k817j3785J1329P026j5348K188J3863
$$ 8735 -7086 -3804 9869 -1625 -8220 7202 4385 -9400 1929 8955 -6393 -4205 9658
4301I658j0630p336J4978j709j3900J0429P384j4968J615J3867r702p945J4549
$$ 9658 -972 -8308 6670 4961 -8939 1490 8874 -6094 -4479 9388 -314 -8259 6290
4314F290n93j4548R905Q257j5003P89J4480r262q839J4717j15j4206Q390R067
$$ 6290 5697 -8851 1054 9311 -5692 -4903 9577 315 -8524 6193 6078 -8128 262 9329
4328I329j4230l76J4669q531r447J4012N35j4156P866R843j3929j370J4794p734
$$ 9329 -4901 -5277 9392 861 -8586 5426 5961 -8195 -329 9514 -4415 -5785 9009 1275
4342A275r886J3534J689j4874P329J0398j3652j766J4519o768j0980J3793K452
$$ 1275 -8611 4923 6612 -8262 -933 9465 -4187 -5953 8566 1798 -9182 4611 7063
4355G063j5017O555J0883j3562k479J4908o160j1475J2653L906j5332O159J1303
$$ 7063 -7954 -1399 9484 -4078 -6557 8351 2191 -9284 3369 7275 -8057 -1898 9405
4368I405j2600l868J4484m968j1687J2023M269j4862M585J2511j2091m728J4451
$$ 9405 -3195 -7063 7421 2453 -9234 2789 7058 -7804 -3219 9292 -2799 -7527 6924
4381F924m206j2146J1841N022j5015M119J2571j1869n288J4795l448j2839J1279
$$ 6924 2718 -9428 2413 7435 -7580 -3461 9110 -2759 -8047 6748 3300 -9539 1740
4394A740N960j4871L261J2638j1137n891J4661k449j3488J0899O537j4717K473
$$ 1740 7700 -7171 -3910 8728 -2409 -8300 6361 3912 -9576 1323 7860 -6857 -4384
4407d384J3207j0546p089J4986j856j3445R727P499j4696J690J3480r720p562
$$ -4384 8823 -1723 -8812 6174 4318 -9127 600 8099 -6597 -4907 8573 -1147 -8709
4420h709J4596j281j4042J0051P885j4404Q28J3573q937q115J4502j029j4247
$$ -8709 5887 4606 -9436 615 8500 -5904 -5076 8497 -440 -8555 5947 4918 -9329
4433i329R093Q872j4227J14J3859q264r414J4391P53j4577Q449R193j3937j319
$$ -9329 -236 8636 -5591 -5477 8382 118 -9296 5095 5848 -8729 -280 8913 -5024 -6343
4447f343J4976p692r801J3327J506j4637P715J0077j3645k090J5044p017j0182
$$ -6343 8633 941 -8860 4467 5973 -8664 -949 9128 -4517 -6607 8437 1420 -8762
4460h762J3135K387j5212P124J0654j3135l179J5146o386j0940J2736L546j5238
$$ -8762 4373 6760 -8452 -1328 9326 -3809 -6988 8158 1772 -9168 3568 7114 -8124
4473h124O258J0962j2483l938J4847n009j1925J2526M170j5114N233J1759j2352
$$ -8124 -1866 9096 -3387 -7325 7522 2513 -9412 3114 7284 -7830 -2597 9162 -3190
4486c190m487J5149m506j2327J1599N182j4697L883J2575j1523n707J4664l551
$$ -3190 -7677 7472 2966 -9361 2238 7420 -7277 -3394 9181 -2342 -8049 6615 3064
4499C064j2400J1086O022j4674K654J3074j0703o296J4595k498j3389J0337P384
$$ 3064 -9336 1750 7772 -6902 -4248 8826 -1877 -8173 6422 3924 -9465 872 8256
4512H256j4651J829J3395j0161p239J4609j368j3962R670P957j4494J080J3776
$$ 8256 -6395 -4566 8829 -1332 -8571 6038 4670 -9292 378 8335 -6159 -5079 8697
4525H697r483p473J3564l48j3788Q995Q378j4199L53J3769q581q590J3886J43
$$ 8697 -786 -8259 5305 4957 -8831 164 8542 -5657 -5304 8465 -116 -8706 5180 5323
4539E323j4208Q924Q977j4133o56J4204p710r247J3374R33j3875P330R815j3289
$$ 5323 -8885 39 9016 -5117 -5773 8431 721 -8526 4848 5781 -8094 -764 9051 -4238
4553d238j858J4526p301r846J3308J885j4052O297J0630j3390k460J4723o056
$$ -4238 -6096 8430 1129 -8717 4591 6476 -7576 -1279 9351 -4039 -6499 8224 2168
4566B168j0735J2422L314j4265N684J0553j2058l402J4002m885j1271J1486M552
$$ 2168 -8567 3855 7169 -7096 -1412 9141 -2917 -6319 7683 2798 -8473 3013 7565
4579G565j4314M801J0976j1273m427J4334m395j1745J1526M605j4158L824J1648
$$ 7565 -6749 -1948 9028 -2245 -6672 7662 3267 -8478 3048 7653 -6505 -2681 8967
4592H967j1035m887J4451l876j2066J0724N653j4341L193J2221j0506o005J3868
$$ 8967 -2068 -6955 7496 3620 -8446 2278 7931 -6410 -3217 9004 -1502 -7507 6361
4605F361k398j2471R991O527j3896J991J2507r602o672J3534k136j2087R665O689
$$ 6361 3963 -8508 1483 8010 -5886 -3895 8612 -990 -7662 5872 3736 -8351 1314 8003
4619H003j3543J034J3079r350o968J3195j029j2634Q525P516j3283J053J2551
$$ 8003 -5540 -4506 8573 -777 -7745 5450 4421 -8213 312 7828 -5455 -4402 8149
4632H149q139q001J2611K06j3090Q098Q079j3304J52J2986p576q286J2328Q29
$$ 8149 10 -7991 4620 4826 -8264 -166 7913 -5391 -5239 7747 171 -8115 4213 5042
4646E042j2923O981Q662j2210j162J3190p069r186J2333J508j2921O434Q954j1907
$$ 5042 -7881 -900 7762 -4448 -5610 7580 511 -8675 3658 5166 -7755 -1321 7633 -4274
4660d274j623J3539o645r569J2104K476j3325N672R643j1703k317J3270n691j0221
$$ -4274 -5897 7642 997 -8572 3532 6008 -7317 -1645 7998 -3705 -6022 7248 1557 -8664
4674h664J2128K618j3100N129R993j1113k953J2675m827r958J0752L562j2972
$$ -8664 3464 6082 -7018 -1889 8104 -3009 -5962 6713 1886 -8072 2680 6242 -6730
4687f730M276J0485j0644l916J3376m532j0399J0767M064j3192L762J0914j0490
$$ -6730 -2454 8031 -2613 -6529 6847 2315 -8084 2683 6747 -6445 -2683 8231 -2259
4700b259m617J3270l613j0807J0034M809j2711K796J1176r482n531J2903k953
$$ -2259 -6876 6394 2781 -8026 2008 6817 -5894 -3098 8078 -1404 -6935 5968 3015
4713C015j1043R629N464j2961K576J1228q906o091J2474j659j1063Q562O105j2732
$$ 3015 -8028 1601 7065 -5896 -3320 7908 -998 -7089 5385 3726 -7337 1225 7330 -5402
4727e402J319J1981q532o629J2026n73j2012Q116P018j2519O34J2169p944p487
$$ -5402 -4083 7898 -634 -7263 4763 4190 -7822 294 7312 -5207 -4573 7596 -348 -7835
4741g835J2428n1j1827P125P435j1982k7J2188p492p632J1679M65j2020O906Q220
$$ -7835 4593 4542 -7285 -160 7275 -4707 -4734 7454 -38 -7670 4009 4474 -7546 -640 7580
4756G580j2141n86J2451p063q124J1739J316j2461O277Q733j2084j168J2882o329
$$ 7580 -4561 -5147 7304 241 -7883 3856 5172 -7289 -1012 7721 -4363 -5531 7351 1022
4770A022r256J1738J733j2273N281R057j0754k330J2507n423r169J0903K642j2599
$$ 1022 -8234 3504 5237 -7036 -1755 7302 -3452 -5782 6725 1302 -7867 3036 5678 -6921
4784f921M963R542j0562l582J2705m270r683J0593L257j2440L733J0622j0710
$$ -6921 -1958 7584 -2978 -6560 6145 1875 -7808 2785 6042 -6398 -2665 7957 -2753
4797b753l249J2496m002r885R583M166j2838L868J0929j0212m435J2776l299j0624
$$ -2753 -6002 6494 2492 -7393 2190 6356 -6482 -2614 8315 -1897 -6332 6444 3145 -7479
4811g479R283M800j2296K853J0723r340n315J2754k464j0903R000N238j2087K370
$$ -7479 1804 6604 -5692 -2839 7884 -1456 -6771 5983 3519 -7384 1616 6854 -5233 -2863
4825b863J0978r029n990J2604j854j1088Q225O310j1849R48J1634q510o112J1861
$$ -2863 8115 -914 -6904 5700 3846 -7242 983 7293 -4556 -3608 8026 -484 -6596 5265
4839E265n42j1862P830O917j1988K75J1662p545o831J1656K56j2100P060P610
$$ 5265 4723 -7139 691 7608 -4380 -4105 7557 12 -6819 4837 5093 -7007 53 7663
4853G663j1733k98J1747p119p488J1762N52j2031O570Q089j1278j188J1735o035
$$ 7663 -4070 -4368 7379 260 -7228 4534 5086 -6945 -375 7714 -3564 -4752 6983 948
4867I48q201J1086J469j1953N560Q475j0867j847J2115n405q669J0651K028j1748
$$ 948 -7253 3833 5302 -6651 -1091 7384 -3483 -5330 6785 1380 -7289 3362 5390 -6358
4881f358M734R213j0681k784J2492m972q942J0064L117j2318M387R136j0028l439
$$ -6358 -1624 7589 -3092 -5876 6616 1644 -7298 2766 5883 -6435 -2048 7088 -2940 -6379
4895f379J2204l514r747R629L507j1893L456R922r436m323J2109l346r655R038
$$ -6379 5825 2311 -7436 2193 5700 -6193 -2737 7185 -2251 -6574 5535 2189 -7466 1572
4909A572M619j1850K585J0029q542m853J1278j888j0627Q891M712j1304J882J0445
$$ 1572 6191 -5659 -3074 6955 -1587 -6440 4838 2950 -7677 1214 5926 -5378 -3496 6949
4923F949q488n164J1730j479j0646Q055N823j1740J498J0402p587n837J1207j178
$$ 6949 -1539 -6703 5027 3548 -7098 957 6780 -4960 -3462 6940 -647 -6484 4723 3545
4937C545j0551P416O059j1120O61J0971p353o317J0952o24j0413O873O558j1015
$$ 3545 -7006 410 6469 -4651 -3990 6981 -372 -6689 4263 3639 -6774 99 6657 -4358
4951d358Q0J0886o353p006J0590P16j1255O123P423j0554r13J1199n639p880J0411
$$ -4358 -4278 6608 255 -6751 3839 4555 -6700 -577 6846 -3708 -4621 6578 939 -6941 3470
4966C470R94j0837N736P535j0008j768J1280n351p558R826J728j1335N264P987
$$ 3470 4464 -6373 -637 6898 -3110 -4878 6402 1051 -6507 3319 5047 -6288 -1024 6963
4980F963r896k384J1301m352q552R742K375j1122M224Q760r798k513J1218m120
$$ 6963 -2933 -5317 5984 1632 -6920 2822 5197 -5925 -1701 7059 -2739 -5252 5966 1846
4994A846q497Q972K948j0675L559Q681r191l211J0725k974r017Q655L533j0746
$$ 1846 -6651 2321 5269 -5406 -1847 6834 -2357 -5568 5157 2183 -6834 1821 5354 -5392
5008e392K955R144q609m029J0846k653q944Q330L892j0867K668R140q161m174
$$ -5392 -2437 6707 -1902 -5931 4915 2262 -6682 1648 5540 -5327 -2659 6481 -1680 -5854
5022e854J0544k020r497Q023M559j0608J971Q988p536m771J0667j619r603P516
$$ -5854 4690 2670 -6827 1196 5755 -4853 -2882 6106 -1430 -6201 4466 2847 -6756 760
5036G60M876j0212J412R517p396n067J0429j126r917O928N831j0478P83R965o909
$$ 760 5636 -4576 -3164 6353 -1043 -6110 4319 3193 -6724 204 6035 -4443 -3660 6305 -604
5051f04n613J0245l42r740O244N626r701M1J0391o545o068J0118k14j0094N975
$$ -604 -6217 4028 3686 -6054 190 5816 -3885 -3844 6547 2 -6066 4052 3838 -6256 -281
5066b81O910r830q00J0347n993o454R638M69r689N196P109r695j185J0371n069
$$ -281 6629 -3201 -4001 6346 353 -6101 3537 4006 -5683 -487 6622 -3073 -4258 6113 1044
5081A044o740R083J074r833M851O861r102j444J0204m202p750Q729K348j0509
$$ 1044 -5696 3387 4461 -5372 -521 6340 -2762 -4206 5998 1796 -5954 2775 5123 -5386
5095e386M387P574q921j898R993l917q071Q920K525j0036L249Q131q608k636J0309
$$ -5386 -999 6575 -2346 -4244 5749 1832 -6239 2681 5206 -4830 -1581 6550 -2058 -4694 5615
5110E615l539q043Q153K993j0024L273Q230q371k944R745k732q499Q206L665j0528
$$ 5615 2076 -5967 2186 5179 -4845 -1572 6658 -1713 -4657 5088 2356 -6143 2063 5728 -4800
5125d800K776Q299p565l976R997k125q959P582M375j0303K106Q658p218m415J0226
$$ -4800 -2024 6275 -1290 -5266 4731 2606 -6353 1229 5604 -4699 -2593 6065 -1153 -5568 4658
5140D658k052q501O849M612j0029J719Q975p222m889R827o92r590P026M651r617
$$ 4658 2606 -5895 954 5566 -4463 -2744 6231 -991 -5880 3947 3255 -6335 691 5342 -4275
5155d275Q17R331o449n235R513l98r715O380N985r952L68R295n647o094R501k02
$$ -4275 -3458 5873 -576 -5811 3702 3304 -6411 -31 5954 -3998 -3630 5665 18 -6076 3425 3223
5171C223r447O058O208r906l4R677n462o169Q980J039r883M921O652q961j113
$$ 3223 -6224 -166 6042 -3864 -3898 5779 317 -5852 3128 4167 -5716 -795 5857 -3104 -4217
5186d217R839m936p033R111J500r797M625O867q962j539R981m154p186Q455K029
$$ -4217 5622 686 -6347 2764 4264 -5533 -908 5959 -3003 -4542 5439 1285 -5901 2554 4583
5201D583r812L760P355q284k056R823l887p868Q376K924r883L322P623p765k847
$$ 4583 -5229 -1469 5886 -2398 -4454 5369 1482 -6386 1990 4914 -4969 -1647 5976 -1789 -4636
5216d636R727l289q046Q073L166r592K463Q291p628l697R808k205q512P419L970
$$ -4636 5091 1802 -6244 1829 4995 -4597 -2134 6157 -1471 -5168 4640 2435 -6077 1342 5312
5231E312r767J931Q568o903m615R876j928q451P298L746r294J424Q694o863m451
$$ 5312 -4455 -2524 6044 -859 -5474 4402 2474 -5977 1321 5067 -4227 -2803 5891 -972 -5423
5246e423R340q54r188O954M792r684Q13Q817o027n304R500o72r088O207N438r340
$$ -5423 3917 3063 -6125 829 5621 -4063 -3250 5567 -460 -5764 3736 3064 -6024 183 5621 -3719
5262c719O91Q733n997n686R236L5r023N700N508r228J42Q950n179o094Q714P01
$$ -3719 -3028 5705 -292 -5978 3258 3293 -5730 -30 5478 -3750 -3608 5342 163 -5931 2783 3484
5278C484r257N222N866q243j091Q884m339o817Q729J213r167M355O411q271j046
$$ 3484 -5773 -551 5315 -2928 -4019 4865 526 -6291 2438 3651 -5516 -1161 5250 -3021 -4067
5293d067R001m403o632Q475J585r071L687O760p981j611Q906l608o719P848K108
$$ -4067 4934 531 -6101 2374 3959 -5112 -1425 5335 -2646 -4257 4649 1041 -5678 2170 4278
5308D278r411L381P026p439k217R031l455o840P641K572r133K917P338p296k959
$$ 4278 -5133 -1752 5274 -2165 -4382 4649 1194 -5646 1995 4567 -4566 -1649 5689 -1607 -4566
5323d566Q880k467p448P053L409r158K019P986o867l537Q818j655q095O939L918
$$ -4566 4314 1847 -5601 1452 4861 -4297 -2278 5708 -1159 -4696 4122 2467 -5628 1311 5229
5338E229r195J928P499o305l850Q972j741p697O184M243r202J502Q045n985m466
$$ 5229 -3966 -2038 5461 -844 -4694 4278 2537 -5160 1024 5267 -3935 -2433 5612 -373 -4839
5353d839Q781r14q016N513M454q226O48P922n300m656Q163j77q472N693M648q307
$$ -4839 3942 3028 -4988 525 4979 -3247 -2599 5323 23 -4633 3530 3353 -5119 574 5222 -3085
5369c085J13Q130n076m955Q455m70p803M778N108q013l36Q016m650m997P949L40
$$ -3085 -2972 5158 82 -4873 3582 3112 -4691 87 5195 -2818 -3154 4862 212 -4785 3164 3504
5385C504q254M229N927p963m81Q153m520n884Q101P43q440M026O022p358j518
$$ 3504 -4750 -521 5406 -2557 -3038 5115 595 -5289 2812 3555 -4885 -859 5163 -2195 -3713
5400c713Q474l769o348P746J724q826L597O505p928j377Q395l421o281P245K106
$$ -3713 4761 992 -5356 2390 4114 -4712 -1115 5390 -2538 -3915 4480 1059 -5222 2023 4129
5415D129q852L197O583o877k130Q320l174o709P159K374q385K858O817p017k720
$$ 4129 -4723 -1526 5057 -1820 -3950 4370 1196 -5513 1646 4020 -4365 -1507 5310 -1707 -4427
5430d427Q516k791o822P208K730q718K543P075o631l180Q307k135o923O449L120
$$ -4427 4089 1298 -5524 1684 4414 -4304 -1761 5314 -1317 -4497 3810 1675 -5248 1201 4321
5445D321q487K274P004o171l555Q239j473p285N918L819q286J432P610o165l845
$$ 4321 -4166 -1892 5112 -1059 -4614 3625 2152 -5133 785 4604 -3682 -2250 5360 -805 -4650
5460d650Q346q88q060N827M205q369Q42P819n314m484Q252m47p942N312M596p981
$$ -4650 3696 2808 -5252 575 4780 -3589 -2747 5072 -242 -4726 3526 3079 -4863 449 5045 -2936
5476b936M11P650n155m625P818Q8q282M813N199p855r1P814m583n342Q127L84
$$ -2936 -2525 5125 -30 -4655 3163 3251 -5031 -218 4981 -2874 -2965 4849 266 -5076 3051 3435
5492C435q292M618N427p723r75Q224m315n680P796J381q823L917O091p487j302
$$ 3435 -4857 -239 5188 -2535 -3510 4714 399 -5281 2515 3896 -4927 -1010 5081 -2406 -3708
5507c708Q100l550n907P172J583q150L300O217p142j633P896l103o336O993J882
$$ -3708 4392 842 -5065 2107 3690 -4460 -1160 5057 -2085 -3718 4178 1075 -5261 1732 3614
5522C614q094K804P062p352k438Q535k632o869P186J893q285K522P187o770k861
$$ 3614 -4480 -1676 5386 -1966 -4404 4131 1499 -5370 1816 3709 -4576 -2054 5133 -1637 -4498
5537d498Q518k339p177O453K939q205J883P125o132l420Q523j833p273O134L714
$$ -4498 4020 1681 -5496 957 3896 -4309 -2426 4699 -1433 -4853 3670 1837 -5436 698 4412
5552D412q493J876P490o015m156Q385j330p763O246L665p890R49P598n591m149
$$ 4412 -4081 -2205 5285 -730 -4886 3499 2169 -5594 652 4317 -3573 -2624 4974 -617 -4766
5567d766Q085j124p380N471M503p995K36P773n200m432P771j75p520M987M652
$$ -4766 3319 2195 -5185 286 4789 -3206 -2970 4803 -397 -4829 2942 2767 -4753 234 4886
5582D886p949J29P600m261n127P468L29p764M423N324p633o19Q016l911n576P372
$$ 4886 -3063 -2934 4666 405 -4722 2746 3075 -4689 -266 5058 -2575 -3194 4822 911 -4665 2707
5598B707M15p659M105N678p552p64P706l965n457P406J352q256L703N507o916
$$ 2707 3122 -4537 -432 5246 -2306 -3070 4636 671 -4786 2620 3972 -4284 -581 4926 -1990
5613a990j160P576k961o158O850J785q453L432O233o976j994Q224k669o464O541
$$ -1990 -3150 4426 1465 -4693 2157 3942 -4511 -1079 5154 -1822 -3816 4408 1739 -4725 1816
5628A816K194p637K489O332o384k524P782k159o286N871K713p973K177O799o182
$$ 1816 4010 -3627 -1138 5194 -1190 -3714 4068 1909 -4377 1494 4207 -3766 -1589 5210 -972
5643i72l396Q089k059o517N742L538q045J656O742n524l626P804j018p328N329
$$ -972 -4368 3721 1662 -4855 887 4425 -3620 -1964 4778 -746 -4372 3432 2414 -4914 415
5658D15L786p513J176P075n657l908Q223j114p351N214L654p300Q53P313n387
$$ 415 4201 -3312 -2136 4939 -718 -4626 3597 2483 -4868 346 4000 -3300 -2447 4866 -521
5673e21l905P557p30o875M523M595p702J41P284m760m304P387K73p868M619M771
$$ -521 -4426 3131 2401 -4474 49 4644 -3058 -2917 4367 -393 -4697 2690 2963 -4905 -286 4485
5689D485p182l80P761n034m095O908L57p583M594M864p256o98P777l996n203O944
$$ 4485 -2697 -3077 4684 -350 -4445 2463 2820 -4763 -169 4695 -2561 -3259 4518 522 -4681 2263
5705B263R12p494M119M939p109p12P328l639n245O943J241p928L392N761o823
$$ 2263 3175 -4319 -200 4739 -2370 -3082 4246 607 -4638 2305 3546 -4382 -990 4771 -2052
5720b052j513P675l215n614O652J232p204K864N725o124k049P576k707n856O303
$$ -2052 -3565 4110 895 -4719 1933 3165 -4039 -1175 4550 -1574 -3623 3953 1246 -4610 1693
5735A693K256q002K650O389o482k176P574k599n863N863K418p485K261O273o430
$$ 1693 3949 -4053 -1403 4986 -1496 -3672 3902 1303 -4560 1303 3721 -3764 -1503 4770 -1660
5750a660k065P575k052o260N597L012p929J857O620n840k918P714j548o657N516
$$ -1660 -3725 3850 1798 -4462 1135 4147 -3782 -1925 4695 -1145 -4063 3651 2103 -4554 962
5765I62L247p642J352O616n378l617P767q89p066N076L735p631R97O851m863m004
$$ 962 4209 -3433 -2081 4535 -843 -4460 3307 2418 -4648 428 4163 -3468 -2471 4380 -483 -4487
5781d487P292p06o786N008M156p511L6P452m854m029P091j75p574N069M351p071
$$ -4487 2805 2099 -4687 321 4477 -3034 -2998 4454 -400 -4429 2662 2487 -5087 -18 4333 -2738
5797b738k86P397m446m668P157J52p385M504M695o910p33P245l824m714O776Q72
$$ -2738 -3024 4373 -73 -4741 2416 2568 -4817 -313 4382 -2528 -3261 3984 160 -4554 2222 3094
5813C094p708M099N015o906j024P461l858m980O529J391p368L414N165o293j579
$$ 3094 -4614 -515 4500 -2406 -3430 4031 173 -4807 1722 3113 -4255 -841 4324 -1969 -3548
5828c548P715k904n988O718J225p279L000N744o374j979P189k450n945O691J764
$$ -3548 4167 1263 -4725 1993 3218 -4061 -1061 4683 -1691 -3670 3519 1069 -4876 1815 3579
5843C579p371K322O022o117k341Q000k545o040O048K479p780K159O479n974k886
$$ 3579 -3792 -1470 4552 -1565 -3906 4094 1549 -4491 1557 4036 -3744 -1585 4894 -1080 -3966
5858c966Q081k160o362N610K911p674J884O427n580l310P806j556o316N196L180
$$ -3966 4115 1955 -4407 1203 4114 -3560 -1676 4751 -829 -4139 3667 2111 -4205 991 4171
5873D171p483J195P100n391l469P266j094o334M815L716p679R76P040n157l880
$$ 4171 -3312 -2117 4983 -408 -3877 3389 2295 -4039 776 4492 -3187 -2211 4829 -328 -4208
5888d208P652q77p041M982L844p347M10P335m588m428P013K07p069L980M763p037
$$ -4208 3444 2567 -4474 508 4352 -2995 -2585 4750 162 -4266 2747 2954 -4115 -135 4628 -2409
5904b409n60P535m392m655O972P48p512L871M703o357j168P646l791n352P093
$$ -2409 -2969 4566 174 -4481 2491 3239 -4273 -402 4301 -2056 -3224 4422 631 -4721 2372
5919B372Q57p384L394N104o290j200P004l154n368O650J253p251L085N410o487
$$ 2372 3229 -4155 -761 4343 -1947 -3147 3857 703 -4665 1985 3238 -4013 -928 4482 -2005
5934b005j417P101k579n907O526J919p762K703N606n681k197P220k352n508N715
$$ -2005 -3422 3679 1100 -4807 1719 3638 -4124 -1421 4185 -1496 -3693 3527 1175 -4333 1382
5949A382K411p677K021O524o046k352P210j961n898N876K380p268J654O051n164
$$ 1382 3793 -3884 -1863 4661 -1385 -3737 3473 1512 -4386 1490 3870 -3398 -1744 4307 -857
5964h57k827P139j612o431N444L191p642J765O092m616l408P093j246o332M910
$$ -857 -3684 3455 1843 -4588 856 4047 -3595 -1830 4262 -354 -3762 3331 2085 -4247 663
5979F63L369o875Q16O368m928l191O820p88o349M504L832o931N23O450m132m130
$$ 663 4032 -2843 -2027 4341 -587 -3778 3042 2254 -4095 409 4241 -2690 -2167 4283 151 -3979
5995c979O590j94o502M239M318o884J8O834m412m099P132mp224L924M371o663
$$ -3979 2611 2417 -4085 154 4472 -2412 -2394 4440 28 -4071 3061 3057 -4167 -243 4128 -2535
6011b535k59O858l650m504O345Q17p161L664M717o076j066O396l023m682O414
$$ -2535 -2794 4064 414 -4090 2255 3072 -4089 -425 4292 -1784 -2850 3546 523 -4159 2255
6026B255K88o467L070N209o139j625O910k646n208N932J594p137L205N140n970
$$ 2255 2543 -3924 -854 4355 -1784 -3409 3501 855 -4353 1579 3173 -3964 -759 4381 -1589
6041a589j617O687k527n291N606J841o865K248N474n586j839O775k337n280N674
$$ -1589 -3206 3481 954 -4337 1269 3110 -3755 -1507 3967 -1619 -3458 3317 980 -4300 1374
6056A374K301p118J876N857n576k549P208k027n640N165K489p049K030N511n041
$$ 1374 3675 -3443 -1567 4290 -1286 -3835 3373 1346 -4294 871 3360 -3689 -1659 3852 -1189
6071a189k725O837j571n574N130K556o647J116N917m887l081P030j016o207M958
$$ -1189 -3914 2923 1352 -4222 908 3464 -3183 -2067 3850 -1037 -4118 2912 1896 -4311 647
6086F47K976o516R35O169m816k966O276o36o044M599L310o895O16O331m179l809
$$ 647 3623 -2893 -1958 4211 -605 -3571 2705 2069 -3975 624 3934 -2961 -2345 3986 -193 -4002
6102d002O947m56o488L890L674n991J41O134l987l605O213J83o607L834M202o220
$$ -4002 2945 2489 -3999 -109 3565 -2426 -2285 3849 -138 -3743 2470 2653 -3954 -120 4082 -2138
6118b138m03O520l819m004O132O93o999L787M535o363n51O379l420m577O225R32
$$ -2138 -2541 3979 160 -3844 2288 2981 -4018 -231 4304 -2059 -2610 3769 349 -4228 1997 2929
6134B929o601L360M498o041j005O795l143m625N852J391o766K899M557n780j044
$$ 2929 -3672 -312 4186 -1855 -2860 3935 792 -3833 2019 3410 -3356 -457 4100 -1680 -2724
6149b724O341k348n403N955J454o486K169N072n519j677O668k362n002N174K112
$$ -2724 3617 1269 -4134 1821 3275 -3211 -1042 4030 -1489 -3166 3502 1140 -3862 1312 3424
6164C424o519J794N666n563k218P024k081n533N468J908o486J896N271n281k272
$$ 3424 -3095 -1301 4365 -1198 -3416 3608 1527 -4006 1462 3370 -3116 -1220 4051 -1230 -3502
6179c502O424j105n809M580K702o245J341N648m799k789O527j158n936M703K740
$$ -3502 2922 1817 -3992 588 3290 -2955 -1614 4034 -765 -3554 2973 1815 -4121 582 3322
6194C322o182R68O037m573l367O531n93n876L808L656o467N53O020m226l465O279
$$ 3322 -2860 -1892 4145 -428 -3795 2736 2143 -3733 75 3731 -2736 -2183 3837 -389 -3854 2425
6210B425j84n902L878L458n948K01N823l997l564O197M36o547L893L613o034j0
$$ 2425 2241 -3661 217 3675 -2273 -2072 3751 -246 -3810 2387 2823 -3724 169 3782 -2252 -2262
6226b262N936l140m448O072M41o578L525M411n941l71N809l037m148N619J060
$$ -2262 3674 534 -3914 2158 2599 -3979 -454 3957 -1984 -2355 3454 417 -3731 1888 2948
6241B948o681L154M685n688j012O104k841m372N547J373o474K463M745n469j718
$$ 2948 -3733 -579 4106 -1582 -2594 3510 669 -3703 1844 3217 -3257 -794 3951 -1518 -3236
6256c236O583k226m749N305J158n890K143N040n417j483N886k107n025N338J669
$$ -3236 3347 1121 -3628 1677 2835 -3055 -912 4128 -1289 -2772 3114 1007 -4018 1320 2989
6271B989n848J410N239m930k091O171j389n392M997J991o049J332N325m581k502
$$ 2989 -2859 -1449 3790 -1140 -3231 2940 1551 -3841 1156 3147 -2902 -1570 3755 -826 -3328
6286c328N958j005n565M701K267n846J209N471m450l085O446j312n046M235K734
$$ -3328 2630 1625 -3940 761 3028 -2818 -1609 3862 -588 -3673 2773 1461 -3585 650 3384
6301C384o065O21N733l965l337O181p69n711L802L578n918L95M966l153l493N640
$$ 3384 -2681 -2060 3673 -292 -3629 2552 1783 -3928 -126 3452 -2466 -2071 2895 -258 -3751 1889
6317A889J3n743L677L527o062L97N836l539l531N425K45n774L313L541n256l68
$$ 1889 1902 -3841 -164 3363 -2699 -2302 3534 -5 -3536 1889 2134 -3640 -327 3214 -2042 -2410
6333b410N716l278l897N509N39n562K898L663m846r04N948k633m410N303R06n774
$$ -2410 3306 28 -3869 1640 2179 -3383 -485 3178 -1668 -2572 3376 743 -3667 1636 2542 -3232
6349c232K352M459n120r19N402k366m094N000J197n459K154M201m987j445N862
$$ -3232 -880 3579 -1541 -2460 2942 576 -3518 1482 2679 -2780 -626 3575 -1412 -2857 3005
6364C005j917m463M624J773o069K232M208m474j821N795j913m263M302K148n829
$$ 3005 1088 -3375 1249 3022 -3047 -815 3393 -1081 -2902 2893 980 -3283 1019 3167 -2662
6379b662J703M666m406k210N935j309n215M177K346n382J027M708m102k140N479
$$ -2662 -959 3707 -699 -2909 3026 1717 -3498 679 3025 -2357 -1330 3378 -724 -2864 2615
6394B615r56n149M161K295n164O19N034l897k447N432j207m636M083K556n607
$$ 2615 1659 -3490 671 2966 -2198 -1579 3455 -442 -2889 2543 1336 -3300 783 3339 -2268
6409b268N37N154l744k837N245l93m917L418L490o010M00N352l358l066M937k56
$$ -2268 -1731 3423 -321 -3158 2087 1694 -3223 195 3685 -2325 -1925 3427 69 -2997 1940 1684
6425A684m909L261L033m857j35N145l607k734M888L57n325L066L290n128k7N187
$$ 1684 -3225 36 3069 -1788 -1923 3222 -385 -3119 1769 2126 -3199 -133 3157 -1971 -1998 3189
6441C189l142l341M967M08n328K819L822n347k32N291k425m110N238O05n449K579
$$ 3189 47 -3294 1673 2081 -3247 -428 3394 -1953 -2185 3106 681 -3429 1809 2414 -3035 -456
6457d56L646m704q76N252k226l901M581J104n436K550L779m709j235N384j992
$$ -456 3190 -1514 -2390 2862 636 -3265 1316 2420 -3016 -466 3313 -1396 -2631 2753 761
6472G61m020M624J040n388K164M384m567j660N209j584m218M454J227m996J418
$$ 761 -3259 1365 2405 -2983 -819 3565 -1002 -2662 2547 963 -3255 1199 2426 -2570 -1152
6487a152M191l646j805N151j411m635M214K203n810J291M829m014k053N216j353
$$ -1152 3039 -607 -2412 2739 1328 -3307 907 3110 -2700 -1409 3420 -594 -2647 2569 1216
6502A216m525M105K144n357R85M693l506k532M930o14m699L730K393n122O77M682
$$ 1216 -3309 796 2940 -2417 -1432 3261 -245 -2777 2153 1539 -3160 570 2963 -2159 -1482 3200
6518C200l663k523N236m46m789L400K687n354O38M905l693k519M800j81m827L368
$$ 3200 -463 -2986 2250 1804 -2985 415 3102 -2252 -1614 3291 -402 -2921 1879 1698 -3129 239
6534B39K583m670L08M487k775l084M864J75n457L154L019m627l1M733k937l053
$$ 239 2822 -1848 -1540 2947 172 -2912 1952 2127 -3330 -176 2843 -1784 -1815 2918 -19 -3072
6550c072M857L33n236K415L769m714l31M662k373l757M909N55n036K327L819m603
$$ -3072 1785 2118 -3118 -703 3066 -1648 -1979 2683 310 -3447 1462 2017 -3019 -692 3127 -1476
6566a476j154N310k345l555M115R53m801K017L985m358j395N225j754m238M618
$$ -1476 -2630 2680 335 -3220 895 1848 -2953 -936 3049 -1309 -2704 2521 767 -3471 1147
6581A147J231n053K063L714m009j684M900j421m193M126J735n016J280M165l844
$$ 1147 2378 -2675 -612 3102 -907 -2591 2309 888 -3305 821 2556 -2460 -1180 2985 -859
6596h59j940N169j335m301L968J741n135J453M138l988j681N065r68m488L492
$$ -859 -2799 2370 1035 -3266 702 2443 -2692 -1239 2899 -1089 -2770 2295 1327 -3161 331
6611C31K439n150R47M514l400k717N135n37m623L325K696m942M38M735l442k629
$$ 331 2770 -2380 -1433 3081 -319 -3036 2099 1562 -3061 264 2960 -1982 -1544 3191 -251 -2880
6627b880M876n50m543L073K623m169m5M520k800k858M777k72m646K728L383m683
$$ -2880 1996 1446 -3097 -24 2599 -1570 -1615 2905 105 -2753 2024 1752 -2894 -166 3217 -1466
6643a466l14M430k507k914M382M16m595K416L210m465o45N013k683l073M553M65
$$ -1466 -1780 2650 143 -2771 1611 2027 -2568 -152 3058 -1407 -2052 2961 278 -2795 1758 2223
6659B223m768K087L719m533r44M730k068l293M237O75m730K387L157m080r97M755
$$ 2223 -2545 -458 3261 -1272 -2216 2514 446 -2847 1390 2065 -2665 -278 2879 -1201 -2198 2557
6675B557j960l621M237J138m990K229L346m228j027N007j954l621L583J530m656
$$ 2557 597 -3024 1213 2351 -2639 -410 2936 -1292 -2319 2688 734 -2887 696 2226 -2430
6690b430J595L884m006j355M591j269l839L416J956n007J442L633l465j544M669
$$ -2430 -835 3049 -957 -2312 2279 1010 -2829 587 2543 -2464 -1022 2611 -854 -2398 2271
6705B271j023m169L623J603m069O19L875l437j904M394o31l991L105K259m327
$$ 2271 1248 -2921 702 2305 -1764 -1145 2730 -707 -2611 1783 1152 -2839 266 2525 -1802
6720a802M49M124l412j945M599m46m454L047K554m458N32L974l063k311M170j06
$$ -1802 -1353 2771 -641 -2586 2013 1567 -2887 160 2714 -1744 -1212 2762 -301 -2612 1558 1452
6736A452m164K690K522m174N8M500l073k414M264J0m308K828K416m376L79L936
$$ 1452 -2712 -22 2500 -1674 -1616 2884 -189 -2603 1661 1671 -2637 191 2607 -1769 -1390 2546
6752B546k399k776L735O59m358K562K660l815l38M544k926k547L832O57m141J808
$$ 2546 147 -2629 1106 1765 -2593 -31 2629 -1186 -1524 3020 94 -2453 1379 2036 -2105 -297
6768b97K950m144j05M114k109l053L937O93m183J871L219m063q27M312j675l082
$$ -297 2653 -1491 -1596 2518 409 -2644 1293 1986 -2197 -326 2893 -1170 -1997 2315 640 -2442
6784b442L534Q18m198J655L278l678r57M285j690l054L477Q32m141J782L143l513
$$ -2442 1092 1910 -2288 -633 2645 -1033 -1990 2295 605 -2449 1028 1860 -2281 -499 2644 -869
6800h69j472M415j291l307L365J351m436J448L530l958j011M225r92l818L369
$$ -869 -2341 2074 783 -2524 841 2192 -2244 -796 2734 -1224 -2235 1990 998 -2820 549
6815E49J808m452Q90L828l562j418M416j035l469K542J996m175P20M067l137j980
$$ 549 2357 -2095 -1205 2623 -939 -2357 2059 1024 -2445 97 2093 -2082 -1362 2705 -432 -2412
6831b412M330p40l760K708K067m101N72L930k918k350M192J41m257K179K921m613
$$ -2412 1918 1178 -2582 126 2193 -1908 -1336 2594 -324 -2674 1518 1659 -2598 -419 2502 -2111
6847b111O41M098k886k235L965j05l972K552K580m388K89M081k755k149M054j07
$$ -2111 -1470 2628 -258 -2493 1472 1367 -2605 -53 2527 -1861 -1572 2509 -246 -2395 1659 1552
6863A552m252K410K789l868k58L880k443k437L678N60l990J911L175m018k82M261
$$ 1552 -2700 -290 2499 -1369 -1627 2253 -190 -2627 1051 1611 -2379 -468 2707 -1311 -1593 2668
6879B668k563k621L887O69m665K609K817l947q16M411j994k931L790O71m305K013
$$ 2668 105 -2516 1371 2040 -2625 -16 2801 -1146 -1962 2449 455 -2476 1314 1985 -2320 -307
6895c07L193l621j215M445j882l358L734J027l980J348L624l683j270M308j294
$$ -307 2886 -735 -1950 2495 613 -2745 989 2016 -1964 -616 3008 -675 -1945 2363 1069
6910A069l663L514J319m594J360M018l601j342M184j511l759L650J783m264J024
$$ 1069 -2594 920 2239 -2355 -995 3023 -578 -1920 2264 753 -3006 644 2427 -1837 -813
6925h13L429k970k029M279o87l760L262J787m376R25L478l071j758M162m65l761
$$ -813 2616 -354 -2383 1896 1209 -2551 711 2498 -1878 -953 2525 -546 -2304 1858 1393 -2368
6941b368K759J917m348O95L655k400k390M152m81l677K873K217m633M87M074k687
$$ -2368 391 2308 -2040 -1345 2310 -90 -2480 1672 1191 -2486 387 2604 -2029 -1542 2532 -155
6957a55k418M138O9m266K511K695m339K5M268k571k274L728K6l682K237K315l595
$$ -155 -2573 1565 1634 -2632 -121 2574 -1765 -1740 2528 -43 -2317 1411 1437 -2245 -8 2307 -1288
6974a288m18L959k199k915M160L72m101J897K925l849m74M261j900l231L704J085
$$ -1288 -1706 2253 54 -2861 1299 1671 -2430 -533 2392 -1457 -1931 2330 430 -2801 903 1988
6990A988m211J931K931l500j338M487j841k982L823J107m575J690K847l439r32
$$ 1988 -2223 -292 2639 -861 -2199 2288 447 -2535 1288 2395 -2180 -490 2357 -1082 -2014
7005b014M100j335l179L150J482m222J235L343l038j489L979j173l425L346J121
$$ -2014 2086 751 -2428 722 2204 -2018 -783 2560 -478 -1967 2012 839 -2586 760 1881
7020A881m084J265L378l165j106L682q77l483L102J469m365J243L823l281j472
$$ 1881 -2203 -938 2440 -725 -1831 1851 974 -2509 593 2062 -2303 -1060 2763 -518 -1990
7035a990L859o79l502K871J869m320O86L760k587k049L859r75k824K537J810m051
$$ -1990 1869 1190 -2312 559 2428 -1892 -1206 2554 -33 -2082 1777 802 -2022 515 2325 -1726
7051a726L32M032k623k157L930l75l735K572K107l809J98L515k425j997L586j06
$$ -1726 -1394 2638 15 -2142 1788 1413 -2322 250 2357 -1452 -1254 2261 -164 -2161 1425 1319
7067A319l618K371K222l831j97L877k143k476L927j12l809K415K146l598m39M160
$$ 1319 -2299 72 2294 -1537 -1734 2143 0 -2476 1451 1339 -2470 -55 2091 -1507 -1946 2214
7083B214k323k314L664M85m026J805K715l377o79L791j456l081L439J086m016
$$ 2214 -109 -2423 1241 1726 -2300 -495 2220 -1157 -1836 1955 499 -2582 857 1943 -2073
7098b073J768K620l762l68L837j723l003L551O71l604J270L173l532q30M269j895
$$ -2073 -305 2315 -1447 -1815 2022 299 -2704 847 1518 -2086 -816 2357 -1175 -2005 2264 369
7114C69l114L339J258l858J411K847l208j110L476j067k885L684M25l488J073
$$ 369 -2745 594 1852 -2006 -595 2252 -956 -2066 1410 343 -2542 1142 1567 -1921 -848
7129h48L140k904j352L899p15l641L217J157l741Q44L136k805j284L738r79l528
$$ -848 2292 -612 -1964 1935 1220 -2421 796 1953 -1788 -944 2192 -613 -1897 1841 862 -2666
7145b666L181J541l852R75L353k617k282M263q09l421K557K033m151R20L267k349
$$ -2666 515 2056 -1796 -821 2532 -85 -2367 1896 1087 -2334 223 2256 -1895 -975 2292 -57
7161e7j945L527l16l257K426J983l834K64L432k347j738L495k19l887K812K168
$$ -57 -2002 1525 1209 -2048 378 2361 -1473 -1209 2223 -124 -1862 1633 1414 -2473 339 2507
7177B507l955L31L512k204k389L720Ml939K468K060l340pL491k171k651M122j82
$$ 2507 -1448 -1117 2395 191 -2198 1522 1526 -2413 55 2115 -1225 -1232 2259 88 -2563 1559 1377
7194A377l759J977K585l617k03L841j860k553L214N20l709J838K675l329n93L700
$$ 1377 -2382 -405 2180 -1437 -1640 2201 341 -2212 1002 1522 -2187 -349 2326 -1003 -1596 2104
7210B104j732k858L641O22l941K019K446l377r54L917j560k602L247J066l923
$$ 2104 372 -2486 1155 1777 -2164 -145 2301 -1076 -2030 1887 327 -2275 972 2038 -1885
7225a885J323L281l761r33L827j517k666L081J156m051J813L115l331j504M062
$$ -1885 -562 2719 -1042 -1975 1852 335 -2331 750 1906 -2145 -332 2783 -548 -2052 2010
7240B010j398l351L299J501l992Q86L776l386j080L488j033l098L083J512l845
$$ 2010 612 -2739 560 2061 -1931 -1045 2731 -655 -1735 1753 720 -2378 705 2217 -1628
7255a628Q10L151k843j615L921j127l076K789J617l699N17L496k782j632L782
$$ -1628 -818 2333 -510 -2125 1796 669 -2407 382 1999 -1700 -1183 2313 -469 -2101 1681
7270A681k15m066K876K000l603R7L365k276k109L632o1l660K040K695l883j35
$$ 1681 1466 -2600 276 2276 -1327 -1230 2135 -141 -2250 1382 1321 -2339 -299 2396 -1487 -1622
7286a622L898k174k099L588j62l902K448K590l862l44M107k496k244L566L69l781
$$ -1622 2276 102 -1997 1591 1429 -2473 -25 2565 -1297 -1641 2466 -30 -2274 1292 1661 -2120
7302b120J815K785l816j75L512j626k448L117M60l397J332K991l372q49L619j553
$$ -2120 -305 2480 -1336 -1511 2001 375 -2073 1044 1504 -1893 -561 2430 -942 -1791 1828 275
7318B75k519L388M28l466J494K770l433p63L553j160k816L115R48l947J513K618
$$ 275 -2244 1144 1572 -1894 -400 2370 -1063 -1826 1727 567 -2249 866 1814 -2133 -620 1998
7334A998k894q96L520j581k496K909J300l989J419K653k726j042L554r07l104
$$ 1998 -896 -1792 1728 147 -2349 560 1860 -2129 -710 1943 -783 -1825 1729 822 -2282
7349b282K718J518l945Q27L353l241j177L799n32l493L076J449l999P76L128k575
$$ -2282 436 1954 -1991 -1164 2189 -1052 -2229 1570 1038 -2455 621 2070 -1929 -1153 1975 -600
7365f00j606L642l46l292K587J676m036R79L091k543j766L762p27l190K373K398
$$ -600 -2206 1436 1090 -2202 385 2061 -1975 -996 2095 -448 -2214 1548 821 -2369 4 2402
7381B402l785k05L710k431j553L054P8l605K424J712l516L23L175j669k196L190
$$ 2402 -1383 -1588 2122 -309 -1862 1192 1270 -2335 89 1801 -1715 -1392 1783 114 -2082 1108
7397A108ql402K398J944l157m84L767k083k116L178L08l534J728K603l416L4L173
$$ 1108 1100 -2302 96 2040 -1117 -1601 2166 83 -2033 1145 1453 -2081 -353 2250 -1166 -1132 2041
7414B041j501k511L039K02l256J699J974k655p51L508j182k445K657P52l323J299
$$ 2041 540 -1971 1068 1270 -1986 -287 1687 -968 -1719 1789 607 -1838 819 1571 -1752 -453
7430d53K690l211o78L945j596k563K965O51l633J488K627k784j019L114o53l169
$$ -453 2237 -974 -1652 2293 697 -1866 1099 1750 -1883 -395 2232 -552 -1571 1543 890 -2279
7446b279L028O90l340J208K711k598r65L577j175l079K829J290l489O00L272k835
$$ -2279 749 1439 -1901 -693 2018 -580 -1545 2032 857 -2222 607 1897 -1592 -992 2280 -555
7462e55j138L416j068k712K601J386l761P71L192k604j483L658j146k669K527
$$ -555 -1693 1723 655 -2057 544 1930 -1831 -1060 2132 -472 -1955 1703 557 -2112 415
7477D15J585l693O98L358k750j652L593l91l453K399J950l308J70L244k219k226
$$ 415 2000 -1693 -995 2363 -387 -2039 1554 1163 -2290 109 2059 -1249 -1079 2165 -54 -2280
7493b280L432l5l428K433J675l169K54L115j969j912L094N8l401J882K443l367
$$ -2280 1152 1117 -2311 122 1797 -1372 -1118 1997 28 -1884 1210 1268 -2133 -251 2192 -1175
7509a175M5L353k168k100L477l54l242K165K000l082r3L115j425k555L343J27
$$ -1175 -1130 2223 55 -2045 1432 1078 -2164 1 2001 -1081 -1174 1941 516 -2039 1304 1431
7525A431l297J397K659l329k13L596k070k305L346P84m084J594K952l610k14L197
$$ 1431 -1866 -469 2190 -1139 -1352 2244 174 -2131 1215 1999 -2085 -491 2461 -1149 -1363 1834
7541A834j112k686K728O50l097J333K574l202n42L143j389k161K787J067l481
$$ 1834 722 -1964 764 1414 -1683 -350 2224 -978 -1520 1623 234 -1927 860 1927 -1554
7556a554Q28K719k626j173L615j303k594K798J294l707R27K995k656j576L798
$$ -1554 -726 1993 -633 -1806 1809 506 -2088 710 2004 -1703 -776 2219 -437 -2013 1785
7571A785j067k906K834J054l338R71K911k866j441L469n18l336K719J478l409
$$ 1785 718 -2188 646 1700 -1638 -667 2244 -622 -2063 1406 888 -2448 271 1749 -1660
7586a660Q16K942k450j682L652p97l026K411J732l544M20L050j975j895L642p42
$$ -1660 -844 2098 -352 -2034 1618 821 -2205 206 1938 -1606 -1186 1864 -111 -2006 1636 894
7602H94k820K113J551l062l2L103j946j788L260j14l331J994K271l244k09L207
$$ 894 -1926 187 1738 -1324 -1356 1747 -199 -1987 1273 1159 -2172 -178 2093 -1151 -1360 1847
7618A847j769k081L252r8l158J672K465l063o39L298j553k112K790M39l099J579
$$ 1847 78 -2003 1249 1151 -2007 -335 2130 -933 -1572 1726 173 -1939 851 1290 -1809 -230
7634b30K223k897r06L824j880k166K999N39l533J758K177k937m52L048j026k571
$$ -230 1993 -904 -1810 2014 134 -2032 967 1506 -2027 -269 1908 -1029 -1481 1567 541 -2030
7650b030K706O63l075J485K623l221r46L622j286k858L199P56l277J454K069k421
$$ -2030 676 1339 -1736 -251 2372 -849 -1795 1827 541 -2317 882 1638 -1639 -185 1884 -537
7666e37j349L705j431k544L120P77l552R24L005k408j474L268n30l187L006J013
$$ -537 -1886 1819 388 -2156 964 1741 -1811 -887 2118 -290 -1764 1504 974 -2213 793 1806
7682A806l206N57K794k426j397L539r81l008K789J258k912J58L220k173j981L451
$$ 1806 -1400 -843 1951 -475 -1872 1667 686 -2322 467 1725 -1187 -1029 2191 18 -1963 1488
7698A488p92k586K008J692l188N17K866j987j887L123rl105K053K060l380j29
$$ 1488 696 -1890 118 1810 -1378 -861 2005 18 -1869 1254 1245 -1860 193 2253 -1127 -1256
7714a256L106j920j844L118j97k889J914J640k833o1L111j807j954L165l28k648
$$ -1256 1850 -70 -1914 1204 1007 -1882 32 1672 -1161 -1222 1889 82 -1872 1293 965 -1683
7730a683J396K328l194l30L245j614k064K746M19l098J693K241l135k82L113j197
$$ -1683 -287 2041 -1153 -1483 1762 148 -1916 830 1249 -1849 -156 2085 -1050 -1332 1781 584
7746E84k319K634O11k986R01K370k812p45L492j116k584K843N48k907J034K418
$$ 584 -1735 899 1510 -1476 -575 1795 -1017 -1762 1730 614 -1970 873 1421 -1486 -452 1966
7762A966k601o36K929j159k387K657P39l126J187K300k469q17L015j198k462K394
$$ 1966 -635 -1271 1658 499 -1888 769 1508 -1618 -431 1869 -600 -1417 1598 400 -2062 332
7778C32J262l165N68K947k407r97K773o40k454K291J207k989L03K898k256j450
$$ 332 1594 -1571 -1003 1944 -463 -1460 1313 673 -1781 510 1717 -1272 -969 1929 -327 -1777
7794a777L109n15k493K017J517l007N36K642k130j730L005m13k433K021J407l126
$$ -1777 1332 817 -1676 341 1858 -1149 -613 2029 -101 -1831 1174 761 -1672 349 1756 -1370
7810a370M73K807k067j352L020k67k802J409J975l127L05K895j658k073K759L39
$$ -1370 -897 1910 -157 -1509 1511 1244 -1558 -149 1826 -1301 -996 1899 241 -1832 927 1266
7826A266l083J533K010k804k36K947j479j715K375M82l218J898J857k779k40K945
$$ 1266 -1817 -284 1726 -1078 -1314 1633 154 -1561 814 1296 -1922 -24 1833 -946 -1186 1759
7842A759j579j996K651N48l040J538J741k679j39K742j334j839K500L28k770J449
$$ 1759 180 -1816 835 1383 -1657 -119 1622 -1057 -1196 1546 212 -1627 873 1201 -1569 -120
7858a20J768k482m27K540r58k421K983L52k815R49K216k234p06K663o43k592K285
$$ -120 1648 -834 -1261 1279 321 -2100 883 1235 -1580 -631 1585 -649 -1355 1308 665 -1927 358
7875C58J215l313J297J918j853j183K727r03k352K480J267l417R52K731k375j182
$$ 358 1573 -1740 -443 1475 -378 -1561 1166 263 -2089 391 1658 -1759 -807 1924 -451 -1633
7891a633K908n66k558K208J233l347J213K322k272j170K929n01k528J848J144
$$ -1633 1275 709 -1849 359 1592 -1755 -542 1780 -492 -1662 1267 766 -1762 86 1230
7906A230k620M83K415j890j420L304q91k504K024J575k878M77K633j927j499L037
$$ 1230 -1390 -907 1508 -382 -1802 1502 611 -1893 131 1706 -1172 -695 1938 11 -1488 1549
7922A549m24k734K080J355k868J1K846j737j668K844m06k641K104J304k840J78
$$ 1549 1125 -1609 471 1826 -1042 -1031 1815 78 -1590 1254 848 -1793 311 1615 -1225 -1047
7938a047K819j639k036K692L55k659J465J856k621k16K749j541j829K600M32k704
$$ -1047 1772 133 -1903 789 1144 -1515 -50 1806 -815 -1031 1718 177 -1652 948 1380 -1324
7954a324J450J757k495o26K906j353k486K966M30k699J222K007k581l68K774j006
$$ -1324 126 1883 -612 -1238 1668 315 -2171 795 1225 -1474 -252 1755 -826 -1194 1580 574
7970E74k448K476R61k970Q55K451k545p85K975r49k494K474Q01l102J337K374
$$ 574 -1874 602 1563 -1407 -552 1899 -646 -1431 1544 595 -1899 575 1376 -1726 -389 1985
7986A985k272q98K547p92k138K114J074l091Q79K333k175j139K688n27k480K269
$$ 1985 -287 -1185 1362 570 -1568 546 1620 -1471 -592 1741 -434 -1573 1115 588 -1892 377
8002C77R75k721N00K353j583j468K845o22k327K011J373k721K83K575k081j349
$$ 377 1352 -1369 -869 1484 -99 -1567 1278 656 -1671 340 1713 -1008 -725 1850 -231 -1580
8018a580K947o26k318J904J086k526M06K333j569k111L087j41k508J542K075l050
$$ -1580 1367 741 -1577 327 1413 -1113 -707 1626 57 -2054 1033 892 -1616 -74 2001 -1049
8034a049K63K649j920j748K810j35k634J791J494k350N3K652j673j806K536L44
$$ -1049 -786 1863 -57 -1805 1005 870 -1764 27 1521 -829 -776 1876 203 -1603 933 1277
8050A277k610J308J703k394l55K501j126j689K291j6k226J022K049k687k09K688
$$ 1277 -1333 -25 1678 -716 -1071 1430 304 -1385 906 890 -1336 -314 1735 -952 -1161 1527
8066A527j229j883K184P86k775Q77K206k140p62K352o68k174K082J166k840R41
$$ 1527 298 -1585 599 1385 -1390 -513 1693 -447 -1209 1143 475 -1699 383 1549 -1291 -350
8082c50K145k349o51K535p98k003K181N86k440P52J987j965j158K819r79k033
$$ -350 1795 -554 -1205 1330 532 -1471 710 1296 -1144 -392 1595 -370 -1528 1291 312 -1721
8098a721K042Q19k164O31J946k039j124K733r37j931K330O80k492O24K046j709
$$ -1721 321 1140 -1024 -393 1553 -486 -1610 1123 186 -1745 585 1265 -1227 -603 1443 -266
$$ [...]
##END NTUPLES=NMR FID
##END=
