##TITLE=1H_Pr 4599-22
 CDCl3, 8 sc, 
 29.4.2019
##JCAMPDX= 6.0         $$ Bruker NMR JCAMP-DX V2.0
##DATA TYPE= NMR FID
##DATA CLASS= NTUPLES
##ORIGIN= UXNMR, Bruker Analytische Messtechnik GmbH
##OWNER= root
$$ XWIN-NMR		Version 3.5
$$ Tue Apr 30 13:56:15 2019 Russian Standard Time (UT+4h)  she@DPX200
##.OBSERVE FREQUENCY= 200.1315
##.OBSERVE NUCLEUS= ^1H
##.DELAY= (6, 6)
##.ACQUISITION MODE= SIMULTANEOUS
##.ACQUISITION SCHEME= undefined
##.AVERAGES= 8
##.DIGITISER RES= 18
##SPECTROMETER/DATA SYSTEM= spect
##.PULSE SEQUENCE= zg30
##.SOLVENT NAME= CDCl3
##.SHIFT REFERENCE= (INTERNAL, CDCl3, 0, 15.7039)
##AUDIT TRAIL= $$ (NUMBER, WHEN, WHO, WHERE, WHAT)
$$ ##TITLE= Audit trail, XWIN-NMR		Version 3.5
$$ ##JCAMPDX= 5.01
$$ ##ORIGIN= Bruker BioSpin GmbH
$$ ##OWNER= she
$$ F:/spectra/data/she/nmr/H-F/1/audita.txt
$$ ##AUDIT TRAIL=  $$ (NUMBER, WHEN, WHO, WHERE, WHAT)
(   1,<2019-04-30 13:55:12.75 +0400>,<she>,<DPX200>,
      <created by zg, POWCHK disabled, PULCHK disabled
       configuration hash MD5:
       00 E9 B6 7A A2 85 ED C7 34 08 36 98 17 FE 4E 26
       data hash MD5: 16K
       44 CF F8 AF 53 91 2F 9F C9 1F 43 F2 2B 96 0C 7A>)
$$ ##END=
$$ 
$$ hash MD5
$$ 7C EF 3A E9 32 1A 13 7F 44 FE DA 14 C2 95 9D FE
##$RELAX= 
##$RELAX= 
##$RELAX= 
##$RELAX= 
##$RELAX= 
##$RELAX= 
$$ Bruker specific parameters
$$ --------------------------
##$DU= <F:/spectra>
##$EXPNO= 1
##$NAME= <H-F>
##$PROCNO= 1
##$TYPE= <nmr>
##$USER= <she>
##$AMP= (0..31)
100 100 100 100 100 100 100 100 100 100 100 100 100 100 100 100 100 100 
100 100 100 100 100 100 100 100 100 100 100 100 100 100 
##$AQSEQ= 0
##$AQ_mod= 1
##$AUNM= <au_zg>
##$AUTOPOS= <>
##$BF1= 200.13
##$BF2= 200.13
##$BF3= 200.13
##$BF4= 200.13
##$BF5= 200.13
##$BF6= 200.13
##$BF7= 200.13
##$BF8= 200.13
##$BYTORDA= 1
##$CFDGTYP= 0
##$CFRGTYP= 5
##$CHEMSTR= <none>
##$CNST= (0..31)
1 1 145 1 1 1 1 1 1 1 1 1 1 1 1 1 1 1 1 1 1 1 1 1 1 1 1 1 1 1 1 1 
##$CPDPRG= <>
##$CPDPRG1= <>
##$CPDPRG2= <>
##$CPDPRG3= <>
##$CPDPRG4= <mlev>
##$CPDPRG5= <mlev>
##$CPDPRG6= <mlev>
##$CPDPRG7= <mlev>
##$CPDPRG8= <mlev>
##$CPDPRGB= <>
##$CPDPRGT= <>
##$D= (0..31)
0 1.2 0 0 0 0 0 0 0 0 0 0.03 0 0 0 0 0 0 0 0 0 0 0 0 0 0 0 0 0 0 0 0 
##$DATE= 1556618112
##$DBL= (0..7)
120 120 120 120 120 120 120 120 
##$DBP= (0..7)
150 150 150 150 150 150 150 150 
##$DBP07= 0
##$DBPNAM0= <>
##$DBPNAM1= <>
##$DBPNAM2= <>
##$DBPNAM3= <>
##$DBPNAM4= <>
##$DBPNAM5= <>
##$DBPNAM6= <>
##$DBPNAM7= <>
##$DBPOAL= (0..7)
0.5 0.5 0.5 0.5 0.5 0.5 0.5 0.5 
##$DBPOFFS= (0..7)
0 0 0 0 0 0 0 0 
##$DE= 6
##$DECBNUC= <off>
##$DECIM= 24
##$DECNUC= <off>
##$DECSTAT= 4
##$DIGMOD= 1
##$DIGTYP= 9
##$DL= (0..7)
0 120 120 120 120 120 120 120 
##$DP= (0..7)
150 150 150 150 150 150 150 150 
##$DP07= 0
##$DPNAME0= <>
##$DPNAME1= <>
##$DPNAME2= <>
##$DPNAME3= <>
##$DPNAME4= <>
##$DPNAME5= <>
##$DPNAME6= <>
##$DPNAME7= <>
##$DPOAL= (0..7)
0.5 0.5 0.5 0.5 0.5 0.5 0.5 0.5 
##$DPOFFS= (0..7)
0 0 0 0 0 0 0 0 
##$DQDMODE= 0
##$DR= 18
##$DS= 0
##$DSLIST= <SSSSSSSSSSSSSSS>
##$DSPFIRM= 0
$$ [...]
##$SUBNAM2= <"">
##$SUBNAM3= <"">
##$SUBNAM4= <"">
##$SUBNAM5= <"">
##$SUBNAM6= <"">
##$SUBNAM7= <"">
##$SUBNAM8= <"">
##$SUBNAM9= <"">
##$SW= 24.9337058887773
##$SWIBOX= (0..15)
0 0 2 0 0 0 0 0 0 0 0 0 0 0 0 0 
##$SW_h= 4990.01996007984
##$TD= 16384
##$TD0= 1
##$TE= 0
##$TE2= 300
##$TE3= 300
##$TEG= 300
##$TL= (0..7)
0 120 120 120 120 120 120 120 
##$TP= (0..7)
150 150 150 150 150 150 150 150 
##$TP07= 0
##$TPNAME0= <>
##$TPNAME1= <>
##$TPNAME2= <>
##$TPNAME3= <>
##$TPNAME4= <>
##$TPNAME5= <>
##$TPNAME6= <>
##$TPNAME7= <>
##$TPOAL= (0..7)
0.5 0.5 0.5 0.5 0.5 0.5 0.5 0.5 
##$TPOFFS= (0..7)
0 0 0 0 0 0 0 0 
##$TUNHIN= 0
##$TUNHOUT= 0
##$TUNXOUT= 0
##$USERA1= <user>
##$USERA2= <user>
##$USERA3= <user>
##$USERA4= <user>
##$USERA5= <user>
##$V9= 5
##$VALIST= <valist>
##$VCLIST= <CCCCCCCCCCCCCCC>
##$VD= 0
##$VDLIST= <DDDDDDDDDDDDDDD>
##$VPLIST= <PPPPPPPPPPPPPPP>
##$VTLIST= <TTTTTTTTTTTTTTT>
##$WBST= 1024
##$WBSW= 4
##$XGAIN= (0..3)
0 0 0 0 
##$XL= 0
##$YL= 0
##$YMAX_a= 185875
##$YMIN_a= -225457
##$ZGOPTNS= <>
##$ZL1= 120
##$ZL2= 120
##$ZL3= 120
##$ZL4= 120
##$ABSF1= 10
##$ABSF2= 0
##$ABSG= 5
##$ABSL= 3
##$ALPHA= 0
##$AQORDER= 0
##$ASSFAC= 0
##$ASSFACI= 0
##$ASSFACX= 0
##$ASSWID= 0
##$AUNMP= <proc_1d>
##$AZFE= 0.1
##$AZFW= 0.1
##$BCFW= 1
##$BC_mod= 2
##$BYTORDP= 1
##$COROFFS= 0
##$CY= 11.3945322036743
##$DATMOD= 1
##$DC= 2
##$DFILT= <>
##$DTYPP= 0
##$F1P= 18.9103706918063
##$F2P= -1.10871071338519
##$FCOR= 0.5
##$FTSIZE= 0
##$FT_mod= 4
##$GAMMA= 1
##$GB= 0.15
##$INTBC= 1
##$INTSCL= 1
##$ISEN= 128
##$LB= 0.24
##$LEV0= 0
##$LPBIN= 0
##$MAXI= 10000
##$MC2= 0
##$MEAN= 0
##$ME_mod= 0
##$MI= 1.114404
##$NCOEF= 0
##$NC_proc= 0
##$NLEV= 6
##$NOISF1= 3.799351
##$NOISF2= 2.8
##$NSP= 1
##$NTH_PI= 0
##$NZP= 0
##$OFFSET= 15.70392
##$PC= 1
##$PHC0= -8859.813
##$PHC1= 23.20026
##$PH_mod= 1
##$PKNL= yes
##$PPARMOD= 0
##$PSCAL= 0
##$PSIGN= 0
##$REVERSE= no
##$SF= 200.130013532006
##$SI= 16384
##$SIGF1= 3
##$SIGF2= 2
##$SINO= 400
##$SIOLD= 16384
##$SREGLST= <1H.CDCl3>
##$SSB= 0
##$STSI= 0
##$STSR= 0
##$SW_p= 3612.71676300578
##$SYMM= 0
##$S_DEV= 0
##$TDeff= 0
##$TDoff= 0
##$TI= <>
##$TILT= no
##$TM1= 0
##$TM2= 0
##$TOPLEV= 0
##$USERP1= <user>
##$USERP2= <user>
##$USERP3= <user>
##$USERP4= <user>
##$USERP5= <user>
##$WDW= 1
##$XDIM= 8192
##$YMAX_p= 0
##$YMIN_p= 0
$$ End of Bruker specific parameters
$$ ---------------------------------
##NTUPLES= NMR FID
##VAR_NAME=  TIME,          FID/REAL,        FID/IMAG
##SYMBOL=    X,             R,               I
##VAR_TYPE=  INDEPENDENT,   DEPENDENT,       DEPENDENT
##VAR_FORM=  AFFN,          ASDF,            ASDF
##VAR_DIM=   8192,          8192,            8192
##UNITS=     SECONDS,       ARBITRARY UNITS, ARBITRARY UNITS
##FACTOR=    0.0002004,     1,               1
##FIRST=     0,             0,               0
##LAST=      1.6414764,     0,               0
##MIN=       0,             -225457,         0
##MAX=       1.6414764,     185875,          0
$$ Real data points
##PAGE= N=1
##DATA TABLE= (X++(R..R)), XYDATA
0@%%%%%lJ1j6J6j7K5l2M0m9N8p4R0j06J30j55J79k10K43k83L29l77M29m86N52
29B94o28P09p98Q95j000J120j252J393j548J718j905K114k341K589k866L176l521
46a851L907m344M843n422O098o898P865r065J0600j2642J5506j9849K7306m3573
60b7519J41921r1251j45371K53847n4698p7610J49780l6763k41151J45982J67293
71A84460j86795m5379J94076j30580j55454K02649O7076j98256O4262R0151j96967
82a10757J8598K69541j06124k23938J39026Q1774j35336J06989J06138k30615
92h4704m4527K54727m2347j64032J42449L2786k01218Q8181J78182j56708o6821
103f4032J70809r2139j49689K07331Q5943k34000j180J45367j11357j2831J89488
$$ plain form
0 0 0 0 0 0 0 -3 8 -8 8 -9 16 -16 24 -25 33 -41 49 -57 73 -82 97 -113 130 -153 176 -201 228 -258 294
29 294 -334 375 -423 472 -528 592 -660 733 -815 903 -1002 1112 -1229 1360 -1506 1670 -1851
46 -1851 2056 -2288 2555 -2867 3231 -3667 4198 -4867 5733 -6909 8597 -11252 16054 -27519
60 -27519 114402 23151 -122220 131627 76929 -681 149099 112336 -128815 17167 184460
71 184460 -2335 -47714 146362 15782 -139672 62977 130053 -68203 -3941 86210 -110757
82 -110757 -92159 177382 71258 -152680 -13654 68120 -67216 39773 145911 -84704
92 -84704 -129231 125496 83149 -80883 61566 94352 -106866 -18685 159497 2789 -64032
103 -64032 106777 14638 -135051 72280 158223 -75777 -76957 68410 -42947 -55778 133710
114A33710j18565k07143J79629J24412j80226J6145J27066j55946m9447K20750
124I0385m1379j81461J32672P0535j92302N7689J95456j39233j12936J61194k4892
135A5728j26071J68615O2981k42198J5081K13060r0378r6539J47775m9892j59611
146a41449J60607J07937k00220j592J68979j16849r0304J92188n529j81948R9662
157h518R1691j63661L6908J82597j39425j36057J81502L5042j51136Q8867P3292
168I1102j81178K0571J98374j04214j33720J53474J3481j59350J01892J09471
178A09903j71245j8234J67623r0714j06507J71153J5372j87860P4522J30055j34283
189d0215j5814J52657r9407j15652J76328M0007j79010N9989J19993j39268j9879
$$ plain form
114 133710 15145 -191998 -12369 112043 -68183 -52038 75028 -80918 -130365 90385
124 90385 49006 -132455 217 70752 -121550 -63861 131595 -7638 -120574 40620 15728
135 15728 -110343 58272 121253 -120945 -105864 107196 16818 -79721 68054 18162 -141449
146 -141449 19158 127095 -73125 -74717 94262 -22587 -112891 79297 73768 -108180 -8518
157 -8518 83173 -80488 -43580 139017 -408 -136465 45037 80079 -71057 17810 91102
168 91102 -90076 -69505 128869 24655 -109065 44409 57890 -101460 432 109903
178 109903 -61342 -79576 88047 -2667 -109174 61979 77351 -110509 -35987 94068 -40215
189 -40215 -56029 96628 -2779 -118431 57897 97904 -81106 -21117 98876 -40392 -60271
200f0271J68652q0032j30420J48858L6733j69126O8174J28923j49046m9401J63605
211G6649n6615j21745J38611K9526j77401O3483J44193j37053n9141J57225n1373
222F359j23977J39656M7373j71778M9701J41964j26222n6390J63258m1679j33829
233a05564J27856N9031j59795M3952J38800j26088o4669J63712l0167j39456J13770
244B1382O4032j56498L2061J37598j18372p1718J56416k4279j40801J05332P1085
255G6238j51337K2410J37670j08201p5099J53323j4607j40848R9675P9545j44808
266f6039J3087J40335r5650p8144J46156p326j39117R4180Q6270j42133K694J39593
278I3906q7846q3188J41997r99j43871Q4421R1361j36344o070J37396q2779r0461
$$ plain form
200 -60271 108381 28349 -102071 46787 83520 -85606 -17432 111491 -37555 -86956 76649
211 76649 20034 -101711 36900 66426 -110975 -47492 96701 -40352 -99493 57732 6359
222 6359 -117618 22038 69411 -102367 -52666 89298 -36924 -93314 69944 28265 -105564
233 -105564 22292 81323 -78472 -34520 104280 -21808 -86477 77235 47068 -92388 21382
244 21382 85414 -71084 -39023 98575 -19797 -91515 64901 40622 -100179 5153 76238
255 76238 -75099 -52689 84981 -23220 -98319 55004 40397 -100451 -776 78769 -66039
266 -66039 -52952 87383 -8267 -86411 59745 52419 -86698 7482 93752 -48381 -45687 93906
278 93906 6060 -77128 64869 63870 -80001 4420 95781 -40563 -46633 90763 7984 -82477
290h2477J37937Q491j42762P4883R2820j33958j0786J42604p4851r9175J31646
301D4372J8028j40195P0836R8178j31502k0770J43441o3305j01142J25345K1995
312F5281j40074O4114J04024j25542k8342J40111n8186j03839J22147L0288j41113
323g1131N3478J06063j17120l3805J37472n0978j07753J14331L8012j36178M6134
334b1475J06962j12756l9766J36543m1937j09996J07411M2753j33487L8680J10263
345H3195j04875m7247J31650l3616j10225J00909M7925j31157L0826J12316r8421
356a8720n2537J28897k6748j12380R5443N4119j28565K2399J14998r1659n8304
367g3057J26029j9690j13994R0004O0203j26528J5482J16263q5855o2610J24680
$$ plain form
290 -82477 55460 63951 -78811 -3928 88892 -45066 -55852 86752 11901 -87274 44372
301 44372 62400 -77795 -6959 91219 -40283 -61053 82388 19083 -82059 43286 65281
312 65281 -74793 -10679 93345 -32197 -60539 79572 21386 -82453 39694 69982 -71131
323 -71131 -17653 88410 -28710 -62515 74957 23979 -83774 30557 68569 -67609 -21475
334 -21475 85487 -27269 -67035 69508 27571 -82425 24986 67739 -65748 -27068 83195
345 83195 -21680 -68927 62723 29107 -81118 19791 67716 -63441 -32615 79701 -18720
356 -18720 -71257 57640 30892 -81488 13955 68074 -60491 -38092 76906 -14753 -73057
367 -73057 52972 33282 -80712 9292 69495 -57033 -41551 74712 -11143 -73753 50927
378E0927j3464j17319Q4078O7519j23319P853J17454p9607o8357J22500m887j18799
390g5421P6566P2390j19717J775J18976p3811p4185J18506K900j19901P0056P6404
402G4538j16890o182J19412o6539p8335J12842Q685j19238O3061Q0015j11360
413c9991j3016J18149n9164q1797J09089J6165j18258N5357Q4810j04639j9439
424e2734J17629n0982q4634J04092K3516j16000M7778Q7455r9552k4787J15783
435F7564m5295q8943R8863K9607j15343L9247Q8322r5256l1218J14184l9088r3385
447g0741R1425L4965j12602L3989R0450r3085l7934J14957l0033r4738Q7001L8825
459E2479j11971L0643R7882q7041m4851J11729k2833r3616Q4923M5090j13222
$$ plain form
378 50927 37463 -79856 4222 71741 -51578 -43725 73729 -5878 -74235 48265 43378 -75421
390 -75421 1145 73535 -46182 -44407 74569 758 -73427 45079 47979 -71922 -1866 74538
402 74538 -42352 -48534 70878 4339 -73996 38846 47531 -71707 -8646 71369 -39991
413 -39991 -53007 65142 5978 -75819 33270 49435 -68823 -13466 71344 -33295 -52734
424 -52734 64895 13913 -70721 33371 56887 -59113 -11335 76120 -23432 -48219 67564
435 67564 22269 -66674 32189 61796 -53547 -14300 74022 -21234 -52452 61732 22644 -70741
447 -70741 20684 55649 -56953 -22964 67486 -25599 -63533 51424 21391 -73347 13654 52479
459 52479 -59492 -28849 69033 -18008 -62859 48870 26037 -67579 17344 62434 -50788
470e0788K1516J00294p8920m7469J09654k1632j00212Q0383N3773j09268J2898
481b9771R6802p8543n2030J11819j1912j04611O8922N4404j03532J2820J00546
492F4914p5238o1918J06348j558r8302O6800N5900j06369M373J06474o0112o3468
504f2156R6804k508r9218O6766O8230j01448r690R8272n4542n8186R9742K049
516D4115j08208N3373P3723q9801r624R5258n6767o9296R8955J7243j01791M4442
528h378O7431r1939j1576J05839m4442p7374Q3986J7650r4859M9767P4846r5652
540b4701k8943J03450l0926p1896Q1706J5423j04414M1821Q5034q3443l2133R5350
552D6328l5873p7013Q7613L1455j02681K6449P8139p8671k4770J06054l2164r1326
$$ plain form
470 -50788 -29272 71022 -7898 -55367 54287 32655 -67557 12826 66599 -42669 -29771
481 -29771 67031 -11512 -63542 48277 36365 -68246 676 55080 -48452 -35632 64914
492 64914 -10324 -72242 34106 32548 -65754 1046 56946 -49423 -45050 61424 1312 -62156
504 -62156 34648 32140 -67078 -312 67918 -33530 -43220 55052 510 -57676 42066 44115
516 44115 -64093 -10720 63003 -26798 -36422 58836 2069 -67227 31728 48971 -52820 -8378
528 -8378 59053 -32886 -44462 61377 16935 -60439 23547 41197 -53662 -3895 70951 -24701
540 -24701 -53644 49806 18880 -53016 28690 44113 -60301 -18480 66554 -16889 -49022 46328
552 46328 10455 -66558 21055 52510 -50171 -23722 54417 -24254 -49024 57030 24866 -66460
564f6460P5785M2716q9128K7361P5473q4163l4276J09590j7607q8983O6939L7247
576E4494r3517K4222Q5398p3893m4778R4721j8541q5693P2692M5075r9799N859
588c3760Q3150n9335l8012R1671k2423r3416P0153N8424r1284R13Q0916n7883
600a0886m1310R4862q476r0350O1173N5327q8977K702R0646n2315n4334Q3380
612D1442j265q1076O0324N1786r7452n659R5790m4097o0560P5222o80q3530N5771
625F016N5722r4536j0247R4508m4631o4853P7531J0838q3578M5876N5951q7527
637c8930o448R8718m2602p2114P7377K2350q1154L9108N8173q1378r910R5932
649E9122m0836p3872P9702K7201q7938K7776O1831p2198j3666Q9213m3639p7439
$$ plain form
564 -66460 9325 52041 -37087 -9726 65747 -18416 -52692 56898 39291 -49692 17247 54494
576 54494 -39023 -14801 70597 -3296 -48074 46647 28106 -57587 15105 60180 -39619 -33760
588 -33760 49390 -9945 -47957 43714 21291 -72125 -1972 56452 -34832 -33919 46997 -10886
600 -10886 -52196 42666 34190 -56160 5013 60340 -28637 -25935 64711 12396 -41938 41442
612 41442 40177 -40899 19425 71211 -26241 -31900 63890 19793 -40767 34455 33775 -49755 6016
625 6016 61738 -32798 -43045 51463 6832 -58021 19510 30348 -53230 -7354 48597 -38930
637 -38930 -45378 53340 10738 -61376 16001 38351 -42803 -3695 54478 -26900 -36810 59122
649 59122 18286 -55586 24116 51317 -36621 -8845 52986 -19212 -32878 56335 12696 -64743
661f4743P9866L5017r0552J7139O3680o6693j8544Q6906l5352p5667P4754L3090
673C8901r0916J9064P6219o1133l2903P7848k3524o3520P5828L0334r9748J2852
685d0698Q7045m8213l7939O8723k3583o5378P5076L8623r5017N432Q0395n2073
697g607l9280P9157j0780p4719N4456L6735q0980J7469Q3126o3791n7870Q1989
709A7905J0383o5770M4977K6958q5995J8725R5295n4136o4119P1653P391o8461
721d5194N1383M3158q4135j151Q0747m7608m7990Q4405K777r1216L6555N9372
733D1103o0063L30O5632o1696n2237R7224K2856r0286J9947N0400n9606N937Q0212
746E9753n0866o5790P6259K0667p6010L6391N6778p5871k1647P9178k3674m9170
$$ plain form
661 -64743 15123 50140 -40412 -23273 40407 -26286 -44830 42076 6724 -68943 5811 38901
673 38901 -52015 -32951 43268 -17865 -50768 27080 3556 -59964 15864 46198 -53550 -40698
685 -40698 46347 -1866 -39805 28918 5335 -60043 15033 53656 -41361 -35929 44466 -7607
697 -7607 -46887 32270 21490 -53229 1227 37962 -43018 -25549 57577 -6214 -64084 17905
709 17905 28288 -37482 7495 34453 -51542 -32817 62478 8342 -55777 15876 23267 -45194
721 -45194 6189 49347 -34788 -35939 44808 -2800 -50790 33615 36392 -54824 -18269 41103
733 41103 -18960 -18630 47002 -14694 -66931 30293 53149 -37137 -17190 33210 -26396 -20459 59753
746 59753 8887 -56903 19356 40023 -35987 404 57182 -18689 -40336 38842 15168 -34002
758c4002O6352L51r1948M0202Q0202o1690l7171N9717k8297m2759P9014J3703
770D3674r6416J9713P1484n2410k1077P3243l0269o6673O3961L1193o9305K5309
782g573N7190p2824k9361R1987l384o7634M0695J7167o7920L8095P4063p2636
794b135m8884P5882o51n5615N2752K0710q4350J4874P5543m9461l5101P0826j9199
807A5191p4193N8404M8827o9902p46N5444n4295k4478R1035q247q7639L8947M8182
820C6530n6981J2261O2666o0078m4441Q2462P141o9819M0675L7446p5510L260
832b4388P8810l7841m7698O1278o059o8565N4421N3188p8536j8385O7638k8885
844D978l5470O8096o718q1821M0392N9732o0847j2623O4036m0020m7320P2436
$$ plain form
758 -34002 32350 32701 -59247 -19045 61157 -533 -37704 22013 -6284 -49043 29971 43674
770 43674 -52742 -33029 38455 -13955 -35032 38211 7942 -58731 5230 36423 -32882 -7573
782 -7573 49617 -23207 -52568 39419 36035 -31599 9096 26263 -41657 -3562 70501 -2135
794 -2135 -51019 24863 24212 -31403 21349 42059 -42291 -27417 48126 -1335 -36436 34390 15191
807 15191 -59002 -598 48229 -21673 -22419 33025 -21270 -45748 45287 37040 -50599 -11652 36530
820 36530 -20451 -8190 54476 -5602 -50043 32419 39560 -30259 10416 47862 -27648 -24388
832 -24388 54422 16581 -31117 30161 24102 -44463 9958 63146 -15390 -33775 33863 4978
844 4978 -30492 37604 30886 -50935 -10543 49189 -11658 -24281 39755 -265 -47585 24851
856B4851J4336p3113K7875M6838o4959n575P9149l1806o1596N6211J7419o2310
868c2680L4793M9352p2558k0314P8694j8918n4565N4231J1411p2446L0464O1576
880D9040n9971k5738O8324k3835n5043O2960K4029p5892J5104N7499n2549j7915
892c3987P2638k5174o6574N6780L3528o7317J4029N5423n7427k5300P7170j3277
904B0512o5903M8244K9798o8407J6258O4168n3143l5464O9283q075o1102N0940
916G109L1867p3571P189O7735m3333l5068O5650q921o4426M8712L9787o8660J452
929b4478O3842m2674l6017O8094k606o7595M0434M0916o4129J203O5040m1316
941G14m2973O5614M478o5122L6816M0543o4276k828O8554l6367m5997O1826O099
$$ plain form
856 24851 39187 -33926 -6051 40787 -24172 -29747 49402 17596 -44000 12211 29630 -32680
868 -32680 2113 51465 -21093 -41407 37287 18369 -36196 18035 29446 -43000 -12536 49040
880 49040 -10931 -36669 31655 7820 -47223 15737 39766 -36126 -21022 36477 -16072 -33987
892 -33987 38651 13477 -53097 3683 37211 -30106 -16077 39346 -18081 -43381 33789 20512
904 20512 -45391 2853 32651 -35756 -19498 44670 -8473 -43937 25346 17271 -43831 7109
916 7109 38976 -34595 -27406 40329 -3004 -38072 27578 18657 -45769 2943 42730 -25930 -24478
929 -24478 39364 -3310 -39327 28767 26161 -41434 -1000 39916 -24213 -23010 42030 714
941 714 -42259 23355 27833 -37289 -473 40070 -24206 -27034 41520 5153 -40844 20982 27081
954B7081o5371L6431M5094o4109q382O7485l1934m6017O1180P902o7786L2494
966e932M9270o0724j1620O6471l0279m8400O1081J2445o8725K8523N0246n8742
978a6386j4092O8289k8119n1654N9002J6083o8142K5616N2216n8298j7230O8156
990C5441k3767n3445N5835J8952o8360K2377N4638n5498k1530O7461k0089n4913
1002d2898N3585K2139o7545J8255N5890n1906k3605O6208j6776n6720N1731K5954
1014C4312o6242J4256N6914m8596k6776O5842j2629n7992M7727K9463o4536J0198
1026a8059N8039m5886l0119O4629q955n9342M3960L2211o3602O583N9302m3025
1038d264l3928O3398m626o0710M0724L5114o1843K687O0835l9962l6634O2336
$$ plain form
954 27081 -38290 -1859 43235 -20874 -29256 38229 6295 -39722 21458 29360 -38426 -5932
966 -5932 43338 -17386 -29006 37465 7186 -41214 19867 32312 -36413 -7890 42356 -16386
978 -16386 -30478 37811 9692 -41962 17040 33123 -35019 -9403 42813 -15485 -32715 35441
990 35441 11674 -41771 14064 33016 -35344 -12967 41671 -13827 -35357 32104 12015 -42898
1002 -42898 10687 32826 -34719 -16464 39426 -12480 -36085 30123 13347 -43373 8358 34312
1014 34312 -31930 -17674 39240 -9356 -36132 29710 17081 -40911 6816 36279 -28257 -18059
1026 -18059 39980 -5906 -36025 28604 19649 -39693 4267 36478 -27124 -20541 38761 -4264
1038 -4264 -38192 25206 20580 -40130 594 35708 -26135 -23448 37387 -2575 -39209 23127
1050B3127j250o0970L8508L8236o1559r55O3451l7285m0101O1319L194o2680L5873
1063a092M0990o0215m845O3473l3898m2768N9695O337o3492L1929M4132n8802
1075a8556q208O3733l0383m5778N7660J0418o3164K8294M5605n6654j1583O4036
1087C5420k6479m7876N4893J3566o2841K5026M8560n4903j5862O3411k2495m9142
1099c8722N2715J6929o3652K0781N0523n0433j9634O2329j9120n0926N0271K1477
1111C2538o2777J6911N1756m8288k2472O2928j4656n3191M6726K4018o1213J4459
1123a3261N3728m6646k6824O1473j0860n3671M5114K5604o2420R790N6424m2785
1135d334k9464N9451r977n6147M3964L1502o2099N193N5138m0557k9573O1445
$$ plain form
1050 23127 21877 -39093 -585 37651 -23908 -24863 38588 1303 -38798 22521 25715 -36965 -1092
1063 -1092 39898 -20317 -25162 38311 4413 -38355 21340 27677 -35815 -3886 40246 -18556
1075 -18556 -26764 36969 6586 -39192 18468 28886 -34278 -5984 39621 -17033 -28616 35420
1087 35420 8941 -38935 15958 29524 -33317 -8291 40269 -14634 -30496 32915 10420 -38722
1099 -38722 13993 30922 -32730 -11949 38574 -11859 -31493 30836 11716 -39210 11061 32538
1111 32538 -30239 -13328 38428 -9860 -32332 30596 15940 -37251 9475 33493 -27720 -13261
1123 -13261 40467 -6179 -33003 28470 17610 -36061 9053 34657 -27763 -17973 38451 -4334
1135 -4334 -33798 25653 15676 -40471 3493 34995 -27104 -21911 33227 -7330 -36903 24542
1147B4542o078n8868L8969L4244n7868M577N7483l9871l5361O0665O10n6754L6343
1160B633L4231n9751N51O1474l3539l8609N4931N64n7326L6709L9137n9448p632
1173b6075N8561l0047l7019N5506L148o2445K9690M3266n2374p464N6559l1368
1185f2m2607N7165J2895n8710K3125L8993n1575n804O3357k5682m9355M8722J5773
1198B6235n3715K5795M2273n5232j4715O1747j8126m4446M7148J1842o1205K2481
1210i918N0413m6968j9084N3963k2797m4655N4278J9992o3852J0782M6761m1548
1222a2633j3474N8467k2730n3963M8188K6483n5790J3961M5103m8505k0624O3160
1234B7643j0286n0460M0792J8721n9042J8020N7320m4337l1756N2590q633m2777
$$ plain form
1147 24542 18464 -40404 -1435 32809 -25059 -20482 37001 -2870 -38231 22434 23044 -33710 2633
1160 2633 36864 -22887 -22336 39138 5599 -33010 21921 22485 -34841 1868 41005 -18443 -26075
1173 -26075 32486 2439 -34580 20926 24074 -38371 -8681 34585 -17789 -25253 31306 -62
1185 -62 -42669 14496 27391 -31319 -8194 30799 -20776 -26580 36777 11095 -38260 10462 26235
1198 26235 -27480 -1685 40588 -14644 -29359 32388 14262 -30184 16964 28806 -32399 -9918
1210 -9918 40495 -6473 -25557 28406 5609 -39046 15232 35224 -28628 -17846 28915 -12633
1222 -12633 -26107 32360 9630 -44333 3855 30338 -25452 -11491 33612 -14893 -35517 27643
1234 27643 17357 -33103 7689 26410 -32632 -14612 42708 -1629 -33385 19205 10572 -32205
1246c2205M7343K0554o7083P077N8630l4118k6982N1435j3523n2493M4810L2721
1258C6166n7700K922M9261l9947k7482O1812r01n7392K9008K8168m9636J1709
1270a4012N5279m3986m0981N7073Q872m8179K8803K5480n7440M116O1627l1378
1282E274l8746M9417J279n3375L4328L9838n2765q587M9469k8552k9951N9057
1294B6686K813o5599K3405M4840m0389n560M7685l5304l8167N9607J4655o0274
1306b5602J8642L8422m6988o953N7673k4631m3650M6433R838n5156K7894M6357
1318D2279n3416k1698N5131j3016l5609M5632M943o2229K4878N5046m4506k3897
1330b6462M9891j5904l9373M9072J5819n9670J6012M6899m4039j8417N9315j3139
$$ plain form
1246 -32205 15138 35692 -31391 -24314 34316 198 -26784 24651 11128 -41365 3445 36166
1258 36166 -21534 -18612 30649 -9298 -36780 25032 24131 -33261 -4253 23915 -25721 -14012
1270 -14012 41267 -2719 -43700 13373 22245 -25934 2869 28349 -29091 -24975 36652 5274
1282 5274 -33472 15945 17224 -36151 -1823 38015 -14750 -23337 26132 -2420 -32371 26686
1294 26686 29499 -36100 -12695 32145 -8244 -13804 33881 -1423 -39590 20017 34672 -25602
1306 -25602 -6960 31462 -15526 -22479 35194 10563 -33087 13346 23184 -31972 -4078 42279
1318 42279 -11137 -32835 22296 9280 -26329 19303 24246 -37983 -13105 41941 -2565 -26462
1330 -26462 23429 7525 -31848 17224 33043 -26627 -10615 36284 -7755 -26172 33143 20004
1342B0004n1727L7627K2090m8131J7411M2921n1162k4753O3193l361n1008L0840
1354C944J9557m9814J6462M8603m4499k8727N6394m727m9974L6554K6853n2803
1366b2177N047M6728l5495k2666N6025q646n6577L5768L6003m7680p57M3607l4990
1379e810k3755N7165m023n7540L1706L5357m9102j423M8317l1138l0411N1460
1391B0803j769n3227L3798L5325n3685p244N3291k4222l2487M6226o42n2143L3623
1404b353L8205n3897j0343N4947k1721l5420M5301L616n0838K9623L7716n2439
1416a7603j0304N6662k0331m0420M3077J0031m9948K4617L7642m9824j1030N6417
1428B8986j9517m3391M3010J4586m9780J8355L7886m5520j1363N6241j9197m6797
$$ plain form
1342 20004 -31723 5904 27994 -20137 -2726 40195 -10967 -35720 27473 24112 -26896 3944
1354 3944 23501 -26313 -9851 38752 -5747 -34474 21920 17193 -32781 3773 30626 -22177
1366 -22177 -17130 29598 -5897 -28563 27462 18816 -37761 -1993 34010 -13670 -14427 29180 -5810
1379 -5810 -29565 27600 23577 -33963 -2257 33100 -16002 -17425 30892 -246 -30657 20803
1391 20803 19034 -34193 -395 34930 -18755 -25999 27292 3070 -29417 16809 16167 -35976 -2353
1404 -2353 35852 -18045 -28388 26559 4838 -30582 14719 18335 -32503 -2880 34836 -17603
1416 -17603 -27907 28755 8424 -31996 11081 21112 -28836 -4219 33423 -16401 -27431 28986
1428 28986 9469 -33922 9088 23674 -26106 -7751 30135 -15385 -26748 29493 10296 -36501
1440c6501M2372J9819m8903J3847L8397m2532j4130N5378j5738m7076M0483K1294
1452B6710n1347J1962M3389l8878j8883N0695j3149m4221M1862K2646n5053O730
1464a7537M6510l3310j9467M7877j3879m5932M2061K6291n3166L995M5411l3921
1476e067k1665N1342q540m8045L5032K5880n0928P257M8159l5428k9076M9412
1488A8333j701m4343L3630K2675n3386N598N2481l0581l2212M5807j695m5194
1500c0588L3663K9067n1631j359M9097k8381k8919M8871k14n0522K7643L1824
1512B8551m4506q22M7334l1229l3421N0111P284m9063K1791L0242m4328j618N0989
1525C1315k6687l7526M4600Q441m6865K3932L3518m6405q946N0278j9904l4836
$$ plain form
1440 -36501 5871 25690 -23213 -9366 29031 -13501 -27631 27747 12009 -35067 5416 26710
1452 26710 -24637 -12675 30714 -8164 -27047 23648 10499 -33722 8140 30786 -24267 -17537
1464 -17537 28973 -4337 -23804 24073 10194 -35738 6323 32614 -20552 -16557 28854 -5067
1476 -5067 -26732 24610 16070 -31975 3057 28937 -21991 -14734 33425 -2003 -31079 18333
1488 18333 16632 -27711 5919 28594 -24792 -19194 33287 2706 -29506 16301 14606 -30588
1500 -30588 3075 32142 -19489 -20848 28249 -132 -29051 19820 19606 -30916 -3273 28551
1512 28551 -15955 -16777 30557 -672 -34093 16018 23302 -25761 -3970 26272 -18056 -19674 31315
1525 31315 4628 -32898 11702 20143 -26722 -2790 30728 -15677 -24623 25655 5751 -29085
1537b9085M2436P207n0677K1638L9810m1583j2990M6656j9655l5407M4528J2316
1549B5194n1556J5369L9458l9338j2035M8804j8133m0304M0379J6477m7929J5024
1561h590L8639m0712j6182N0905j1835m1160L6111J6096m7998J4334M3248l8751
1573e895k1172M8383r211m0835L7030J8866n0131Q833M4439l3742k1301M6672
1585B1936q778m3373L5215K4082m7846M864M3065l2707k3026M8248m785m5611
1597b8716L0524K6021m5548L505M4343l0929k6674M6278q44m4849K8613K6792
1609B8516m5356J36M5466k6539k9111M3913J314m4935K6636K9544m4270l765M5989
1622B7538k4694k9856M3147L590m5796K3597L1618m2716n171M5114k2563l1766
$$ plain form
1537 -29085 13351 20558 -30119 -8481 31329 -10254 -23244 23412 3757 -31650 12878 25194
1549 25194 -26362 -10993 28465 -10873 -22908 25896 7763 -32541 7838 24315 -23614 -8590
1561 -8590 30049 -10663 -26845 24060 12225 -28935 7176 23272 -24726 -10392 32856 -5895
1573 -5895 -27067 21316 12105 -28730 8300 27166 -22965 -14132 30307 -3435 -24736 21936
1585 21936 13158 -30215 5000 29082 -18764 -13900 29165 -3542 -26568 21680 16895 -28716
1597 -28716 1808 27829 -17719 -14214 30129 -800 -27474 18804 17960 -26889 1724 28516
1609 28516 -16840 -16704 28762 2223 -26888 17025 18339 -26596 40 29584 -14686 -18451 27538
1622 27538 2844 -27012 16135 19725 -26071 -2474 29144 -13572 -18743 26371 3808 -27958
1634b7958M2205O455m6174K1174L2620m1404p285M5685k0656l3658M0867R018
1646B0889m6106J9204L3596m0199r168M6477j8907l5406L9510J1568m5700J6586
1658g656L5390l9077j1875M6838j5896l6876L7860J3474m6191J5239L7108l7723
1670i385j4496M5869j3399l7393L6639J5287m6108J2145L8369l4694j6739M4763
1682B0858j1102l8532L4573J8038m4999R159L8557l2848j8616M4856q032l9902
1694b7990L1640K0463m3602O893L9811l1171k1417M3635m600l9826K9472K1627
1706B4935m3462M855M1036k8748k3393M1813k553m0096K8135K3779m3247K036
1718a4910M1137k5930k4699M1346j301m1291K6418K5985m1449r70M1570k4972
$$ plain form
1634 -27958 14247 20702 -25472 -4298 28322 -13082 -20367 25318 4662 -28996 11871 20889
1646 20889 -25217 -6013 27583 -12616 -21784 24693 5786 -29620 9890 21458 -24242 -7656
1658 -7656 27734 -11343 -23218 23620 7724 -29152 8708 22182 -24009 -8770 28338 -9385
1670 -9385 -23881 21988 8589 -28804 7835 23122 -22986 -10841 27528 -7166 -23905 20858
1682 20858 9756 -28776 5797 23835 -21164 -12005 26552 -6296 -24912 19944 11912 -27990
1694 -27990 3650 24113 -19489 -12596 27215 -3956 -25373 18262 13662 -26164 3308 24935
1706 24935 -18527 -13672 27364 -1384 -24777 17036 14483 -25613 2522 26301 -16946 -14910
1718 -14910 26227 297 -24402 16944 15643 -25648 770 26755 -14694 -15664 25906 934
1730I34k5956M1387J272m2881K3704K8159m0273k557M1803k3428k8121M0366M075
1743A8484m2217K1442K8636l9611m500M2809k1137l0094L8952N675m2265K0416
1755c410L0471l9056p572M2438j7957l0475L7473P354m2728J7781L2424l6456
1767i713r907M1496j6359l1982L6556J0674m2815J4103L2941l3880j1715M2027
1779B1426j4244l4391L3809J4007m0975J2036L3185l4082j3683M2276j0352l5066
1791b6054L1169J4966m0731J0336L5820l1625j7145M0827q127l5061L1040J6797
1803B2212m1332O937L6940k8745j7789L9679o716l6988K9129K0015l9976M496
1815a2138L6247k8082j9505M0485l478l8323K5629K1201l8875L740L7877k6849
$$ plain form
1730 934 -25022 16365 17637 -25244 -1540 26619 -13654 -16211 25592 2164 -25957 14409 18484
1743 18484 -23733 -2291 26345 -13266 -17766 25043 3906 -26188 12764 18439 -23826 -3410
1755 -3410 27061 -11995 -19567 22871 4914 -25561 11912 19266 -23462 -5681 26743 -9713
1767 -9713 -19620 21876 5517 -26465 10091 20765 -22050 -7947 24994 -8886 -20601 21426
1779 21426 7182 -27209 6600 20607 -20368 -8332 24853 -9229 -22912 19364 9012 -26054
1791 -26054 5115 20081 -20650 -10314 25506 -6119 -23264 17563 9436 -25625 5415 22212
1803 22212 -19120 -12183 24757 -3988 -21777 17902 11186 -25802 3327 23342 -16634 -12138
1815 -12138 24109 -3973 -23478 17007 13529 -24794 835 22036 -16839 -13099 24778 -2071
1827b071k2891L9762q56l7442K4768K2331l9588O96L9342k2813k4024L7401K63
1840A4878l8263K3492K5628l7838k803L7925k1697k4361L7859K921l9799J9385
1852b673K6513l4918m046L8412k0061k7643L5436O502l8282J7745K7360l5484
1864a1139p090L9949j5849k8338L2881O302l8335J7349L0814l4348j0689L7480
1876A8987j3452k7709L3372Q407m0195J3858L1236l1055j0946L8004j3727l1500
1888b4720L2016J2144l7597J1975K9584l2175j2185M0697r357l3232K7041J2741
1900A6932l6264J2705L2520l2270j6015L8532o756l1308K8257J3702l9377Q508
1912a0834L4322k7241j4819L6642r207l5159K9315J9996l7051L262L0116k6416
$$ plain form
1827 -2071 -24962 14800 13944 -23498 1270 23601 -15987 -15291 24051 1238 -22786 14615 14878
1840 14878 -23385 107 25735 -12103 -14906 23019 1322 -23039 14820 17741 -22058 -2673
1852 -2673 23840 -11078 -15124 23288 3227 -24416 11020 17522 -20760 -3015 24345 -11139
1864 -11139 -18229 21720 5871 -22467 10414 16716 -21619 -4270 26544 -7804 -18493 18987
1876 18987 5535 -22174 11198 19605 -20590 -6732 24504 -6551 -17497 20507 6780 -24720
1888 -24720 7296 19440 -18157 -6182 23402 -8773 -20958 19739 10382 -22850 4191 16932
1900 16932 -19332 -6627 25893 -6377 -22392 16140 9384 -21924 6333 20035 -19342 -10834
1912 -10834 23488 -3753 -18572 18070 8863 -26296 3019 23015 -14036 -10774 19342 -7074
1924g074j3839M0558o659l8529K3554K1349l3558M377L2133k7128j9766L8278
1936A3696j051l4148K3075J8754l7063R88L7939j9639k1860L1462l157l3263K6701
1949B434K4417l8800n479L4500j5918j8808L3348k438l7813K1121K6362l2401
1961i475l815L3407k0116k4402L4480O562l4211J5419K0650l4018j301M0850j6490
1974G540l0885K8031P762k9653J9214K2242l7225p706M0154j0797k7277K8127
1986I527N499l6000J6189K8879k9845r395L3800j5671k7270L4057J2606l7822
1998a5446O498K5598k5434m130L6698j7362l3654L0037J6993l2042P024K5103
2010A9883k9579r755L8816q996l0775K5860J1470l5446R943L3538k5805j7397
$$ plain form
1924 -7074 -20913 19645 12986 -25543 -1989 19360 -14198 -9821 22312 -4816 -24582 13696
1936 13696 12645 -21503 1572 20326 -16737 -15749 22190 2551 -19309 12153 8996 -24267 2434
1949 2434 26851 -11949 -17428 17072 1154 -17654 15694 13256 -24557 -3436 22926 -9475
1961 -9475 -13290 20117 1 -24401 10079 16641 -17570 -2151 18499 -15519 -16820 24030 7540
1974 7540 -23345 4686 12448 -17205 2009 24251 -12974 -20680 19474 8677 -18600 9527
1986 9527 15026 -20974 -4785 24094 -5751 -15146 18654 2983 -24287 9770 22376 -15446
1998 -15446 -8948 16650 -8784 -12914 23784 6422 -27232 2805 19798 -12244 -5220 19883
2010 19883 -9696 -19451 19365 10369 -20406 5454 16924 -18522 -8579 24959 -846 -18243
2022a8243L0486p088k4997K9622J3028m0983K625L5079j8377j5102K8836r538
2034E348l0292K8363J9369l5574P85L0276k2166j5854L4464k052l2339J9463J6393
2047A6184l2037O016L4697k4757k4774L2630M366k7788J9110J4130l5446L082
2059a4587L7365j8771k3987K8349J948l0382K0195K0883l2429l142L1841j7941
2071f58k0220L3307L141l6102J3823K4261k6337j283K9500k0751k4071L5247Q390
2084A8247l4184J0985K1867k7318k427L3358j6035k6424K9521P693l2741J4055
2096c403K5503k9262r412L2217j0739k2486K7705N578l5699J2691K9970k5657
2108b994j1766K9375j1031k3131K8640R361l5500Q917K7744k4021j0956L1771
$$ plain form
2022 -18243 12243 5155 -19842 9780 22808 -18175 -15550 19529 1152 -13950 14886 5348
2034 5348 -24944 3419 22788 -12786 -12001 18275 -3891 -19745 14719 12667 -19672 -209 16184
2047 16184 -15853 -9837 24860 103 -24671 7959 12325 -15463 3647 17777 -17669 -14587
2059 -14587 22778 4007 -19980 8369 10317 -20065 130 21013 -11416 -14558 17283 -658
2071 -658 -20878 12429 15570 -20532 -6709 17552 -8785 -10068 19432 -1319 -25390 9857 18247
2084 18247 -15937 -4952 16915 -10403 -12830 20528 4493 -21931 7590 15283 -17458 -3403
2096 -3403 22100 -7162 -16574 15643 4904 -17582 10123 15701 -19998 -7307 22663 -2994
2108 -2994 -14760 14615 3584 -19547 9093 18454 -17046 -8129 19615 -4406 -15362 16409
2120A6409q334k7779K4495J2303l1062Q577K6906k5916j3906L3730l933k8655
2132a7165K1524J1474l0662Q263K9256k4922j6637L1792k543k7785K1231J3782
2144A7608l1375M530K9528k2051j5745L1098l252k9936K0903J7316l0072J562
2156i886K8197k0878j5779L2269k244l1401J9087J8706k9093M55K9074k0031j7741
2169a9265L1047J97l0690J7897J8858k9246j286L0315j6951k0233K9319J230l0147
2182a8955J7448K0574l0031l255L0733j4583k0550K7711K783l1121J6317K2592
2194A9663k8549n484L0280j3465k1409K6976N071l0621J3221K2833k6608n986
2206a4078L0249j2317k3463K6150P991l0129J1136K2675k5672p496L1359j0557
$$ plain form
2120 16409 8075 -19704 4791 17094 -13968 -5391 21515 -4401 -18307 15423 11490 -17165
2132 -17165 4359 15833 -14829 -6566 22690 -2232 -18869 12923 10380 -17405 3826 17608
2144 17608 -13767 -9237 20291 -1760 -17505 13593 10341 -19595 1308 18624 -11448 -9886
2156 -9886 18311 -2567 -18346 13923 11679 -19722 -635 18071 -11022 -10567 18507 -1524 -19265
2169 -19265 11782 11979 -18711 -814 18044 -11202 -12488 17827 876 -19357 9962 11192 -18955
2182 -18955 -1507 19067 -10964 -14219 16514 1931 -18619 9092 11875 -19246 -2929 19663
2194 19663 -8886 -14370 15910 2445 -18964 8012 13083 -17538 -4317 18516 -8092 -14078
2206 -14078 16171 3854 -19609 6541 14532 -15597 -4461 18214 -7458 -14954 16405 5848
2218E848k4707K4706Q709k9720R991K4339k5019r525L0826q999k4916K4270R944
2231A5747l0570Q033K5444k3036j0511K9427p792k5743K3900J2322l0783N834
2243g728K6214k1785j2050L0046o642k6991K2327J3783k9695M539K6478k1081
2255b585j4248K9857l833k7302K0434J4251k9775L576K7780j9965j5708K8879
2267A1361k138k7277J8997J6044k9317J631K8085j8433j6675K8684n60k8143J7869
2280A28J6915k7759o4K8209j7176j8099K8121J363k8189J5631J8106k6945j619
2293a1378K8478j5607j9564K6786L136k8540J4270J9357k6119l858K8439j3876
2305A524j9715K5931M208k8689J2856K1053k5495m835K8883j2524k1266K5861
$$ plain form
2218 5848 -18859 5847 14556 -15164 -5173 19166 -5853 -15378 15448 6449 -18467 5803 15747
2231 15747 -14823 -6790 18654 -4382 -14893 14534 6742 -19001 4899 17221 -13562 -7728
2243 -7728 18486 -3299 -15349 14697 8055 -18936 3391 17174 -12521 -7982 18496 -2585
2255 -2585 -16833 13024 9191 -18111 2323 16574 -13201 -9625 18155 -1810 -17518 11361
2267 11361 9223 -18054 943 16987 -12330 -10699 17386 -1047 -17722 10962 10402 -17741 128
2280 128 17043 -10716 -10780 17429 253 -17846 10275 11638 -16551 -920 17186 -9759 -11378
2293 -11378 17100 1493 -18071 8715 11851 -16689 -2419 16938 -9181 -13039 15400 1524
2305 1524 -18191 7740 11948 -16741 -3885 17168 -8327 -13162 15721 3197 -18069 7792
2317G792N842k8830J2030K1341k4810o417K9169j0532k2141K4102O858k8859J0899
2330c556K2566k4103q960K9082r220k2536K3322Q349k9357Q988K3822k3036j0107
2343a4746K9159q301k3665K2530J0469k8809O775K4296k1423j0748K8627n748
2355H416k5585K1274J2048k7794N577K4599k1132j2293K8554m309k5537J9264
2367C082J3107k7959M203K5479j9185j4487K7402k580k5972J8680J4856k7866
2379a1240J791K5754j7106j4950K6937j539k6631J7076J6785k6611l37K6012j6091
2392a50j6330K6799O49k6872J5307J6835k5821p78K6858j5775j7790K5677K279
2405A0888k6857J4525J7667k6195k029K7956j4068j9503K5000L645k7317J3887
$$ plain form
2317 7792 13634 -15196 -3166 18175 -6635 -13052 16117 5585 -16556 7546 14404 -14455 -3556
2330 -3556 19010 -5093 -14053 15029 5809 -16727 6595 14944 -14413 -5425 18397 -4639 -14746
2343 -14746 14413 6112 -17553 4977 15446 -13363 -6588 17708 -3715 -14463 14164 8416
2355 8416 -17169 4105 16153 -11641 -6064 18535 -2597 -14890 13664 9355 -16182 3082
2367 3082 16189 -11770 -7567 17912 -1273 -15760 11642 9062 -16910 1770 16626 -11240
2379 -11240 -9449 16305 -801 -15751 11186 9647 -16984 92 16877 -9734 -10071 15941 -150
2392 -150 -16480 10319 10968 -15904 -597 16238 -9583 -10361 16497 722 -17068 8609 10888
2405 10888 -15969 -1444 16223 -9972 -12001 15955 1887 -17616 7384 11029 -16288 -2401
2417b401J8971k5389l556K7549j2646j9694K4647M633k7222J1888K0320k4253
2429g153n156K7118j1399k0856K4031O671k7782R709K1034k3077o745K7814j0417
2442C792k2240K2887Q146k7091Q684K1503k2306p925K7480p901k2438K1057R346
2455A2994k6701P277K3591k1077j0511K7088o160k2734K1153R753k7577N723K4237
2468A7056j9542j1311K5625n281k3442J9758J2384k7391L577K3818j8207j2459
2480a5415K6413l624k5088J8289J3360k5728K987K4480j8289j4196K7133j228
2492I094k4959J6694J4421k6055J761K6488j6495j5955K5140k23k4686J6619J5245
2505A7089k6138p73K6207j4952j6029K5191l4k6764J5363J7410k4586k288K5177
$$ plain form
2417 -2401 16570 -8819 -12375 15174 2528 -17166 7481 12114 -15108 -3220 17100 -7153
2429 -7153 -12309 14809 3410 -17446 6585 13256 -14526 -4817 16217 -6860 -13605 14209 3792
2442 3792 -18448 4439 12585 -14506 -5822 15681 -6625 -14550 12930 5029 -17409 3648 12994
2455 12994 -13707 -6430 17161 -3916 -14427 12661 6501 -16233 4920 14673 -12904 -7181 17056
2468 17056 -2486 -13797 11828 6547 -16895 2863 15247 -12144 -8567 15251 -2956 -15415
2480 -15415 10998 7374 -17714 575 13935 -11793 -8806 15674 -2615 -16811 10322 9094
2492 9094 -15865 829 15250 -10805 -9044 17444 949 -15006 10134 9911 -14775 1844 17089
2505 17089 -9049 -9822 16385 1433 -14596 10595 10561 -16203 -840 16570 -8016 -10304 14873
2518A4873j4612j7177K5792K638k6514J2130J7614k3614k066K6201j2819j9640
2530a7194K4014N070k5549J1803J8110k3666m610K7031j0572j9617K2245N300
2542A2365k6253J0747K0420k2229p020K5671j0106j9755K2585P098k7306P845
2554e938K1276k0274p576K6348r677k1817K1774R308k6191O850K1310k0801q576
2567a3984K6926p195k2188J9933R590k6179O711K2949j9814j0762K5249n189k1970
2580a5923J9812J0882k7138M203K3960j7951j2112K5426m572k2978J8869J2223
2592A4701k5955L414K3796j7987j3261K5446j551k3629J6764J2269k4889L047
2604g835K4882j7278j5561K4927K41k3407J5746J3347k5153Q71K5091j5139j6058
$$ plain form
2518 14873 261 -16916 8876 11514 -15000 -2870 14744 -8870 -10936 15265 2446 -17194
2530 -17194 6820 11890 -13659 -1856 16254 -7412 -12022 15009 4437 -15180 7065 12365
2542 12365 -13888 -3141 17279 -4950 -11970 13701 3595 -16160 6425 13523 -13783 -5938
2554 -5938 15338 -4936 -12512 13836 4159 -17658 4116 13424 -12767 -5917 15393 -5408 -13984
2567 -13984 12942 5747 -16441 3492 13082 -13097 -6386 16563 -3251 -14013 11236 6047 -15923
2580 -15923 3889 14771 -12367 -8164 15796 -2155 -14267 11159 6587 -16391 2478 14701
2592 14701 -11254 -7840 15956 -2031 -15292 10154 8603 -15026 1738 14007 -10882 -7835
2604 -7835 17047 -231 -15792 9135 9376 -14031 1715 15062 -10091 -9220 15871 732 -15326
2617a5326K4603N89k4900J4273J5826k3263j077K4214j5018j6266K5055L287k6141
2630a4144J1959J6689k1933j532K4290j3637j7930K4225M003k4938J1336J7696
2642A6084k2511m144K4546j0802j7325K2691L253k6811J1605K0273k1457p053
2654a1651K3849j0351j7122K3149M927k7532R227K0961k0483o781K4860r526j9946
2667a6419K1579P082k5361R186K0049k1898q438K6521n995k0456J8539O813k4713
2680a3511R433K2032k1153j1599K5807m873k0288J8694Q563k5814N670K2451j8627
2693c215j0194K4888n273k2884J7677J2801k3333K952K0116j8422r825K6900l201
2706H987k5450J5823J3099k2263L650K1674j8351j3119K6115j073k3726J5754
$$ plain form
2617 -15326 9277 9866 -15034 -761 15065 -8198 -9275 14939 -79 -16345 8710 11997 -14144
2630 -14144 -2185 14504 -7429 -8961 15329 1692 -16238 7987 11990 -12948 -1612 16084
2642 16084 -6427 -10571 13975 3173 -14152 8539 11792 -15019 -3414 16859 -4598 -11651
2654 -11651 12198 1847 -15275 7874 12801 -14731 -5504 15457 -5026 -11807 13053 3527 -16419
2667 -16419 5160 12242 -13119 -3933 16116 -5782 -14220 12301 6306 -14150 4389 11202 -13511
2680 -13511 -4078 17954 -3199 -14798 11009 6136 -14152 4542 13105 -12709 -7039 15412 -3215
2693 -3215 -13409 11479 6206 -16678 999 13800 -9533 -6581 13535 -4887 -14712 12188 8987
2706 8987 -16463 -640 12459 -9804 -6154 15520 -2831 -15950 10165 9092 -14634 1120
2718A120J3120k4458J085K3960j4260j3834K2629j953k3425J6488J6302k4797
2730h023k417K2760j2416j3104K3593j347k5258J4298J6998k1823k664K3446j3710
2743C33j5663K3290K573k3826J2258J6064k3583k487K6278j1101j9001K0462L645
2756I242k2602J3574J6458k4253n117K5957q823j7950K0483L063k3616J0894J8778
2769A6088k1080o189K4080r927j8659K1780O826k4640P158J8460j9395n284K5135
2782A4353r357k1369K0022R237k3379O737J8570k0158p860K5962o345k1298J8399
2795C514Q905k4498O181K1552j8336j0190K3477n607j9907J9005R693k5507L736
2808g982K2283j6011j0675K2714m603k2229J8876J1619k4330K065K2047j6285
$$ plain form
2718 1120 14240 -10218 -9133 14827 567 -13267 9362 7409 -16016 472 16774 -8023
2730 -8023 -10440 12320 -96 -13200 10393 9046 -16212 -1914 15084 -6739 -9403 14043 333
2743 333 -15330 7960 10533 -13293 -1035 15029 -8554 -11041 15237 4136 -14865 5597 9242
2756 9242 -13360 214 16672 -7581 -12698 13259 4436 -13514 6969 10032 -13584 -2690 16088
2769 16088 -4992 -11181 12899 2972 -15687 6093 12919 -11721 -4563 13897 -5498 -10782 14353
2782 14353 4996 -16373 3649 12886 -10493 -3756 14814 -5344 -13204 12758 6413 -14885 3514
2795 3514 12419 -12079 -5898 15654 -2682 -12872 10605 4998 -14909 4096 13789 -11718 -7982
2808 -7982 14301 -1710 -12385 10329 5726 -16503 2373 13992 -10338 -8273 13774 -2511
2820b511j1589K4379l230k2455J6109J2194k3416K537K2691j6154j3524K3558
2832H589n43k1797J4827J2291k3701J155K3845j4496j4751K2522J41k2214J4230
2845I8J4075k3267j90K2968j3337j4749K2542J203k3513J2543J5471k1118k194
2858i468K3008j2766j5842K2513L661k4084J1010J6261k0926k932K3450j1304
2870B581j6677K1245M334k3376J0176J7355k1044m496K3908r675j7569K0281M980
2883A2023k3799R068J8811j9796o938K3240p895j8121J9840O021k4325P956J9359
2896A5444j8946p460K3247p196j9088J8793Q177k3756O423J9827j8775q332K3801
2909A2159n500k0482J7943Q589k2924N421K0139j7940r948K3451m244k0917J6899
$$ plain form
2820 -2511 -14100 10279 7049 -15406 703 12897 -10519 -7982 14709 -1445 -14969 8589
2832 8589 8046 -13751 1076 13367 -10334 -9179 14666 170 -14581 7941 8082 -14132 98
2845 98 14173 -9094 -9284 13684 347 -14402 8140 9343 -14170 -1627 13844 -7274 -9468
2858 -9468 13540 774 -15068 7445 11106 -12978 -1968 14293 -6633 -9565 13885 2581
2870 2581 -14096 7149 11483 -11893 -1717 15638 -5406 -9902 14006 4331 -13238 7043 12023
2883 12023 -11776 -2708 16103 -3693 -10631 12609 4714 -13407 6433 12454 -11871 -3915 15444
2896 15444 -3502 -10962 12285 5089 -13999 4794 12971 -10785 -4362 15465 -3310 -11642 12159
2909 12159 6659 -13823 4120 12709 -10215 -4794 15345 -2595 -12543 10908 6664 -14253 2646
2922B646R990k3369M379K0906j7080j0902K2800l235k1065J6318J1266k2989K578
2935g757K0964j5676j1439K2731k617k1718J5258J2496k2583J643K1344j4597
2947a951j2685K2227o39k2130J3904J3714k2033m09K2078j3310j3629K1252N45
2960F934k1515J2638J4544k1353k128K2842j2053j4495K0793J852k2142J1668
2972b415J5705k0832l136K2892j0957j5582K0237L676k2654J0475J6171k0222
2984f642l957K2927j0078j6599J9851M550k2304Q930J7142j9496n072K2715q923
2997C044j7079J9216N671k2627Q092J7767j8563n772K2337p421j8311J8800P050
3010A2204k2671P217J8107j8214p205K3110o700j8642J7439P822k2184N504J9000
$$ plain form
2922 2646 12636 -10733 -6354 14552 -2528 -13430 9370 6135 -14930 1388 12654 -10335 -7757
2935 -7757 13207 -2469 -13908 8823 6206 -15512 -254 12242 -10341 -8698 12646 -1951
2947 -1951 -14636 7591 6952 -15178 -1274 12440 -9593 -10002 12076 -1234 -14863 6389 6934
2960 6934 -14581 -1943 12601 -8752 -10880 11962 -91 -14586 6207 8059 -14083 -2415
2972 -2415 13290 -7542 -10678 12214 1257 -14325 5912 9588 -13066 -2591 13580 -6642
2984 -6642 -10599 12328 2250 -14349 5502 10052 -12252 -3322 13820 -5676 -10748 11967 3044
2997 3044 -14035 5181 10852 -11775 -3683 14084 -4479 -10251 12086 4665 -13646 5154 12204
3010 12204 -10467 -3250 14857 -3357 -10562 12548 5848 -12794 4645 12467 -9717 -4213 14787
3023A4787j7447q723K2664n415j9349J6931Q915k2530M500J9660j6352r996K1862
3036I507l684j9686J5855J0395k1991K935J9925j4765j1026K2062k213k0656J4576
3049A234J1767k1605K005K0713j4619j2296K1978j347k0568J3461J2118k0948
3061h107O37K0729j3504j3034K0874L76k0952J2363J3393k0942p21K0808j2333
3074d13j3207K0325J616k1749J1675J4567k0062j710K0717j0697j4173J9963K234
3087I086k1495J0731J5149j9469k930K1379j0265j5174J9610L263k1477R877J5787
3100A4072j9416l891K0904q462j5993J8618M617k1780Q615J6493j8323n711K1232
3113A0975o945j6737J7628N801k1360P215J7454j7833o415K1285o035j7247J6699
$$ plain form
3023 14787 -2660 -11383 11281 5866 -13483 3448 12363 -10167 -5667 13993 -2359 -12355 9507
3036 9507 5823 -13863 1992 12387 -9604 -6669 13256 -1509 -12535 9527 7314 -13342 1234
3049 1234 13001 -8604 -6599 14114 -505 -12801 9177 7830 -12738 723 12841 -8107
3061 -8107 -7470 13259 -245 -13279 7595 7971 -12981 -618 12775 -8167 -8888 11920 -413
3074 -413 -13620 6705 8321 -13428 -1753 12814 -7248 -8958 11759 1062 -13111 6852 9086
3087 9086 -12409 -1678 13471 -5998 -8928 12451 2186 -12988 6622 9885 -11592 -1715 14072
3100 14072 -5344 -9235 11669 3207 -12786 5832 10449 -11331 -2716 13777 -4546 -10257 10975
3113 10975 4030 -12707 4921 10722 -10638 -3423 14031 -3802 -10217 11068 5033 -12214 4485
3126D485P136k1600O297J7755j6679p848K1469n146j8600J6500Q170k0975M131
3139d905J8203j5652q755K1351m152j9200J5481R532k0651L488J8207j5303r523
3152a1879K1534k777j9277J4112R636j9803K545J8824j4198j0697K0238j267j9489
3165a2498J3526J1192k1022J539J9091j2438j1338J9528q22j9999J3049J2369
3177A2177k0090k24J9353j2213j1682K0277J19k0319J1544J2677j8772p51J9931
3190A2027j1522j3433J9390J774k0033J0521J3299j9079j992K0514r751j4165
3202a2450J7880K489k0358J0320J4671j8723m123K0252q347j4214J7863K644k0045
3215a2141Q498J5593j7073m549J9586p758j5550J7813N028k0100P105J5518j7000
$$ plain form
3126 4485 11621 -9979 -3682 14073 -2606 -10454 11015 5869 -12731 3769 11939 -9036 -4905
3139 -4905 13298 -2354 -11109 10242 6090 -13110 2371 11903 -8748 -5260 12947 -2356 -11879
3152 -11879 9655 6878 -12399 1713 11349 -8454 -5909 12915 -1283 -11980 8258 6991 -12498
3165 -12498 1028 12220 -8802 -7263 11828 -610 -11948 7580 6758 -13241 -192 12177
3177 12177 -7913 -8137 11216 -997 -12679 7598 7717 -12602 -1058 11619 -7153 -7904 12027
3190 12027 505 -12928 6462 8236 -11797 -1276 12023 -7056 -9048 11466 1715 -12450
3202 -12450 5430 7919 -12439 -2119 12552 -6171 -10294 9958 1611 -12603 5260 7904 -12141
3215 -12141 -3643 11950 -5123 -9672 9914 2156 -13394 4419 9447 -10653 -3548 11970 -5030
3228e030n110K0819o662j6656J5891O371j9382O661J5913j6800p318K0752m891
3241D558j6085J4657O683j9968N304J7080j4464q499J9520m557j7194J5619Q581
3254A1235k0105L314J6768j3712p774J9936m007j8586J4256R901j8523K297J7252
3267A2252j4211r087K0193j981j8676J2977J0031j8968J503J8833j3002j0553
3279a0689J8409j138j7926J2716J0885j9576m20J9080j0987j0371J7585p91j8865
3292a2088J2101J2292j8377j517J8546j0455j1857J8574N75j8593R913J2464j7790
3305f212j443J9027r559j3368J6875K730j8101R038J2629j7802k489J9384p825
3318B884j4551J6144L317j8169Q499J3199j6608l942J9286p629j4518J6150M725
$$ plain form
3228 -5030 -10140 10679 4017 -12639 3252 9623 -9759 -3098 12815 -3985 -11303 9449 4558
3241 4558 -11527 3130 9813 -10155 -4851 12229 -2235 -10734 8786 4229 -12965 2654 11235
3254 11235 -8870 -5556 11212 -2500 -10274 9662 5655 -12931 1325 11226 -7297 -5000 12252
3267 12252 -1959 -11046 9147 7166 -11510 1467 11498 -7470 -5967 12866 -136 -10689
3279 -10689 7720 6582 -11344 1372 12257 -7319 -7739 11341 354 -10017 7568 6777 -12088
3292 -12088 13 12305 -6072 -7589 10957 502 -11355 7219 7794 -10799 -886 11578 -6212
3305 -6212 -7655 11372 1813 -11555 5320 8050 -10051 -1013 11616 -6186 -8675 10709 2884
3318 2884 -11667 4477 7794 -10375 -1876 11323 -5285 -9227 10059 2430 -12088 4062 8787
3331H787j8739P027J3687j5595m128J8780p189j5307J6166N827j8772N840J4338
3344A0722j5224m918J8817o273j5274J5081O640j8788M498J5786j3955o651J8393
3357H854n227j5700J4936O962j8812L717J6068j3055p868J7995l404j5908J3788
3370B346P854j8862L193J6694j2385r170J8097k613j6000J2675Q659j8505K076
3383e941J7663j2065r769J7091j117j6391J1662R644j7911R47J7698j1354j0674
3396a0517J7402K86j7330J0429J0234j6719J16J7134j0822j1000J7425J093j7612
3409i881R265J1046j6399m58J7727j0115j1900J6679K058j7462Q457J2105j6056
3422d934k028J7356q851j2050J6727K291j8401P796J3388j5355l245J6825p629
$$ plain form
3331 8787 -9952 -2925 10762 -4833 -8961 9819 2630 -12677 3489 9316 -9456 -3616 10722
3344 10722 -4502 -9420 9397 3124 -12150 2931 9571 -9217 -4719 11067 -2888 -9539 8854
3357 8854 3627 -12073 2863 9825 -8987 -5270 10798 -2257 -10125 7870 4466 -11442 2346
3370 2346 10200 -8662 -5469 11225 -1160 -10330 7767 5154 -10846 1829 10488 -8017 -5941
3383 -5941 11722 -343 -10112 6979 5862 -10529 1133 10777 -7134 -6187 11511 157 -10517
3396 -10517 6885 7171 -10159 270 10504 -6215 -6099 11035 213 -10787 6638 7731 -9881
3409 -9881 -616 10430 -5969 -6427 11300 1185 -10715 5964 8022 -9440 -983 11122 -4934
3422 -4934 -6962 10394 1543 -10507 6220 8511 -9890 -2094 11294 -4061 -7306 9519 1890
3435A890j2856J6040L986j8586O938J3531j4463m465J7200o485j3797J5246M425
3448H604j7678O294J4085j4881n613J7514m966j3834J3653N128j7331N441J4858
3461A1274j4148o375J7040m125j4574J3489O050j7331M226J4925j2994p026J7175
3474G606l406j5273J1984P632j6537L427J4713j2879p682J7437k117j5690J1175
3487C90Q373j6033J765J5388j1849q280J6912j554j6064J1101R230j6633R54J5698
3501I398j0354r336J6442r13j6352J0650J0055j5678m45J5753j0027r621J6109
3514E681K49j6187R451J0671j5545j036J6060q797j0334J5179J052j5997Q568
3527i85J1189j5634j948J6876q014j1124J4604K265j5941P874J1620j5093l038
$$ plain form
3435 1890 -10966 5074 9060 -9526 -2588 10943 -3520 -7985 9215 2730 -11067 4179 8604
3448 8604 -9074 -2780 11305 -3576 -9189 8325 3359 -10475 3178 8306 -9025 -3584 11274
3461 11274 -2874 -9249 7791 3666 -10908 2581 8631 -8700 -4474 10451 -2543 -9569 7606
3474 7606 4200 -11073 911 8543 -7994 -4567 10146 -2733 -10415 7022 4905 -10785 390
3487 390 8763 -7270 -5505 9883 -1966 -10246 6666 5112 -10952 149 9379 -7254 -6300 9398
3501 9398 -956 -10292 6150 5237 -11115 -465 9590 -6088 -6533 9220 -807 -10428 5681
3514 5681 5930 -10257 -806 9865 -5680 -6716 9344 547 -9787 5392 6444 -9553 -985
3527 -985 10204 -5430 -7378 9498 1484 -9640 4964 7229 -8712 -838 10782 -4311 -7349
3540g349J6563o822j2179J4097K964j5701O919J2096j4682l377J6494n867j2994
3553i838J4045M038j6458O053J2912j4041m421J7029n873j2939J3423M915j6370
3566g525N043J2903j2794m989J5997m719j3526J2551O051j6128L814J3705j2448
3579b065n949J6038l820j4057J2088O669j6150L385J3982j2061o440J5496k810
3592D306j4139J1641P126j5890K491J4593j1411p106J5580k442j4114J0914P794
3605I343j6073J491J4822j0600p635J4863j207j4845J0405Q813j5406O75J4491
3618I137r880r082J5569l85j4592Q796R241j4937L67J5046r123r912J4530R78
3632E753j4699Q473R572j4355j344J5384p638j0546J4402J342j5140P503J1145
$$ plain form
3540 -7349 9214 2392 -9787 4310 7274 -8427 -1508 10588 -4094 -7471 9023 3156 -9838
3553 -9838 4207 8245 -8213 -2160 10752 -3289 -7710 9319 3446 -9493 3930 8845 -7525
3566 -7525 -2482 10421 -2373 -7362 8635 3916 -9610 2941 8992 -7136 -3322 10383 -2065
3579 -2065 -8014 8024 4204 -9853 2235 8904 -7246 -3861 10121 -1940 -8380 7116 4306
3592 4306 -9833 1808 8934 -6956 -4465 10128 -1283 -8389 7191 4749 -9365 1549 9343
3605 9343 -6730 -5239 9583 -1017 -8652 6211 5004 -9841 564 9377 -6029 -5354 9137
3618 9137 -743 -9825 5744 5359 -9233 -437 8804 -6133 -5766 9280 157 -9755 4775 5753
3632 5753 -8946 -473 9099 -5256 -6600 8784 1146 -9400 5002 6344 -8796 -1293 9852
3645I852j4420j596J5091p303j0904J3553L090j5454O573J1413j3262l201J5544
3658H976o972j1406J3338L825j5626O158J1527j3121l599J5227n498j1790J2382
3671C421M203j4896N222J2134j2772m705J5156m552j2244J2264M436j4725L859
3684c199J2997j1848n118J4697m180j2615J1496N920j5251L424J2811j1083o200
3697h149J4993k830j3486J1067O497j5138K800J3279j1204o617J5129k502j3238
3710i399J0233O760j4623K182J3517j0095p687J4209j622j3195R725P514j4087
3723f568Q78J3416q829p903J3908o98j3858R142Q397j3915j22J3846q517q394
3737i217J4051k25j3725Q273R293j4174o81J4189q053r428J3876J318j4241P731
$$ plain form
3645 9852 -4568 -6164 8927 1624 -9280 4273 7363 -8091 -1518 9895 -3367 -6568 8976
3658 8976 2004 -9402 3936 7761 -7865 -1707 9820 -3301 -6900 8327 2829 -8961 3421
3671 3421 7624 -7272 -2050 10084 -2688 -7393 7763 3211 -9033 3231 7667 -7058 -3199
3684 -3199 9798 -2050 -7168 7529 3349 -9266 2230 8150 -7101 -3677 9134 -1949 -8149
3697 -8149 6844 4014 -9472 1595 8092 -7046 -4246 9033 -2171 -8788 6341 3839 -9399
3710 -9399 834 7594 -7029 -4847 8670 -1425 -9112 5097 3475 -9720 5 7519 -6568
3723 -6568 -5690 7726 -1103 -9006 4902 4204 -9654 -512 7885 -6030 -6152 7694 -823 -9217
3737 -9217 4834 4609 -9116 -843 8450 -5724 -6405 7784 -269 -9697 4179 5497 -8744 -1013
3751a013R219j3769o24J4081o813j0445J3241J651j3867O894J0094j3259k297
3764f907J4362o366r907J2705K426j4335N988J1111j2646k930J4562o034j1024
3777h995J2401L811j4291N311J0682j1969l403J4695n474j1498J1850M545j4225
3790f560M743J1345j1905m427J4413m105j1861J1353M958j4924M523J1661j0773
3803a559n165J3732l380j2108J1242N370j4238K810J2347j0342o071J4223k661
3816D200j2348J0223O057j3884K071J2663r960o546J3984k046j2618R569O709
3829H074j4173J834J3052r545o881J3471j469j2568R023P368j3804P75J3426r047
3843d64p593J3504l63j3401Q754P655j3617L22J3412q557q253J3098O49j3327
$$ plain form
3751 -1013 8206 -5563 -6187 7894 1081 -9364 3877 5528 -8339 -1445 8649 -4610 -6907
3764 -6907 7455 1089 -8818 3887 6313 -8022 -2034 9077 -3569 -6499 8063 2029 -8995
3777 -8995 3406 7217 -7074 -1763 8919 -3050 -6453 8242 2768 -8730 3120 7665 -6560
3790 -6560 -1817 9528 -2377 -6804 7609 3504 -8357 2996 7954 -6970 -2447 9214 -1559
3803 -1559 -6724 7008 3628 -8480 2762 8132 -6106 -3296 9051 -1291 -7362 6861 4200
3816 4200 -8148 2075 8132 -5752 -3681 8982 -978 -7524 6460 4414 -8204 1365 8074
3829 8074 -6099 -4265 8787 -758 -7639 5832 4363 -8205 818 8186 -5618 -4843 8583 -464
3843 -464 -8057 5447 5084 -8317 437 8092 -5525 -5203 8209 -348 -8601 4497 5146 -8181
3857h181P610Q385j2814P1J3011p632r209J2920J272j3343O983Q952j2457j355
3871e787J3310o458r610J2367J899j3590O212R936j2185j724J2662o043r707J2009
3885C291L311j4057N286J0506j1458l099J3306n052j0818J1693L577j3101M503
3898b112J0600j1471l756J3783m319j0840J1150L744j3443M162J1511j0470n055
3911f516J2989l707j1055J0948M868j3835L093J1504r804n344J3390l007j1265
3924g741R585N758j3746L008J1233r578n730J3352j967j1827R178N839j3054K233
3938c457J2482r439p126J2999j125j2062Q937O490j3338J334J2367q369o964J2578
3952E307n96j2494Q197P594j2586O7J2080p626p649J2909q0j2692P195P836j1770
$$ plain form
3857 -8181 -571 7814 -5000 -4929 8082 450 -8759 4161 5433 -7910 -927 8025 -4432 -5787
3871 -5787 7523 1065 -8545 3822 5721 -7869 -1657 8279 -3906 -5630 7032 989 -8718 3291
3885 3291 6602 -7455 -2169 8337 -3121 -6220 7086 2034 -8784 2909 6486 -6615 -2112
3898 -2112 8488 -2983 -6739 7044 2725 -8115 3035 6779 -6664 -2502 9009 -1461 -6516
3911 -6516 6473 2766 -8289 2659 7527 -6308 -3215 8289 -1515 -6859 6531 3524 -7741
3924 -7741 1844 7602 -6144 -3136 8097 -1481 -7211 6141 4174 -7653 1525 7364 -5690 -3457
3938 -3457 9025 -414 -7540 5459 4334 -7728 1209 7699 -5639 -4305 8062 -307 -7271 5307
3952 5307 4711 -7783 414 8008 -4578 -4511 7569 -57 -7706 5203 5123 -7569 -374 7462 -4308
3967d308n51J2560p443q670J2952J121j2942O467Q436j2095r44J2749o509q870
3981h047J1827J389j2828O487R250j1661k319J2386n232q931J1332K013j3429
3994g763N578J0209j1103k936J2283m869r629J1328K816j2889M750R974j0788
4007c039l517J3046m370j0273J0366L570j2291M188J0366j0923m161J2869l077
4020B754j0386R606M019j2571M084J0844j0474m578J2554k601j1162R587N431
4033G107j2787K511J0990r374n342J3237k549j1838Q903O201j2234K242J0609
4046G676q712n876J2762j714j1828Q244O266j1777J134J1657q602o485J2517r66
4060D296j2012Q223P257j2315M8J1807p061p488J2373n52j2119P551P853j1864
$$ plain form
3967 -4308 -4859 7701 258 -8412 4540 5661 -7281 -814 7622 -4473 -5417 7332 823 -8047
3981 -8047 3780 5169 -7659 -1172 8078 -3583 -5902 6484 1252 -7679 3653 5666 -7763
3994 -7763 -2185 8024 -3079 -6015 6268 1399 -8230 3098 5914 -6975 -2225 7749 -3039
4007 -3039 -6556 6490 2120 -8153 2213 5783 -6508 -2320 8046 -2877 -7038 5831 2754
4020 2754 -7632 1974 5993 -6578 -2494 8350 -2124 -6702 5852 3251 -7911 1676 7107
4033 7107 -5680 -3169 7821 -1553 -6895 6342 3793 -8045 858 7059 -5175 -2933 7676
4046 7676 -1036 -6912 5850 4136 -7692 552 6818 -4959 -3825 7832 -770 -7255 5262 4296
4060 4296 -7716 507 7764 -4551 -4503 7304 243 -7245 5128 4576 -7543 8 7861 -4003
4074d003p58J2103o921p431J1526N85j2599P208Q046j1809j055J2414o346q322
4088g362J1304J115j1997O127Q566j1416j710J2638n814r326J1347J893j2265
4101f900N866Q652j1489k014J2599m814r793J0743K612j1877M671R305j0489l436
4115f364J2814m411r999J0360L600j2266L770R957j0030l298J2196m063j0264
4128g998J0286M128j2441L312J0004r450m107J2291l227j0759R691M615j2005
4141e660K809J0400r233m959J2353k743j0541R135N209j2241J736J1310q472n798
4155f695J1837j679j0986Q510N987j2382J405J1404p829o299J1831r96j1552Q243
4169G99O510j2010M22J1851p338p464J1954o9j1368O659P228j1496M5J1964p278
$$ plain form
4074 -4003 -4761 7342 421 -7010 4516 5101 -7498 -290 7756 -4053 -5108 7306 960 -7362
4088 -7362 3942 5057 -6940 -813 7753 -3663 -5373 7265 1451 -7875 3472 5365 -6900
4101 -6900 -1034 7618 -3871 -5885 6714 1900 -7893 2850 5462 -6415 -1744 7561 -2928 -6364
4115 -6364 6450 2039 -7960 2400 6000 -6266 -2496 7461 -2569 -5867 6329 2266 -7998
4128 -7998 2288 6416 -6025 -2713 7291 -2159 -6266 6025 2798 -7961 1730 6345 -5660
4141 -5660 -2851 7549 -1684 -6643 5710 2967 -7574 1561 6770 -5471 -3735 7575 -897 -6695
4155 -6695 5142 3463 -7523 987 6974 -5408 -4003 7401 -428 -6727 5104 4108 -7444 799
4169 799 7309 -4701 -4279 7572 234 -7230 4724 4655 -6713 -54 7174 -4322 -4277 7687 409
4184D09p705J1267O73j1261O695P300j1206q24J1853o460p936J1436J066j1984
4198f677N671Q477j1166j084J1653o072q561J1481J512j1597M982Q521j0501j687
4212e048J1469m895q713J0254K869j2371M571R219j0302k873J1845m039r628J0141
4226B499L225j2152L895R588r378l866J2166m136r388R763L797j2442L468J0297
4240G336r391m452J2160l466r848R176M393j1900K816J0410r251m675J1844k349
4254B803j0409Q858M858j1989K397J0902q616o044J1979j462j0642Q330N429j1642
4268e248J161J0749p345o065J1567j428j0649P870O138j1473O18J0922p609o502
4282g294J1919l87j1647P701O577j1497M09J1222p140o799J1372j80j1083O953
$$ plain form
4184 409 -7296 3971 4644 -6617 78 7378 -3828 -4652 7201 741 -7195 4241 5307 -6677
4198 -6677 -1006 7471 -3695 -4779 6874 802 -7759 3722 5234 -6363 -1381 7140 -3361 -5048
4212 -5048 6421 1526 -7187 3067 5936 -6435 -1864 7355 -2947 -5820 6025 1986 -7642 2499
4226 2499 5724 -6428 -2533 7055 -2323 -6189 5977 1841 -7547 2216 6013 -6429 -2961 7336
4240 7336 -2055 -6507 5653 2187 -7661 1515 5908 -5992 -3176 7234 -2017 -6692 5152 2803
4254 2803 -7606 1252 6110 -5879 -3482 7420 -1196 -7240 4739 3277 -7365 965 6394 -5248
4268 -5248 -4087 6662 -683 -6748 4819 3391 -7258 612 6750 -4723 -4105 6817 -792 -7294
4282 -7294 4625 4238 -7409 292 6869 -4628 -4219 7003 -137 -6936 4436 4256 -6827 126
4296A26O979j1365m75J1849o518p695J1100M70j1385O832P350j0589j545J1632
4310F766n710q210J1072J470j1592M887Q798j0619j568J1369n701q092J0545K564
4324E979j2038M931Q604j0317k273J1876m880q556R681K868j1870M749Q856j0060
4338b450l273J1944m326q901J0325K770j1554L557R340r475l393J1407l662r569
4352g260R409M209j1876L126R438r016m181J1628k773r646Q934M295j1679K301
4366c091J0384q924m520J1556k459r890Q229M950j1604J689J0883q268n459J1174
4380D650j570j0119Q012N313j1486J316J0545p563o094J1512q77j0740P625O128
4394F652j1257R67J0399p171o602J1134K9j1285P023O743j0594l25J0771o418
$$ plain form
4296 126 7105 -4260 -4735 7114 596 -7099 4001 4471 -6914 -82 7268 -3321 -4866 6766
4310 6766 1056 -7154 3918 5388 -6204 -1317 7481 -3138 -4706 6663 962 -7130 3415 5979
4324 5979 -6059 -1128 7476 -2841 -5114 6762 1882 -6674 3007 5875 -5995 -1246 7610 -2450
4338 -2450 -5723 6221 1895 -7006 3319 6089 -5465 -1908 7432 -2043 -5436 5971 2309 -7260
4352 -7260 2149 6358 -5518 -2392 7046 -1970 -6151 5477 2704 -6942 1992 6287 -5392 -3091
4366 -3091 7293 -1631 -6151 5405 2946 -6944 1285 6235 -5369 -3680 7203 -1065 -6524 4650
4380 4650 3080 -7039 973 6286 -5200 -3884 6661 -902 -6996 4516 3639 -7101 524 6652
4394 6652 -4605 -3638 6761 -410 -7012 4122 4151 -7134 -111 6632 -3962 -4287 6484 66
4408F6p190J0824R70j1306O254P005j0531o91J1313o290p275J0220J462j1271
4422f440N512P996j0566j251J0928n069p451R768J574j1257N142P996r676k295
4436e089J1237m763p963J0126J990j1468M552Q539r564k871J1271m014q689R046
4450B340L086j0915L859Q972r356l322J0984l268q886Q732L419j0962K969R493
4464G145q873l832J0996k886r122Q607L972j1399K748R186q198m256J1041k328
4478B801r702P980M904j1224K231R473q125m236J0689j451j0014P552N190j0891
4492d823J707R688p514n750J1113j005j0084O963N965j1146Q80J0193o979o149
4506f941J1125o85j0370O743O242j0645O1J0505o240o488J0523J78j0718O020
$$ plain form
4408 66 -7124 3700 4670 -6636 -382 6623 -3908 -4599 6714 424 -6851 3369 4831 -6440
4422 -6440 -928 7068 -3498 -4749 6179 1110 -6341 3427 5001 -6256 -1114 6882 -2794 -5089
4436 -5089 6148 1385 -6578 3548 5538 -5930 -1378 7161 -2403 -5274 5997 1983 -6706 2340
4450 2340 5426 -5489 -1630 7342 -2014 -5336 5648 2380 -6506 2226 5645 -5317 -2348 7145
4464 7145 -1728 -5560 5436 2550 -6572 2035 6007 -5392 -2644 6542 -1656 -5912 5129 2801
4478 2801 -6901 1079 5983 -5241 -3010 6463 -1662 -5898 4791 3340 -6674 878 6068 -4823
4492 -4823 -3116 6572 -942 -6692 4421 3416 -6668 295 6260 -4886 -4006 6187 -792 -6941
4506 -6941 4184 3499 -6871 -128 6114 -4531 -4470 6035 -205 -6693 3830 4008 -6710 -690
4520f90O883j0008m08J0302n876o799J0326M49j0750N914P070r895j003J0174
4534E689n020p152R356J621j0577N067P709r919j781J0945m640p745R359J723
4548D635j0642M892P757r406k156J0591l986q498R529K360j0631L828Q247q733
4562b213l088J1146l689q478Q454L465j0909L676Q447q664l768J0924k643q897
4576f237Q067L914j0687K834R029q580l840J1110k783r285Q152M351j0665K375
4590b245Q823p440m462J0463k106r633P710M877j0613J771R624p527n186J0221
4604D277r77r693O982N607j0464Q81R314o102n455R761r46r841P243N439r982
4619c956K59R784o193n895R495K86j0084O239O201r972k79R934n830o151R465
$$ plain form
4520 -690 6193 -3815 -4223 6079 203 -6596 3730 4179 -6571 -657 6413 -3482 -4485 5689
4534 5689 669 -6483 2873 4494 -6083 -1016 6693 -3226 -5007 5938 1298 -6447 2912 4635
4548 4635 -6007 -1115 6642 -2764 -4920 5671 1685 -6813 2716 5076 -5555 -1727 6520 -2213
4562 -2213 -5301 5845 2156 -6322 2132 5597 -5312 -1636 6811 -1853 -5621 5303 2660 -6237
4576 -6237 1830 5744 -4943 -2109 6920 -1660 -5500 5610 2827 -6458 1694 6045 -4620 -2245
4590 -2245 6578 -862 -5324 5139 3033 -6600 1110 5987 -4626 -2855 6769 -758 -5944 4277
4604 4277 3300 -6393 589 6196 -4268 -3387 5927 -175 -5630 4131 3185 -6656 587 6026 -3956
4619 -3956 -3697 6087 -106 -6001 3494 3780 -6304 -65 6136 -3836 -4115 5819 -11 -6162 3303
4634C303M69r974N535O825r632r01J0214n228o915R055R46r649N311O577q998
4649c062j380R891m748o805Q869J562j0084M437P641r138j825J0359m883p368
4663f534R031K141j0116L963P549q168k355J0114m166q015Q822K812r972L155
4677a739P867q031l050J0251l273q076Q393L066j0294K945Q183p652l493R976
4691E073k971q363P991M133j0356K583Q150p533l750R779k126q628P446M088r707
4706d191J503R167p236m809R995j676q654P337M105r577J089R179o862m801R293
4721C862q72q792O519M922r842P55R776o356n677R415k29r143O049N390r282j56
4737c661R442n563n860R209J4r125N017O100r145l90R942n703o431R313Q16r324
$$ plain form
4634 3303 3772 -6202 -667 6158 -3474 -4375 5839 611 -6304 2751 3697 -5952 -641 5936 -3062
4649 -3062 -4442 5449 701 -6104 2765 4327 -5757 -1320 6321 -2817 -4642 5717 834 -6534
4663 -6534 2497 4638 -5478 -1515 6034 -2134 -4489 5625 1459 -6556 2266 5078 -4894 -1739
4677 -1739 6128 -1903 -4953 5298 2025 -6051 2342 5408 -4886 -1941 6242 -1410 -4903 5073
4691 5073 2102 -6261 1730 5863 -4493 -1910 6240 -1293 -5043 4736 2610 -6018 1428 5516 -4191
4706 -4191 -2688 6479 -757 -5566 4429 2753 -5901 1436 5541 -4036 -2947 6232 -630 -5431 3862
4721 3862 2990 -5802 717 5639 -4203 -3448 6328 -28 -5705 3710 3481 -5662 387 5777 -3505 -3661
4737 -3661 5781 218 -5642 3567 3581 -5544 -527 5573 -3572 -3962 5980 277 -6154 3159 3975 -5349
4753e349M813N957q463j065R541n197o206Q555J579r543M385O827q858j084R253
4768E145m531o810Q965J192r509M019P343q301j798R463m493o480Q119K130r686
4783e232L561P392p830k539R177l314p026P845K437r583L060P711p564k777Q880
4798D198k603p347P547K944r502K632Q061p620k880Q997k349p554P020L164q734
4813d026J775Q107o939m065R199j171q222O389L966r141K040Q097p025l815R301
4828D470j619q420O071M757q792P16Q446o114m644R231r12q455N581N037q653
4843c300O58Q406o005m846Q592J98q828N318M883q260J76Q521n348n605Q722O13
4859C895r011M909N704q080q68Q726m558n920Q302N27q855M744N851q142p63Q424
$$ plain form
4753 -5349 -536 5421 -3042 -4107 5434 237 -5969 2586 4165 -5378 -993 5834 -3024 -4108 5145
4768 5145 614 -6196 2769 3961 -5548 -1529 5814 -2487 -4285 5178 685 -5795 2324 4454 -5232
4783 -5232 -1671 5721 -2109 -4648 4529 1215 -5811 2034 4471 -5112 -2052 5659 -1905 -4682 4198
4798 4198 1595 -5752 1795 4739 -4763 -2131 5930 -1690 -4570 4427 2078 -5476 1544 4708 -4026
4813 -4026 -2251 5856 -1083 -5148 4051 2880 -5342 1047 5013 -4128 -2088 6009 -1016 -4831 4470
4828 4470 2851 -5569 502 5259 -3533 -2817 5629 -485 -5129 4102 3190 -5265 316 5353 -3300
4843 -3300 -2642 5764 -241 -5087 3505 3703 -5125 193 5076 -3184 -3008 5513 165 -5440 3282 3895
4859 3895 -5116 -207 5497 -2583 -3451 5275 717 -5203 3099 3626 -5229 -485 5366 -2776 -3539 4885
4875D885m162o300Q272R93q668L901O423p920j413Q594l590o398P453J689q625
4890d866L914O565p696k390Q901l267o448P095K570q738K698O922p070k590Q552
4905D152l065o392O949K471q469K787O802o962k836Q561k299p097O715L000q366
4920d049K112P162o537l419Q789k038p054O269L327q538J717P562o296l989R030
4935D048j750p482O180L795q346J095P494n569m087Q399p21q227N897M205q240
4950c309P46P824n405m446Q004o28p874N445M883q100K82P676n279m367P803r8
4966C157p680M608N184q027l74Q385m790n188P754N20q177M245N444p399o14P825
4982D873m046o000P579J240q013L880N519p322j102Q113l572o101P112J639q403
$$ plain form
4875 4885 723 -5577 2695 3688 -4980 -1079 5344 -2576 -3989 4605 1015 -5383 2070 3759 -4866
4890 -4866 -952 5613 -2083 -4473 4428 1161 -5287 1808 4378 -4360 -1662 5260 -1810 -4400 4152
4905 4152 1087 -5305 1644 4115 -4354 -1567 5235 -1727 -4563 3998 1699 -5398 1317 4317 -4049
4920 -4049 -1937 5225 -1312 -4731 4058 2020 -5034 1235 4562 -3976 -2259 5303 -993 -4982 4048
4935 4048 2298 -5184 996 4791 -3555 -2460 5034 -535 -4622 3777 3056 -5171 726 4931 -3309
4950 -3309 -2563 5261 -144 -4590 3414 2786 -5088 357 5240 -2860 -2578 5098 -181 -4548 3255 3157
4966 3157 -4523 85 5269 -2758 -3132 5253 463 -4725 3029 3549 -4628 -383 5061 -2338 -2952 4873
4982 4873 827 -5173 2406 3646 -4367 -487 5032 -2290 -3392 4721 1149 -4952 2160 3799 -4604
4997d604L848N848p346j414Q075l494n899O653J822p898L171N944o698j879P955
5012D084k983o095O688K360q257K761O192o443k529P755j844p092O579K571p610
5027c863K213O170o148k647Q091k067o996O198K836p573J810O617n966k956P839
5042C558j668o901N606L548p916J533O778n166l736P400j037o894N270L935p584
5057c274P20P132n162l719P483n40p419N306M007p458M80P215m905m333P518j38
5073B913p334M428M921p819J21P383m646m292O768N23p215M418M580p230l92P444
5089D571m009n030P379L32p238M008M827o798j017P206l443n208O815J150p672
5104d127L590N030o807r35P538l333n245O378J089o893K709N540o458j253P278
$$ plain form
4997 -4604 -756 5092 -2254 -3668 4407 913 -4986 1667 3489 -4409 -1238 4706 -1992 -3871 4084
5012 4084 1101 -4994 1694 4054 -4203 -1442 4750 -1693 -4222 3533 1689 -5403 1176 3747 -3863
5027 -3863 -1650 4520 -1628 -4275 3816 1749 -5247 951 3787 -3786 -1976 4641 -1325 -4281 3558
5042 3558 1890 -5011 595 4143 -3773 -2240 4538 -628 -4364 3036 1999 -4895 375 4310 -3274
5057 -3274 -2554 4578 -584 -4303 3180 2640 -4779 527 4534 -2924 -2444 4771 -134 -4467 3051 2913
5073 2913 -4421 7 4928 -2891 -2770 4613 -33 -4325 2443 2966 -4249 169 4749 -2481 -2873 4571
5089 4571 562 -4468 2911 3243 -3995 13 4840 -1958 -2975 4231 788 -4420 2395 3545 -4127
5104 -4127 -537 4493 -2314 -3249 4289 956 -4289 2089 3178 -3715 -1006 4534 -1924 -3177 4101
5119D101l068n602O342K021p570K614N993o408j867P204k597n675O172K204p542
5134c678K421N451n427k739P645k248o132N903K564p392J983O010n473k644P244
5149C488j847o253N434K866p112J322O467n451k961P059j201o403N354L264p239
5164c213Q37O664n104l329P292j108o275M821L210o902N79O864m499m081P041
5179B797l24o927M590L799o783O20O470m266l945O477O4o633L970M478o759j73
5195b545O791m008m384O395N52o685L671M570p002K6O725l695m361O472L61o533
5211c650L562M310o084p85O785l451m689O420R56o754K529N138n752j651O971
5226C855k977n169N945J757o899K807N019n844j606O852k551n368N856J869o853
$$ plain form
5119 4101 1033 -4569 1773 3794 -3776 -1162 4831 -1577 -3444 3760 1163 -4512 1660 3864 -3678
5134 -3678 -1257 4194 -1233 -3972 3673 1425 -4707 1196 3760 -3632 -1649 4361 -1112 -3756 3488
5149 3488 1641 -4612 822 3688 -3424 -2102 4365 -1086 -4047 3012 1811 -4592 762 4026 -3213
5164 -3213 -2376 4288 -816 -4145 3147 2039 -4236 585 3795 -3107 -2528 4336 -163 -4244 2797
5179 2797 2473 -4454 136 3935 -2848 -2228 4242 -24 -3969 2508 2572 -4061 -91 4387 -2372 -2545
5195 -2545 4246 238 -4146 2249 2801 -3884 -213 4357 -2645 -2619 4106 411 -3950 2522 2883 -3650
5211 -3650 -88 4222 -1862 -2647 4138 687 -4002 2418 3374 -3380 -851 4287 -1465 -3116 3855
5226 3855 878 -4291 1654 3411 -3488 -681 4338 -1506 -3112 3740 1189 -4179 1677 3546 -3307
5241c307J949N591n646k038O747k156n053M800K643p062K107N714n223k493O348
5256B921j456n261M920K494o764J197O139n224k534O595j285n722M403L084o855
5271c348J389N826m540l074O375p63o089M425L334o352Q17N676m202l491O723
5286B706p90o084M092L681o315M74N984m482l310O348k33o240L766M105o285K34
5302b349O108l914l778O457j96o133L604L714n778l61O240l589m214O222K91n987
5318c663L291M266n915q58O488k967m457O108P33o801K977M898o023q74O081k355
5334I29m619N470J246o735K840M821n519j474O330k195m948N580J061o199K416
5349i96N202n567j531O296k296m965N434J422n992K157M615m844j972O187k015
$$ plain form
5241 -3307 -1358 4233 -1413 -3451 3296 1140 -3913 887 3530 -3532 -1425 4289 -934 -3427 2921
5256 2921 1465 -3796 1124 3618 -3146 -1949 4190 -1034 -3568 3027 1742 -3980 423 3507 -3348
5271 -3348 -1959 3867 -673 -3747 2628 1865 -4224 201 3535 -2817 -2000 3676 -526 -4017 2706
5286 2706 1916 -4168 -76 3605 -2710 -2236 3748 -734 -4044 2304 2071 -4169 -403 3702 -2583 -2349
5302 -2349 3759 -155 -3933 2524 2328 -3805 -201 3513 -2265 -2626 3614 25 -4189 2033 2324 -3663
5318 -3663 -372 3894 -2021 -2879 3609 642 -3815 2293 3026 -3775 -798 4100 -1923 -2797 3284 929
5334 929 -3690 1780 3026 -3709 -869 3952 -1567 -3041 3289 1094 -3854 1726 2787 -3412 -996
5349 -996 4206 -1361 -2892 3404 1108 -3857 1577 2999 -2993 -836 3779 -1065 -3037 3150 1135
5364A135n061M892K567o574J693N777n407k481O597j506n444M823K215o281J571
5379a484N222m402k577N954j193n332M306L014n956L77O128m399k936O133j215
5394A640n652M346L378o201N54N774m111l375O095j97o003L790L597o244M09N889
5410C689l938l298N739k50n670L634L372n265n81O093l516l838O386n04n581L244
5426b84L983n739o56N888k957l897N828J91n961K899M413n628q00O327l121m306
5442c820N673Q37n854K720M222n468j257O543k903m056M679J422n838K399M477
5457C776n174j647O076k227m519M937J559o138K444M675n085j514O162k139m955
5472c769M961J972n791J742M845m799k028N694j443n002M777K173n822J406M660
$$ plain form
5364 1135 -3926 966 3533 -3041 -1348 4429 -978 -3459 3138 1632 -3812 1011 3226 -3055 -1484
5379 -1484 3738 -664 -3241 2713 1520 -3812 494 3508 -2448 -2071 4057 -342 -3278 2855 1640
5394 1640 -4012 334 3712 -2489 -1935 3839 -272 -3647 2448 2251 -3752 38 3635 -2609 -2200 3689
5410 3689 -249 -3547 2192 1942 -3728 -94 3278 -1987 -2568 3525 9 -3829 2557 2053 -3528 -284
5426 -284 3699 -2040 -2696 3192 235 -3662 2166 2357 -3604 -705 3708 -1920 -2720 3607 486 -3820
5442 -3820 1853 2690 -3164 -444 3778 -1690 -2947 3596 693 -3363 1316 2738 -3100 -701 3776
5457 3776 -1398 -3045 3031 804 -3715 1222 2781 -3357 -913 3762 -1323 -2837 3325 1186 -3769
5472 -3769 1192 3164 -2627 -885 3960 -839 -2867 2827 1384 -3618 1159 3332 -2490 -1084 3576
5487C576m143k301N512j040n094M289K593o125J247N184m149k303N374q39n530
5502c749M301K958n954P95N571m305k723N820r99n004L631L063n986Q20N373l917
5518c05l111N925p69n103L471L090n439J54N434l617l270N567R1n709L696L285
5534C390n756k60N947l127l796N663K85o002L408L794n382n99N274k388m106N393
5550A738P43o003L214L554n110n18N131k176l883M701J015n925K665L861m801
5565a794r11N572k357m151M742J942o063J823M813m863j455N582j981m433M793
5580A259J724n786J691M593m465j781N792j843m768M783J841n813J533M810m572
5595a002k138N958j244n183M379K011n225J275N024m549k286N832j162n230M205
$$ plain form
5487 3576 -567 -2868 2644 1604 -3490 799 3392 -2733 -1486 3698 -451 -2754 2620 1781 -3749
5502 -3749 552 3510 -2444 -1649 3922 -383 -3106 2714 1715 -3289 342 3405 -2581 -1761 3612 -305
5518 -305 -3416 2509 1740 -3363 108 3198 -2241 -2087 3347 -270 -3540 2027 2118 -3591 105 3390
5534 3390 -2366 -2626 3321 194 -3602 2061 2346 -3656 -248 3546 -1836 -2435 2839 451 -3655 1738
5550 1738 2481 -3522 -308 3246 -1864 -2382 2749 573 -3310 1391 2406 -3519 -854 3007 -1794
5565 -1794 -2705 2867 510 -3641 1101 3043 -3020 -1197 3616 -1247 -2702 2880 899 -3534 1259
5580 1259 2983 -2803 -1112 3481 -984 -2765 3027 1184 -3584 1199 3040 -2773 -1240 3570 -1002
5595 -1002 -3140 2818 1574 -3609 770 2781 -2444 -1169 3855 -694 -2980 2852 1690 -3540 665
5610F65K473n665J265M458l544k517N289p88m664L429L098n674J16N691l804k847
5626c019N367j13n338L360L064n591N26N285l645l118N083P0n227L699L159n846
5642b284J34N655l564l396N361K46n412L109L442n295J99M819k525l792N075O07
5658B379n223K424L777n129m46N169k380m198N329M63n255K658L559m971q98N516
5674B774k016m487N327Q72n899K552M326m863j419N809k105m151M710J283n790
5689c077K341M303m617j549N429j786m555M460J819n797J873M520m262j869N686
5704B919j408n066M604J866n420J188M738m056k291N707j572m659M559J914n436
5719b413J085N109m342k324N465j002m560L872K317n608Q78M985l606k702N214
$$ plain form
5610 665 3138 -2527 -1262 3196 -348 -2865 2424 1636 -3028 401 3499 -2175 -2059 3632 -172 -3019
5626 -3019 2348 2235 -3103 257 3321 -2270 -1744 3541 -104 -3222 1861 1931 -3296 403 3562 -2284
5642 -2284 -2150 3505 -59 -3455 1906 2152 -3260 -151 3291 -2004 -1805 3014 489 -3303 1772 2379
5658 2379 -2844 -420 3357 -1772 -2218 2951 571 -3627 1702 2165 -3090 -432 3127 -1844 -2742 2774
5674 2774 758 -3729 1598 2470 -3429 -877 3449 -1414 -2833 2976 871 -3280 1430 2713 -3077
5689 -3077 -736 3567 -1050 -2599 2830 1044 -3511 949 2768 -3029 -1156 3364 -898 -2767 2919
5704 2919 1511 -3555 1049 2915 -2505 -1317 3421 -635 -2926 2781 1209 -3450 1109 3023 -2413
5719 -2413 -1328 3781 -561 -2885 2580 1578 -2982 890 3207 -2401 -1523 3462 -144 -2846 2368
5734B368l48n307L492L135n462N98M882l519k642N039m02n157L675K771n090L3
5750a934N229l188l261N550m37n174L351L448n639R4N429l299l536N126O20n567
5766c188K648L862n116n07N461k827l625N107K95m896K523L640m816q45N141k360
5782D97l712M758J005n668K360L948m820r39N442k265l923M623J202n825K239
5797a078M466m390j709N564k283m265M724J597n556J856M215m440j449N295j446
5812A101m440M299J656n303J365M447m077k015N548j541m503M378J804n366J347
5827a300M470m031k147N594j068m968M069K420n493R53M781l756k748N635r95
5842A416m835L833K638n175N56M661l782k102M941l52n172L624L199n487L29N126
$$ plain form
5734 2368 2020 -3287 205 3340 -2122 -1524 3358 -161 -2803 2236 1834 -3323 352 3123 -1967 -1934
5750 -1934 3295 107 -3154 2396 1959 -3215 136 3584 -2055 -1961 3468 169 -3367 1759 2379 -3188
5766 -3188 -540 3322 -1794 -2301 3160 333 -3292 1815 2110 -2786 -263 3377 -1439 -2284 2857 497
5782 497 -3215 1543 2548 -3120 -760 3188 -1632 -2571 2871 606 -3317 1306 2508 -3317 -1078
5797 -1078 3388 -1002 -2711 2853 570 -3695 1029 2626 -2930 -1074 3141 -1299 -2748 2547 1101
5812 1101 -3339 960 2616 -2687 -1322 3125 -952 -2967 2581 1040 -3463 915 2719 -2647 -1300
5827 -1300 3170 -861 -3008 2586 1518 -3450 619 3039 -2454 -1501 3280 -476 -3224 2411 1416
5842 1416 -3419 414 3052 -2123 -1567 3094 -688 -2790 2151 1799 -3373 251 3450 -2037 -1708 3418
5858C418l608k815N150j4n090L070K966m768l06M789k555l237M849K16n022K998
5874D1L522n169p14N271k764l323N087N44n373K512L763m848n88N399k890l700
5890c230M719N55m823K443L558m864q46N260j997l887M679R07n062J894L782m584
5906a496j102N372j817m196M392J242n224J911M269m720j110N055j801l971M314
5921A118J067m691J652L728m258j399N394j555m361M438J331n037J381M249l826
5936g69k329N538j105m874M469J988n316J015M463l593k286N255j330m203L500
5951D23K605n420Q21M859l848k243M919o67m537L114L104m916J8N130l623k618
5967b879M868j08m877L187K966n242N41M703l347k717M774j59m889L124L253m914
$$ plain form
5858 3418 -190 -3005 2145 2131 -2959 111 3077 -1691 -1997 2792 237 -3000 1849 2065 -2957 41
5874 41 3563 -1606 -2320 2951 187 -3136 1951 2495 -2878 -366 3397 -1451 -2039 3360 470 -3230
5890 -3230 1489 2044 -2779 -336 3222 -1642 -2488 2772 775 -3112 1567 2474 -2588 -694 3088 -1496
5906 -1496 -2598 2774 957 -3239 1153 2395 -2829 -918 3351 -1369 -2479 2576 775 -3196 1118
5921 1118 2185 -2506 -854 2874 -1384 -2783 2611 1056 -3305 1133 2464 -2573 -1192 3057 -769
5936 -769 -3098 2440 1335 -3539 930 2918 -2398 -1383 3080 -513 -2799 2456 1126 -3077 423
5951 423 3028 -2392 -1571 3288 -560 -2803 2116 1449 -3088 26 3130 -1786 -1768 3362 -261 -2879
5967 -2879 1989 1881 -2996 191 3157 -2085 -1544 3159 -188 -2905 1869 1710 -3179 -55 3198 -1716
5983a716p4M673k711k929M542J93m700K523L575m806n63N151k814l200M338J160
5999B642n404K456L312m615k55M560k165l371L885J159m741K130L504m669n83
6014b155M531j796l818M398J302n068K197L320m064j398N374k107l957M631R29
6029B319m854J832L756m044j459N156j596m365M098J467m752J538M228m311j860
6044b847N419j573m535M071J916m968J522L925l692k103N184j289m352L992J968
6059B638n046R39M267l239k435M996j002m350L695K501n165R27M464l763k266
6074b839M886n87m349K772L065m733j7M643l305k577N224o38m521L098K768m522
6090a632N8M648k987k771M742l53m685K725K999m377k92M917k827l010M703j0
$$ plain form
5983 -1716 -1790 2883 172 -2757 1785 1978 -2722 -199 3376 -1430 -1993 3158 344 -2856 1482 2642
5999 2642 -2762 -306 3006 -1609 -1864 2696 531 -2840 1045 2204 -2537 -407 3097 -1572 -2155
6014 -2155 2376 580 -3238 1160 2462 -2606 -409 2911 -1153 -2551 2823 716 -3241 1390 2319
6029 2319 -2535 -703 3053 -991 -2450 2706 1110 -3255 843 2310 -2442 -904 3324 -987 -2847
6044 -2847 2572 999 -3536 535 2451 -2517 -995 2930 -762 -2865 2319 1030 -3322 670 2638
6059 2638 -2408 -1469 2798 -441 -2876 2120 1118 -3232 463 2964 -2201 -1274 3190 -573 -2839
6074 -2839 2047 1460 -2889 -117 2948 -1785 -1802 2841 -464 -3041 2183 1545 -2976 122 2890 -1632
6090 -1632 -1574 3074 87 -2684 2058 1705 -2980 -255 2744 -1633 -1925 2992 165 -2845 1858 1848
6106A848m533K624L141m757k29M886k609l371M681L38m720K534L542m889n30M739
6122B695k272l576M820M92m921K407L442m446q50M930j923l654M102J138m915
6137b531J951L684m261j208N175j973l816M288J112m818J418M058l995j577M830
6152B337j678l395L527J641n030J562M089l643j785M702j389l836L499J950m789
6167b238J159L974l519j846M877j440l640L060K087m511P33M212l403k232M700
6182A973q00l823L216K007m543N84M249l098k646M879m27m367L096K126m500L88
6198a686M481l291k118M285j52m361K928K353m059P6M346k720k847M596j2m381
6214b562K492K646m249R8M229k541k981M654jm154K129L008m491l34M627k164
$$ plain form
6106 1848 -2685 -61 3080 -1677 -1906 2980 371 -3000 1681 2019 -2701 -167 3375 -1514 -2044 2695
6122 2695 423 -3153 1667 2159 -2762 -355 3087 -1359 -2209 2721 798 -2856 1246 2384 -2531
6137 -2531 -580 3104 -1157 -2365 2810 837 -2979 1309 2421 -2397 -979 3079 -916 -2493 2337
6152 2337 659 -2736 791 2432 -2598 -1036 3053 -590 -2375 2327 938 -2898 601 2551 -2238
6167 -2238 -1079 2895 -624 -2470 2407 967 -2673 387 2474 -2037 -1304 2908 -495 -2727 1973
6182 1973 1173 -2650 566 2573 -1970 -1386 2863 -235 -2881 1998 1571 -2796 300 2426 -2074 -1686
6198 -1686 2795 -496 -2614 1671 1519 -2842 86 2439 -1620 -1544 2802 82 -2765 1831 1819 -2562
6214 -2562 -70 2576 -1673 -1575 2654 113 -2868 1786 1785 -2369 -240 2768 -1723 -2057 2570 406
6230D06l256M228L45m477K474K990l973p07M665k134l318M064Q03m696J954L516
6246B884l929p07M339j644l495L906R34m617J953L081l618j265M623j501l207
6261b263L571J024m572J454L410l815r61M234j354l306L605J165m189J230L547
6276B780l650j301M337j284l481L412J551m482R13L567k985j838M605r79l964
6291b799L071K167m215P91L628l218j948M315o86l703L318J519m303O54M041l059
6307d27k060M299l84m204K789K225m083M10M087k739k454M206O9m419K928K229
6323B472m412N02L777k633k464M289j35l760K133K749m082K6L741k266k639M076
6339A374L59l911J739K718l866o0L928j826k968L796N57m028J608L057l784l46
$$ plain form
6230 406 -2850 1378 1723 -2754 -280 2710 -1263 -1970 2695 561 -2757 1307 2110 -2586 -632 2884
6246 2884 -1045 -1752 2587 943 -2552 1354 2288 -2329 -376 2705 -913 -2178 2445 944 -2263
6261 -2263 1308 2332 -2240 -786 2624 -1191 -2152 2082 728 -2578 1027 2192 -1997 -767 2780
6276 2780 -870 -2171 2166 882 -2599 813 2364 -2118 -1205 2362 -623 -2461 2144 1165 -2799
6291 -2799 272 2439 -1776 -985 2643 -575 -2523 1792 1106 -2597 721 2240 -2063 -1409 2632 -427
6307 -427 -2487 1812 1428 -2776 13 2238 -1845 -1435 2652 -87 -2541 1665 1734 -2685 243 2472
6323 2472 -1940 -1438 2339 -294 -2758 1531 1396 -2364 -231 2518 -1564 -1538 2203 -63 -2702 1374
6339 1374 1733 -2178 -439 2279 -1587 -1647 2281 455 -2513 1283 1840 -2188 -580 2477 -1307 -1653
6355a653M131k285k968L891R82m416J806K868l274r69M295j862k900L184J072
6370A902l921J510L131l746j150M167j175l263L517J454m331J294L047l191j243
6385a998M459j492l355L207J611m344R20L477l148j379M025j010l533L276J556
6400B272l989J108L459l288j841M071q20l352K781J796m120O64L744k895j662
6415b072L530M1m113K798K319m217L42L854k787j815L754l41l787K626K259l809
6431a418j51L996k621k309L853P2l856K184K143l517M52L264k048k461L719Ql654
6448b344K270K463l742m81M269k345k398L456K19l871K389K219l388n8L690k469
6464a21k140L306N50l524J420K974l885P1L351j585k687L188P59l894J539K923
$$ plain form
6355 -1653 2478 193 -2775 1116 2098 -2318 -512 2356 -918 -1887 2408 546 -2354 830 1902
6370 1902 -2019 -509 2622 -1124 -2274 1893 718 -2545 972 2426 -1905 -611 2436 -755 -1998
6385 -1998 2461 969 -2386 821 2432 -1912 -992 2485 -663 -2042 1983 973 -2560 716 2272
6400 2272 -1717 -609 2850 -438 -2279 1792 972 -2380 401 2197 -1923 -1259 2485 -410 -2072
6415 -2072 1458 1499 -2614 184 2503 -1714 -1372 2482 -305 -2120 1634 1293 -2494 132 2391 -1418
6431 -1418 -1569 2427 -194 -2503 1350 1422 -2434 -250 1893 -1624 -1172 2092 44 -2417 1302 1310 -2344
6448 -2344 -74 2389 -1353 -1834 2435 90 -2308 1148 1367 -2504 -115 2104 -1284 -1342 2348 -121
6464 -121 -2261 1045 1595 -1929 -509 2465 -1420 -1349 2002 417 -2270 918 1677 -2217 -678 2245
6480B245l151q48L860j388l202L418P43l477J522K844l198r67L751j259l096L275
6496A072P51l634R72L457l181j010L370j238k624K765J529l823Q76L154l216q27
6512a607L307l08l577K557J307l241O87L260l047j300L644r37l066K654J768l730
6528a629O06L182k484j640L610l33l499K402K021l603M35K870k427j540L514j66
6544A319l541K499J928l826M02L326k222k083L655m9l896K288K221l449j0L579
6560B141k262k082L333k18l049J759K318l236n3L295j878k091L042J56l522J814
6576e33K565l223l02L503j690k571K881O05l316J474K702k987n03L393j725k599
6592b326L365Q25l863J341K496k884q14L709j337k992L293P01l429J149L114l269
$$ plain form
6480 2245 -906 -1754 2106 718 -2484 934 1677 -1800 -278 2566 -632 -1599 2152 893 -2203 1072
6496 1072 1823 -1811 -839 2618 -563 -1573 1797 559 -2065 700 2229 -1594 -718 2436 -780 -1607
6512 -1607 1700 1392 -2185 372 1679 -1562 -875 2385 -662 -1962 1682 745 -2321 333 2101 -1629
6528 -1629 -1023 2159 -325 -1965 1645 1312 -2187 215 2236 -1367 -932 1938 -489 -2029 1485 1319
6544 1319 -2222 277 2205 -1621 -1219 2107 -115 -2198 1457 1408 -2488 -200 2021 -1428 -1438 2141
6560 2141 -121 -2203 1130 912 -2137 -378 1940 -1296 -1349 1946 68 -2023 1019 1175 -2347 -533
6576 -533 2032 -1191 -1493 2010 320 -2251 630 1235 -2081 -607 2095 -892 -1395 1998 273 -2326
6592 -2326 1039 1864 -1999 -658 1838 -1046 -1860 1849 512 -2480 813 1514 -1915 -766 2348 -921
6608i21j091L952j301k766K525J255l543J275L150l181j200L518q10k930K873
6623H05J313l582P07K728k403j517L911q77l180K600J196l218O51L176k518j605
6639a813L691p71l271K378J810l385N12L014k415j888L868m25l193K158J597l181
6655a314O96K497j539k274L107k04l190K080K167l261J18L094k035j628K945q1
6671A178l406K050K055l278k28L546j781j869L032n8l225J538J948k513j69K853
6687A673j467k227K679Q30l151J213K405k949o25L626j812k303K865P69l509J712
6703b71K401l233k58K895q90k555K623R48l475J386K218k616p86L139j046k751
6719b271K840P43l028J105K669k679j268L317q75k448K459J167l450J145K881
$$ plain form
6608 -921 -2012 1940 639 -2127 398 1653 -1890 -615 2535 -646 -1846 1672 862 -2068 805
6623 805 2118 -1464 -757 1971 -432 -1949 1962 1085 -2095 505 1701 -1517 -866 2310 -208 -1813
6639 -1813 1878 1107 -2164 214 2024 -1361 -849 2165 -250 -2138 1730 1305 -1888 270 1867 -1314
6655 -1314 -618 1879 340 -1934 1173 969 -2221 -141 2026 -1235 -1117 1977 -58 -1686 1259 1178
6671 1178 -2228 -178 1877 -1401 -1629 1917 136 -1733 1299 1241 -1984 -446 1502 -1011 -1180 1673
6687 1673 206 -2021 658 1488 -1663 -450 1955 -994 -1619 2007 195 -2108 757 1526 -1983 -271
6703 -271 2130 -1103 -1361 1534 644 -1911 712 1660 -1815 -429 1789 -827 -1613 1526 480 -2271
6719 -2271 569 1312 -1716 -611 2058 -621 -1889 1428 553 -1895 564 1731 -1719 -574 2307
6734B307l184o20L132o27l012K517J208l425J037K680k308j527L500o82l117K792
6750F71J271l345O58K768k393j443L236l74l215K767J282l228L08K986k215j212
6766a478K985n02k879J855J852k935N7K895k014j941L407k25l047J854J911k789
6782i94J68K576j614j965L105n4l216K278J649k951L93K531j959j598K741M45
6798A535l253J768J778l073j12L156j409k267K509P22k987J419J742k594k23L043
6814A754j155k592K993K73k991J532J955k530p97L302j505k242K884M40l086J318
6830d47J995k382p27K920j337j896K513Q09l065P10K607k323r87K905p06k441
6846a852K585Q01l136Q50K565k168j251L047o21k774K337J289l190M21L094k414
$$ plain form
6734 2307 -877 -1497 1635 1008 -2004 513 1721 -1704 -667 2013 -295 -1822 1678 996 -2121 671
6750 671 1942 -1403 -745 2023 -370 -1813 1423 1049 -2166 601 1883 -1345 -1037 1949 -266 -1478
6766 -1478 1507 1005 -1874 -19 1833 -1102 -1045 1850 -164 -2105 1302 1077 -1970 -116 1795 -994
6782 -994 -826 1750 136 -1829 1276 1222 -1994 284 1933 -1018 -625 1906 -53 -1651 1090 1535
6798 1535 -1718 50 1828 -1245 -1357 1799 390 -1877 632 1354 -1633 -214 1528 -1066 -1289 1754
6814 1754 599 -1993 1000 1273 -1718 -186 1769 -761 -1558 1744 239 -2003 881 1321 -1765 -447
6830 -447 1548 -834 -1561 1359 22 -1874 639 1448 -1617 -907 1700 -623 -1610 1295 589 -1852
6846 -1852 733 1534 -1602 -752 1813 -355 -1606 1441 820 -1954 383 1672 -1518 -1097 1997 -417
6862d17j421K988m31k689K359J377l527O85K965k248j173K967m71k777K400Q86
6878A473k867L24K818j883j705L343o43k816K107J395k817K81K716j732j581K613
6894A026jl069J973K049k753o44L492j810k039K767J73k509J222K096k947j70
6910a144K730j216k010K606K15l172J889K126k895k57K687j528j658K546J14k538
6926a505J147K380k847o06L129j138k406K436O98k641J083K308l063k17K583q06
6942E35k432K601Q14l222J126K452k383p97L143j464k229K426J001l190J121K253
6958A755k635o09L095j114k346K535Q64l136Q63K635k359j173L133j223j911J715
6974H9J554k870O03K388j822j635K877n11k653K415J046k874O15K228k053j087
$$ plain form
6862 -417 -1838 1150 719 -1970 389 1766 -1761 -1076 1889 -359 -1532 1435 964 -1813 587 1473
6878 1473 -1394 -1070 1748 -135 -1840 1503 860 -1956 151 1546 -1271 -990 1726 -6 -1587 1026
6894 1026 1025 -2044 -71 1978 -775 -1419 2073 263 -1776 991 1164 -1345 -123 1973 -974 -1144
6910 -1144 1586 370 -1640 966 1181 -1991 -102 2024 -871 -1128 1559 31 -1627 919 1033 -1505
6926 -1505 -358 2022 -825 -1431 1698 560 -1846 590 1288 -1353 -270 2038 -1025 -1242 1341 535
6942 535 -1897 704 1518 -1704 -578 1874 -509 -1306 1837 373 -1856 570 1571 -1619 -498 1755
6958 1755 -880 -1489 1606 492 -1854 681 1545 -1591 -728 1907 -452 -1625 1508 285 -1626 89
6974 89 1643 -1227 -624 1764 -58 -1693 1184 673 -1980 435 1481 -1393 -778 1450 -603 -1690
6990a690K976k18k731J974J269k844J14K780j964j527K951j49k569J858J465k904
7006a209K59K514j607j673K877K98l054J680J650k711qK709j687j783K834L0k973
7023a854J820J969l032K15K512j381k055K710jk573J408K207k513o91K816j255
7039C02j849K323O60l118J694J760k810j80L182j961j617K383M34k950J567J981
7055A801k336k93K131r57k004K347O82l182J572K111k441r72K941q28k387K376
7071E61O09k668R24K102k226m84K478p62k570K538R07l126J030K379k035j258
7087a601K911n54k285J896R95k707R54K034k167j352L043n16k586J909J607k879
7103a298K06K807k177j083K783n69k310J876J360k819J70K723j666j514K346R1
$$ plain form
6990 -1690 1286 1068 -1663 311 1580 -1264 -1150 1630 -334 -1861 1090 941 -1628 230 1695 -1209
7006 -1209 -950 1564 -43 -1716 1161 1459 -1595 85 1735 -976 -984 1725 38 -1745 1089 1119 -1854
7023 -1854 -34 1935 -1097 -882 1630 249 -1806 904 903 -1670 -262 1945 -568 -1259 1557 302
7039 302 -1547 776 1436 -1682 12 1772 -1038 -1218 1964 3 -1614 769 1203 -1747 -180 1801
7055 1801 -535 -828 1303 346 -1658 689 1371 -1811 -239 1872 -569 -1541 1400 572 -1815 561
7071 561 1170 -1498 -574 1528 -698 -1182 1296 534 -2036 502 1409 -1717 -687 1692 -343 -1601
7087 -1601 1310 756 -1529 367 1362 -1345 -391 1643 -524 -1876 1167 651 -1935 -26 1581 -1298
7103 -1298 -1092 1715 -462 -1545 1238 669 -1641 235 1595 -1224 -1054 1669 3 -1511 835 926
7119I26k748J658J990k835K17K400j480j515K456j51k237J496J744k919j60K723
7135A565j477j384K307m8k555J858J375k368n27L088j820k010K908J81k788J798
7151A03J405k532M0K596j497j737K673N6k752J715K041l003n64L320j604j870
7167a610K434O81k756R63K301k873l21K882j468j848K332N07k373N86K492k481
7183e52q41K601m21k435K045J034k901P46K324j902j398L165j019k304K022J524
7199A688l085Q08K349k025r75K373m91k290K007J228k939L16K788k185j048K818
7215A337o97k273J773J410l200R52K473j791j477K433J09l055K193J500k937L23
7231i27K732k197j094K492L6k724J956J163k604j56L116j893j963L100J73k749
$$ plain form
7119 926 -1822 -164 1826 -1009 -792 1608 128 -1387 1069 918 -1319 177 1921 -998 -1158 1565
7135 1565 88 -1296 1011 963 -1592 266 1641 -727 -1254 1834 14 -1996 912 1093 -1695 103
7151 103 1508 -1024 -984 1612 115 -1622 1051 1107 -1645 70 2111 -892 -1456 1864 260 -1610
7167 -1610 824 1505 -1251 -288 2013 -860 -1181 1701 233 -1615 717 1224 -1149 -563 1929 -552
7183 -552 -1393 1208 787 -1648 397 1431 -1470 -724 1600 -302 -1700 1465 446 -1858 164 1688
7199 1688 -1397 -589 1760 -265 -1240 1133 642 -1648 359 1587 -1352 -1036 1752 -433 -1481 1337
7215 1337 640 -1633 140 1550 -1650 -698 1775 -16 -1493 940 1049 -2006 187 1687 -1250 -927
7231 -927 1805 -392 -1486 1006 1042 -1682 274 1437 -1167 -1323 1793 -100 -2063 1037 1210 -1539
7247a539J542J723k544j4K630j611j899K594J19k114R39J905k987L24K542j080
7263E30k034K421J38k643J300K159k697j34K706j521j913K354N14k536R55K123
7279A722k108p70K625j118j827K082R87l109J112K000k558n08K963j057k499K788
7295G25Q42k526M81K023k253p26K722m84k496K358O62k627Q31K289k284j095K965
7312A407n73k660K539O85k680N55K471j938j418K976p30k131K336Q16k931Q21
7328d55J935j848j233K505J12k494J673J032k521M66K337j862j239K778l60k485
7344a659K045R51k356k03K728j650j307K414j03k578J899J438k667kK848j525
7360B73j837K976m82k317J471J754k870k12L007j708j433K247K54k767J388J536
$$ plain form
7247 -1539 3 1726 -818 -832 1798 187 -1712 882 1001 -1113 -174 1731 -1256 -932 1610 530
7263 530 -1504 917 1055 -1588 -288 1871 -826 -960 1746 225 -1688 666 1180 -1356 -401 1722
7279 1722 -386 -1156 1469 351 -1476 606 1593 -1516 -404 1596 -962 -1470 1493 436 -2063 725
7295 725 1567 -959 -478 1545 -708 -1434 1288 804 -1692 666 1328 -1299 -468 1821 -463 -1558 1407
7312 1407 834 -1826 713 1398 -1282 -727 1744 -194 -1612 1364 634 -1497 839 1655 -1276 -455
7328 -455 1480 -368 -1601 904 1016 -1478 195 1227 -1294 -828 1509 -353 -1592 1186 826 -1659
7344 -1659 386 1337 -1019 -1222 1506 -144 -1451 963 860 -1718 181 1619 -1048 -1050 1798 273
7360 273 -1564 1412 930 -1387 84 1838 -1032 -1244 1763 55 -1378 869 1123 -1644 -256 1280
7376A280k380k73K911j490j426K360J64k552J108J953k601m01L015j269k028K282
7392F53N38k716R64K167k529o4K483r99j999K279N12k722J316J842k430n07K778
7409A566j049k143K192P42k713J236J567j835q20K549r89j858J850R44k596Q30
7425e27K462k522p34K816r29k039J781R35k706O85K476k101q17K522p15k297K192
7442D82P27k451L59K912k135j285K318l04k086J411J636l018J29K761j696j164
7458a404K622m61k500J831J463k747K75K487j859j084K353k7k682J620J158k446
7474a401K83K677j625j494K431kk489J481J846k678k7K409j471j262K093J95k327
7491a361R87J992k546m0K316q64k145K524J21k243J120J903k509l41K481j027
$$ plain form
7376 1280 -1100 -1373 1538 48 -1378 982 1146 -1406 -298 1655 -946 -1347 1668 399 -1629 653
7392 653 1191 -1525 -561 1606 -923 -987 1496 497 -1502 777 1289 -1433 -117 1725 -705 -1212 1566
7409 1566 517 -1626 566 1308 -1405 -169 1398 -437 -1257 1292 303 -1555 295 1239 -1357 -527
7425 -527 1935 -587 -1321 1495 566 -1473 308 1243 -1463 -778 1698 -403 -1220 1302 587 -1710 482
7442 482 1209 -1242 -883 2029 -106 -1391 927 623 -1463 -52 1584 -1434 -1305 1456 -240 -1404
7458 -1404 1218 757 -1743 88 1551 -1196 -921 1566 -293 -1377 976 949 -1733 -113 1045 -1401
7474 -1401 -1118 1559 -66 -1560 871 869 -1620 -139 1707 -971 -998 1411 -60 -1322 771 966 -1361
7491 -1361 -374 1618 -928 -968 1348 484 -1661 863 984 -1259 -139 1764 -745 -1086 1395 368
7507C68j903K202O29k645J003K396k825l50K343p32k133K365M39k356Q98J517
7523A216j696j072K815q87k223K531R37l030J221K151k528p49K810q22k256K262
7539F80O44k639J072J846j964r53K613q51j858J460J553k874O01K438j905j215
7555a352K448m01k164J795J322k464M87K088j849j336K344J02k429J771J289k535
7571h84Q7K105j371j232K456n76k113J779J116k475m0K608j552j371K315j61k172
7588a481J411J503k454P4K613j725j557K568K2k668J574J767k470m66K953j868
7604b04j362K518%k609J501J684k401j17K406j438j457J985P07k693J067J857
7620A444j913m40K561j576j668K373O9k229R11K198k551k21K147j080j441J826
$$ plain form
7507 368 -1535 667 1296 -1349 -346 2050 -775 -1125 1218 486 -1647 718 1157 -1199 -301 1216
7523 1216 -480 -1552 1263 376 -1847 684 1621 -1409 -188 1963 -565 -1314 1496 674 -1582 680
7539 680 1324 -1315 -243 1603 -361 -1314 1299 448 -1410 50 1603 -1271 -670 1768 -137 -1352
7555 -1352 1096 695 -1469 326 1648 -816 -329 1759 -90 -1426 918 1020 -1409 362 1651 -884
7571 -884 -797 1308 -63 -1295 1161 585 -1528 251 1367 -1108 -1148 1460 -92 -1463 852 691 -1481
7588 -1481 -70 1433 -1021 -947 1666 -59 -1616 952 974 -1694 -120 1647 -823 -1289 1664 -204
7604 -204 -1566 952 952 -1657 -156 1528 -873 -990 1416 -22 -1479 506 1213 -1480 -413 1444
7620 1444 -469 -909 1652 76 -1592 781 850 -1379 -468 1730 -821 -1042 1105 25 -1416 410
7636D10Q40k576R98J823j696j106K634r68k054K247O57k496P86K122k381n64K525
7653A201q42k031K321O90k271P01J936k278q33K376k78k145J643J365k713M72
7669f86K581k228j333K907n60k372K087Q07k164O00J887j705j314K824o97k243
7685a609J716J462k520J45K485j776j357K442j47k339J580J285k270j55K585j408
7701A19j549K506k29k458J152J786k273J25K278j390j728K628J12k378J416J181
7717A298k241J21K099j225j646K308M63k713J082K014k218l73K303j118j430J911
7733F35Q04k783R57J751k192o0K354j125j929K120K73k257J239J605k195m9K125
7750A273r95j721K313J03k239J043J744j619j017K164o51j983K084M68k103P11
$$ plain form
7636 410 1250 -1326 -328 1495 -201 -1307 1327 359 -1695 552 1209 -1287 -501 1621 -760 -1324 1201
7653 1201 359 -1672 649 1339 -932 -231 1705 -573 -1406 970 692 -1453 190 1555 -1158 -686
7669 -686 1895 -333 -1666 1241 681 -1691 396 1203 -961 -361 1526 -179 -1493 1331 634 -1609
7685 -1609 107 1569 -951 -806 1679 -97 -1454 988 841 -1498 82 1367 -903 -1058 1527 119
7701 119 -1430 1076 847 -1611 -459 1327 -946 -821 1457 67 -1661 967 1079 -1299 117 1298
7717 1298 -943 -822 1277 52 -1594 714 1177 -1536 -454 1560 -658 -1031 1272 154 -1276 635
7733 635 1439 -1344 -387 1364 -828 -888 1466 341 -1588 532 805 -1452 -213 1392 -803 -852 1273
7750 1273 278 -1443 870 973 -1266 -223 1521 -98 -1115 1049 398 -1585 499 967 -1136 -425
7766d25J892k402l58K568r09j889J956O85k324P21K140j892r70K158l7k411J814
7783C17R23k150R3K249j809q32K470m19k337J649J341k529N23J979j463j523K822
7800A304o55j765J273J363k430K91K254j792j186K269j36j869J238R58k012J91
7816g04K162j821q10J784J63k518J681J633k544J29K046r16j567K121j77j946
7832a284J196J597k334l69K350q96j816K145J90k184J171J707k260l48K418j049
7848B34j528J560P68k451J252J451j924l58J870p80j431J605M26k094Q44J822
7864A266j817n59K085j123j263J918N92k233P21J662j702o36K009n05j941J716
7880A90R83k246L25K277k143m27J899m87j598J573R46k269M14K123j764p36K206
$$ plain form
7766 -425 1467 -935 -1293 1275 366 -1523 433 1118 -1206 -485 1655 -237 -1207 951 914 -1497 317
7783 317 1240 -910 -817 1432 -377 -1209 1261 842 -1495 154 1495 -1034 -511 1468 5 -1518 1304
7800 1304 649 -1116 157 1520 -910 -619 1635 -157 -1343 926 790 -1079 159 1117 -895 -704
7816 -704 1458 -363 -1173 611 774 -1744 -63 1570 -974 -845 1201 285 -1282 839 662 -1284
7832 -1284 -88 1509 -825 -1194 1156 260 -1556 589 779 -1405 -234 1473 -787 -1135 1283 234
7848 234 -1294 266 1034 -1417 -165 1286 -638 -996 874 94 -1337 268 694 -1400 -556 1266
7864 1266 -551 -1110 975 -148 -1411 507 1099 -1134 -413 1249 -453 -1089 920 415 -1526 190
7880 190 1173 -1073 -748 1529 -614 -1041 858 371 -1227 346 1292 -977 -563 1560 -204 -940 1266
7897A266o08j695J293R07k217M51K353j670j374K259m11k141J677J295k131J98
7913e48J837j331j000K009k71k324J667J182k105L11J645j066j193J741Q7j616
7929i75J370J014k014Q2J951j234j424K158n5j925J247J245j780q50K361r80j524
7946a333J709N90j876R31J293j902m28J908o45j745J997M28k057R88J461j908
7962e89k30J938q32j518J618L87k038Q61J637j844j75J926r31j592J958M95k244
7979a173N61J601j594p51K432l82j894J649L83k036Q20J883k042p11K094n28j745
7996a433J699P89j924L87J807j769p23K193n16j786J539P65k072N88J723j399
8012a32o66J968p29j682J448Q53j794J85J844j542m99J611k38k060J843J037k463
$$ plain form
7897 1266 658 -1037 256 1163 -1054 -603 1750 80 -1294 965 554 -1587 90 1385 -746 -548
7913 -548 1289 -42 -1042 967 696 -1628 39 1221 -884 -573 1072 6 -1187 554 641 -975
7929 -975 395 1409 -605 -523 1428 194 -1230 928 873 -1052 195 1440 -340 -1190 1171 191 -1333
7946 -1333 376 966 -910 21 1314 -588 -1016 892 247 -1498 499 927 -1130 -142 1319 -589
7962 -589 -819 1119 287 -1231 387 774 -1264 -403 1234 -610 -785 1141 210 -1382 576 1071 -1173
7979 -1173 -612 989 -605 -1356 1076 694 -1200 449 832 -1204 -384 1499 -543 -1254 840 312 -1433
7996 -1433 266 1055 -869 -482 1325 -444 -1167 1026 510 -1276 263 1028 -1044 -456 1267 -132
8012 -132 -798 1170 441 -1241 207 1060 -734 -549 1295 -247 -746 865 627 -1433 410 1447 -1016
8029a016M03J585j045q19J954n13j971J540Q90j742J20J607q85j211K240m24j722
8046a009J167J141k015J29J685j089j052J821K8j929J252J128j841k3J906r71
8062C28j409J554L18j723R48J236j723j85J893j090j383J854Q8j730R71J617k251
8079f87j81J654o28j283J480L48j635P41J082j439l13J834q81r75J198Q49k251
8096a087J245J044j842k34J935r86j623K125L17j901K05J989j684p61J863j41
8112D64j685J527N68j758M44J567j472o94J715k78j625J340R97k096N47J666j310
8129h3j013J866l45j562J273P91j896M77J917j435j197J951l1j768J015J127j762
8146f75K58J653j351j087J733K13j781J153R40j887L04J641j436n68J859r8j801
$$ plain form
8029 -1016 -613 972 -73 -892 1062 549 -1422 118 1008 -734 -614 993 108 -1103 1137 713 -1009
8046 -1009 158 1299 -716 -587 1098 9 -1043 778 806 -1123 129 1257 -584 -607 1299 328
8062 328 -1081 473 791 -932 16 1252 -471 -656 1237 147 -1236 618 706 -1024 -53 1564 -687
8079 -687 -868 786 158 -1125 355 703 -932 -191 891 -548 -861 973 92 -883 315 1164 -1087
8096 -1087 158 1202 -640 -874 1061 75 -1548 577 894 -1007 -802 1187 -497 -1258 605 464
8112 464 -1221 306 874 -884 -440 1127 -345 -1039 676 398 -1227 113 1110 -986 -439 1227 -83
8129 -83 -1096 770 425 -1137 136 927 -969 -492 1425 -10 -1207 744 713 -1055 -40 1087 -675
8146 -675 -417 1236 -115 -1202 531 744 -1037 116 1056 -831 -527 1114 -322 -890 969 871 -930
8163i30J089Q48j383J2J190r60j005J883O5j735P75J431j746l69J882q88j409
8180a250J914%j779Q36J517j705k55J759p91j408J967
$$ plain form
8163 -930 159 1007 -376 -364 826 -134 -1139 744 809 -926 -151 1280 -466 -835 1047 159 -1250
8180 -1250 664 664 -1115 -279 1238 -467 -722 1037 246 -1162 805
8191H05
$$ Imaginary data points
##PAGE= N=2
##DATA TABLE= (X++(I..I)), XYDATA
0@%%%%%%%%qJ6j6J6j6K4l2L2l4M2n3O2p3Q4r5J10j27J44j62J86k12K38k68L01
32A59l36L77m22M69n19N76o42P11p86Q69r61J066j184J312j455J623j818K047
50A086k315K636l040L553m229N168o555Q812j3070K3686r3286j47903K80480L5884
64I0907j53286J02939K8806k08190J05743K18956j66813j14184J98511m8260j78191
75a23062J76301J17818k16878o312J47407j37040l8374K43076p2466k64405J24528
$$ plain form
0 0 0 0 0 0 0 0 0 0 -8 8 -8 8 -8 16 -16 16 -18 24 -29 33 -40 44 -51 59 -68 76 -86 100 -112 126 -142 159
32 159 -177 200 -222 247 -272 304 -338 373 -413 456 -505 561 -623 689 -766 857 -961 1086
50 1086 -1229 1407 -1633 1920 -2309 2859 -3696 5116 -7954 15732 -77554 -225457 55023 90907
64 90907 -62379 40560 69366 -138824 -33081 185875 19062 -95122 103389 55129 -123062
75 -123062 53239 171057 -45821 -52133 95274 -41766 -80140 162936 90470 -173935 -49407
$$ [...]
##END NTUPLES=NMR FID
##END=
