##TITLE=1H_Pr 4538-37
 200.13MHz, CDCl3,
 8 sc
 
 10.10.2025
##JCAMPDX= 6.0         $$ Bruker NMR JCAMP-DX V2.0
##DATA TYPE= NMR FID
##DATA CLASS= NTUPLES
##ORIGIN= UXNMR, Bruker Analytische Messtechnik GmbH
##OWNER= pz
$$ XWIN-NMR		Version 3.5
$$ Fri Oct 10 13:51:08 2025 Russian Standard Time (UT+4h)  she@DPX200
##.OBSERVE FREQUENCY= 200.1308
##.OBSERVE NUCLEUS= ^1H
##.DELAY= (6, 6)
##.ACQUISITION MODE= SIMULTANEOUS
##.ACQUISITION SCHEME= undefined
##.AVERAGES= 8
##.DIGITISER RES= 18
##SPECTROMETER/DATA SYSTEM= spect
##.PULSE SEQUENCE= zg30
##.SOLVENT NAME= CDCl3
##.SHIFT REFERENCE= (INTERNAL, CDCl3, 0, 14.3821)
##AUDIT TRAIL= $$ (NUMBER, WHEN, WHO, WHERE, WHAT)
$$ ##TITLE= Audit trail, XWIN-NMR		Version 3.5
$$ ##JCAMPDX= 5.01
$$ ##ORIGIN= Bruker BioSpin GmbH
$$ ##OWNER= she
$$ F:/spectra/data/she/nmr/H-C/1/audita.txt
$$ ##AUDIT TRAIL=  $$ (NUMBER, WHEN, WHO, WHERE, WHAT)
(   1,<2025-10-10 13:49:42.75 +0400>,<she>,<DPX200>,
      <created by zg, POWCHK disabled, PULCHK disabled
       configuration hash MD5:
       00 E9 B6 7A A2 85 ED C7 34 08 36 98 17 FE 4E 26
       data hash MD5: 16K
       F5 DE 7D 1D 55 95 85 A2 E8 BA B3 67 89 3F 12 D1>)
$$ ##END=
$$ 
$$ hash MD5
$$ 1C D1 12 E1 AF FE 8B C2 4C DE 79 4C 87 C7 91 36
##$RELAX= 
##$RELAX= 
##$RELAX= 
##$RELAX= 
##$RELAX= 
##$RELAX= 
$$ Bruker specific parameters
$$ --------------------------
##$DU= <F:/spectra>
##$EXPNO= 1
##$NAME= <H-C>
##$PROCNO= 1
##$TYPE= <nmr>
##$USER= <she>
##$AMP= (0..31)
100 100 100 100 100 100 100 100 100 100 100 100 100 100 100 100 100 100 
100 100 100 100 100 100 100 100 100 100 100 100 100 100 
##$AQSEQ= 0
##$AQ_mod= 1
##$AUNM= <au_zg>
##$AUTOPOS= <>
##$BF1= 200.13
##$BF2= 200.13
##$BF3= 200.13
##$BF4= 200.13
##$BF5= 200.13
##$BF6= 200.13
##$BF7= 200.13
##$BF8= 200.13
##$BYTORDA= 1
##$CFDGTYP= 0
##$CFRGTYP= 5
##$CHEMSTR= <none>
##$CNST= (0..31)
1 1 145 1 1 1 1 1 1 1 1 1 1 1 1 1 1 1 1 1 1 1 1 1 1 1 1 1 1 1 1 1 
##$CPDPRG= <>
##$CPDPRG1= <>
##$CPDPRG2= <>
##$CPDPRG3= <>
##$CPDPRG4= <mlev>
##$CPDPRG5= <mlev>
##$CPDPRG6= <mlev>
##$CPDPRG7= <mlev>
##$CPDPRG8= <mlev>
##$CPDPRGB= <>
##$CPDPRGT= <>
##$D= (0..31)
0 0.7 0 0 0 0 0 0 0 0 0 0.03 0 0 0 0 0 0 0 0 0 0 0 0 0 0 0 0 0 0 0 0 
##$DATE= 1760089782
##$DBL= (0..7)
120 120 120 120 120 120 120 120 
##$DBP= (0..7)
150 150 150 150 150 150 150 150 
##$DBP07= 0
##$DBPNAM0= <>
##$DBPNAM1= <>
##$DBPNAM2= <>
##$DBPNAM3= <>
##$DBPNAM4= <>
##$DBPNAM5= <>
##$DBPNAM6= <>
##$DBPNAM7= <>
##$DBPOAL= (0..7)
0.5 0.5 0.5 0.5 0.5 0.5 0.5 0.5 
##$DBPOFFS= (0..7)
0 0 0 0 0 0 0 0 
##$DE= 6
##$DECBNUC= <off>
##$DECIM= 32
##$DECNUC= <off>
##$DECSTAT= 4
##$DIGMOD= 1
##$DIGTYP= 9
##$DL= (0..7)
0 120 120 120 120 120 120 120 
##$DP= (0..7)
150 150 150 150 150 150 150 150 
##$DP07= 0
##$DPNAME0= <>
##$DPNAME1= <>
##$DPNAME2= <>
##$DPNAME3= <>
##$DPNAME4= <>
##$DPNAME5= <>
##$DPNAME6= <>
##$DPNAME7= <>
##$DPOAL= (0..7)
0.5 0.5 0.5 0.5 0.5 0.5 0.5 0.5 
##$DPOFFS= (0..7)
0 0 0 0 0 0 0 0 
##$DQDMODE= 0
##$DR= 18
##$DS= 0
##$DSLIST= <SSSSSSSSSSSSSSS>
$$ [...]
##$SUBNAM0= <"">
##$SUBNAM1= <"">
##$SUBNAM2= <"">
##$SUBNAM3= <"">
##$SUBNAM4= <"">
##$SUBNAM5= <"">
##$SUBNAM6= <"">
##$SUBNAM7= <"">
##$SUBNAM8= <"">
##$SUBNAM9= <"">
##$SW= 18.0517779522481
##$SWIBOX= (0..15)
0 0 2 0 0 0 0 0 0 0 0 0 0 0 0 0 
##$SW_h= 3612.71676300578
##$TD= 16384
##$TD0= 1
##$TE= 0
##$TE2= 300
##$TE3= 300
##$TEG= 300
##$TL= (0..7)
0 120 120 120 120 120 120 120 
##$TP= (0..7)
150 150 150 150 150 150 150 150 
##$TP07= 0
##$TPNAME0= <>
##$TPNAME1= <>
##$TPNAME2= <>
##$TPNAME3= <>
##$TPNAME4= <>
##$TPNAME5= <>
##$TPNAME6= <>
##$TPNAME7= <>
##$TPOAL= (0..7)
0.5 0.5 0.5 0.5 0.5 0.5 0.5 0.5 
##$TPOFFS= (0..7)
0 0 0 0 0 0 0 0 
##$TUNHIN= 0
##$TUNHOUT= 0
##$TUNXOUT= 0
##$USERA1= <user>
##$USERA2= <user>
##$USERA3= <user>
##$USERA4= <user>
##$USERA5= <user>
##$V9= 5
##$VALIST= <valist>
##$VCLIST= <CCCCCCCCCCCCCCC>
##$VD= 0
##$VDLIST= <DDDDDDDDDDDDDDD>
##$VPLIST= <PPPPPPPPPPPPPPP>
##$VTLIST= <TTTTTTTTTTTTTTT>
##$WBST= 1024
##$WBSW= 4
##$XGAIN= (0..3)
0 0 0 0 
##$XL= 0
##$YL= 0
##$YMAX_a= 442541
##$YMIN_a= -528289
##$ZGOPTNS= <>
##$ZL1= 120
##$ZL2= 120
##$ZL3= 120
##$ZL4= 120
##$ABSF1= 10
##$ABSF2= 0
##$ABSG= 5
##$ABSL= 3
##$ALPHA= 0
##$AQORDER= 0
##$ASSFAC= 0
##$ASSFACI= 0
##$ASSFACX= 0
##$ASSWID= 0
##$AUNMP= <proc_1d>
##$AZFE= 0.1
##$AZFW= 0.1
##$BCFW= 1
##$BC_mod= 2
##$BYTORDP= 1
##$COROFFS= 0
##$CY= -3
##$DATMOD= 1
##$DC= 2
##$DFILT= <>
##$DTYPP= 0
##$F1P= 0
##$F2P= 0
##$FCOR= 0.5
##$FTSIZE= 0
##$FT_mod= 4
##$GAMMA= 1
##$GB= 0.15
##$INTBC= 1
##$INTSCL= 1
##$ISEN= 128
##$LB= 0.25
##$LEV0= 0
##$LPBIN= 0
##$MAXI= 10000
##$MC2= 0
##$MEAN= 0
##$ME_mod= 0
##$MI= 1.114404
##$NCOEF= 0
##$NC_proc= 0
##$NLEV= 6
##$NOISF1= 3.799351
##$NOISF2= 2.8
##$NSP= 1
##$NTH_PI= 0
##$NZP= 0
##$OFFSET= 14.38212
##$PC= 1
##$PHC0= -2278.14
##$PHC1= 10.79224
##$PH_mod= 1
##$PKNL= yes
##$PPARMOD= 0
##$PSCAL= 0
##$PSIGN= 0
##$REVERSE= no
##$SF= 200.129724274929
##$SI= 16384
##$SIGF1= 3
##$SIGF2= 2
##$SINO= 400
##$SIOLD= 16384
##$SREGLST= <1H.CDCl3>
##$SSB= 0
##$STSI= 0
##$STSR= 0
##$SW_p= 3205.1282051282
##$SYMM= 0
##$S_DEV= 0
##$TDeff= 0
##$TDoff= 0
##$TI= <>
##$TILT= no
##$TM1= 0
##$TM2= 0
##$TOPLEV= 0
##$USERP1= <user>
##$USERP2= <user>
##$USERP3= <user>
##$USERP4= <user>
##$USERP5= <user>
##$WDW= 1
##$XDIM= 8192
##$YMAX_p= 0
##$YMIN_p= 0
$$ End of Bruker specific parameters
$$ ---------------------------------
##NTUPLES= NMR FID
##VAR_NAME=  TIME,          FID/REAL,        FID/IMAG
##SYMBOL=    X,             R,               I
##VAR_TYPE=  INDEPENDENT,   DEPENDENT,       DEPENDENT
##VAR_FORM=  AFFN,          ASDF,            ASDF
##VAR_DIM=   8192,          8192,            8192
##UNITS=     SECONDS,       ARBITRARY UNITS, ARBITRARY UNITS
##FACTOR=    0.0002768,     1,               1
##FIRST=     0,             0,               0
##LAST=      2.2672688,     0,               0
##MIN=       0,             -528289,         0
##MAX=       2.2672688,     442541,          0
$$ Real data points
##PAGE= N=1
##DATA TABLE= (X++(R..R)), XYDATA
0 0 0 0 0 0 0 0 0 0 0 0 0 0 8 -8 8 -8 12 -16 16 -24 24 -31 36 -40 48 -56 64 -76 85 -100 112 -128 145 -164
34 -164 184 -208 233 -259 290 -322 361 -399 443 -489 541 -595 658 -725 798 -881 970 -1070
52 -1070 1179 -1301 1440 -1597 1777 -1985 2230 -2520 2874 -3319 3886 -4646 5719 -7347 10097
67 10097 -15605 30910 -165706 -528289 -42060 442541 321703 -31894 20028 240426 188780
78 188780 -42779 -105251 -72445 -47588 13955 54481 -75554 -222745 -137881 71613 37372
89 37372 -166345 -150185 70773 147492 67607 65222 156152 147069 41434 -14763 -59176 -156202
101 -156202 -129540 51147 110045 -51663 -158033 -30818 112691 61604 -25884 428 19423
112 19423 -21486 -13475 29355 8115 -26926 38243 98448 -22758 -172900 -108601 27365 8581
124 8581 -38573 65292 163985 63305 -48177 56460 151130 -741 -145487 -50274 42236
135 42236 -88269 -196339 -32524 136864 9804 -165235 -72754 105100 92771 -3317 31567
146 31567 124157 98213 24116 29585 31598 -20883 -26644 6195 -43133 -152536 -161372 -60958
158 -60958 -21754 -48884 13731 113494 83185 -5147 21651 113677 95142 -6066 -15223 36916
170 36916 6289 -46993 -14045 19752 -39978 -110196 -82406 -24520 -42090 -54454 24184 94567
182 94567 81628 51136 42092 20372 -10172 6357 38513 -14427 -86296 -38991 35903 -12284
194 -12284 -87982 -23290 93719 48709 -94237 -74892 80756 115131 6018 -50121 7506
205 7506 50076 7929 -36411 -36444 -36447 -26499 2839 -10679 -56397 -37814 55776 104972 45244 -7978
219 -7978 28409 46966 -13092 -49720 -13690 14434 -16732 -46564 -27463 -18326 -38176 -15466
231 -15466 27096 8277 -33070 -6365 64579 76336 23377 12717 49818 36716 -19636 -43611
243 -43611 -35674 -37131 -46369 -32400 -11676 -24137 -29021 14171 45134 27841 10455 19225 23325
256 23325 5200 6984 45067 46320 -6101 -31611 -18838 -29892 -64295 -58258 -2513 23688 -5721
269 -5721 -9100 31655 41922 10499 -5469 15753 34895 19532 -759 -3263 -9715 -15628 -11879
282 -11879 -24834 -47001 -38138 2785 30646 15093 1749 25862 32974 -2670 -19151 11753
294 11753 38239 17132 -17403 -14430 -2576 -22007 -38594 -25792 -8938 -1018 2929 10849 16038
307 16038 13006 20835 32655 19157 -1358 -2458 -868 -10819 -21392 -13519 486 -12378 -31680
320 -31680 -17354 4889 5427 -1070 5793 20999 20970 11820 18114 23701 8606 -4663 -8118 -14732
334 -14732 -24346 -26744 -13322 -1866 -8417 -8826 2529 3706 1043 9436 24287 30716 18306 4587
348 4587 3086 -4273 -14400 -12532 -8184 -9861 -11764 -9758 -3845 -5440 -9867 -619 7051 3973 7083
363 7083 19268 28098 21415 4938 -694 -2434 -16556 -28233 -24155 -11431 1831 5213 2096 1896
377 1896 1985 5457 9440 3337 -512 6360 11096 8634 1718 -670 3898 -1427 -16120 -20538 -17625
392 -17625 -12814 -6030 1623 11187 16279 13240 12918 13905 7614 2704 -2328 -7800 -8494 -8705 -7804 -6154
408 -6154 -6641 -1297 4499 -2884 -12698 -10823 2560 15058 12022 4210 11489 21180 18042 3858 -11188
423 -11188 -13719 -9037 -13032 -19438 -20542 -11968 6995 18156 11957 1133 -3166 4923 13056 3036
437 3036 -9860 -3136 16016 23803 6996 -13999 -9922 3101 -3092 -22540 -31412 -15436 8160
450 8160 13765 8130 7991 11616 14958 10298 -3056 -11486 -9459 106 9091 2503 -8584 -3567 7647
465 7647 7710 -6021 -16784 -9045 1230 -1238 -1745 6682 12825 11159 4460 4205 4472 -9740 -21116
480 -21116 -11591 1966 636 -10003 -6316 16391 25362 8512 -5810 -3691 3753 3182 -5526 -6712
494 -6712 -1277 2238 7128 7318 -6909 -19853 -15150 1534 4456 -14340 -21343 7991 36086 28209
508 28209 1702 -2351 18348 21273 -9524 -32173 -22403 -1138 5140 -4690 -10322 -3211 2115 1876
522 1876 -1886 -11933 -14735 875 21604 25996 10674 3719 19370 23908 -2948 -28588 -24317
535 -24317 -5105 -3592 -17863 -14264 4530 8043 -731 -992 7476 8331 -2321 -2742 10890 12134
549 12134 97 -326 11095 13710 -599 -14314 -10807 -7790 -14042 -13189 -2372 4747 4898 7082
563 7082 17101 17798 -2054 -15289 -4980 6352 -1402 -17346 -12276 13606 20485 -613 -15919
576 -15919 -6415 10860 9761 -7057 -10204 4671 15167 11582 1467 -4828 -2575 -33 -2132 -11132
590 -11132 -22379 -19392 433 12307 4524 -2165 9249 27209 19673 -5072 -9740 3320 6832
603 6832 -4738 -10805 -1220 4899 -4843 -11568 -7740 -8433 -14003 -12013 1403 11946 10005 8849 17513
618 17513 20360 10545 1345 -1900 -3576 -7866 -11006 -8107 -7876 -11353 -7279 1642 3171 -2585 -6663
633 -6663 194 10885 9206 1978 1773 10367 17357 9908 -6034 -10572 -4339 -1965 -10558 -20021 -14112
648 -14112 3367 9714 4753 1805 4567 9985 8540 165 -5682 -4811 2132 8141 2154 -7509 -6104
663 -6104 1241 1328 -7793 -12658 -3042 7709 5827 2993 4802 8199 7720 3441 -362 -2524 -6627 -6112
679 -6112 -2618 -5256 -9918 -7406 1208 6822 3436 752 5969 8512 3925 -139 -1001 1694 4831
694 4831 3345 3 -3212 -6403 -6460 -8983 -12698 -8800 -315 6230 7486 6322 8725 10525 5157 99
710 99 237 842 650 -1146 -3156 -4258 -7286 -7875 -5010 -4854 -4670 -663 3986 5644 3745 2493 6009
727 6009 7815 5973 4866 2322 -1331 -3957 -6300 -8257 -9337 -7575 -852 3367 -265 -1370 2007
742 2007 4878 3842 643 2860 8409 7069 2453 -1130 -4801 -6056 -5574 -5453 -3972 -2361 250 3186
758 3186 1314 -2994 -1263 2752 5615 5965 4752 5031 3854 -1524 -5782 -7933 -7969 -4225 -430 1488
774 1488 1206 553 1641 2857 -304 -633 3351 6784 6363 2558 -736 -1367 -3668 -6344 -6364 -5942 -3021
791 -3021 398 551 -848 -1051 786 5156 5511 3350 5075 6984 4417 28 -4244 -5146 -3960 -5308
807 -5308 -4060 -2856 -3218 -2217 -169 205 294 776 3544 6912 5352 1983 1971 2431 1580 -767 -3427
824 -3427 -3464 -2631 -3318 -4123 -5431 -4771 355 4078 4169 3058 2917 5224 4148 -1863 -4012 -1822 189
841 189 864 -118 -471 52 -934 -2695 -3025 -3465 -1442 3103 4482 3538 2700 2983 3339 -532 -5033 -4610
859 -4610 -2449 -2159 -2229 -2512 -759 1505 1956 2822 1812 532 2567 4096 2432 -277 -817 731 1522
876 1522 -2079 -3633 -2244 -2027 -3023 -4599 -4878 -2575 670 3298 5011 3730 4844 7954 5877 -1258
892 -1258 -6049 -4162 608 467 -4179 -3489 686 2137 -805 -5241 -6257 -3185 760 3496 3360 2449
908 2449 5239 7869 3717 -2156 -3946 -1109 982 -1989 -4099 -2190 129 1133 324 -2570 -2422 459
924 459 2917 1732 -2890 -3825 2469 5496 2315 -929 -231 1922 1235 -2206 -3033 -2903 -3639 288 5199
941 5199 3368 -1223 -1677 2820 3002 -3919 -6323 -328 3224 34 -2783 -1535 1708 1871 596 1364
957 1364 386 -202 2297 2822 -1670 -4761 -851 6531 6229 -1596 -4025 -458 74 -4591 -8840 -6380
973 -6380 967 5862 5772 3875 1995 2575 1340 -3443 -4677 -508 3834 3844 868 1813 3356 -1661 -7513
990 -7513 -6645 -3687 -1991 -1031 1667 3890 1928 1309 4767 3473 -2241 -2557 2562 3872 -2095 -5352
1006 -5352 1819 4918 -2635 -6979 -1013 3343 -1363 -7204 -3399 4322 3336 819 3032 4216 1369
1021 1369 48 1766 1024 -4386 -5746 1113 3931 -1330 -4525 -1291 2639 1526 -1771 -512 1463
1036 1463 1036 820 633 -513 108 1205 1192 456 -1395 -634 -379 -2286 -2893 -1511 -599 1101 4372 5122
1054 5122 1533 -2521 -130 3478 -2242 -7925 -3838 3748 3815 -1551 -2221 2145 819 -3154 -1186 2013
1070 2013 -93 -1123 3292 7318 2373 -3842 -1367 3034 -2288 -7146 -3812 1828 553 -3508 -623
1085 -623 4323 2214 -1143 1325 3506 552 -1025 1844 3775 -1154 -4402 -600 2097 -1330 -4857
1100 -4857 -3355 -696 -382 -1057 247 1158 1407 3983 5587 2274 -510 730 1857 -1290 -5115 -2861
1116 -2861 545 -1170 -3253 -461 1075 -544 -1507 -77 1403 -170 1009 4908 3804 -562 19
1131 19 2913 1102 -4980 -6013 -551 471 -3213 -2687 2327 3043 -200 -300 2369 2324 -1285 -335 2928
1148 2928 643 -1430 324 1812 -1461 -5110 -2201 1595 -799 -2936 722 4156 2390 -391 639
1163 639 2686 365 -1964 345 1459 -1644 -2514 -447 -706 -2574 -3121 734 2091 -62 1227 4562
1179 4562 3259 -50 -521 1162 616 -2534 -1719 1134 -544 -3409 -2188 -775 -2075 -3109 -836 2731
1195 2731 2283 1405 4129 4475 1655 -769 425 281 -2191 -3774 -578 561 -2091 -2219 -70 -515
1211 -515 -2328 -1825 1746 2727 952 2378 4861 3312 -756 -1072 -353 -1304 -3723 -2847 709 -88 -2080
1228 -2080 -548 1592 -5 -1272 462 3318 2543 450 2092 2909 -325 -2376 -1789 -1997 -2740 -2827 -488
1245 -488 837 -631 -344 2160 1786 -115 413 2721 3119 683 13 1558 483 -2568 -3179 -2656 -2392
1262 -2392 -2606 -1653 209 325 294 2332 3185 1397 419 1850 2886 1016 -974 231 1077 -1338 -2944
1279 -2944 -2096 -1583 -2353 -2487 -603 1498 892 1329 2760 1745 454 603 1478 773 -1217 -966 870
1296 870 -85 -2175 -1776 -349 30 -752 -191 1935 1762 158 737 1296 102 -909 -683 -272 -780 -1869
1314 -1869 -741 -112 -1770 -1279 845 1973 1493 1357 2626 3425 1283 -88 479 -260 -2287 -2887 -2315
1331 -2315 -1236 -1772 -2491 -1510 -1037 -485 630 1844 1619 2690 3871 4188 2510 578 412 463 -1850
1348 -1850 -3124 -2583 -1926 -2510 -3352 -2517 -580 -580 -271 1238 2123 2687 3388 2986 1891 616 675 1601 123
1367 123 -1930 -1642 -591 -1304 -2984 -3071 -1180 -251 -910 -253 1664 1891 1243 406 564 641 198 41 542
1386 542 -72 -14 610 397 -401 -637 -142 173 -173 -994 34 11 -604 -688 -505 -86 -809 -1859 -1097 -500
1406 -500 -163 616 1447 1802 3075 2980 1933 541 -554 -353 -377 -1747 -1778 -223 -544 -1859 -3880 -3146
1424 -3146 -1197 -929 -931 866 3263 4184 3183 1913 1623 1550 584 471 -140 -867 -1026 -1471 -2393 -3223 -3358
1443 -3358 -2060 -738 -352 74 1717 1883 1639 941 1367 2308 1913 1099 783 280 15 -1043 -2482 -2459
1461 -2459 -1280 -1036 -900 -1460 -184 1118 545 -1008 -110 1754 1786 293 -305 1021 1353 -185 -667
1478 -667 -271 857 497 -84 -655 -849 -671 -29 612 -339 -810 431 586 -697 -2426 -1579 444 834
1496 834 -220 578 2230 2100 872 -473 394 1093 228 -549 93 570 -88 -1582 -2381 -1924 -1279 -1243 -809
1515 -809 -273 714 1387 802 665 1547 1888 1630 925 676 722 -56 -590 -1348 -2012 -1258 -961 -1010 -1236 -1528 -226
1536 -226 1038 433 -538 722 2178 2167 314 -36 1262 1339 -648 -2026 -634 47 -547 -1528 -1150 150
1554 150 225 -537 -458 -242 683 969 862 392 -74 64 1083 284 -1033 -656 265 336 -586 -749 288 749
1574 749 -208 -687 -162 841 780 -87 -435 -158 -235 -229 -524 -488 237 699 -156 60 479 831 -59 -444 280
1595 280 1114 280 -813 -374 -301 -211 -879 -1034 -113 5 -55 246 91 -168 397 799 688 292 544 1267 744
1616 744 -1100 -1781 25 203 -644 -1416 -68 811 77 -1125 -795 382 940 942 503 1026 600 635 34
1635 34 -724 -1209 -2 357 -228 -464 -254 256 106 -1089 -569 636 893 914 182 111 477 -227 -571 -119
1655 -119 -351 -82 408 -62 -618 -675 -372 144 -207 95 844 848 -9 -107 89 -188 -676 -439 466 290 -629
1676 -629 -515 -94 -163 -107 -376 218 714 561 367 178 -455 -413 192 244 -624 -346 423 624 -422 -1056 -393
1697 -393 706 492 56 -11 830 712 -83 -377 -810 -244 359 423 -167 -422 152 357 -398 -973 32 1372
1717 1372 667 123 -36 532 373 -133 -471 -213 -92 80 156 -336 -569 -632 -19 -47 -147 -109 642 827 -44
1738 -44 58 -4 -5 -2 -284 -98 127 -450 -394 -33 261 -225 -247 213 495 262 -45 399 -51 319 -1 -273 -261
1761 -261 5 221 -198 -742 -624 438 266 -313 -179 196 612 417 -249 -98 428 107 -139 -273 -347 -252
1781 -252 -7 51 -475 -566 62 663 -4 -389 101 574 555 68 -209 307 223 -90 -240 -185 -202 -127 -317 -381 -48
1804 -48 -269 476 219 166 323 222 262 202 -309 -156 101 -65 -43 -87 -80 -215 40 -160 -232 -179 69 74 77 134 76
1829 76 -112 -166 -160 -120 -142 106 82 -74 -142 -16 -189 437 589 146 -204 160 327 -133 -70 -332 -84 150 -166
1852 -166 -117 -153 -33 23 96 79 274 455 135 234 -74 -34 148 250 7 -253 -117 -197 -432 -600 -291 -30 186
1875 186 137 232 -201 302 243 103 -29 -96 257 115 76 329 -96 -134 -347 -371 -93 -33 149 16 205 -166 -68
1898 -68 18 172 263 -122 147 501 307 71 119 209 -57 -67 -271 171 298 -64 -55 131 -44 -320 -210 122 -68
1921 -68 -205 -223 48 126 118 134 72 442 195 0 -11 343 244 51 -211 16 -28 -159 -24 -419 -68 63 -207
1944 -207 -324 68 171 144 303 297 197 94 86 -25 164 -456 -362 15 -131 -265 -399 -190 116 -44 -201 4
1966 4 144 126 76 113 176 148 -118 116 323 -167 -334 -157 -142 -139 -119 9 68 -56 87 -6 72 16 -173 -110 -83 93
1992 93 -141 -223 -260 8 -104 -6 -52 -50 -80 92 -47 -69 246 -279 -309 -105 66 -28 -23 -64 91 -108 85 276 376
2017 376 136 8 19 196 -231 -182 4 164 -93 -89 -17 173 -244 -376 -24 161 43 -260 -57 50 210 388
2039 388 -23 247 166 -444 -143 -67 47 -88 -77 137 85 -112 -154 -137 -238 172 -122 132 481 297 7 -12
2061 -12 -217 -153 174 53 -374 -13 212 60 -253 -98 -41 176 -96 286 1 88 275 201 -37 -56 -97 257
2083 257 33 -135 14 -54 -51 -231 -96 -40 -429 183 -13 32 56 -190 351 -117 246 -114 -90 -125 -126 115 -180
2106 -180 -212 166 468 169 -240 -20 -76 51 -300 110 -251 -164 -212 -256 258 -11 -53 37 210 215 -33 57 165
2129 165 22 -10 56 -18 -252 -248 -212 -29 -33 -139 -100 90 -103 -21 48 508 464 -4 -101 155 -392 153 -14 26 48
2154 48 -130 -2 101 330 -94 -294 87 89 129 159 51 -53 106 127 100 118 -85 -233 -5 -159 -63 56 26
2177 26 49 -107 -47 -107 -62 -197 -1 142 310 26 -80 -40 -100 -80 -43 -50 390 -138 24 8 -228 111 14 97 -115
2202 -115 -151 221 -195 -115 200 67 -152 -52 74 -37 -71 142 200 73 -156 -275 -19 201 69 41 135 91
2224 91 -62 -222 -74 -158 -8 34 -228 328 -58 -121 94 92 -184 -205 296 -60 -2 74 -24 34 235 71 -131 -27
2248 -27 158 46 -34 184 8 -22 -101 -16 72 153 -144 29 -80 21 -16 -21 -162 60 152 65 35 52 -38 -23 -206
2273 -206 -48 -142 90 338 -40 63 73 103 181 163 71 18 -236 40 89 -26 -21 267 18 -109 -177 -68 -282 -53
2297 -53 271 -15 -140 -46 88 -12 -81 -163 -31 109 140 31 55 -9 -231 170 -253 113 215 127 66 37 346
2320 346 292 -328 111 180 112 -31 29 -99 -117 204 -256 11 -180 -80 -5 121 147 -135 -231 -107 83 -244 -183
2343 -183 77 -47 -46 -18 114 -120 100 -17 -8 132 -21 -160 140 21 -189 -113 -163 -336 61 236 -249 -35
2365 -35 140 -62 214 -153 203 163 -26 -18 -65 -119 -141 -226 -32 -166 74 -281 -58 31 123 39 -67 56 50 -3 -137
2390 -137 315 -263 -28 138 27 11 -161 -331 -323 109 -114 -109 -47 163 182 116 264 31 -322 -96 -64 -209 180
2413 180 152 264 237 82 -111 202 -151 83 210 59 110 23 225 96 150 223 -137 56 -74 6 -126 -48 -51
2436 -51 -136 -135 19 -220 -114 33 260 301 -74 158 261 -142 128 -8 40 -221 -225 -165 69 -206 -31 19 -137
2459 -137 -8 462 -161 -106 31 64 178 22 270 75 128 -135 160 -234 -158 -28 -25 -88 225 208 11 -180 -200
2482 -200 -9 -186 -37 -278 -54 126 -144 -230 139 -63 15 -121 8 64 -188 -86 33 153 63 3 2 86 -314
2505 -314 -131 -143 -135 -42 136 -115 -12 254 193 84 -4 26 101 52 -41 232 14 -252 42 -314 -237 -51 -174 74
2529 74 2 -238 107 -50 295 199 365 170 -81 248 -16 -266 -191 -141 -234 -90 -190 -75 98 -173 190 -288
2551 -288 267 105 21 288 75 193 196 -132 -32 -256 -119 136 121 -30 31 74 -74 -93 -86 -349 -17 -63 71
2574 71 101 -394 -161 110 6 -230 37 63 -216 -102 -37 132 215 -84 -78 161 21 -140 -13 -143 -15 -67 36
2597 36 -194 189 -194 -21 114 15 -100 107 503 103 289 178 -128 -119 -68 -132 48 -106 -336 35 -189 -151
2619 -151 -10 128 142 223 -103 -182 30 -48 -16 -36 -101 -266 -166 -187 -330 -166 117 -20 208 -87 -3 -14 528
2642 528 9 63 233 -250 158 -241 -191 -228 20 -289 -183 45 -116 97 81 -124 361 297 7 463 67 34
2664 34 -211 -113 -183 -143 -162 -161 82 -327 -12 100 -30 70 -7 109 69 -58 219 -71 -226 -7 14 -12 48 -135
2688 -135 -256 -455 -54 -21 -96 -65 -112 186 90 233 72 -251 -6 -238 -167 -274 55 185 -84 6 -4 -141 14
2711 14 -37 102 111 69 40 24 283 -126 -131 -265 -478 -223 -52 -229 -19 2 257 163 165 55 185 347 72 -74
2735 -74 -87 -312 76 -395 -234 -78 -261 -147 84 110 -141 -82 183 446 6 228 -112 -28 73 98 -219 -268
2757 -268 -95 -194 -217 -9 -193 120 -163 -67 352 -253 129 -108 97 213 266 72 32 -131 -164 -173 64 90 -301
2780 -301 -124 109 4 10 398 222 119 -64 -116 -167 79 -42 -315 -137 120 56 -231 229 46 56 -37 -67 58
2803 58 549 -60 86 15 -25 -44 -66 -123 -177 -293 -132 -83 79 291 386 -72 161 210 68 -149 344 6 -39 -9
2827 -9 -283 -195 -182 -59 13 -284 -282 -61 -119 219 269 134 145 205 314 189 368 91 -317 -459 -254 -18 5 -143
2851 -143 -242 90 154 193 -20 94 133 352 119 346 392 95 -77 -106 127 86 -147 -237 95 10 -89 274 88
2874 88 -68 -11 -42 168 -225 78 -133 188 -9 269 230 -126 -268 38 -122 67 21 252 321 49 269 246
2896 246 145 -119 185 -109 -120 -84 20 -202 -115 326 49 -62 24 164 100 150 -176 96 -5 186 -1 50
2918 50 -128 163 -145 -517 47 -110 -35 -265 -64 276 459 88 91 104 268 -78 125 -162 169 220 95 232
2940 232 -151 -177 -101 82 87 42 113 152 233 -42 225 87 227 153 21 -59 -96 -107 171 35 -14 62 -156 41 153
2965 153 56 -101 -107 101 145 -43 -219 -24 282 -161 -117 -213 -164 -111 48 142 209 134 174 282 23 -135 -88 47
2989 47 -258 -101 -17 -40 -113 -235 -270 -388 425 371 -321 229 217 166 -130 -37 74 48 -6 -284 37 -213 -215 -54
3013 -54 32 -108 -24 88 -125 141 17 158 25 35 193 -126 57 310 -52 140 -15 -121 -1 -65 238 94
3035 94 -62 -82 228 -35 68 94 -168 163 -234 58 -207 255 -126 76 125 0 192 51 -187 -371 144
3056 144 -35 -87 -35 -83 77 75 -10 198 96 -89 124 -307 -156 -113 -5 238 78 -88 79 72 157 29 144
3079 144 -130 192 -67 -153 -154 -140 -24 -155 -96 -204 -18 139 -53 251 305 -138 81 206 -91 -8 -5 55 87 54
3103 54 -55 -37 -200 46 -67 -207 -80 -31 -123 69 81 309 129 -111 -179 -43 86 -301 -108 202 -10 -178
3125 -178 -43 -282 215 -47 111 64 284 -97 135 39 58 12 -151 -74 251 448 -137 31 -211 -311 -25 -6
3147 -6 353 -12 255 -13 -236 261 -43 -126 45 -153 -281 -189 -80 -26 -99 -21 286 40 380 245 406 54
3169 54 -13 274 15 20 -89 -38 -369 -60 -147 -333 -209 -85 38 -51 425 530 296 213 267 -1 -310 -335 245
3192 245 -277 -468 -7 -275 -98 166 3 72 369 -145 73 -21 324 302 -59 219 -73 195 -69 -350 -184
3213 -184 -443 -285 -179 -41 0 270 -17 236 43 -241 99 268 4 -145 39 -157 59 -194 -84 -356
3233 -356 -211 -154 139 11 8 124 -16 55 310 235 -36 102 -264 -155 -113 -253 -97 332 -37 -168 270 280
3255 280 456 203 -371 104 103 -7 70 -49 -40 -318 -291 -116 -235 -492 121 98 128 159 333 369 173 113 -147 -128
3279 -128 -54 -141 -30 -500 -157 -67 -182 122 -65 -94 6 146 48 72 448 144 221 -19 285 -169 -258 -13 -382
3302 -382 -344 197 -11 266 101 33 273 -113 -269 139 -366 145 70 337 -102 33 107 -19 -93 -269 -262 -55
3324 -55 -103 -83 -21 -69 175 286 101 -68 42 90 -368 -428 -9 -148 -213 98 366 66 -81 -129 83 -124 -83
3347 -83 -164 -242 149 -41 133 103 -119 -3 -535 25 -44 -142 -72 -69 209 426 160 21 123 -65 168 81 -116
3370 -116 -332 -106 23 71 -92 242 -241 -124 -106 65 -51 164 685 240 -54 107 111 156 -159 -114 -187 52
3392 52 -14 -179 27 174 208 122 381 65 79 -40 116 -146 88 68 141 -44 -231 -246 -85 -14 -86 60 184
3415 184 -23 179 203 79 238 136 -151 -82 44 -142 30 -72 129 67 -84 19 87 29 -27 148 100 7 102
3438 102 313 171 220 195 24 -243 98 -218 -169 30 44 270 -47 164 350 336 -53 -165 -205 295 139 53
3460 53 430 -9 102 19 20 30 121 -14 62 167 365 91 -1 147 -190 -38 -234 -58 -305 -92 33 -37 88
3483 88 8 -116 -175 54 -139 101 -188 30 132 48 -110 133 184 103 -97 -177 -192 -53 60 -109 -77 210 285
3506 285 357 21 -75 -98 247 -29 -241 91 105 30 193 -137 72 -45 23 58 182 47 40 -73 176 87 80 -1
3530 -1 79 27 -59 -250 25 204 -15 -73 23 -84 40 119 -226 14 154 110 -52 208 -128 153 87 -34 -64 20
3554 20 -93 9 -22 -1 50 -253 -39 93 -148 -133 206 16 65 -79 -46 -61 -170 131 50 22 3 21 -33 284
3578 284 -101 47 165 111 -149 152 59 -107 295 1 -85 -186 8 -45 -96 118 51 -177 -60 210 -163 101
3600 101 -234 -115 -140 -187 207 -21 137 53 304 -46 -143 -103 189 -25 200 -183 -92 -84 117 -66 8 74 -65
3623 -65 -230 -290 13 7 -127 -121 -325 -63 -86 78 149 124 82 106 -25 -89 35 36 123 -21 -139 173 28 171 105
3648 105 -95 -5 -187 -90 -242 129 -102 25 -128 -83 110 26 -74 29 48 13 10 115 50 -102 63 -137 64
3671 64 35 186 60 149 -86 9 60 -54 -179 -18 246 -90 181 -59 4 -78 -45 310 -117 -127 115 27 165
3694 165 121 13 38 165 8 -241 -207 80 94 -141 -130 54 196 101 244 -79 -148 -34 -27 -154 43 -98 104
3717 104 36 194 67 -173 39 -291 -276 15 22 -167 -58 94 14 130 -103 109 -64 -372 -175 62 -13 -174
3739 -174 -192 -14 -142 238 66 -135 279 -120 28 -436 46 50 -120 -112 87 -61 -171 70 -59 -196 -61 217
3761 217 -58 69 25 238 -18 -266 -252 -8 -105 87 -98 -127 -38 -7 35 -171 64 161 -44 -91 44 180 66
3784 66 55 115 143 -136 -181 -215 -30 199 -11 90 -206 -211 67 192 33 86 324 -47 -17 9 -12 189 -228 222
3808 222 430 -19 -58 -84 -123 -261 -297 11 217 -71 10 308 218 -125 76 -123 63 -319 -21 -56 -64 -90 154
3831 154 -227 56 -90 -81 126 54 -218 -7 98 54 173 124 -208 -131 -62 -141 -153 -28 -55 -172 -37 188 4
3854 4 6 140 -248 -123 63 -249 99 -39 -158 11 76 33 18 -120 -171 11 94 109 -1 -244 -377 251 45
3877 45 -165 179 -97 -343 -63 -140 191 -39 113 -4 41 -215 211 39 -204 -95 238 260 177 106 121 -102
3899 -102 -159 -39 -109 63 -137 23 -59 16 184 350 155 -37 55 313 83 104 422 -77 -34 87 143 77 -90
3922 -90 176 170 -111 -74 -31 57 152 -38 101 84 81 -80 -204 -71 -186 -20 123 -28 -155 -33 -3 -108 251 -21
3946 -21 -147 -107 -7 -94 -261 -2 -242 -3 -220 277 -96 -43 -366 37 32 -170 210 103 -16 -20 219 98 -30
3969 -30 -261 71 -134 -441 -86 -77 92 -16 150 316 103 -125 30 -12 109 -13 10 52 74 -201 0 -89 -21
3992 -21 -210 -257 -83 -38 -28 -26 2 -58 157 -26 383 -59 -302 185 153 -126 -123 -60 63 -43 155 -49 184 -235
4016 -235 -44 -24 -179 150 -61 168 -13 58 35 -51 -39 -20 14 -128 -168 -46 103 -36 -84 36 136 105 -17
4039 -17 137 -40 -49 -121 -92 -140 56 317 -111 284 63 54 -175 -15 -20 41 -87 -81 -21 -100 11 -50 256 170 -5 78
4065 78 31 177 124 -110 162 -55 -39 53 56 -257 -19 155 63 -56 299 244 -124 2 -107 -212 72 -329 40
4088 40 -154 -61 83 327 328 -65 72 -97 125 79 -215 -295 -41 10 268 -8 -100 -39 -251 271 -70 -18 -88 17
4112 17 93 109 309 -73 -135 6 -214 84 -40 73 -9 -66 -29 103 -69 -57 45 207 -126 141 34 -180 34
4135 34 -72 68 -180 -104 -169 17 64 99 103 177 29 30 -26 101 -300 -322 209 -177 -44 60 -29 -180 137 -34
4159 -34 -156 -133 -38 -175 -47 12 -89 -37 -120 -73 -66 -217 21 12 -128 217 -288 -136 94 -29 -29 131 -123 210
4183 210 212 54 -176 154 86 40 -109 199 -305 -73 -22 73 279 62 -66 -145 -313 284 68 128 10 168 77
4206 77 170 -75 -92 190 -128 213 -27 148 -85 -33 -111 -126 -159 -137 100 -10 65 115 -104 -91 -47 68 -145 -176
4230 -176 -38 30 -275 105 112 -76 -73 4 -125 -4 -231 70 -10 233 33 43 104 -59 158 -209 -45 -145 -54
4253 -54 -73 -181 204 19 111 -223 95 98 100 156 85 95 -102 -119 32 30 -18 -39 84 140 -126 160 41 -58 -13 126
4279 126 -43 194 -107 183 -91 -132 -61 -73 228 25 -36 152 -207 -20 -137 -85 -40 -53 314 172 -9 -37 -91
4302 -91 -220 99 -113 10 50 10 -144 -175 58 111 -50 152 45 -151 83 -269 -38 435 48 76 138 0
4324 0 0 122 18 -165 -41 121 49 148 79 -189 -63 -61 -63 -171 103 162 -1 -86 -161 246 84 -52 161 209 -14
4349 -14 90 206 -29 -174 -227 -125 30 160 117 178 -101 -292 -168 -53 -107 -11 -61 -6 164 196 -115 -28 3 -129
4373 -129 -32 165 -27 67 -220 123 95 168 263 -59 146 210 2 -27 31 132 -12 129 123 50 216 -84 -50 33
4397 33 16 -100 36 -81 150 -70 186 13 -6 -213 120 -106 -25 83 -102 4 -191 -36 -136 122 55 102
4419 102 107 172 41 -100 58 176 -335 -236 79 -12 153 162 101 230 136 91 163 209 -12 -83 -85 -139 -348 51 -140
4444 -140 -97 -72 133 -143 112 -218 -138 -47 53 89 47 -48 185 252 -80 208 -74 -91 -113 -160 -11 -26 -45 -63 252
4469 252 -20 -1 -181 59 -267 -109 17 36 246 90 -20 -220 -74 -12 -57 -71 -351 -172 224 6 80 -73
4491 -73 -77 19 -212 -173 -74 -205 -218 -21 24 -61 184 -30 92 116 -148 35 -119 210 -266 -255 -25 -78 -41 122
4515 122 168 -83 -185 7 -215 -71 475 179 -61 -10 -154 81 75 -42 -157 -86 9 -109 -24 -138 158 26
4537 26 129 -15 163 -39 -217 140 -81 310 89 298 16 -22 -82 18 -18 49 -21 -106 -100 172 -1 -66 -203
4560 -203 -2 -238 71 225 -2 164 -24 172 265 193 -133 -259 56 -178 -118 -102 -261 132 -4 -48 23 -114
4582 -114 -120 39 34 62 -105 6 110 -103 -16 72 -80 -23 -219 -48 30 -321 334 183 224 -38 129 83 -135 -167
4606 -167 174 -335 31 -78 226 163 -15 10 -82 55 -41 -156 -50 -100 30 214 -48 281 126 239 213 141
4628 141 -54 -115 71 -31 -23 106 150 45 -46 -93 -225 122 223 -172 -210 -155 -9 132 -32 9 -254 -37 271
4651 271 374 -102 74 -93 -3 -9 -2 261 48 13 -82 -237 -176 -195 -158 115 102 -35 30 -344 130 -32 -54 27 124
4676 124 -150 -259 -33 95 -60 235 40 174 27 -160 -10 -216 -166 109 80 56 39 45 -267 50 -86 -16
4698 -16 74 120 -248 114 182 121 70 -358 43 -116 91 171 -78 91 222 -66 -270 -14 7 54 75 53 -70 -170
4722 -170 -185 -111 -28 110 -39 -205 -255 -234 103 -148 -147 -19 -27 -218 -35 -5 -58 103 -73 -38 49 -93 -248 -67
4746 -67 282 178 -27 58 62 99 -338 60 -139 -71 48 -222 42 -151 21 -1 112 119 136 -145 55 -65 -91 -93
4770 -93 40 118 -121 226 -37 -62 -161 -97 -90 41 -205 -71 -181 11 79 63 208 18 129 28 -20 -55 8 164
4794 164 66 -12 254 10 -78 174 -129 175 -150 192 -80 140 -150 -228 9 16 -267 -378 118 110 126 76 -44
4817 -44 -133 12 8 217 177 183 -89 -258 -88 37 161 -114 0 110 28 200 -147 -96 180 283 54 177 -1
4840 -1 204 40 124 -93 -10 -53 -115 28 20 245 91 68 75 -4 -27 228 79 -239 33 2 -51 170 -85 47 -199
4865 -199 172 -8 8 120 34 207 80 139 -138 16 -171 19 33 -154 -5 -32 215 -285 -108 262 -170 79
4887 79 -21 -135 59 1 99 159 -133 -15 -73 29 94 -308 11 102 243 -67 75 10 -122 -162 20 -116 37
4910 37 -214 233 145 349 -38 -294 170 -131 -242 -249 -214 100 40 -53 102 361 119 1 -139 -159 -22 -23 54 -21
4934 -21 -19 108 -56 -117 -107 -121 64 19 -20 -205 -74 -86 147 154 -132 184 83 -345 23 -101 22 -3 -135 -92
4958 -92 27 167 72 82 -67 -90 -39 -27 -194 -134 182 -56 -85 121 -64 118 1 -140 -29 -258 -60 -141 95
4981 95 -64 132 127 -157 -121 143 143 53 70 -42 78 -41 -83 72 40 -18 80 -24 -2 44 -122 -211 137 -39 -39 -243
5007 -243 -281 -208 84 -2 -86 66 -37 175 40 156 87 49 -272 -106 -70 -38 94 26 5 -176 -188 54 -253 -107
5031 -107 -152 77 -162 -98 103 156 -110 170 146 -55 102 197 33 19 92 -172 228 82 31 28 135 108 -145 -11
5055 -11 116 124 180 -61 71 -15 -173 -168 -321 66 114 -155 50 164 -105 23 -54 -57 40 -48 312 239 91 -188 -126
5080 -126 1 -149 -154 -85 -37 -166 81 -162 -11 146 16 74 -118 -225 -54 68 -47 -194 191 38 -244 -22
5102 -22 177 11 146 -65 70 -104 -52 -72 36 -126 5 -64 32 -45 233 -159 -47 -6 -28 -10 6 134 105 -303
5126 -303 -142 48 -19 22 -41 81 -201 -170 -164 286 -68 -124 40 121 53 212 102 -15 135 -267 59 11 44 207
5150 207 38 30 -157 -135 -58 -94 -53 160 -103 -78 198 -172 -152 -103 -137 140 77 -67 94 50 43 149 -105 35 81
5175 81 -33 95 -81 -110 -186 -124 -118 -56 -201 -23 153 -190 -22 41 -50 123 -205 129 -182 -253 78 57 -110 -100
5199 -100 -96 129 -48 -16 -206 113 -27 67 -49 -22 -6 -313 -204 257 76 -249 -37 -128 73 9 -178 83 -142
5222 -142 -31 181 -152 -12 -37 141 219 405 -147 -111 99 76 -98 -234 92 -106 -16 11 -53 -5 36 129 -297
5245 -297 -347 -99 -150 -194 -219 15 125 -98 66 23 -121 -67 -25 -37 96 -156 55 51 28 -86 110 -102 -350 -215
5269 -215 -141 -257 -132 94 68 197 27 71 5 24 -151 79 134 -206 -3 -102 -241 -145 -13 -108 -100 -314 -86 146
5293 146 -162 30 -247 10 167 68 -11 139 -33 17 244 140 134 -60 36 -156 -271 -172 -32 -164 -97 -25 157
5316 157 148 165 79 -67 -150 -119 -159 51 135 138 259 33 252 63 327 472 -112 246 87 -94 0 44 -122 -122 208
5341 208 -20 -56 2 -124 154 -237 244 213 -257 -88 182 160 -180 125 -63 -72 -228 -60 242 -29 -179 -222
5363 -222 127 341 -91 -129 -69 52 100 -131 20 4 169 -58 -64 -132 177 -130 -19 -42 -40 -148 219 7 -122
5386 -122 -70 27 39 -64 -140 -24 -59 53 -143 -28 252 -132 41 249 -122 64 -171 -315 114 105 -6 -56 90
5409 90 9 -55 -391 196 -335 -110 -110 -121 -34 -46 -190 -93 26 -219 178 -20 -2 220 150 191 -153 -202 -96 232
5433 232 -149 -165 356 140 -287 170 -13 65 -131 200 -121 -85 62 -144 -172 -363 -28 63 48 207 152 106 93
5456 93 -356 92 -135 201 -284 -19 73 -13 322 -49 -145 124 87 -17 185 67 -141 80 -265 -67 11 12 47
5479 47 -35 130 -12 -79 86 -75 -429 -147 305 122 238 96 91 73 143 -125 -65 -353 -148 23 89 -22 16
5502 16 77 6 103 33 -44 250 10 43 295 -114 54 -156 -100 -68 -21 -105 -72 95 111 -10 179 5 83 139 250
5527 250 72 14 -165 -346 -24 63 156 -5 144 34 83 112 75 -168 75 291 15 112 190 83 17 -177 -167
5550 -167 73 -170 -20 -12 63 -130 -32 123 208 16 -212 8 210 83 130 -64 158 -145 -195 104 86 -205 107
5573 107 -144 130 210 37 76 75 -22 -72 276 -159 -57 -237 226 -99 -44 -70 -88 101 205 -116 -64 107 186 115
5597 115 148 -184 162 47 -27 -207 -140 0 -131 -125 106 262 -69 -208 51 -141 -285 129 104 -68 -168 73
5619 73 -76 -281 -39 -48 56 123 -41 94 -4 20 114 -24 -58 91 -166 -282 147 -116 -129 285 78 -93 -82
5642 -82 20 118 81 35 -75 -65 -85 15 0 -209 29 -49 105 198 -20 -275 38 -4 -104 -227 -9 107 5
5665 5 1 194 -225 1 -98 40 80 241 -236 -110 -100 -103 162 41 -76 -101 10 -10 -33 25 301 31 75 -36 195
5690 195 108 -25 -64 -136 -12 -101 -28 79 32 -169 79 -178 -61 77 -131 124 6 132 112 146 6 223 37
5713 37 -87 -130 -98 22 -125 66 -3 10 55 -23 5 151 -190 47 101 -162 -3 64 81 241 15 194 -3 -101
5737 -101 -253 114 358 -266 69 70 -188 362 -201 -111 -20 -181 -158 -39 -91 207 122 -211 -186 -168 94 -110 193
5760 193 61 70 -100 121 -362 -84 53 39 105 -179 -69 63 -32 -1 -73 -107 60 -220 -9 197 -188 -101 -76
5783 -76 6 -148 293 25 89 -219 -56 -101 -210 -22 146 -118 -218 91 -173 -97 -134 -240 6 -76 -63 -81 -163
5806 -163 -6 -7 -88 194 -330 -124 211 -9 -262 -329 -75 -120 179 149 -233 -99 -274 -44 25 -232 -331 -61 -10
5829 -10 -60 17 -210 -315 -249 -290 146 -220 149 108 -29 230 -172 -31 -57 -62 99 2 -5 -67 -186 -79 -140 67 145
5854 145 143 -41 -20 300 1 -26 335 261 48 50 187 -67 -267 57 -79 357 141 221 -30 -136 -13 95 119
5877 119 -69 68 -106 -30 124 -204 306 -32 50 -106 -18 -69 86 169 129 47 -16 -3 3 -18 7 -122 116 -175
5901 -175 -81 56 18 18 83 -226 76 200 -22 147 -182 54 225 -46 121 -90 56 38 5 -13 -81 -112 -345
5924 -345 -42 74 121 28 -109 350 132 5 -62 71 -300 -167 91 174 -22 97 22 -160 3 47 49 172 2
5947 2 -108 80 141 -263 19 -55 -206 105 -222 101 160 246 0 55 299 86 -147 -32 -15 -103 38 77 139 95
5971 95 89 117 -189 -14 -99 3 -51 -66 -91 -32 115 54 133 -192 61 65 81 167 -110 184 136 15 -123 -84 -183 114
5997 114 111 -116 162 -11 311 72 132 -192 7 96 73 101 12 218 -125 2 46 156 14 161 211 -23 138
6020 138 9 -11 248 -64 179 -128 170 29 -143 88 -373 -227 -279 58 -188 -195 175 -1 -80 95 5 347
6042 347 -208 -51 -282 -163 123 54 -274 320 0 -171 64 175 24 -49 124 99 -30 -332 -101 116 -24
6063 -24 58 123 84 -23 90 4 141 -223 76 64 107 162 -148 216 39 7 233 105 -65 -68 -112 -19 96 251
6087 251 -76 -86 109 344 83 -97 242 89 -119 174 -141 89 -65 126 -45 -67 13 -189 27 206 140
6108 140 -145 83 37 119 -162 174 -90 163 197 20 -63 18 401 -55 -109 9 219 -18 -167 -241 -103 97
6130 97 176 -50 47 -150 -99 33 55 213 70 114 32 53 -260 177 202 42 -141 119 30 -110 -71 -290 181 -14
6154 -14 89 -76 -389 100 181 -80 221 141 92 16 -117 112 -166 256 13 189 -130 105 -113 13 -18 61
6176 61 -29 -186 54 94 74 -184 -168 82 -51 251 -274 -29 -183 -68 -75 109 43 7 -194 -94 -122 55 -225
6199 -225 -54 -81 159 -4 189 74 -196 -109 -31 86 45 137 83 -65 -99 93 60 69 -38 -60 22 -155 -143 76
6223 76 -107 -104 119 109 -179 71 -228 48 32 115 200 -343 -207 -293 -200 132 37 106 -118 49 -195 64 -76 -170
6247 -170 79 9 15 188 -93 -77 175 -54 123 -32 -217 -118 3 -226 -212 52 189 81 23 -94 -316 219
6269 219 -107 -127 25 31 122 4 -227 -149 69 -5 -206 8 -165 53 17 -120 193 -236 -276 -57 -4 160 33
6292 33 122 -25 132 64 119 57 58 114 33 152 111 -64 -201 -185 -82 28 46 136 -153 -41 -47 -97 -160 208 36 263
6318 263 -67 -81 -125 -125 91 168 -4 -24 55 -174 20 -43 -86 67 -37 14 64 -211 -284 -193 234 -304 226 59
6342 59 3 -88 -280 15 405 162 242 202 -114 -276 67 -142 -33 88 -206 -18 159 -43 -108 -116 -117 -43 -217 64
6366 64 32 -85 -28 137 -162 -121 -70 -119 4 -113 -302 129 180 -71 -43 92 0 -223 -136 -84 13 -281 19 32
6390 32 128 -162 53 -98 17 24 -452 -117 -259 -249 -104 -13 81 -111 -28 51 144 -156 -36 39 27 89 301 -51
6414 -51 111 -163 160 24 119 11 -31 -157 1 29 -243 -163 -86 10 -166 -36 -251 -78 -5 -231 -14 -75 147
6437 147 17 -267 -3 15 -69 -71 184 -57 271 -47 -157 66 32 -158 -226 0 -121 130 40 130 -120 22 -21
6460 -21 164 -140 54 -125 -320 -25 -314 -52 169 -205 -65 -43 207 295 293 40 22 -44 -105 -273 -154 31 40
6483 40 -286 -8 44 3 -46 64 -223 16 -67 -123 214 15 -200 -1 -152 -29 -6 -116 106 -91 -180 -21 -42
6506 -42 167 68 -48 95 -162 1 185 165 -23 -163 -113 -420 -65 37 310 -91 -183 139 94 172 13 -81 -19
6529 -19 184 158 -92 -239 -68 -19 116 -54 -147 29 49 -192 -105 55 136 122 -229 -66 214 -170 -2 30 184
6552 184 30 -194 -127 252 -155 120 -52 102 -149 -62 110 -183 339 -32 -249 73 -131 141 135 -223 -88
6573 -88 250 92 70 -17 -21 73 -78 -270 8 55 253 -108 15 -76 158 -93 23 111 16 42 187 -114 175 -7
6597 -7 149 -2 -180 132 -120 -21 102 -82 248 -73 45 124 202 222 30 43 -235 -318 -169 -58 -154 144 -207
6620 -207 144 94 206 18 -107 -34 -186 -72 -136 48 6 137 214 124 169 45 244 -32 -99 121 231 140 -145
6643 -145 -85 -237 37 -212 -74 52 -34 46 123 54 104 36 -68 -80 -72 77 53 258 17 28 85 201 116 -217 237
6668 237 149 32 105 -65 152 117 -16 -82 -36 124 -82 46 98 156 -79 -13 -85 431 -36 23 -11 -140 -218 -22
6692 -22 30 102 41 -212 -52 191 -130 122 97 104 48 -93 280 26 6 257 179 -174 -64 -159 142 -113 -62 -214
6716 -214 3 14 -148 -2 -38 -83 -185 -17 -308 -139 158 -157 157 31 -9 -26 -22 0 33 -239 6 128 -243
6739 -243 -146 -61 123 28 -44 -163 82 255 14 4 -87 62 -224 -55 -45 118 -59 -203 -89 283 72 112 8
6762 8 99 -92 3 -45 -168 72 263 -59 -76 -307 -114 -63 -108 129 172 -105 -5 53 165 -97 285 28 -289
6785 -289 70 -5 187 68 86 -180 -163 161 181 -51 -76 -160 29 -19 -24 192 5 -47 81 -71 -195 130 43 -90
6809 -90 210 203 52 159 26 79 72 47 147 -139 260 408 -194 -57 119 112 88 -30 -164 -26 52 198 60 3
6833 3 24 54 218 83 87 -48 133 -183 267 -334 -99 62 92 -20 -275 4 -146 -24 73 -2 -244 266 171
6856 171 -63 90 -65 76 -157 -215 370 -25 1 -221 214 -80 153 204 -112 -206 -7 61 -8 -34 -55 -81 -57
6879 -57 -27 -254 11 -26 10 35 86 22 -274 -169 148 -271 162 -12 204 100 119 -9 -32 12 70 -283 138 -90
6903 -90 -51 -289 -63 -38 -85 -141 93 -216 -117 298 70 18 54 -12 -47 14 224 50 -101 -149 75 -80 26 38
6927 38 -121 -140 -53 31 -199 -91 -184 -76 6 -115 -173 -72 -51 -114 163 -105 128 -263 -65 166 184 2 -120
6950 -120 273 -32 100 -178 -210 -53 71 27 84 26 -174 -41 -112 103 166 -10 43 -95 124 71 18 -180 -175 160
6974 160 -215 91 279 143 194 79 -44 38 -26 -108 -257 69 44 -153 -88 192 -84 -327 -236 -264 -136 -170 -322
6997 -322 83 -21 0 -69 -102 -5 124 177 -67 -25 -97 -217 -341 75 85 180 -69 -29 -193 -28 68 16 265 186
7021 186 -174 -15 131 -58 -119 31 -45 -112 -11 183 37 -66 -48 -56 -97 64 47 -56 131 34 -5 5 75 116
7045 116 297 92 56 218 -95 68 -120 248 -66 105 -224 267 -145 190 5 43 -133 -131 289 -80 -85 -120
7067 -120 331 15 -148 -158 -194 34 -19 99 28 -53 -48 -341 218 -251 -114 -30 -157 32 101 -80 -136 235 -176
7090 -176 -22 115 209 -141 107 76 -34 -28 -44 39 -8 -83 121 -33 -111 -34 329 191 -78 -17 272 194 -75 115
7114 115 46 -370 -142 -264 -34 -303 -97 -217 -74 121 86 93 -11 -198 91 146 27 -164 250 343 -152 -195
7136 -195 -158 -84 -124 -126 -122 -99 145 195 13 -21 -57 -183 11 74 -321 -64 -115 34 120 -108 -28 73 46 118 -57 -169
7162 -169 89 -25 -14 449 -351 -11 -289 -23 -2 -95 -202 -87 214 193 30 199 -17 -67 -46 -337 -106 163
7184 163 -33 -74 -158 -104 -167 143 193 -19 -149 182 63 -368 -107 105 253 161 274 -78 339 -82 -88 -234 -125
7207 -125 48 -121 -148 -21 238 -20 75 59 68 -221 -51 77 75 121 -103 -33 81 -55 316 14 -153 -276 -73
7230 -73 -99 -5 -53 -149 88 -87 -199 -119 14 106 -30 19 -167 -67 16 -179 193 -98 148 -234 45 -91 -83 -208
7254 -208 -201 129 -65 18 58 -15 206 105 35 -136 -152 -140 -49 5 -78 -147 186 6 -26 -101 -189 -130 -230 -20 -16 -58
7280 -58 -118 99 -277 -82 -59 292 139 -60 1 253 -77 189 47 -27 -55 -35 9 -317 -36 -217 -107 143 206
7303 206 139 -405 -289 12 -126 -134 8 29 -44 -39 229 -193 -65 -147 -225 -87 41 -84 -27 -180 -237 155 40 -30
7327 -30 -80 140 -20 45 -227 -120 -41 -348 -127 -212 -29 43 71 146 -64 -167 -64 107 64 -47 212 39 -176
7350 -176 21 -89 117 276 -61 -69 198 25 100 102 191 -144 165 153 332 75 -64 -5 -370 9 -138 -375 175
7373 175 -107 -279 -189 -17 -161 131 94 49 -220 43 -78 -162 255 -116 -325 -57 237 -52 -110 -223 -14 260
7395 260 -22 -145 -103 242 197 -148 93 -13 123 -220 -292 101 -241 172 242 -82 -87 270 332 -70 62 65 149
7418 149 26 243 27 75 156 -105 -197 -225 31 111 26 -77 -102 -89 -74 -114 121 -55 -166 131 88 -81 7 -487
7442 -487 -6 237 -90 128 -156 19 -215 -102 -215 -3 73 89 93 -123 66 44 -129 -65 -184 45 88 -29
7464 -29 -219 -142 -13 6 61 -280 13 -232 147 171 -48 168 313 225 60 -41 20 137 -120 -23 4 24 112 167
7488 167 -243 -27 -24 165 65 103 88 71 244 -170 113 -147 155 -115 13 -212 -175 12 177 -1 82 55 55
7511 55 236 -184 -23 -70 117 -146 -25 92 -108 148 -115 -29 105 -124 -165 152 -83 -229 61 264 145
7532 145 -45 -59 -170 22 168 112 -186 -120 245 132 -124 -139 -82 -47 164 166 -1 -74 -352 124 -91 -11 -51 79
7556 79 -557 18 51 212 -55 -279 -27 27 87 2 -82 166 157 283 251 -107 -36 -148 136 43 -60 163 51 -163
7580 -163 -29 154 -133 -152 39 -157 112 -225 83 -109 -6 110 -29 -254 -10 17 -347 -55 -45 67 76 19
7602 19 322 -10 -22 -18 -127 13 80 150 175 -186 49 -93 -291 -26 31 88 -57 2 257 79 -144 44 36 104
7626 104 69 -103 5 -239 32 -125 167 6 131 -112 78 -128 -38 198 -357 250 231 85 -15 146 -30
7647 -30 51 -230 -243 -185 -12 -41 -45 24 136 84 -148 41 -93 -4 -137 -263 -184 -267 85 22 36 46 124 285 -179
7672 -179 -94 164 38 283 -82 74 -9 148 -196 -150 -20 -165 115 -41 210 135 -187 -134 163 27 -35 195
7694 195 -2 -72 -108 -287 -116 46 -98 223 372 -123 36 -94 66 -122 292 -323 126 351 62 -83 -197
7715 -197 -25 4 -2 38 -151 95 -51 -210 115 -22 50 -41 56 97 -137 29 -8 27 75 -199 -30 -115 215 53
7739 53 239 79 -69 301 274 -3 -77 -94 82 104 10 59 -72 38 272 -161 -32 -91 99 78 -117 -13 1
7762 1 52 72 -102 -100 -122 72 513 -89 337 -74 1 20 -58 106 -254 41 -109 107 -48 1 66 -11 -80 197 -139
7787 -139 16 -166 -110 259 56 -212 -34 -346 -130 -207 -100 76 -113 209 -216 -229 24 44 -25 -148 -253 -32
7809 -32 235 226 269 -48 -60 90 220 0 -49 -109 -263 -211 -50 148 191 104 -75 51 50 -402 62 -186 150 67
7833 67 159 -88 -71 48 125 -64 -152 142 359 -37 177 -83 279 23 126 -105 -143 148 -301 62 -143 292
7855 292 -72 58 -139 -52 -116 99 68 3 83 -134 142 107 92 30 -47 125 104 -193 -257 166 -165 -3 -35 34
7879 34 -32 -24 -98 -121 32 100 -223 -100 -116 -75 209 -2 38 113 148 -175 3 -58 -178 29 -140 7 -13 62 -4
7904 -4 -70 -79 -67 -62 -90 -246 77 -15 -90 26 -119 8 -186 100 -140 -92 -92 53 216 -134 -27 -129 -71 -47 18 -167
7930 -167 -204 -50 122 270 -98 192 3 46 12 2 252 172 50 -36 17 31 166 189 35 74 105 68 -110 149
7954 149 209 -115 99 132 -207 -9 -61 -34 220 41 90 1 -24 -286 -101 88 -66 -100 53 329 -21 28 12
7977 12 56 -177 -126 -146 51 -95 -316 101 -74 3 54 117 280 -123 -130 -64 56 -28 151 -108 -151 -15 -340 -47
8001 -47 64 -22 10 -125 233 -198 -177 204 -98 73 80 218 36 -55 -155 147 110 39 51 -143 -10 64 -10 -276
8025 -276 -132 47 52 -40 77 18 20 -116 -97 -59 -14 -163 276 -96 10 172 148 -265 55 -133 18 -96 -59 -54
8049 -54 190 43 117 28 -55 11 59 -186 -81 209 116 -131 392 249 110 -136 78 139 -88 106 8 81 59 87
8073 87 -190 -223 -42 -19 -183 -25 -62 34 118 43 -194 5 45 81 -129 84 -33 376 113 -213 -92 89 148
8096 148 -74 -279 -89 31 -106 -106 153 143 86 3 324 -94 34 -131 205 31 29 160 -119 250 -67 -60 -153
8119 -153 -27 124 153 18 268 182 -126 101 83 -61 -51 354 111 239 92 -236 -69 -168 -39 -49 -61 -57 -303
8142 -303 -137 -97 -193 220 92 -23 70 -78 -11 -4 -397 -196 76 -36 -185 -20 -194 -43 -49 265 -306 19 -45
8165 -45 -106 16 276 -164 27 63 127 -97 -171 -138 -9 -43 -110 -209 29 -110 -255 35 -45 -109 113 10 91 -5
8189 -5 43 177
8191A77
$$ Imaginary data points
##PAGE= N=2
##DATA TABLE= (X++(I..I)), XYDATA
0 0 0 0 0 0 0 0 0 0 0 -8 8 -8 8 -16 22 -24 32 -40 48 -56 70 -80 96 -113 136 -153 182 -209 241 -278 319
31 319 -362 411 -465 527 -592 665 -746 834 -929 1036 -1150 1277 -1413 1562 -1727 1905 -2102
48 -2102 2315 -2550 2809 -3095 3412 -3766 4159 -4604 5114 -5694 6369 -7168 8125 -9296
62 -9296 10774 -12700 15332 -19158 25255 -36535 64471 -288917 -240110 328351 33565 -276092
74 -276092 -162652 209570 177577 -12423 -37177 103093 126513 143386 121666 14645 -101745
85 -101745 88 146026 50467 -214987 -225658 -35673 4192 -120951 -109864 30518 90669
96 90669 36483 39655 73489 41506 46132 142233 103410 -111667 -212465 -54976 99930 40420
108 40420 -62282 -19692 27588 -14787 -26869 13622 6407 -14298 45315 103653 9992 -107211
120 -107211 -32091 87188 14786 -106509 -65589 6287 -70104 -129372 29096 183028 85995
131 85995 -25460 83897 169582 17533 -120877 -6493 107946 -51555 -226453 -106248
141 -106248 83936 39592 -97348 -79251 16419 -143 -57259 -2241 81846 93708 114594
152 114594 153617 99617 -20710 -56815 -3665 -18645 -107834 -104095 -30462 -54520 -115139 -50263
164 -50263 69646 66252 -22378 -15352 66823 63710 20233 59412 100189 41921 -30108 -15382
176 -15382 17359 -36027 -94993 -57194 -13464 -44412 -67035 -30566 11155 32759 68224 97795
188 97795 46253 -30687 -3899 51686 -6811 -82908 -23052 75609 21122 -110520 -78638 72043
200 72043 78203 -54469 -93381 4608 75020 44091 8573 27615 36984 19498 5598 -34821
212 -34821 -90871 -76568 4089 36415 -20206 -52586 13034 63650 22348 -4494 38696 62410
224 62410 19206 -20014 -2932 11601 -13148 -14794 4115 -29984 -80033 -57148 5834 12556
236 12556 -30154 -19814 47924 64187 26272 21066 44478 40301 11982 -2444 -6867 -33403 -52730
249 -52730 -23595 -1293 -27362 -45404 -24837 -3467 -3287 8620 48419 55460 12113 -1863 27120
262 27120 26956 -4912 -8228 21795 17226 -39234 -62439 -26579 -13311 -36131 -31594 11634 43941
275 43941 34721 16185 20254 21688 11933 8722 -3750 -23772 -16265 11536 16952 -15859 -40933
288 -40933 -21319 -6262 -27689 -25443 22287 53979 33915 3030 9915 26728 6767 -16458
300 -16458 -8531 46 -8000 -18864 -21082 -18466 -18670 -9906 7353 5937 -2271 11691 27284 24038
314 24038 15865 17425 20581 -707 -27080 -19863 -2775 -11283 -24813 -19324 -4825 -1904 -7703 1245
328 1245 15725 10325 6072 15481 19981 15461 12865 15052 10331 -12262 -29384 -26676 -25588 -26555 -12280
343 -12280 7484 16793 9990 2579 8608 11097 4817 8194 13723 9569 5156 2744 2071 -5116 -17522
358 -17522 -17666 -14506 -21167 -18536 -2112 10808 11896 8017 13234 21863 13315 1564 2834 5517
372 5517 2696 -7027 -18238 -18074 -11651 -4997 1688 -172 -4244 2183 6026 2452 -45 3857 14852
387 14852 16297 6152 2938 4359 -707 -8274 -14695 -17670 -16859 -16520 -8728 5236 12013 15407 16508
402 16508 12175 7873 3347 -1806 -3333 -3748 -338 5060 -1319 -10877 -9198 -2324 -1796 -12667 -21948
417 -21948 -10247 8837 14541 11984 12141 18465 23616 12490 -5632 -14834 -14691 -6829 -2877 -11239
431 -11239 -15843 -8220 5520 12619 723 -13601 -6513 9510 12781 448 -7790 8685 29434
444 29434 21318 -2641 -14533 -7354 977 -9065 -23825 -21174 -7025 5641 10545 6097 4395
457 4395 8802 10987 7912 -5234 -17178 -7774 9306 12121 3310 -2593 3729 8209 -4742 -15944
471 -15944 -12766 -6717 -4309 -874 8961 18540 12698 2787 6398 8095 -7748 -25437 -23081 -1369
485 -1369 10044 -1625 -6799 6388 16490 11308 -2344 -8425 -3313 1137 4804 8385 3229 -935
499 -935 7238 14991 4375 -23874 -36493 -13620 7702 -3210 -19131 -5698 27400 35870 8518
512 8518 -10109 3334 18065 11211 -8155 -14705 -3997 4839 2438 -3438 -12804 -17201 -7904 991
526 991 -4119 -17007 -13962 12893 29139 13776 1135 13713 28344 16565 -12117 -20357 -7690
539 -7690 -7385 -16531 -11641 2178 6318 -2362 -5599 3426 1316 -11914 -8784 9023 17263 10071 4028
554 4028 11193 14583 934 -9600 -9165 -10560 -14710 -11918 780 8338 63 -3167 12451 20569
568 20569 5002 -15091 -13085 6536 8889 -11638 -18468 1132 18830 12450 -9214 -14795 -1690
581 -1690 4862 -1371 -5990 -1114 12138 20624 16880 5202 -8344 -11563 -3376 -3764 -19049 -24418
595 -24418 -7915 12410 9563 -6812 -3455 15751 17460 2512 -4085 5110 12247 4326 -1913 3856
609 3856 3436 -6586 -10877 -7699 -7906 -16339 -19384 -6840 4273 4499 6914 14489 18663 15538 7988
624 7988 4181 -191 -7521 -7087 -505 -1280 -7347 -9839 -4612 1558 -4368 -13738 -10861 1916 10778
639 10778 9032 2209 6530 17927 17039 2945 -10363 -9820 -454 -1985 -12232 -13871 -5154 3983
653 3983 5883 394 -1957 2276 6795 8720 1432 -6518 -1702 8228 7364 -2370 -8106 -1720 3136
668 3136 -5311 -12424 -8922 -1414 3307 4364 6841 9888 8651 6676 5836 -1151 -9756 -9132 -3093 -552
684 -552 -4239 -6970 -828 2463 -2152 -5051 -2138 3440 7804 7537 5936 5902 4670 3931 714 -5226
700 -5226 -6219 -2995 -3616 -7877 -10327 -7194 -654 -194 177 5941 10161 9838 7226 4108 2037 -82
716 -82 -1582 224 -1060 -3947 -3349 -3229 -5995 -8880 -9054 -3565 1814 3547 5951 7755 6979 6426 5032
733 5032 2314 277 -612 718 -236 -7139 -9984 -6330 -2669 -2631 -3225 64 6493 6199 1700 780 1634
750 1634 2912 4365 3902 2694 1300 -1309 -3168 -6982 -11216 -7715 -1198 2269 3446 3067 4188 4373
766 4373 1488 -1095 869 2104 3466 4170 509 -3473 -6770 -7034 -5261 -5848 -4314 2569 6344 5828
782 5828 2669 1299 2928 2854 1140 1707 2435 1873 1393 -2344 -6491 -8001 -6821 -3705 -2064 -2566 674
799 674 5410 5171 4033 3084 4025 5728 3500 975 -4 -2978 -4200 -3628 -4321 -4533 -3415 -1689 645
816 645 -903 -3374 -665 2875 4416 5161 4525 5338 5386 1885 -1679 -4838 -6371 -3605 -1534 -2623 -3091
833 -3091 -1025 2069 2938 -952 -1743 2182 4166 2903 1414 517 915 397 -1393 -1715 -2194 -1596 423
850 423 -938 -2846 -2534 -236 2696 3103 1392 3714 5633 3119 -444 -3991 -5146 -4215 -3898 -2878
866 -2878 -1538 -712 1808 4068 1322 -1256 -1236 1440 3601 1853 1783 4767 4896 1508 -1902 -4757 -5349
883 -5349 -4800 -4814 -4301 -3572 -839 4245 4586 404 -614 3265 6896 4664 -1546 -1642 2535 2776 -905
900 -905 -4255 -4308 -1158 587 -1165 -3861 -5646 -2761 1384 464 -1001 2081 7227 8737 3576 -1938
916 -1938 -1506 -760 -1727 -2815 -3506 -1345 2857 4309 1700 -3802 -5597 -545 1905 -2218 -3486 465
932 465 4797 5024 1718 392 -245 -2124 -1292 857 -2138 -4854 -2034 4282 5986 539 -1502 3325
948 3325 3541 -2193 -6894 -4655 -170 1215 438 1706 2398 515 644 -683 -5245 -6264 -240 7095
964 7095 7013 690 -4 4811 3961 -2151 -6873 -5446 462 1948 -699 -2938 -2662 -192 561 -2270 -1922
981 -1922 2580 4766 2375 -445 311 3432 1196 -2333 123 3641 2122 -1450 -2986 -3356 -5494 -5883
997 -5883 -933 1608 -721 638 6363 6423 -385 -4099 1455 4728 -1982 -5262 2660 7120 1037 -5579
1013 -5579 -3311 2393 -1117 -6431 -4002 -369 -274 1187 4712 5230 1034 -457 3893 3837 -3895 -7121
1029 -7121 -2162 2220 1574 -997 302 2414 495 -2063 -2408 -2954 -1774 1137 2910 3111 2464 2525 1977
1046 1977 -1344 -3905 -2977 -2606 -1738 1142 2097 267 -1531 1964 5180 431 -5162 -1123 5607 2865
1062 2865 -3558 -3747 1318 1180 -2839 -1837 1339 -1326 -3248 193 3459 393 -3372 1387 7559
1077 7559 3436 -2387 584 3871 -343 -6144 -4482 69 -983 -3975 -228 3058 731 -312 1958
1092 1958 3232 -202 -2917 1948 5639 1759 -1511 -3 1661 -302 -3881 -4366 -3720 -3520 -798 1738
1108 1738 515 -398 2851 4907 2628 -827 504 3608 910 -2389 -535 636 -1673 -3301 -2113
1123 -2113 -983 -2043 -2051 1509 1262 -1714 340 5100 3681 -574 -940 3661 3549 -2731 -4089 27
1139 27 -288 -3690 -3536 316 1220 -1284 -309 3085 1470 -1133 1019 2419 31 -2525 -17 3335
1155 3335 138 -3834 -1166 1180 -1541 -4264 -2060 1820 1450 336 3215 4857 1119 -656 100
1170 100 -100 -2946 -3406 -696 688 -1908 -1732 1478 250 -2622 -1491 1930 2630 958 2098 5168
1186 5168 2771 -809 -667 -80 -2381 -4183 -2885 -300 -1198 -2349 -178 1922 -531 -1210 1611 3213
1202 3213 1888 1254 3023 3826 -16 -2052 -483 -1359 -3773 -3353 -778 4 -1737 -841 2489 1711 -1108
1219 -1108 -202 2823 2482 527 879 3143 1594 -2612 -2112 -1402 -2870 -3878 -1348 1461 888 -735
1235 -735 1361 3106 928 -393 726 1647 684 -339 641 960 -2368 -3365 -1817 -1653 -3054 -1820 745
1252 745 2275 937 1023 3612 3287 429 303 1156 927 -1124 -1197 -800 -1963 -3153 -1897 -745 -2346
1269 -2346 -2250 400 2280 2037 807 2554 3955 1198 -326 617 709 -1007 -1677 -1256 -501 -1685 -2747
1286 -2747 -1197 -885 -1634 506 2131 2116 1040 1227 2894 1649 -1504 -1547 -77 -305 -1547 -840 255
1303 255 439 -1087 -451 1106 551 204 1144 1767 1131 414 432 425 -1981 -3150 -1557 -1179 -2145 -1630 -240
1322 -240 1406 939 613 2365 2818 1641 1256 1911 1749 88 -1640 -1982 -1935 -2699 -2849 -2315 -2564 -1727 -43
1341 -43 587 282 770 2472 4196 3144 2156 3055 2795 601 -2112 -2269 -1776 -2420 -3453 -2175 -1600 -1619
1359 -1619 -656 -737 -723 -202 902 2840 2932 1820 2241 3194 1615 -594 -1822 -514 -868 -2602 -2534 -372
1377 -372 19 -1158 -910 -412 780 418 261 454 261 61 919 655 -89 -102 545 616 222 -645 398 658
1397 658 56 304 786 964 -94 -1054 -1366 -1254 -1605 -1711 -1027 -809 -172 316 22 188 651 2108 3222
1416 3222 2036 1893 2543 1835 -477 -2304 -1819 -860 -1385 -2983 -2171 -934 -1583 -2281 -2342 -815 1372 2021
1434 2021 3177 3801 3476 2688 1997 190 -790 -1285 -645 -220 -1724 -2471 -1592 -1954 -2526 -2420 -1415 656
1452 656 1133 1195 2048 2291 1946 1450 678 441 855 676 -588 -1448 -1061 -158 -1098 -2380 -1320 555 447
1471 447 -874 -1465 389 1167 -78 -400 885 1581 1059 -232 -925 -349 -99 501 1113 84 -184 885
1489 885 551 -594 -1498 -1313 449 186 -1172 -1204 55 -254 -1487 -1470 450 1897 1190 518 1627 2018
1507 2018 1190 216 -487 493 228 -486 -726 -1154 -1196 -1575 -2105 -2239 -884 53 331 804 1304 1828 1545 913
1527 913 721 771 917 1010 248 -655 -1580 -957 -324 -1582 -2496 -1307 401 578 -701 -293 1621 2048 477
1546 477 -116 1666 2012 962 -857 -674 450 -74 -1243 -1371 -905 -460 -95 39 -471 -431 -79 803 579
1565 579 -398 -10 1141 963 -484 -735 141 330 -598 -960 213 829 808 175 -300 288 374 -422 -344 -314
1585 -314 -121 -16 -698 -502 -212 -105 -193 -85 412 1009 477 -270 381 997 380 -448 -149 426 389 -572 -740
1606 -740 -564 -808 -673 3 130 38 617 968 682 -588 -462 1327 1556 153 -834 255 781 -747 -2230
1625 -2230 -1359 156 433 321 -408 181 335 -111 136 222 -54 1142 1444 263 -602 -589 -359 -596 -1442
1644 -1442 -872 805 679 86 -432 -258 -217 250 181 401 451 686 727 -87 -532 -624 -147 -86 -224 -329 448
1665 448 307 -647 -324 471 195 -286 134 853 871 -455 -570 -62 -39 -448 119 24 445 233 -88 -312 -403
1686 -403 80 718 621 -162 175 501 697 -931 -1301 -236 929 237 -451 -175 371 666 -165 -467 32
1705 32 345 1046 308 -183 -223 118 -150 -578 -701 -236 860 0 -494 -562 -104 482 57 36 391 691 95
1726 95 323 -235 -499 -562 -169 32 -692 -361 -129 320 -433 -536 201 284 298 328 603 489 62 -272 73 44
1748 44 -727 -764 151 431 -216 -638 150 87 77 90 200 354 467 253 143 -169 -431 55 163 -643 -494 262
1770 262 268 -298 -734 90 431 164 158 -62 17 52 223 -206 -345 -445 -115 487 -252 -407 -373 514 -124 -305
1792 -305 -198 446 366 -40 44 101 294 132 -142 -618 -138 52 59 -122 -268 -202 300 -33 -59 11 -37 274 176
1815 176 -15 108 -86 -134 -124 -133 211 -167 -187 206 -183 -155 86 -127 -62 -99 -104 -14 63 -177 -117 -366 -544 -8
1839 -8 108 -92 -38 -238 385 445 271 -177 -214 191 305 -100 -322 -129 -79 -15 71 -350 -266 106 -91 -259 33
1862 33 225 637 397 -40 526 56 39 -212 -336 -317 -49 201 -165 -188 -365 -37 -347 -162 37 242 142
1883 142 428 -24 307 401 -6 119 -139 -127 26 -7 -133 -61 -203 -354 -100 -85 -197 -104 -46 456 -23 -90 -2
1906 -2 -114 -215 39 -76 149 222 -79 -58 31 -10 88 102 -118 -39 -77 -77 59 -218 -356 -166 -124 26 -39 -27 -5
1931 -5 90 153 267 127 -233 161 15 114 57 -11 -82 -132 17 -617 -146 48 -23 -110 301 76 102 451 106 -106
1955 -106 -40 374 294 74 -5 -158 203 -172 -252 99 -359 -263 -230 30 268 204 154 154 503 119 -232 98 183 -160
1979 -160 -114 -400 190 1 -205 81 -62 8 -55 98 178 -17 -32 -28 -194 -63 15 -189 -97 240 153 89 22 246
2003 246 -210 126 18 64 85 339 317 -64 -78 -254 -614 -122 196 -85 -144 232 -144 75 -204 297 114 156
2025 156 -65 298 36 -64 -331 25 141 -98 -331 -308 321 8 71 182 304 287 -116 111 237 62 183
2046 183 210 26 -12 8 -269 -113 -56 36 77 -74 -161 53 -79 -134 73 79 123 48 287 95 72 208 -280 -242 -123
2071 -123 -245 -106 97 -12 -254 282 85 11 108 -191 89 207 -44 -1 -63 -94 203 -135 -36 -199 -53 -76
2093 -76 59 -166 -6 274 87 14 -36 183 21 -211 -182 203 135 162 4 130 -67 69 102 -81 20 21 77
2116 77 211 23 -13 -273 -227 -66 -241 -193 12 13 62 -36 -119 78 54 198 83 -16 -178 -65 -102 -95 -187 -183 344 -257
2142 -257 -27 138 183 40 -253 -8 -157 8 56 203 322 -50 137 -60 272 -253 -202 -140 80 63 38 49
2164 49 -128 4 196 8 -267 -27 25 71 -60 -10 -27 26 -24 -184 58 -26 268 -122 35 -1 -199 -45 82
2187 82 90 -51 28 15 -64 -126 155 206 51 -143 240 -15 134 251 410 143 211 -243 2 -36 43 -125 -60 167
2211 167 86 -163 2 54 -253 72 9 -104 -5 87 11 -10 -201 238 103 -115 181 216 121 -125 -198 -2 -355
2234 -355 -222 33 -17 -220 41 -189 128 -39 0 -43 -48 -114 143 -66 -29 -161 -160 104 96 76 -111 -123 -137 -35 -180
2259 -180 81 34 137 -133 212 107 36 -318 91 -82 -168 43 -70 -176 -297 324 5 159 -34 66 -27
2280 -27 200 -408 -256 111 232 7 35 188 -2 144 24 -43 -150 -27 -73 106 27 -156 131 -129 40 -199
2302 -199 90 -29 -300 80 -37 4 -37 -157 -83 182 61 -18 200 -188 -55 140 212 -19 -100 -167 66 -196
2324 -196 -20 -241 130 -2 -100 -79 -159 96 -7 -55 -67 215 -178 -11 145 14 157 -135 -68 -39 -57 160 16
2347 16 -164 -220 154 7 -84 185 109 -22 83 12 -203 71 -11 -123 151 -82 -154 -71 -19 87 -482 256 39
2370 39 122 -245 -144 -44 75 26 -192 6 -204 -110 -182 -80 117 197 245 6 -145 -277 87 61 -117 25 -42
2393 -42 -238 20 112 282 -339 219 21 202 91 160 -211 -292 -46 24 165 -311 -81 83 61 -12 -228 -12
2415 -12 -42 29 220 -100 -330 -161 -151 -60 145 76 108 86 268 15 -27 107 80 -38 -515 -118 -38 60 -43 -46 -76
2440 -76 -28 -70 -140 52 112 -132 46 173 259 -136 244 6 -46 112 52 142 -224 -18 186 -157 -219 -126 -92 -6
2464 -6 -71 268 169 204 -99 239 159 -105 75 -18 4 -216 103 18 -72 83 70 59 -2 0 -116 228 105 -138 87
2489 87 50 -211 -16 -3 122 -206 -66 62 -175 134 -126 -27 251 58 -18 -240 -80 -213 -148 -25 -34 -190 -200
2512 -200 -52 88 -95 135 160 12 194 118 131 -484 522 23 -131 -13 153 -219 -168 -27 -393 -130 -102
2533 -102 -2 -1 148 -153 -86 199 186 315 92 -52 -59 42 -149 -123 40 -291 -42 162 -227 -394 -24 -16 318
2556 318 -95 -150 -107 3 -6 173 -40 320 135 -214 102 -159 -151 -13 -44 20 -101 147 281 125 21 105 -179
2579 -179 -90 -245 -82 -118 23 29 -176 -8 268 104 97 -70 30 63 49 76 -91 117 -254 -40 -312 -278 44
2602 44 196 -225 73 -10 59 194 -33 357 441 -2 135 -67 -74 -29 87 -289 27 -128 -159 -115 -39 -236 151
2625 151 200 -162 70 338 612 25 -65 38 25 -318 -133 -537 180 -58 -52 -90 -4 210 -234 -7 -176 154
2647 154 210 0 52 126 62 -61 -65 -72 -258 51 -63 -219 -5 289 -38 60 33 281 35 0 -277 182 42 -20
2671 -20 -76 -258 -252 -130 -94 142 50 176 -129 -9 103 3 -96 -51 263 7 -12 -156 100 -232 21 -120 -140
2694 -140 -78 79 -138 116 335 385 74 166 32 271 -269 -127 22 -11 -256 -22 -80 -26 -84 -30 -49 -33 88
2717 88 91 273 3 -221 65 -249 -182 -82 -200 -212 -105 12 -218 -398 101 147 40 177 236 289 -89 19 196
2740 196 -21 -305 0 -361 -407 -187 -78 -100 -29 -268 264 51 206 295 308 140 -106 -65 -11 -405 -353 -58 32
2763 32 -222 -192 56 -477 67 152 -66 92 -8 248 260 -109 -47 125 166 -54 -68 -66 -129 77 -45 -184 80
2786 80 147 -226 74 44 124 -220 -148 45 117 -122 46 -243 -12 -11 36 192 -208 -19 147 88 105 183 169 208 153
2811 153 -164 -233 -359 -380 -99 -56 -105 102 157 -214 140 226 -15 142 63 320 -87 71 30 -64 -124 -159 -317 -358
2835 -358 -330 -67 -107 -73 -300 301 47 54 133 -81 33 55 -184 69 -94 -136 87 198 7 -170 -19 33 13
2858 13 -156 206 139 -273 312 216 334 368 -160 6 -9 -47 115 60 57 38 2 -51 -59 13 -207 113 35 162 -54
2883 -54 -140 -102 48 21 -372 -82 -167 -92 -260 -163 268 33 261 -94 417 139 176 58 -93 -68 -247 -389 -354
2906 -354 -78 110 -135 123 -194 13 259 264 87 -12 299 347 287 210 -111 113 33 -96 -352 -223 -160 -137 -149
2929 -149 34 126 201 18 -318 317 51 -66 82 68 383 203 -36 68 -173 -199 -180 39 -45 -500 240 202
2951 202 -31 61 164 234 102 -196 -142 -98 -191 -205 -339 -179 -28 56 -162 -94 -207 -243 117 -385 204 204 83 154
2975 154 -181 286 -110 -92 -125 -238 -312 74 -150 -55 81 31 -90 11 322 232 167 116 -163 -281 -32 159 53
2998 53 -295 -332 31 51 91 -289 -233 4 62 -128 87 20 166 -16 2 -85 244 -220 -196 41 -69 122 166 -248
3022 -248 -12 30 -124 -90 322 -200 72 284 97 69 -70 -39 -262 -267 -64 115 273 177 57 83 160 264 -157
3045 -157 136 -81 -67 6 -167 -32 -88 -135 -6 -205 71 -87 -19 -17 207 205 -13 -38 -109 110 229 116 -343 -316
3069 -316 -348 151 63 -140 -112 95 -23 155 -287 205 167 107 199 101 -63 -196 201 -75 -89 -334 -6 330 -274
3092 -274 -158 -58 -30 -81 -209 105 110 273 19 161 -28 -152 56 -10 -158 2 -245 -74 -120 -125 -46 -332 -128
3115 -128 143 42 159 441 44 93 -185 41 -206 -139 -116 -204 -209 -260 -378 -147 98 50 -134 -27 279 -63 359
3138 359 -85 -27 -235 -92 -86 50 -157 254 -165 -100 43 63 35 63 120 259 139 142 111 -115 26 -111 151 -290
3162 -290 -61 -195 -107 -81 6 173 291 583 62 113 347 -58 -13 157 5 -175 -193 -22 -137 -194 85 35 67
3185 67 121 4 422 200 238 305 230 -208 -92 -224 -116 -272 -143 -107 33 -261 -191 -259 -24 138 230 185 209 208
3209 208 79 344 225 74 -116 -127 -146 -179 -405 -38 -122 13 54 214 40 205 252 -174 -46 -185 -176 16 14
3232 14 -102 -115 -460 -199 -135 -50 -106 -335 83 429 323 180 140 49 87 -28 20 -22 -302 -95 -7 -239 -53 122
3256 122 -68 340 43 -12 109 56 -69 87 168 -174 29 -171 -187 -184 -343 -234 224 -274 -125 184 59 267
3278 267 439 235 184 27 0 -199 -351 -104 -8 -193 -517 1 -297 -29 -210 191 92 307 351 11 179 300
3300 300 394 -146 -193 -401 -28 -428 -251 -226 -80 284 -143 235 -9 -117 -70 71 -5 126 4 23 115 -25
3322 -25 -70 -327 -293 -224 -234 -20 46 -13 -64 430 210 71 43 100 42 8 -144 -191 -305 -123 -9 74 171 -31 -112
3347 -112 -134 -71 -29 130 265 260 313 220 90 120 -89 -461 -186 -557 -212 40 -10 128 313 177 107 -49 40 215
3371 215 178 241 -53 7 -22 75 -104 -166 70 -251 -179 -353 115 -139 279 361 149 162 18 124 18 -284 -137
3394 -137 -120 -103 -210 -246 74 190 16 154 166 133 108 -3 286 161 -28 38 41 48 -251 -148 -97 -181 -178 -46 -76
3419 -76 217 301 -125 -31 230 186 -193 8 -145 12 -199 3 39 -216 177 -59 -28 -49 -35 -92 101 64 124 172
3443 172 31 47 -13 -241 10 -7 -16 -304 -214 95 129 272 -21 -243 63 -28 431 -1 -154 -22 363 -75 -20
3466 -20 -296 -182 -100 -83 -213 -227 41 5 105 251 -96 -77 -99 -119 6 -280 -192 -423 -80 -50 -119 75 -21 125
3490 125 -184 85 -165 25 327 228 19 -116 32 325 14 -78 -57 121 14 -100 -163 141 178 144 15 -43
3512 -43 8 199 271 34 -58 40 -254 138 147 -91 0 40 14 0 -49 -3 6 151 1 -141 141 159 -97 -72 154 157
3538 157 74 -3 -220 3 -31 198 213 152 334 10 15 -14 45 12 85 -132 59 195 -283 -48 -201 -253 23 -132
3562 -132 16 -84 59 200 200 153 111 235 -65 -178 3 -200 -70 148 72 124 6 188 -130 -29 -306 -140
3584 -140 113 89 -81 144 26 100 213 -251 63 17 -160 76 78 -204 107 225 66 125 104 -43 -177 -318
3606 -318 69 24 -1 104 -12 -2 -105 -372 -194 -118 69 -67 102 185 109 -102 210 247 168 227 -94 72 -55
3629 -55 174 69 72 -132 55 30 48 -34 -123 -86 88 -220 224 40 -187 -304 7 99 -226 -197 -290 -178 49 145
3653 145 182 -84 35 11 -36 -210 69 127 -66 160 -12 222 -1 177 139 85 189 107 220 -139 -41 20 -198
3676 -198 -27 14 72 28 -122 -198 307 192 28 167 203 -64 77 0 -53 -31 -8 126 -188 -182 174 195 109 -172
3700 -172 115 -35 55 -71 71 -180 -388 -187 -40 -97 -31 296 -87 -43 231 -30 147 31 53 396 -128 117
3722 117 266 -236 -126 -260 -281 -138 167 110 -123 139 142 162 -39 -21 274 -205 -123 144 123 15 237 -94 -149
3745 -149 -39 27 104 23 -53 8 -70 -106 47 -125 47 245 -25 248 -3 93 -334 -99 116 0 -208 128 -2
3768 -2 -9 140 55 6 -105 72 -104 -182 -115 -178 -15 4 99 -39 -151 -182 -14 -55 172 -59 131 -72 97 233
3792 233 -274 96 -81 70 -226 -119 203 196 -161 128 -131 105 57 12 -232 41 93 76 10 285 -181 -128 29
3815 29 -7 23 -132 -238 85 142 118 -137 10 176 92 205 -230 -71 -62 -312 22 43 -86 336 -59 -160 -73
3838 -73 177 -85 129 -158 -46 142 -28 98 108 -104 -65 -39 -138 -143 -22 92 -20 -55 11 354 -52 102 -213
3861 -213 18 131 317 15 239 57 135 -109 177 143 -23 154 111 171 -192 63 265 -5 -6 -91 7 189 62
3884 62 -163 -106 -95 -14 234 -13 382 227 -25 112 204 -28 366 113 50 42 28 -16 -203 205 -101 -57 -40 -237
3908 -237 -63 -170 68 -53 19 175 265 149 -6 4 134 -51 -136 36 -187 -19 -52 -319 -88 -83 89 239
3930 239 35 -146 50 193 -84 -61 -203 58 -86 -273 -79 -97 111 -81 -59 -56 15 202 121 113 -180 164 -65
3953 -65 -121 245 161 58 -10 2 -64 -92 -280 -169 109 -42 218 53 -461 -137 -91 164 100 -262 -120 62 167
3976 167 44 -45 56 -65 -115 -336 62 -124 -215 -160 -212 136 133 204 -65 53 -54 59 156 -32 70 -120 164
3999 164 82 194 93 -71 21 -119 96 218 -133 -198 101 -23 87 -101 -54 -96 -133 -124 -107 -123 19 178 -56
4022 -56 -95 53 23 113 158 -45 48 -45 29 183 -3 130 -107 -1 149 -165 -98 77 14 303 31 11 -201 -37
4046 -37 -29 109 -66 -47 -179 220 207 -289 204 81 -16 -38 -96 153 -23 -282 -189 46 -45 -18 -81 -2 31 -6 74
4071 74 -87 -126 147 32 -53 171 -20 -150 263 35 -86 150 -157 1 -76 126 -40 -132 70 116 77 138 230
4094 230 -96 206 303 111 -194 137 41 -233 267 -65 -322 -162 -167 55 -61 -244 -136 153 130 69 -34 74
4116 74 9 93 -179 114 14 189 144 -144 205 -188 91 161 240 87 -92 141 198 -227 -50 26 -50 192 -139
4139 -139 -9 60 56 -278 -95 -149 173 2 260 28 -189 130 -124 127 51 85 -123 180 160 -182 -26 -224
4161 -224 -30 -103 -78 -45 234 116 70 -34 123 -31 278 26 37 43 146 46 148 180 280 19 -122 62 -29
4184 -29 73 142 237 -147 45 -113 86 267 83 -135 -222 61 -266 77 -139 18 -246 -57 3 -192 221 281
4206 281 224 315 -246 -126 32 195 2 -152 -16 -56 -18 41 -112 39 131 96 174 26 88 124 347 156 94 -115
4230 -115 -114 -67 -230 16 -28 -57 111 159 14 248 -43 -231 -125 -115 33 310 30 136 175 105 16 -269 130
4253 130 -83 16 -91 154 230 -37 103 47 -112 -103 341 280 56 159 -39 105 74 -150 -143 330 -50 66 -59
4276 -59 -86 -310 146 125 -30 -2 267 -128 -114 -6 -31 -91 -209 -74 -247 212 283 98 75 166 245 -45 132 80
4300 80 65 89 137 -23 250 -216 64 158 54 132 185 116 -289 50 216 -182 108 193 -15 16 166 -36 -136
4323 -136 -81 17 -80 67 -267 -143 179 -166 169 -22 172 -222 -141 -103 -108 -20 12 25 108 157 -3 -48 -257 -48
4347 -48 220 26 168 -18 -1 106 138 144 -83 216 116 -60 -127 156 117 -212 36 20 -89 209 161 18 33
4370 33 76 140 300 130 131 -125 -72 -87 12 247 -79 49 301 -104 -272 -223 153 148 -15 -25 -55 -53 -178 -229 118
4395 118 -81 -25 -117 144 0 -41 5 -78 -41 -206 -57 18 167 -107 -120 -107 218 7 -224 206 -197 75 -119
4418 -119 -75 -31 32 276 -83 -32 134 51 187 114 174 137 -115 64 -197 -97 -267 184 -43 219 -147 7 -122
4441 -122 64 117 -106 143 -351 -209 -340 -55 -14 -24 130 -151 -28 -84 204 -219 -181 52 -59 99 16 124
4463 124 -80 151 -22 155 245 -50 40 152 -115 -120 32 111 30 -294 -131 10 34 68 18 -2 28 259 58 27
4487 27 -49 -121 98 28 231 -78 -44 -102 -117 -65 117 -63 -92 -6 145 -213 -254 -32 -93 -25 -99 393 -235 36 -54
4512 -54 34 -3 262 97 227 154 58 -100 112 160 -276 -79 -375 114 -202 -66 -136 9 51 78 50 -59 263
4535 263 -149 -23 -84 -143 65 -257 -130 -110 -112 -2 -134 16 288 -158 336 237 -43 66 269 160 -166 231
4557 231 413 -122 -3 241 -185 52 53 -186 54 259 -48 -38 66 -159 -192 321 -14 -318 88 -6 -81 94
4579 94 -7 43 68 -81 -57 -59 17 226 105 -132 -43 222 146 9 134 160 -16 103 -43 -75 65 83 -72 29
4603 29 -316 141 70 40 -176 287 -182 -107 -111 -69 64 162 -114 47 -27 -49 105 -274 59 168 -35 130 108 -165
4627 -165 39 79 156 142 37 46 39 -156 -109 -74 106 -94 338 -171 -120 28 97 -35 -44 -136 -16 -28 97 154 -114
4652 -114 -43 -217 14 168 -92 -79 117 -66 16 81 237 39 -82 -80 -28 52 -142 -128 8 -195 192 -364 280
4675 280 85 -44 57 -151 -257 -164 253 24 34 42 -230 -40 -243 289 22 -14 -69 122 172 53 310 -3
4697 -3 -42 -152 215 -93 171 -17 -28 40 368 280 -46 -26 121 -45 -186 -135 -163 147 246 78 232 252 -117 191
4721 191 -130 -185 110 -8 -128 -340 27 -188 -31 199 8 -122 64 -171 -165 186 275 167 -43 -130 0 -23
4743 -23 -55 -178 -63 -43 25 -213 85 -6 41 139 -138 168 119 -118 -52 103 -78 -309 -15 -115 193 67 -129
4766 -129 -150 -29 80 110 25 -141 -68 -137 64 38 -26 -20 -51 -34 124 -306 117 198 -182 -152 123 13 -104 109
4790 109 86 48 -138 -255 -149 143 -101 34 169 98 -29 -13 157 -56 -25 -114 -19 -6 125 10 -226 -202 -252
4813 -252 184 -116 -69 32 -31 -169 7 -242 -122 -105 201 -62 1 -12 -178 -202 -10 8 -203 124 -72 249
4835 249 46 14 155 -4 346 387 -24 113 113 -28 -46 -2 45 -72 -220 13 273 145 97 17 50 -82 43
4858 43 -67 -155 274 -49 -40 -83 -107 -343 -41 164 -42 91 75 28 39 53 -74 78 -254 -115 -285 -99 -5 -78
4882 -78 -151 -179 -61 26 -19 26 -39 -88 -306 -99 -6 -290 35 -11 -47 68 -97 -133 -109 -77 -78 -127 -105 -108 4 -19 107
4909 107 69 31 169 34 -106 229 -179 70 74 74 184 -236 -101 128 74 173 156 132 -72 16 204 180 -71 -245
4933 -245 -129 10 244 24 207 6 -276 -95 -252 -140 193 -285 187 -374 -100 -86 108 -33 36 106 16
4954 16 70 111 -134 -48 27 -140 151 88 66 106 59 -125 -55 -27 -138 -90 286 30 72 -113 -13 227 -70 -78 10
4979 10 257 -361 -32 43 72 53 303 -283 86 -115 -154 227 -184 37 155 28 236 65 -250 148 140 -207
5001 -207 -3 182 236 -139 373 150 -193 56 -51 15 -4 -77 5 -137 74 -68 -298 117 -205 207 112 -154
5023 -154 32 348 -28 -46 -82 -147 -62 138 -166 -192 -313 42 172 106 232 131 -182 21 132 146 8 84 153
5046 153 54 84 71 182 -11 118 138 9 126 -89 113 -169 56 -100 9 145 -45 -39 7 285 187 -206 -307
5069 -307 91 -1 108 108 -302 36 -66 -104 -229 -221 28 -51 13 355 199 -162 -47 -25 -30 30 -40 -199 -333 26
5093 26 -83 -150 -277 83 74 -81 -111 -357 71 123 88 174 -46 -110 259 -20 4 69 45 -412 -208 13 38 -120
5117 -120 201 -62 -110 -56 -188 110 -216 -99 -267 216 11 -168 -329 6 -29 -378 2 61 75 -94 -144 50
5139 50 -84 132 -173 -133 38 143 273 120 -7 98 125 44 69 -107 267 53 163 -148 -273 51 267 -32
5161 -32 -108 -77 129 -278 91 224 299 26 173 190 -90 -151 179 -82 80 11 243 271 30 327 135 -130 133
5184 133 -81 -34 -68 17 130 -66 4 -199 31 181 -266 113 60 -1 -103 97 -29 7 17 119 45 135 108 -4
5208 -4 3 20 45 -272 406 -94 -1 -315 -104 164 33 49 -101 -205 -3 124 -73 -146 64 177 18 7 -83 17
5232 17 141 56 -11 38 -152 -210 -20 -46 -6 -150 262 -102 17 -86 -127 7 12 34 -189 -247 -141 -33 65 144 -200
5257 -200 22 -129 -74 -60 59 298 119 57 -74 207 3 -187 -132 -124 67 150 -136 -163 -126 99 52 -109 454
5280 454 8 2 133 -43 84 132 178 209 28 -157 83 -193 -274 -312 58 98 14 -222 8 77 -153 145 155 175
5304 175 -94 -7 257 -22 -32 -250 329 -172 34 -83 159 18 -19 37 41 148 9 348 10 -149 -102 117
5326 117 -185 -15 105 117 303 215 -45 4 -16 -134 2 -7 -235 -112 12 -133 -94 -68 77 -3 304 53 -86
5349 -86 124 -60 189 13 47 67 215 192 -239 117 -89 -42 -247 -125 -4 -149 -85 -19 -1 48 59 -42 255
5372 255 302 -36 256 -128 -67 -264 -60 -285 -161 -115 -352 78 -36 174 55 -52 1 -72 148 255 313 -5
5394 -5 64 329 -132 -13 61 190 -226 -98 68 152 424 -158 215 22 -59 -202 264 -34 151 -17 100 -58
5416 -58 12 32 -119 -112 12 130 28 51 165 -162 -234 -73 66 294 138 36 141 -168 -113 35 -175 225 -54
5439 -54 93 37 169 73 59 -83 75 76 -90 122 -271 -133 -152 -55 82 -54 114 -21 -101 -140 -242 13 143
5462 143 151 25 22 59 -199 63 169 210 -8 100 -183 66 -137 143 179 -91 119 91 130 54 50 154 -169 -166 -190
5487 -190 -120 154 89 -19 -168 123 12 -148 128 -227 129 -265 -10 91 -118 -110 105 -178 -89 202 -271 -104
5509 -104 140 66 -43 67 61 106 88 159 -36 9 171 25 -45 -5 -81 -140 -40 72 39 1 56 -319 -94 58 323
5534 323 -28 56 23 -181 -160 49 233 -176 -149 -33 -182 -5 -138 99 -39 -231 -105 -211 -36 60 -20 -69
5556 -69 16 58 -13 184 112 54 -75 144 -83 -110 -223 -43 -49 -163 161 -84 -192 119 -103 -167 -78 106 -64 293
5580 293 310 3 -11 -173 133 -47 -251 -12 -108 -86 215 318 15 171 -258 208 -76 -16 8 -136 -35 56
5602 56 197 -135 -144 -18 119 94 195 -253 -54 -171 -155 210 -186 -18 185 88 39 9 -35 -233 154 -143 -4
5625 -4 26 -38 -142 -15 -165 -305 -114 141 134 -94 -17 15 -42 -252 -348 31 26 73 -90 16 -16 -135 -351 159 92
5650 92 48 41 0 -5 -192 63 144 230 135 74 -3 177 3 76 333 115 37 25 -318 309 174 160 130 20 -3 -95
5676 -95 -80 104 -99 -189 -30 -12 10 -5 78 212 -50 194 -191 -94 165 -110 418 166 70 -185 56 -106 -158
5699 -158 -72 -154 188 0 -43 -51 -169 -7 -117 39 21 -41 52 -207 -11 -378 -400 68 -79 143 184 -42 51 81
5723 81 26 156 -7 -115 220 -46 46 145 181 24 72 -2 144 156 -54 -101 -325 24 -276 -21 21 183 -157
5746 -157 -72 -50 -24 -147 63 -87 -110 -226 327 184 -48 -95 65 77 -372 37 -75 0 -115 -86 -126 -104 -59 -127
5770 -127 206 -77 130 109 27 241 138 27 3 53 58 -52 -65 -97 -58 100 119 -161 -167 -106 25 -415 16 -207
5794 -207 -190 -8 26 75 167 -146 -49 104 198 -105 -73 -132 125 -99 -184 -27 -13 47 68 20 489 -26 -43 -20 -140
5819 -140 130 123 428 -96 104 -34 -153 -29 -36 258 35 418 146 36 -71 -44 -58 186 -60 -254 -117 73
5841 73 -118 -126 86 16 124 134 9 191 43 -263 13 -221 41 232 32 196 -118 -42 20 -84 -24 306 179
5864 179 227 169 -175 -67 -267 -137 252 -141 -120 -46 -133 -83 -273 -5 9 -207 -201 3 -235 166 14 150 187
5887 187 -163 -119 -60 7 70 -80 4 -73 -82 -13 -124 -77 1 89 16 253 -2 -4 88 95 2 -117 -146 -128 -338 -43 -18
5914 -18 264 152 63 -22 -412 -25 79 33 242 61 -108 -104 -148 26 7 46 -229 112 206 -19 77 140 64 -36
5938 -36 -59 -47 143 322 202 -57 263 -156 -24 177 129 -156 150 -222 -41 160 138 66 64 -64 78 32 -35
5961 -35 99 112 155 228 -108 -133 15 -43 129 -83 196 -65 -51 -5 -254 54 -40 -214 -51 -31 33 180 114 103
5985 103 -50 38 -117 144 -42 -4 -88 -216 -78 165 3 95 -460 77 3 -127 22 224 101 -290 10 -74
6007 -74 114 169 -276 -97 149 -2 -32 -12 -199 -11 354 161 240 131 230 162 -64 -128 68 -71 -121 -73 -83 199
6031 199 129 90 136 -10 230 131 39 315 26 198 -42 102 -69 305 -135 -48 -67 -66 -59 -190 -81 -220 -8 -24
6055 -24 -44 -155 -150 11 -62 4 -19 -125 335 -221 -347 -131 101 -101 -51 -94 -25 -148 140 34 103 145 16 -73
6079 -73 -4 -58 -66 360 -28 27 -57 -12 82 206 201 -332 -85 12 -130 -181 -171 193 -35 -206 37 84 -49 12 77 103
6105 103 88 -219 71 -100 -11 14 115 -7 -167 50 -37 -201 -39 209 79 117 62 -63 119 110 -233 29 -96
6128 -96 -58 -53 -10 209 -233 -111 -45 -6 36 187 -53 46 56 -29 158 -150 -92 -16 -174 -27 103 -94 116 -46
6152 -46 20 203 27 14 -132 -247 -1 311 -26 20 158 30 49 252 80 -170 197 176 29 -48 114 -178
6174 -178 -114 130 -64 -268 89 132 80 -73 230 -22 -44 -80 -121 43 7 28 48 -166 -35 177 -88 -164 95
6197 95 0 228 177 145 85 63 10 -70 -58 156 156 -46 -86 60 85 -14 30 -34 -211 -12 63 -77 16 -363 8 178
6223 178 107 -112 -41 -96 94 -214 80 61 34 57 280 315 -239 233 -43 92 19 293 -157 301 18 -264 -91
6246 -91 -212 -1 14 71 -278 -34 -125 219 209 57 -181 109 -56 -120 -94 -35 110 9 150 -50 13 143 -148
6269 -148 -11 -132 -156 184 -251 71 229 191 25 -50 -40 -105 -63 -160 -149 53 60 -158 -18 0 25 -26 -127 -147 -52
6294 -52 88 -233 -254 -129 26 81 74 -242 270 -30 82 1 -9 104 157 229 108 -167 -17 -43 -27 117 220 -255
6318 -255 303 -193 176 -248 89 -35 118 -54 59 81 -10 -3 91 175 164 -77 -75 -106 26 -166 33 63 16 43
6342 43 -95 -163 -42 25 -370 -15 -224 -39 -44 -65 -140 -118 -234 -92 -178 175 20 125 33 50 42 21 -130 -154 32
6367 32 -171 -80 -295 95 -85 -120 -78 94 53 -181 -46 -49 50 74 88 -6 -232 -34 -47 5 31 12 121 107 -90
6392 -90 -124 -72 437 77 -123 44 266 284 -112 -81 449 -57 -94 156 142 -60 -110 127 39 22 27 -159 -76 15 -152
6417 -152 -40 -220 37 107 -102 131 169 -79 113 160 40 317 156 -271 -120 -152 72 91 -398 -47 -316 91
6439 91 -63 83 11 -77 286 58 -148 -241 -35 22 20 -77 258 -69 336 -44 -140 202 132 -27 -13 -94 -261 225
6463 225 -112 -35 -79 2 219 -181 71 -33 -148 175 -85 -229 -269 115 104 -49 288 34 72 -325 -251 -126
6485 -126 167 27 81 59 -127 -130 21 149 -176 17 85 -12 132 -60 36 117 182 -32 20 30 -133 48 -97 79
6509 79 148 68 -70 -9 -23 -70 -12 124 -121 148 -116 36 -197 44 -130 21 -178 138 -4 -154 -105 42 -63
6532 -63 19 24 -40 -52 -302 -142 63 64 -157 -100 58 -118 -164 -41 129 102 -157 -148 -128 -39 9 181 -163 39 264
6557 264 43 -330 206 47 -45 34 61 -338 67 201 35 201 -111 54 180 -21 40 322 303 286 233 -115
6579 -115 45 12 -137 98 -81 -249 -142 1 8 -48 61 -5 267 23 134 8 -125 16 131 -70 243 104
6601 104 0 -109 -172 63 -162 -31 125 -47 137 -54 -79 -78 0 -99 -108 -20 -117 -70 -178 -65 61 14 -10 -10 183
6626 183 -257 -48 57 -16 -72 -136 201 21 69 -107 -52 352 -110 188 -16 207 39 -121 26 -15 17 185
6648 185 -35 112 68 -261 34 191 107 -121 -6 -103 161 140 118 -10 99 -10 -161 35 -85 -171 118 36
6670 36 -179 15 -235 -50 -116 -188 -99 182 27 -37 150 -10 175 -45 14 -194 12 -16 -66 -8 -59 179 356
6693 356 -206 -177 -103 -188 90 -258 23 -103 96 -41 -222 37 -162 0 210 63 290 205 -234 -77 260
6714 260 -121 -27 -60 -49 -82 -243 147 -90 -33 4 -65 87 315 -29 127 -137 93 168 138 227 305 117 67 235
6738 235 -16 -201 60 -58 -207 -233 -141 228 138 208 -138 -48 77 13 -107 267 -159 24 -90 26 -116 67
6760 67 -98 74 -35 -305 15 16 175 -12 -50 -113 -182 268 -89 47 -4 53 387 -157 -297 116 24 -23 184
6783 184 -4 -218 67 -171 -140 -53 -84 -92 -222 61 103 261 32 169 -237 -117 -38 258 83 289 -94 72
6805 72 41 132 31 32 16 -102 186 -158 240 81 204 -308 17 200 39 25 137 -147 256 -217 -32 138
6827 138 -307 -135 -58 -65 -85 -222 94 -157 72 10 -14 269 189 29 -87 60 -238 134 156 185 204 -62 -136 2
6851 2 -54 -194 -216 -185 308 176 -171 81 38 29 -312 159 8 -74 -142 -42 -60 119 -27 -65 240 15 232 -153
6875 -153 -78 -81 -3 130 125 43 68 -128 40 -55 -23 -232 32 54 -23 144 -22 12 131 31 -249 -178 115 35 -65
6900 -65 -7 130 13 -195 86 -203 -25 -139 -262 -88 190 -62 -79 84 -78 -111 41 -51 136 346 -317 -25
6922 -25 50 166 -20 -75 101 -107 -58 -44 -89 60 -9 67 -17 69 -76 -144 106 157 -53 70 108 -32 22 -72 -326
6947 -326 -82 19 -36 -130 -89 -86 86 -226 9 -60 25 -118 -45 -131 -274 -83 -197 -27 -2 -60 159 -184 142 -69
6971 -69 131 -60 -16 111 -101 -218 49 10 -11 16 -130 399 37 201 -274 -301 57 -102 -95 141 133 -77 -5 -57
6995 -57 201 69 -294 51 -85 126 -58 -149 -49 249 45 -161 102 -27 14 -230 184 50 170 66 -149
7016 -149 31 7 46 -38 -97 -223 144 38 89 80 -44 212 180 10 -18 -245 -55 -285 -198 -95 -24 -52 -140 -70 321
7041 321 39 -38 -8 166 -47 -54 -62 -162 61 318 -340 -46 -162 -138 33 136 -132 -195 -117 43 -54 -51 -19 72 63
7066 63 -17 -47 -37 -170 -34 -18 -148 85 196 39 -36 28 247 -12 -41 119 -63 -47 -57 -106 -55 -263 31 189
7090 189 -109 -25 -232 112 207 173 164 -108 247 -178 117 -111 51 -336 -157 0 191 -112 40 -158 -243 -10
7112 -10 4 28 165 166 -66 25 27 -187 -71 -63 74 -187 9 -122 118 -269 -50 123 27 -15 -90 7 -144 -38 -53
7137 -53 -184 52 -34 -60 75 -60 -85 -117 -158 -132 73 156 6 77 0 -50 -136 -128 -8 -117 229 81 -151 -57 227
7162 227 -277 120 -34 -214 -210 6 135 74 139 0 156 -208 -270 -178 -234 -125 -139 107 -271 -75 72 152 -22
7185 -22 -177 -22 -149 14 -44 -132 -152 14 -218 -31 -64 -41 -4 101 26 180 148 323 -135 161 82 268 -227
7208 -227 116 -62 253 48 -99 110 -99 -12 126 -74 -99 145 92 138 -18 172 63 144 251 -112 86 84
7230 84 -50 72 -195 -335 97 -47 112 -245 -199 -7 104 66 -77 280 -27 42 -135 12 -197 -265 -207 -310
7252 -310 29 -66 -15 65 -66 -161 -46 11 -205 -54 95 84 179 -182 -18 -56 157 151 94 63 -66 -207 18 18 91
7277 91 188 126 -19 143 -53 -261 233 -52 -87 -7 125 -1 210 -1 -109 8 216 -190 113 -148 115 -76
7299 -76 -206 111 -144 -20 -79 153 10 17 -174 -121 66 -31 138 -35 81 77 -120 94 50 159 301 130 -72
7322 -72 93 -39 0 37 92 1 -72 158 146 -145 41 137 27 -105 -134 91 -89 -71 25 66 -262 197 67 -89
7346 -89 -123 63 111 5 -440 -240 -199 -180 19 -60 -153 -48 41 150 161 11 20 -118 91 -137 -301 -144 135 239
7370 239 45 -7 -3 14 -148 -2 -33 -88 -143 -213 -60 39 -1 112 120 169 8 -17 -44 41 9 -121 94 -4 -363 54
7396 54 -110 -334 32 242 136 135 118 42 61 -69 60 10 -12 -9 -14 124 163 0 239 -348 116 -44 57 -14 159
7421 159 50 117 33 36 177 204 176 0 94 -15 -120 -212 208 202 -93 -99 168 140 243 -231 -121 186 103 -30 -59
7446 -59 323 210 -142 58 89 35 -68 167 97 217 -147 98 55 62 -6 62 155 -61 -305 153 64 -76 237 -91
7470 -91 -67 136 250 77 -137 1 15 -203 308 59 133 -178 26 -21 -119 24 -168 -115 -79 72 132 -116 4
7493 4 94 -11 38 27 -326 -197 227 -19 86 -25 199 180 -83 -91 -183 -92 20 70 -87 243 -221 -34 24 172
7517 172 41 278 65 -297 145 108 -177 102 2 177 -56 428 -50 -243 -64 -96 86 -136 -86 80 62
7538 62 1 -145 -262 77 -131 -135 183 55 -48 246 -20 13 94 292 -155 -140 -170 3 274 324 91 37 4 169
7562 169 58 54 33 -153 162 -91 72 -50 -100 472 303 169 -92 -324 -79 -176 -149 157 115 -28 -102 39 179
7585 179 -43 210 -74 -64 158 -204 -168 -5 -20 213 50 -75 87 -93 -83 3 105 240 132 42 -269 99
7607 99 5 -163 90 177 -60 103 79 389 11 -56 -100 38 130 102 -365 -36 62 -131 229 2 -200 -274 -114
7630 -114 192 -74 107 -14 152 55 -137 -6 -21 128 -97 -76 -134 -41 -148 222 -35 18 -65 -26 157 118 -180
7653 -180 -193 21 54 -32 -102 143 -184 156 -197 -130 177 -73 76 125 38 1 129 166 -171 -119 328 14 31 -32
7677 -32 -119 -110 28 216 46 60 52 -70 -427 114 180 109 115 -19 132 -492 23 -113 114 2 110 -277 450 -47
7701 -47 173 -37 34 -28 17 79 6 -45 175 176 -250 -71 163 -11 54 72 -158 -28 43 34 -181 -49 -104 83 155
7726 155 69 155 135 -87 86 -56 84 -92 -31 25 1 98 -205 -29 -75 185 -219 -220 211 163 70 -5 -100 96 -86
7751 -86 -49 -67 -141 -34 -22 100 -62 -211 9 141 -38 112 -255 100 96 17 -64 0 147 -52 49 -90 49
7774 49 -88 -25 -177 144 12 -112 -27 -59 -372 -142 -6 90 -202 -27 201 6 -186 136 -54 287 5 -75
7796 -75 51 12 -86 102 140 40 165 17 179 244 62 15 -98 206 68 62 145 -207 70 -70 -274 120 64
7819 64 -27 -108 -117 -3 -87 -318 -223 57 245 42 74 -110 180 58 151 -87 157 -162 70 -156 134 -197 -51
7842 -51 330 -55 251 123 140 125 -197 176 43 60 -135 73 176 -61 40 64 46 13 -44 -267 -79 -222 -136
7865 -136 120 82 -130 105 -111 -76 109 -128 -77 -84 -105 95 95 152 -163 327 297 255 294 -4 -42 -17 117 79 -111
7890 -111 -8 -108 85 -151 -126 -3 -207 -206 19 -42 -50 -30 -19 126 -37 9 15 203 200 -16 -15 -97 110 -136 173
7915 173 97 -70 -38 42 -25 -186 55 -65 -191 -96 -111 228 235 83 92 108 97 -132 35 -33 -48 24 53 -86 164
7940 164 19 -252 63 212 159 128 8 -162 -41 58 -141 111 -71 103 150 144 -75 -207 126 -100 -244 -256
7962 -256 135 -312 -194 131 245 65 -195 28 164 50 -65 -28 78 -18 -44 -89 -48 65 100 129 -120 245
7984 245 -146 -179 87 106 103 204 -87 -106 258 -94 45 78 -117 63 50 -212 -112 -195 -196 -272 5 322 -184 113
8008 113 -271 42 235 -139 -80 -74 -101 153 -119 47 90 60 -32 19 1 0 -66 93 -1 464 -101 -293 -102 92
8032 92 -196 217 124 -46 312 38 81 118 27 -13 16 -134 75 -153 19 105 -44 -13 -114 -87 96 -16 205
8055 205 109 -16 11 -103 -61 149 74 114 129 -124 -116 107 -2 -6 283 36 22 70 260 -43 -146 -134 -182 -7 -116
8080 -116 145 -5 210 -12 -66 127 7 -117 -123 71 18 32 228 186 -78 -148 -10 -38 -126 -39 -37 -25 -155 -1
8104 -1 154 62 -337 166 -179 -6 -8 -17 303 87 -45 -119 -141 -13 23 -24 -85 128 -91 -96 -225 -32 -173 -95 209
8129 209 1 -120 165 33 -49 -205 46 122 174 -273 104 168 -113 -77 330 11 139 63 99 84 50 15 268
8152 268 78 -154 48 31 41 -30 119 17 -142 52 -173 66 -26 249 2 93 -113 103 85 -124 -14 242
8174 242 64 203 -100 -20 133 -191 315 -63 -156 125 188 80 -8 0 305 65 -111
8191a11
##END NTUPLES=NMR FID
##END=
