##TITLE=1H_Pr 4535
 CDCl3,8 sc, 
 10.03.2021
##JCAMPDX= 6.0         $$ Bruker NMR JCAMP-DX V2.0
##DATA TYPE= NMR FID
##DATA CLASS= NTUPLES
##ORIGIN= UXNMR, Bruker Analytische Messtechnik GmbH
##OWNER= root
$$ XWIN-NMR		Version 3.5
$$ Wed Mar 10 11:02:43 2021 Russian Standard Time (UT+4h)  she@DPX200
##.OBSERVE FREQUENCY= 200.131506
##.OBSERVE NUCLEUS= ^1H
##.DELAY= (6, 6)
##.ACQUISITION MODE= SIMULTANEOUS
##.ACQUISITION SCHEME= undefined
##.AVERAGES= 8
##.DIGITISER RES= 18
##SPECTROMETER/DATA SYSTEM= spect
##.PULSE SEQUENCE= zg30
##.SOLVENT NAME= CDCl3
##.SHIFT REFERENCE= (INTERNAL, CDCl3, 0, 15.7039)
##AUDIT TRAIL= $$ (NUMBER, WHEN, WHO, WHERE, WHAT)
$$ ##TITLE= Audit trail, XWIN-NMR		Version 3.5
$$ ##JCAMPDX= 5.01
$$ ##ORIGIN= Bruker BioSpin GmbH
$$ ##OWNER= she
$$ F:/spectra/data/she/nmr/H-F/1/audita.txt
$$ ##AUDIT TRAIL=  $$ (NUMBER, WHEN, WHO, WHERE, WHAT)
(   1,<2021-03-10 11:01:21.75 +0400>,<she>,<DPX200>,
      <created by zg, POWCHK disabled, PULCHK disabled
       configuration hash MD5:
       00 E9 B6 7A A2 85 ED C7 34 08 36 98 17 FE 4E 26
       data hash MD5: 16K
       A4 28 D1 55 C7 5B 16 A9 08 84 63 BB E5 EB 79 49>)
$$ ##END=
$$ 
$$ hash MD5
$$ CC 18 A5 00 9C 85 57 C6 8F F3 A8 81 F2 7A 79 F0
##$RELAX= 
##$RELAX= 
##$RELAX= 
##$RELAX= 
##$RELAX= 
##$RELAX= 
$$ Bruker specific parameters
$$ --------------------------
##$DU= <F:/spectra>
##$EXPNO= 1
##$NAME= <H-F>
##$PROCNO= 1
##$TYPE= <nmr>
##$USER= <she>
##$AMP= (0..31)
100 100 100 100 100 100 100 100 100 100 100 100 100 100 100 100 100 100 
100 100 100 100 100 100 100 100 100 100 100 100 100 100 
##$AQSEQ= 0
##$AQ_mod= 1
##$AUNM= <au_zg>
##$AUTOPOS= <>
##$BF1= 200.13
##$BF2= 200.13
##$BF3= 200.13
##$BF4= 200.13
##$BF5= 200.13
##$BF6= 200.13
##$BF7= 200.13
##$BF8= 200.13
##$BYTORDA= 1
##$CFDGTYP= 0
##$CFRGTYP= 5
##$CHEMSTR= <none>
##$CNST= (0..31)
1 1 145 1 1 1 1 1 1 1 1 1 1 1 1 1 1 1 1 1 1 1 1 1 1 1 1 1 1 1 1 1 
##$CPDPRG= <>
##$CPDPRG1= <>
##$CPDPRG2= <>
##$CPDPRG3= <>
##$CPDPRG4= <mlev>
##$CPDPRG5= <mlev>
##$CPDPRG6= <mlev>
##$CPDPRG7= <mlev>
##$CPDPRG8= <mlev>
##$CPDPRGB= <>
##$CPDPRGT= <>
##$D= (0..31)
0 1.2 0 0 0 0 0 0 0 0.06 0 0.03 0 0 0 0 0.0002 0 0 0 0 0 0 0 0 0 0 0 0 
0 0 0 
##$DATE= 1615359681
##$DBL= (0..7)
120 120 120 120 120 120 120 120 
##$DBP= (0..7)
150 150 150 150 150 150 150 150 
##$DBP07= 0
##$DBPNAM0= <>
##$DBPNAM1= <>
##$DBPNAM2= <>
##$DBPNAM3= <>
##$DBPNAM4= <>
##$DBPNAM5= <>
##$DBPNAM6= <>
##$DBPNAM7= <>
##$DBPOAL= (0..7)
0.5 0.5 0.5 0.5 0.5 0.5 0.5 0.5 
##$DBPOFFS= (0..7)
0 0 0 0 0 0 0 0 
##$DE= 6
##$DECBNUC= <off>
##$DECIM= 32
##$DECNUC= <off>
##$DECSTAT= 4
##$DIGMOD= 1
##$DIGTYP= 9
##$DL= (0..7)
0 120 120 120 120 120 120 120 
##$DP= (0..7)
150 150 150 150 150 150 150 150 
##$DP07= 0
##$DPNAME0= <>
##$DPNAME1= <>
##$DPNAME2= <>
##$DPNAME3= <>
##$DPNAME4= <>
##$DPNAME5= <>
##$DPNAME6= <>
##$DPNAME7= <>
##$DPOAL= (0..7)
0.5 0.5 0.5 0.5 0.5 0.5 0.5 0.5 
##$DPOFFS= (0..7)
0 0 0 0 0 0 0 0 
##$DQDMODE= 0
##$DR= 18
##$DS= 0
##$DSLIST= <SSSSSSSSSSSSSSS>
$$ [...]
##$SUBNAM2= <"">
##$SUBNAM3= <"">
##$SUBNAM4= <"">
##$SUBNAM5= <"">
##$SUBNAM6= <"">
##$SUBNAM7= <"">
##$SUBNAM8= <"">
##$SUBNAM9= <"">
##$SW= 16.9725357007746
##$SWIBOX= (0..15)
0 0 2 0 0 0 0 0 0 0 0 0 0 0 0 0 
##$SW_h= 3396.73913043478
##$TD= 16384
##$TD0= 1
##$TE= 0
##$TE2= 300
##$TE3= 300
##$TEG= 300
##$TL= (0..7)
0 120 120 120 120 120 120 120 
##$TP= (0..7)
150 150 150 150 150 150 150 150 
##$TP07= 0
##$TPNAME0= <>
##$TPNAME1= <>
##$TPNAME2= <>
##$TPNAME3= <>
##$TPNAME4= <>
##$TPNAME5= <>
##$TPNAME6= <>
##$TPNAME7= <>
##$TPOAL= (0..7)
0.5 0.5 0.5 0.5 0.5 0.5 0.5 0.5 
##$TPOFFS= (0..7)
0 0 0 0 0 0 0 0 
##$TUNHIN= 0
##$TUNHOUT= 0
##$TUNXOUT= 0
##$USERA1= <user>
##$USERA2= <user>
##$USERA3= <user>
##$USERA4= <user>
##$USERA5= <user>
##$V9= 5
##$VALIST= <valist>
##$VCLIST= <CCCCCCCCCCCCCCC>
##$VD= 0
##$VDLIST= <DDDDDDDDDDDDDDD>
##$VPLIST= <PPPPPPPPPPPPPPP>
##$VTLIST= <TTTTTTTTTTTTTTT>
##$WBST= 1024
##$WBSW= 4
##$XGAIN= (0..3)
0 0 0 0 
##$XL= 0
##$YL= 0
##$YMAX_a= 120286
##$YMIN_a= -16284
##$ZGOPTNS= <>
##$ZL1= 120
##$ZL2= 120
##$ZL3= 120
##$ZL4= 120
##$ABSF1= 10
##$ABSF2= 0
##$ABSG= 5
##$ABSL= 3
##$ALPHA= 0
##$AQORDER= 0
##$ASSFAC= 0
##$ASSFACI= 0
##$ASSFACX= 0
##$ASSWID= 0
##$AUNMP= <proc_1d>
##$AZFE= 0.1
##$AZFW= 0.1
##$BCFW= 1
##$BC_mod= 2
##$BYTORDP= 1
##$COROFFS= 0
##$CY= 11.3945322036743
##$DATMOD= 1
##$DC= 2
##$DFILT= <>
##$DTYPP= 0
##$F1P= 15.9154993809931
##$F2P= -4.1035820241983
##$FCOR= 0.5
##$FTSIZE= 0
##$FT_mod= 4
##$GAMMA= 1
##$GB= 0.15
##$INTBC= 1
##$INTSCL= 1
##$ISEN= 128
##$LB= 0.24
##$LEV0= 0
##$LPBIN= 0
##$MAXI= 10000
##$MC2= 0
##$MEAN= 0
##$ME_mod= 0
##$MI= 1.114404
##$NCOEF= 0
##$NC_proc= 0
##$NLEV= 6
##$NOISF1= 3.799351
##$NOISF2= 2.8
##$NSP= 1
##$NTH_PI= 0
##$NZP= 0
##$OFFSET= 15.70392
##$PC= 1
##$PHC0= -11114.26
##$PHC1= 2.800942
##$PH_mod= 1
##$PKNL= yes
##$PPARMOD= 0
##$PSCAL= 0
##$PSIGN= 0
##$REVERSE= no
##$SF= 200.130013532006
##$SI= 16384
##$SIGF1= 3
##$SIGF2= 2
##$SINO= 400
##$SIOLD= 16384
##$SREGLST= <1H.CDCl3>
##$SSB= 0
##$STSI= 0
##$STSR= 0
##$SW_p= 3612.71676300578
##$SYMM= 0
##$S_DEV= 0
##$TDeff= 0
##$TDoff= 0
##$TI= <>
##$TILT= no
##$TM1= 0
##$TM2= 0
##$TOPLEV= 0
##$USERP1= <user>
##$USERP2= <user>
##$USERP3= <user>
##$USERP4= <user>
##$USERP5= <user>
##$WDW= 1
##$XDIM= 8192
##$YMAX_p= 0
##$YMIN_p= 0
$$ End of Bruker specific parameters
$$ ---------------------------------
##NTUPLES= NMR FID
##VAR_NAME=  TIME,          FID/REAL,        FID/IMAG
##SYMBOL=    X,             R,               I
##VAR_TYPE=  INDEPENDENT,   DEPENDENT,       DEPENDENT
##VAR_FORM=  AFFN,          ASDF,            ASDF
##VAR_DIM=   8192,          8192,            8192
##UNITS=     SECONDS,       ARBITRARY UNITS, ARBITRARY UNITS
##FACTOR=    0.0002944,     1,               1
##FIRST=     0,             0,               0
##LAST=      2.4114304,     0,               0
##MIN=       0,             -16284,          0
##MAX=       2.4114304,     120286,          0
$$ Real data points
##PAGE= N=1
##DATA TABLE= (X++(R..R)), XYDATA
$$ plain form
0 0 0 0 0 0 0 0 0 0 0 0 0 0 0 0 0 0 -8 8 -8 8 -8 8 -16 16 -16 23 -24 27 -32 37 -40 48 -56 62 -69 78 -88 99
38 99 -109 123 -138 151 -168 187 -207 229 -251 278 -305 337 -371 408 -452 497 -549 608 -676 754
58 754 -845 950 -1078 1236 -1436 1699 -2064 2596 -3469 5130 -9501 47496 120286 99786 92579
73 92579 58744 37538 19676 24429 36040 62915 82401 96174 93782 81282 60634 37785 24023
86 24023 20518 24940 39194 50966 59076 57429 50059 32489 18389 5721 967 3446 10830 20813
100 20813 26062 28565 24350 15824 6943 646 -2450 438 8699 14817 24167 27416 28054 25498 21120
115 21120 18838 17855 21403 26598 33975 39371 44549 45149 43341 42407 37973 38536 38943 41712 45084 48682
131 48682 50451 49710 48863 44847 42237 38568 38463 37532 37878 39865 38558 37878 35139 32222 27833 26133
$$ packed form
0@%%%%%%%%%%%%%%%%qJ6j6J6j6J6k4L2l2L9m7N1n9O9p7Q8j04J18j31J47j66J87
38I9k08K32k61K89l19L55l94M36m80N29n83O42p08P79q60R49j046J157j284J430
58G54j599J795k028K314k672L135l763M660o065Q599j4631N6997P2790k0500p207
73I2579l3835k1206j7862M753J1611K6875J9486J3773k392j2500k0648k2849j3762
86B4023l505M422J4254J1772Q110j647p370j7570j4100j2668m754K479P384R983
100B0813N249K503m215q526q881o297l096K888Q261O118R350L249O38k556m378
115B1120k282r83L548N195P377N396N178O00j808r34m434N63M07K769L372L598
131D8682J769p41q47m016k610l669j05r31L46J987j307o80k739k917m389j700
$$ plain form
147 26133 23660 22607 23124 22652 23127 21369 21371 18927 16919 15999 15001 14853 16092 17415 17373 19632 19324 19005
165 19005 19523 18963 19933 20227 22582 23205 25160 26290 27104 27128 27355 28121 27033 29083 28687 29384 30493 30522
183 30522 30166 29645 29885 27987 28260 26961 26643 26063 25248 25290 23151 23096 21196 19994 18833 18136 16869 16077
201 16077 16263 14284 14789 13364 13104 12053 11392 11483 10475 11294 10988 10985 11223 11865 11198 11353 12396 11785 12804
220 12804 12803 13443 13628 14333 14920 14565 15509 15462 16158 15575 16900 16239 16591 17475 16196 17029 16848 16510 15778 16166
240 16166 15395 15542 15203 14335 14604 13292 14042 12444 12032 12098 11103 10834 10336 9901 9187 9667 8144 7860 7597
259 7597 7096 7124 6172 6574 5467 5408 5030 4541 4249 4176 4060 3216 3663 2833 2926 2808 2541 2110 1644 1890 856
280 856 1140 967 1071 424 612 485 -47 864 146 326 322 600 294 488 1195 555 1248 658 1559 1271 2012
$$ packed form
147B6133k473j053N17m72M75j758Kk444k008r20r98j48J239J323m2K259l08l19
165A9005N18n60R70K94K355O23J955J130Q14K4K27P66j088K050l96O97J109K9
183C0522l56n21K40j898K73j299l18n80q15M2k139n5j900j202j161o97j267p92
201A6077J86j979N05j425k60j051o61R1j008Q19l06lK38O42o67J55J043o11J019
220A2804jO40J85P05N87l55R44m7O96n83J325o61L52Q84j279Q33j81l38p32L88
240A6166p71J47l39q68K69j312P50j598m12O6r95k69m98m35p14M80j523k84k63
259G597n01K8r52M02j107n9l78m89k92p3j16q44M47q30R3j18k67m31m66K46j034
280H56K84j73J04o47J88j27n32R11p18J80mK78l06J94P07o40O93n90R01k88P41
$$ plain form
301 2012 2181 1839 2998 2433 2872 2794 3356 2741 3586 3779 3177 3556 3301 3315 2520 2871 2649 1700 1748 1098 1024
322 1024 43 -40 -1073 -1457 -1924 -3227 -3281 -4498 -4783 -6026 -6021 -6863 -7587 -8108 -8524 -9003 -9715 -9574 -10773 -10781
342 -10781 -10775 -11482 -11305 -11330 -10997 -11450 -10805 -11125 -10457 -10001 -9729 -9512 -9450 -8061 -8448 -7481 -7015 -6398 -6048 -5573 -5045
363 -5045 -4663 -3590 -3898 -3603 -3296 -3040 -3090 -3414 -2618 -3243 -3023 -3533 -3628 -4445 -4283 -5038 -5764 -5493 -6852 -6840
383 -6840 -7658 -8198 -8835 -9657 -9975 -10892 -11314 -11910 -12090 -12871 -13073 -13327 -13857 -13798 -14246 -14044 -14439 -13879 -14024 -13701
403 -13701 -13652 -13406 -12933 -12801 -11820 -12080 -11247 -11061 -10800 -9948 -9955 -9405 -8943 -8173 -8421 -7742 -7609 -7890 -7108 -7536 -7109
424 -7109 -7594 -7218 -7675 -8003 -7994 -8387 -8572 -9045 -8881 -9921 -9811 -10179 -10779 -10795 -11503 -11925 -12533 -12478 -13030 -13353 -13409
445 -13409 -13477 -13693 -14085 -13453 -14019 -13659 -13759 -13542 -13077 -12925 -12482 -12295 -11971 -11799 -10979 -10661 -10064 -9996 -9571 -8666
$$ packed form
301B012J69l42J159n65M39p8N62o15Q45J93o02L79k55J4p95L51k22r49M8o50p4
322A024r81q3j033l84m67j303n4j217k85j243Nq42p24n21m16m79p12J41j199q
342a0781Op07J77k5L33m53O45l20O68M56K72K17O2J389l87R67M66O17L50M75N28
363e045L82J073l08K95L07K56n0l24P96o25K20n10r5q17J62p55p26K71j359J2
383f840q18n40o37q22l18r17m22n96j80p81k02k54n30N9m48K02l95N60j45L23
403a3701M9K46M73J32R81k60Q33J86K61Q52pN50M62P70k48O79J33k81P82m28M27
424g109m85L76m57l28Rl93j85m73J64j040J10l68o00j6p08m22o08N5n52l23n6
445a3409o8k16l92O32n66L60j00K17M65J52M43J87L24J72Q20L18N97O8M25R05
$$ plain form
465 -8666 -8881 -8116 -7898 -7402 -7230 -6780 -6843 -6737 -6165 -6577 -6146 -6347 -6220 -6326 -6832 -6610 -7344 -7085 -7591 -7595 -8313
486 -8313 -8138 -8973 -9119 -9377 -9795 -9945 -10601 -10609 -11150 -11295 -11624 -11939 -11965 -12215 -11996 -12531 -11975 -12258 -12214 -11740 -11770 -11520
508 -11520 -11566 -11099 -10890 -10349 -10017 -9738 -9412 -9189 -8233 -8383 -7517 -7503 -7029 -6438 -6156 -6017 -5579 -4825 -5233 -4717
528 -4717 -4325 -4453 -4020 -4173 -4045 -4191 -3710 -4220 -4005 -4055 -4153 -4560 -4410 -4532 -5018 -4630 -5161 -5394 -5132 -5699 -5608
549 -5608 -6381 -5995 -6357 -6272 -6557 -6475 -6647 -6604 -6604 -6981 -6592 -6729 -6482 -6542 -6580 -6438 -6213 -5957 -6118 -5595 -5854 -5380
571 -5380 -5563 -5268 -4830 -5117 -4782 -4710 -4324 -4251 -3764 -3822 -3985 -3763 -3527 -3281 -3421 -3088 -3108 -2810 -2570 -2814 -2685
592 -2685 -2581 -2671 -2361 -2337 -2359 -2314 -1822 -2196 -1910 -1965 -1563 -1962 -1729 -1591 -1874 -1279 -1541 -1137 -1301 -967 -1190 -1013
614 -1013 -1120 -1130 -1008 -852 -590 -960 -633 -933 -731 -792 -676 -491 -628 -249 -773 -461 -579 -383 -698 -701 -523
$$ packed form
465h666k15P65K18M96J72M50o3J06N72m12M31k01J27j06n06K22p34K59n06mp18
486h313J75q35j46k58m18j50o56qn41j45l29l15k6k50K19n35N56k83M4M74l0K50
508a1520m6M67K09N41L32K79L26K23R56j50Q66J4M74N91K82J39M38P54m08N16
528d717L92j28M33j53J28j46M81n10K15n0r8m07J50j22m86L88n31k33K62n67R1
549e608p73L86l62Q5k85Q2j72M3%l77L89j37K47o0l8J42K25K56j61N23k59M74
571e380j83K95M38k87L35P2L86P3M87n8j63K22K36K46j40L33k0K98K40k44J29
592b685J04r0L10K4k2M5M92l74K86n5M02l99K33J38k83N95k62M04j64L34k23J77
614a013j07j0J22J56K62l70L27l00K02o1J16J85j37L79n24L12j18J96l15lJ78
$$ plain form
635 -523 -826 -654 -955 -850 -831 -622 -804 -832 -409 -847 -627 -702 -396 -665 -443 -268 -487 -345 -295 -29 -6 78
657 78 49 177 282 262 597 425 889 580 726 1210 704 1352 1153 1493 1177 1705 1479 1856 1982 1615 1773
678 1773 1757 2049 1692 1913 1929 2125 2104 1833 2232 2137 2081 1872 2278 2234 2101 2323 2312 2453 2364 2334 2354 2313 2370 2425
702 2425 2264 2033 2485 2293 2181 2078 2392 2503 1983 2442 1949 2182 2011 2011 1839 1824 1825 1760 2013 1538 2031 1718
724 1718 1890 1731 2014 1726 1698 2056 1864 1760 1663 1918 2289 1710 2082 1763 1972 1745 2225 2245 2092 2200 1951
745 1951 2409 2290 2549 2406 3013 2498 2645 2628 2660 2827 2670 3073 2696 2919 2866 2774 3298 2959 3086 2779 3132
766 3132 2891 2790 3128 3118 3059 2850 2885 2538 2794 2596 2380 2520 2571 2609 2417 2602 2161 2443 2289 2387 2287 2035
788 2035 2275 1536 1928 1685 1867 1966 1634 1593 1522 1859 1502 1501 1576 1457 1404 1313 1302 1249 1348 1397 1234 1226 1453 1111 1237
$$ packed form
635e23l03J72l01J05J9K09j82k8M23m38K20p5L06k69K22J75k19J42N0K66K3Q4
657G8k9J28J05k0L35j72M64l09J46M84n06O48j99L40l16N28k26L77J26l67J58
678A773j6K92l57K21J6J96k1k71L99r5n6k09M06m4j33K22j1J41q9l0K0m1N7N5
702B425j61k31M52j92j12j03L14J11n20M59m93K33j71%j72j5Jo5K53m75M93l13
724A718J72j59K83k88k8L58j92j04r7K55L71n79L72l19K09k27M80K0j53J08k49
745A951M58j19K59j43O07n15J47j7L2J67j57M03l77K23n3r2N24l39J27l07L53
766C132k41j01L38j0n9k09L5l47K56j98k16J40N1L8j92J85m41K82j54R8j00k52
788B035K40p39L92k43J82R9l32m1p1L37l57jP5j19n3r1j1n3R9M9j63qK27l42J26
$$ plain form
813 1237 1293 1290 1309 1236 1393 1404 1382 1385 1364 1418 1358 1641 1635 1706 1718 1594 1841 1551 1942 1758 1988 2102 2101 2158 2024 2424
839 2424 2091 2203 2183 2135 2094 2302 1918 1940 2003 1683 2047 1738 1871 1899 1964 1601 1644 1622 1151 1380 1105 1073 961
862 961 663 704 617 589 200 556 413 16 62 226 133 -236 142 -120 15 -136 -220 -287 -322 -131 -504 232 5
885 5 -211 111 177 298 287 371 95 533 424 394 397 647 778 595 836 623 886 650 1058 911 926 993 758 916
909 916 927 720 784 832 656 491 850 656 406 256 202 419 94 252 82 39 13 -104 -180 -223 -255 -376 -305 -325
933 -325 -356 -635 -408 -542 -456 -467 -560 -509 -642 -484 -704 -405 -528 -516 -386 -639 -406 -847 -249 -700 -544 -544 -386
956 -386 -474 -702 -520 -277 -423 -493 -231 -401 -666 -494 -345 -369 -688 -670 -700 -635 -520 -602 -542 -857 -339 -554 -302
979 -302 -233 -105 -369 -455 -269 -477 -187 -424 -145 -364 -113 -131 -217 12 -70 -55 -53 309 -36 -1 37 -294 -142 47
$$ packed form
813A237N6lJ9p3J57J1k2Lk1N4o0K83oP1J2j24K47k90L91j84K30J14jN7j34M00
839B424l33J12k0m8m1K08l84K2O3l20L64l09J33K8O5l63M3k2m71K29k75l2j12
862I61k98M1q7k8l89L56j43l97M6J64r3l69L78k62J35j51q4o7l5J91l73P36k27
885Ek16L22O6J21j1Q4k76M38j09l0LK50J31j83K41k13K63k36M08j47J5O7k35J58
909I16J1k07O4M8j76j65L59j94k50j50n4K17l25J58j70m3k6j17p6m3l2j21P1k0
933c25l1k79K27j34Q6j1r3N1j33J58k20K99j23J2J30k53K33m41N98m51J56%J58
956c86q8k28J82K43j46p0K62j70k65J72J49k4l19J8l0O5J15q2O0l15N18k15K52
979c02O9J28k64q6J86k08K90k37K79k19K51j8q6K29q2J5KL62l45L5L8l31J52J89
$$ plain form
1003 47 32 -320 -123 -44 -209 -69 -445 -311 -280 -167 -412 -349 -344 -513 -533 -660 -580 -731 -800 -723 -747 -614 -747 -544
1027 -544 -1048 -958 -677 -632 -1053 -1110 -677 -652 -724 -943 -686 -797 -718 -499 -631 -446 -750 -551 -564 -592 -307 -320 -218
1050 -218 93 -47 -266 -47 -73 -68 16 -33 112 104 190 59 50 -95 -200 197 96 386 114 266 331 263 382 483
1074 483 142 278 590 270 229 114 430 85 203 245 133 242 84 207 -38 62 -59 -49 211 -106 -41
1095 -41 -237 -92 -98 -31 -159 -334 -270 -313 5 -321 -197 -309 -230 -242 -482 -210 -292 -276 -251 -289 -129 152 -18 67
1119 67 230 284 368 223 467 175 448 345 508 582 681 743 1008 781 845 958 1079 829 1125 970 1116 1060 1073
1142 1073 979 1107 1481 1394 1300 948 1057 1130 920 1014 1107 836 835 957 820 744 673 888 731 488 707 291 616
1165 616 472 638 496 318 222 584 405 250 615 391 490 542 230 648 446 660 627 960 812 807 901 667
$$ packed form
1003D7j5l52J97P9j65J40l76J34L1J13k45O3Nj69k0j27Q0j51o9P7k4J33j33K03
1027e44n04R0K81M5m21n7M33K5p2k19K57j11P9K19j32J85l04J99j3k8K85j3J02
1050b18L11j40k19K19k6NQ4m9J45qQ6j31rj45j05L97j01K90k72J52O5o8J19J01
1074D83l41J36L12l20m1j15L16l45J18M2j12J09j58J23k45J00j21J0K60l17O5
1095d1j96J45oO7j28j75O4m3L18l26J24j12P9j2k40K72q2J6K5l8J60K81j70Q5
1119F7J63N4Q4j45K44k92K73j03J63P4R9O2K65k27O4J13J21k50K96j55J46n6J3
1142A073r4J28L74q7r4l52J09P3k10R4R3k71jJ22j37p6p1K15j57k43K19m16L25
1165F16j44J66j42j78r6L62j79j55L65k24R9N2l12M18k02K14l3L33j48nR4k34
$$ plain form
1187 667 714 1113 717 811 1107 933 1038 1312 1119 1423 1054 1341 1368 1325 1334 1077 1213 1224 1479 1211 1304 1286 1462
1210 1462 1248 1312 1289 1078 1429 995 1267 1210 1078 1173 1076 1006 1148 1288 1298 1107 1120 1219 1404 1070 1206 1088 1266
1233 1266 1245 1325 1197 1142 1242 1180 1309 1077 1317 1215 1130 1122 1401 1204 1108 1007 1110 1417 1180 1143 1167 1008 948
1256 948 837 990 1014 865 842 797 782 831 741 1081 660 739 1093 1203 912 730 923 933 853 1011 1088 1047 1211 879
1280 879 1186 1341 1006 1058 1332 1444 1045 1235 1249 1436 1297 1371 1360 1452 1681 1390 1611 1517 1685 1393 1075 1331
1302 1331 1400 1408 1165 1236 1346 1065 1228 1266 1014 1076 726 899 766 996 946 702 987 567 489 762 676 701 567
1325 567 784 395 506 485 672 420 516 374 565 572 392 533 490 618 933 266 561 532 713 637 776 619
1347 619 586 829 560 706 572 652 931 1059 774 690 660 659 708 682 871 1004 738 1071 760 733 720 952 612
$$ packed form
1187F67M7L99l96R4K96j74J05K74j93L04l69K87K7m3Rk57J36J1K55k68R3j8J76
1210A462k14O4k3k11L51m34K72n7j32R5r7p0J42J40J0j91J3R9J85l34J36j18J78
1233A266k1Q0j28n5J00o2J29k32K40j02q5qK79j97r6j01J03L07k37l7K4j59o0
1256I48j11J53K4j49k3m5j5M9r0L40m21P9L54J10k91j82J93J0q0J58P7m1J64l32
1280H79L07J55l35N2K74J12l99J90J4J87j39P4j1R2K29k91K21r4J68k92l18K56
1302A331O9Qk43P1J10k81J63L8k52O2l50J73j33K30n0k44K85m20p8K73q6K5j34
1325E67K17l89J11k1J87k52R6j42J91Pj80J41m3J28L15o67K95k9J81p6J39j57
1347F19l3K43k69J46j34Q0K79J28k85q4l0jM9k6J89J33k66L33l11k7j3K32l40
$$ plain form
1370 612 752 762 716 758 764 869 459 746 596 432 405 516 224 374 436 325 492 282 394 366 416 147 145 53
1394 53 38 217 342 0 17 115 218 -162 77 55 -97 -233 78 92 -207 152 -55 -14 -229 76 8 -197 -334
1417 -334 -169 72 11 -237 71 141 -206 234 63 -43 -82 101 93 -224 329 62 119 56 165 -17 -10 264 128
1440 128 92 94 59 164 278 -69 55 -220 -87 3 262 -35 45 -59 -199 -269 -205 -241 39 -215 -315 -144 -530
1463 -530 -237 -205 -446 11 -363 -419 -178 -535 -554 -422 -504 -581 -542 -702 -531 -625 -529 -760 -722 -591 -719 -595 -812
1486 -812 -508 -527 -628 -842 -833 -662 -512 -477 -619 -553 -866 -563 -505 -724 -417 -563 -649 -727 -880 -443 -420 -680 -631
1509 -631 -439 -571 -509 -559 -561 -606 -657 -356 -331 -541 -560 -645 -691 -655 -317 -487 -523 -729 -624 -620 -456 -650 -566 -802 -670
1534 -670 -738 -696 -598 -971 -761 -883 -918 -909 -667 -711 -791 -739 -797 -899 -961 -987 -987 -773 -894 -976 -820 -691 -1004 -846 -988
$$ packed form
1370F12J40J0m6M2OJ05m10K87j50j64k7J11k92J50O2j11J67k10J12k8N0k69kr2
1394E3j5J79J25l42J7R8J03l80K39k2j52j36L11J4k99L59k07M1k15L05o8k05j37
1417c34J65K41o1k48L08P0l47M40j71j06l9J83ql17N53k67N7o3J09j82PK74j36
1440A28l6Kl5J05J14l47J24k75J33R0K59k97Q0j04j40p0O4l6K80k54j00J71l86
1463e30K93L2k41M57l74n6K41l57j9J32q2p7L9j60J71r4R6k31L8J31j28J24k17
1486h12L04j9j01k14RJ71J50L5j42O6l13L03N8k19L07j46q6p8j53M37K3k60M9
1509f31J92j32O2n0km5n1L01K5k10j9q5m6L6L38j70l6k06J05MJ64j94Q4k36J32
1534f70o8M2R8l73K10j22l5RK42m4q0N2n8j02o2k6%K14j21q2J56J29l13J58j42
$$ plain form
1559 -988 -943 -942 -891 -1167 -930 -1050 -1105 -918 -977 -862 -1108 -737 -759 -891 -961 -939 -799 -896 -939 -813 -758 -939 -746 -753 -942
1584 -942 -633 -769 -553 -799 -512 -798 -547 -381 -756 -791 -599 -425 -621 -523 -580 -477 -646 -819 -714 -750 -503
1605 -503 -682 -613 -941 -780 -613 -778 -687 -706 -825 -817 -645 -784 -804 -884 -676 -851 -852 -731 -737 -876 -694 -906 -870 -943
1629 -943 -912 -1099 -857 -941 -970 -1043 -951 -696 -864 -960 -819 -813 -1004 -707 -841 -959 -971 -622 -619 -702 -609 -796 -730 -721 -747 -749
1655 -749 -628 -581 -661 -303 -717 -550 -382 -553 -571 -543 -363 -520 -683 -621 -539 -395 -595 -443 -464 -456 -312 -602 -261
1678 -261 -273 -338 -630 -499 -381 -550 -490 -544 -267 -330 -232 -309 -493 -509 -406 -344 -432 -473 -382 -540 -491 -398 -231 -384 -766
1703 -766 -560 -480 -563 -606 -602 -574 -684 -419 -455 -671 -440 -328 -481 -499 -594 -334 -548 -328 -248 -536 -223 -732 -521
1726 -521 -361 -155 -452 -141 -101 81 -302 -279 -206 -233 -150 -262 -28 -192 58 -285 -8 -151 -170 -65 -53 -15 36
$$ packed form
1559i88M5JN1k76K37j20n5J87n9J15k46L71k2j32p0K2J40r7m3J26N5j81J93pj89
1584i42L09j36K16k46K87k86K51J66l75l5J92J74j96R8n7J03j69j73J05l6K47
1605e03j79O9l28J61J67j65R1j9j19QJ72j39k0q0K08j75jJ21oj39J82k12L6p3
1629i43L1j87K42q4k9p3R2K55j68r6J41Oj91K97j34j18j2L49Lq3R3j87O6Rk6k
1655g49J21M7q0L58m14J67J68j71j8K8J80j57j63O2Q2J44k00J52k1QJ44k90L41
1678b61j2o5k92J31J18j69O0n4K77o3R8p7j84j6J03O2q8m1R1j58M9R3J67j53l82
1703g66K06Q0q3m3MK8j10K65l6k16K31J12j53j8r5K60k14K20Q0k88L13n09K11
1726e21J60K06k97L11M0J82l83K3P3k7Q3j12K34j64K50l43K77j43j9J05J2L8N1
$$ plain form
1749 36 -78 -26 192 196 -56 29 0 28 -72 18 -113 -207 -84 80 -84 -16 -7 -346 -129 17 -80 -238 -118 21
1773 21 -244 -84 37 -132 -114 -200 -317 -169 -161 -105 -41 -183 -296 -48 142 -269 -74 -41 -200 -425 135 -4 -60
1796 -60 48 -11 -195 -98 -45 -60 135 91 91 89 114 186 233 39 283 301 107 177 356 43 207 68 158 13 328
1821 328 206 400 357 170 287 170 267 79 -39 179 227 128 410 131 498 69 209 166 278 416 140 259
1843 259 47 371 214 161 90 173 62 99 45 245 56 55 82 150 -62 135 167 51 43 25 37 -109 -156 19 132
1868 132 47 174 -72 -49 243 -67 366 390 113 2 152 295 331 -53 412 266 325 273 246 347 363 313 323
1891 323 296 484 498 467 475 256 264 564 227 289 379 343 435 320 393 223 436 242 135 327 147 395 230 331
1915 331 371 213 262 -141 70 158 -1 354 278 101 161 95 146 -1 72 -24 -176 22 10 68 271 -8 61 213
$$ packed form
1749C6j14N2K18Mk52Q5k9K8j00R0j31r4J23J64j64O8Rl39K17J46r7j58J20J39
1773B1k65J60J21j69J8q6j17J48QN6O4j42j13K48J90m11J95L3j59k25N60j39n6
1796f0J08n9j84R7N3j5J95m4%kK5P2M7j94K44J8j94P0J79l13J64j39R0j45L15
1821C28j22J94m3j87J17j17R7j88j18K18M8r9K82k79L67m29J40m3J12J38k76J19
1843B59k12L24j57n3p1Q3j11L7n4K00j89jK7O8k12J97L2j16qj8J2j46m7J75J13
1868A32q5J27k46K3K92l10M33K4k77j11J50J43L6l84M65j46N9n2k7J01J6n0J0
1891C23k7J88J4l1Qk19QL00l37O2R0l6R2j15P3j70K13j94j07J92j80K48j65J01
1915C31M0j58M9m03K11Q8j59L55p6j77O0o6N1j47P3r6j52J98j2N8K03k79O9J52
$$ plain form
1939 213 -44 28 305 48 47 112 263 28 78 226 118 122 106 19 38 174 139 -61 -36 318 226 306 370 196 108
1964 108 169 332 110 121 269 276 166 220 270 416 251 210 -145 391 240 233 308 141 554 138 68 180 118 -39
1988 -39 390 71 18 -42 224 78 178 38 292 -240 39 44 -1 229 145 -89 97 -22 -21 -120 31 164 -71
2011 -71 197 -27 -30 -170 -297 124 151 -184 128 63 -197 -48 153 -161 -107 -103 -244 40 -49 197 -112 142 -12
2034 -12 152 190 116 52 26 120 77 32 -42 134 137 -154 71 59 297 264 17 206 103 29 -105 119 -110 84 -82
2059 -82 96 -22 -40 119 119 -72 -118 -107 -178 -203 -150 70 -8 -56 -222 -180 -27 -238 -202 -91 -87 -282 180 -81 -385
2084 -385 -31 -122 -160 -334 -347 -85 -108 -113 -274 -132 95 -277 21 -254 -245 -152 -250 -241 -301 27 -27 -80 81 4 -110
2109 -110 -193 -21 101 88 -172 -119 -10 -267 -141 -68 -105 -147 -42 -38 -8 -68 -80 -38 -3 85 -133 -16 -269 -90 -39
$$ packed form
1939B13k57P2K77k57jO5J51k35N0J48j08Mj6q7J9J36l5k00K5L54r2Q0O4j74q8
1964A08O1J63k22J1J48Pj10N4N0J46j65m1l55N36j51pP5j67M13m16p0J12o2j57
1988c9M29l19n3o0K66j46J00j40K54n32K79Nm5K30q4k34J86j19Jr9J51J33k35
2011g1K68k24lj40j27M21K7l35L12o5k60J49K01l14N4Mj41K84q9K46l09K54j54
2034a2J64L8p4o4k6R4m3m5p4J76Lk91K25j2K38l3k47J89j03p4j34K24k29J94j66
2059h2J78j18j8J59%j91m6J1p1k5N3K20p8m8j66M2J53k11L6J11Mj95M62k61l04
2084c85L54r1l8j74j3K62k3nj61J42K27l72K98k75RR3r8Ro0L28n4n3J61p7j14
2109a10q3J72J22j3k60N3J09k57J26P3l7m2J05ML0o0j2M2L5Q8k18J17k53J79N1
$$ plain form
2134 -39 -16 -231 -172 72 -151 -36 2 -86 -129 -183 26 -85 -10 -57 -239 -213 -221 -65 -257 -180 -158 -22 -123 -366 -205
2159 -205 -21 -86 -139 -117 -233 -105 -336 -318 -481 50 -21 49 -63 -397 -231 16 -169 -244 -132 -230 -121 -116 -145 -7
2183 -7 38 354 207 -164 -24 -38 70 -170 -133 -79 -92 125 -265 -58 48 88 135 16 102 -80 -240 135 -167
2206 -167 -48 210 -158 -64 -144 -39 28 -45 -130 -143 -169 -49 -35 -37 88 -168 -276 -85 -100 -14 63 -58 -12 -158 -106
2231 -106 -179 -154 41 90 -83 0 -34 -19 -63 -29 -100 27 20 30 -29 -101 -46 -40 -17 -52 -36 -87 26 -116 -35 -15 86 -161
2259 -161 97 199 44 102 36 -116 147 30 -23 297 -12 34 33 21 378 -4 101 290 170 261 295 210 208 84
2283 84 148 239 -16 267 128 214 267 -56 125 165 -168 -65 130 218 42 -34 -85 257 144 -130 195 167 179 185
2307 185 -31 -34 -89 121 337 -79 145 -113 81 313 -42 349 255 -41 -24 302 27 198 -6 106 -131 -106
$$ packed form
2134c9K3k15N9K44k23J15L8q8m3n4K09j11P5m7j82K6qJ56j92P7K2J36j01k43J61
2159b05J84o5n3K2j16J28k31J8j63N31p1P0j12l34J66K47j85p5J12r8J09Nk9J38
2183gM5L16j47l71J40j4J08k40L7N4j3K17l90K07J06M0M7j19Q6j82j60L75l02
2206a67J19K58l68R4q0J05O7p3q5j3k6J20J4kJ25k56j08J91j5Q6P7j21M6j46N2
2231a06p3K5J95M9j73Q3l4J5m4L4p1J27pJ0n9p2N5OK3l5J6n1J13j42Q1K0J01k47
2259a61K58J02j55N8o6j52K63j17n3L20l09M6jj2L57l82J05J89j20R1L4q5kj24
2283H4O4R1k55K83j39Q6N3l23J81M0l33J03J95Q8j76p6n1L42j13k74L25k8J2O
2307A85k16ln5K10K16m16K24k58J94K32l55L91r4k96J7L26k75J71k04J12k37K5
$$ plain form
2329 -106 260 22 209 182 209 39 31 243 36 269 142 199 122 419 204 359 121 155 294 220 372 244 110
2352 110 258 241 277 57 394 281 247 304 404 267 292 37 239 254 132 207 166 195 151 -114 87 110 -28 95
2376 95 63 20 57 94 105 26 210 149 5 -140 91 168 149 35 236 464 62 161 183 271 64 264 88 173 109
2401 109 219 201 20 140 55 446 323 56 187 -94 164 212 402 258 203 78 100 440 334 239 239 287 28
2424 28 249 53 165 234 265 -41 379 216 419 303 237 359 119 158 301 281 251 413 157 197 125 -59 43
2447 43 198 525 270 103 283 100 24 231 190 222 263 126 110 47 171 78 27 27 137 153 103 248 220 194 54
2472 54 33 55 -185 293 78 -47 278 -4 109 387 376 318 -6 197 191 143 177 133 246 303 271 93 440 139
2496 139 234 40 330 461 55 319 371 195 250 345 417 183 176 206 202 106 -16 -155 419 267 76 87 88 -72 156
$$ packed form
2329a06L66k38J87k7K7j70qK12k07K33j27N7p7K97k15J55k38L4J39p4J52j28j34
2352A10J48j7L6k20L37j13l4N7J00j37K5k55K02J5j22P5m1K9m4k65K01K3j38J23
2376I5l2m3L7L7J1p9J84o1j44j45K31P7j9j14K01K28m02R9K2Q8k07K00j76Q5o4
2401A09J10j8j81J20q5L91j23k67J31k81K58M8J90j44n5j25K2L40j06r5%M8k59
2424B8K21j96J12O9L1l06M20j63K03j16o6J22k40L9J43k0l0J62k56M0p2j84J02
2447D3J55L27k55j67J80j83p6K07m1L2M1j37j6o3J24r3n1%J10J6n0J45k8k6j40
2472E4k1K2k40M78k15j25L25k82J13K78j1n8l24K03om8L4m4J13N7l2j78L47l01
2496A39R5j94K90J31m06K64N2j76N5R5P2k34pL0mr6j22j39N74j52j91J1Jj60K28
$$ plain form
2521 156 109 237 56 -52 232 159 19 45 72 -2 51 111 75 -60 126 -50 258 20 -133 -15 -90 -183 -30
2544 -30 148 -23 -91 112 -63 123 29 223 -137 -133 80 79 -191 120 112 239 311 241 157 95 262 14 -34 -2 42
2569 42 -97 13 -71 -151 195 110 -34 96 20 115 -43 123 40 101 -90 29 140 354 143 -117 -78 -35 -120 336
2593 336 -109 -79 31 54 215 1 114 2 48 -228 -46 140 -232 -195 -172 -421 -21 -40 -41 -37 -91 -100 -138 -74 -65 -104
2619 -104 -163 -277 -64 -150 -117 -242 22 109 -203 -206 -48 -189 -24 26 21 -101 -196 -92 -20 -144 -210 -37 21 25 -50
2644 -50 -61 -127 -199 -2 -86 -225 -112 -40 -39 -2 -237 -280 -95 -130 -218 -250 -116 -306 -101 -208 -100 13 11 59 -264
2669 -264 -158 93 -123 -77 131 -82 -90 -236 -341 -248 -195 22 -57 -37 -184 -190 -102 -132 30 -56 -372 -116 -187 -157 -274
2694 -274 -203 -96 -68 -340 78 -282 -105 -335 -70 -29 -207 -203 -154 -59 -106 -106 -440 -68 -174 -191 -27 -152 -151 -208 -264
$$ packed form
2521A56m7J28j81j08K84p3j40K6K7p4N3O0l6j35J86j76L08k38j53J18p5r3J53
2544c0J78j71o8K03j75J86r4J94l60MK13jk70L11qJ27P2p0q4o2J67k48m8L2M4
2569D2j39J10q4q0L46q5j44J30p6R5j58J66q3O1j91J19J11K14k11k60L9M3q5M56
2593C36m45L0J10K3J61k14J13j12M6k76J82J86l72L7K3k49M00j9jMn4rl8O4Rl9
2619a04n9j14K13q6L3j25K64Q7l12lJ58j41J65N0nj22r5J04P2j24o6J73N8Mp5
2644e0j1o6p2J97q4j39J13P2JL7k35m3J85l5q8l2J34j90K05j07J08J13kM8l23
2669b64J06K51k16M6K08k13qj46j05R3N3K17p9K0j47oQ8l0J62q6l16K56p1L0j17
2694b74P1J07K8k72M18l60J77k30K65M1j78MM9R5m7%l34L72j06j7J64j25Jn7n6
$$ plain form
2719 -264 -276 29 -8 -159 8 -254 -220 -241 -11 -80 -109 -149 -109 -227 -242 -156 -194 -130 -179 -86 -95 -90 -219 -41 -129 -195 -275
2746 -275 -117 -207 -36 -355 -166 -217 -293 -10 -262 -284 -302 -49 -248 -234 -204 -337 -158 -199 -43 -289 -125 -258 -386
2769 -386 -64 -88 -255 -474 -386 -142 -368 -197 -293 -142 -98 -18 -217 -56 -156 -107 68 90 -153 -179 106 21 -7
2792 -7 -23 40 -150 63 33 59 -115 149 -101 75 -279 66 -45 -73 -128 119 -93 -52 -295 -33 -85 -400 -184
2815 -184 -91 -240 -210 -173 -224 -212 -3 -94 -53 -127 -117 -47 -163 -182 -53 -191 -208 -24 -230 -205 34 -68 -330 66
2839 66 109 -147 29 -224 -95 -198 -77 187 -152 -16 -50 -39 6 35 -354 -18 55 125 -211 -132 -73 -70 -151 -117 242
2864 242 -49 -240 76 -15 -52 -54 -290 25 -58 -75 -27 -70 -142 17 -52 -221 35 -145 17 -64 7 19 -121 40
2888 40 -57 -393 -52 -49 160 69 139 87 125 12 67 -67 96 -116 14 -6 5 32 -34 111 -204 23 -128 -98 -81
$$ packed form
2719b64j2L05l7j51J67k62L4k1K30o9k9m0M0j18j5Q6l8O4m9R3rNj29J78q8o6q0
2746b75J58r0J71l19J89n1p6K83k52k2j8K53j99J4L0j33J79m1J56k46J64j33j28
2769c86L22k4j67k19Q8K44k26J71r6J51M4Q0j99J61j00M9J75K2k43k6K85q5k8
2792gj6O3j90K13l0K6j74K64k50J76l54L45j11k8n5K47k12M1k43K62n2l15K16
2815a84R3j49L0L7n1J2K09r1M1p4J0P0j16j9J29j38j7J84k06K5K39j02k62L96
2839F6M3k56J76k53J29j03J21K64l39J36l4J1M5K9l89L36P3P0l36P9N9Lq1L4L59
2864B42k91j91L16r1l7kk36L15q3j7M8m3p2J59o9j69K56j80J62q1P1J2j40J61
2888D0r7l36L41LK09r1P0n2L8j13N5j34J63k12J30k0J1K7o6J45l15K27j51L0J7
$$ plain form
2913 -81 -80 -37 -120 -123 68 38 -56 -100 -7 -46 136 -58 -174 -36 -124 -153 -78 6 -59 -85 -171 -216 44 -81 56 203 102
2940 102 -141 -217 1 129 -16 2 15 32 65 121 -5 86 213 -7 233 244 34 -94 286 219 117 -101 -112
2963 -112 -48 -114 216 144 -98 229 213 58 69 273 -62 -38 -100 -98 -66 190 -17 15 17 185 67 -212 -125 -99 -33
2988 -33 12 -134 -65 168 80 231 -61 -1 54 137 52 159 99 66 -129 -20 52 108 283 -47 306 -145 109 55
3012 55 233 113 173 108 -142 -10 302 -16 259 300 0 191 188 122 28 285 267 282 301 -27 71 315 -99 319
3036 319 -6 152 48 115 26 179 268 58 299 186 197 12 62 187 395 110 194 -9 -125 56 242 140
3058 140 165 -32 -112 46 -69 -144 161 46 -270 -133 67 26 -3 42 -95 -4 169 207 169 134 80 -22 177 46
3082 46 188 -134 -12 75 58 124 22 219 -59 -68 121 -183 -176 72 57 204 99 231 -31 -108 45 42 197 190 143
$$ packed form
2913h1JM3q3lJ91l0r4m4R3l9J82j94j16J38q8k9P5Q4o5k6q6m5K60j25J37J47j01
2940A02k43p6K18J28j45J8J3J7L3N6j26R1J27k20K40J1k10j28L80o7j02k18j1
2963a12O4o6L30p2k42L27j6j55J1K04l35K4o2KL2K56k07L2KJ68j18k79Q7K6O6
2988c3M5j46O9K33q8J51k92O0N5Q3q5J07o0l3j95J09P2N6J75l30L53m51K54n4
3012E5J78j20O0o5k50J32L12l18K75M1l00J91lo6r4K57j8J5J9l28R8K44m14M18
3036C19l25J58j04O7q9J53Q9k10K41j13J1j85N0J25K08k85Q4k03j16J81J86j02
3058A40K5j97q0J58j15p5L05j15l16J37K00m1k9M5j37R1J73L8l8l5n4j02J99j31
3082D6J42l22J22Q7j7O6j02J97k78rJ89l04PK48j5J47j05J32k62p7J53lJ55pm7
$$ plain form
3107 143 150 392 57 53 313 124 44 263 -93 -41 14 91 234 71 105 21 -99 -74 179 -66 99 -86 -18 38
3131 38 307 57 85 279 40 117 61 147 161 181 -150 -88 64 -47 -80 -191 -99 -181 -28 157 -6 -196 -195 -49
3155 -49 -118 -101 31 3 -117 -43 52 -348 -42 143 -228 137 166 24 213 68 72 160 12 341 -41 -94 381 213
3179 213 189 -43 242 72 68 247 161 129 170 194 -87 6 50 -167 147 34 46 -114 -105 66 116 77 117 82 105 209
3205 209 -188 -242 -244 165 -93 76 -118 -135 -272 -135 50 -168 24 -72 -5 25 -269 -228 -200 -330 0 -124 -37
3228 -37 -198 10 -210 152 -65 125 33 -138 -108 6 238 -26 108 112 141 -15 58 182 -18 60 87 66 -49
3251 -49 -103 83 197 132 -13 -16 79 -213 -220 -41 66 79 42 -179 -177 -20 126 115 -170 -75 -170 -65 -79 60 98 86
3277 86 117 58 -82 58 -132 -173 6 -120 -203 -353 -92 -44 -74 15 58 -227 -294 -127 -1 -202 -123 -338 -52 -197
$$ packed form
3107A43PK42l35mK60j89q0K19l56N2N5P7J43j63L4q4j20K5K53k45J65j85O8N6
3131C8K69k50K8J94k39P7n6Q6J4K0l31O2J52j11l3j11R2q2J53J85j63j90JJ46
3155d9o9J7J32k8j20P4R5m00L06J85l71L65K9j42J89j45MQ8j48L29l82n3M75j68
3179B13k4k32K85j70mJ79q6l2M1K4k81R3M4k17L14j13J2j60RJ71N0l9M0l5K3J04
3205B09l97n4kM09k58J69j94j7j37J37J85k18J92r6O7L0k94M1K8j30L30j24Q7
3228c7j61K08k20L62k17J90r2j71L0J14K32k64J34MK9j56P3J24k00P8K7k1j15
3251d9n4J86J14o5j45lR5k92pJ79J07J3l7k21KJ57J46j1k85R5r5J05j4J39L8j2
3277H6L1n9j40J40j90m1J79j26q3j50K61M8l0Q9M3k85o7J67J26k01P9k15K86j45
$$ plain form
3301 -197 28 -165 -242 -98 -73 -59 31 -246 -164 48 -103 -333 -103 -25 -49 15 -187 0 -8 -36 -104 137 -60 -65 -327
3326 -327 123 -46 -39 -142 33 88 -58 6 -140 7 15 -147 -65 -129 -287 -23 -134 -122 -41 140 -62 138 -94
3349 -94 144 122 -119 -202 -96 111 -124 -37 -70 180 17 -205 95 -84 128 35 24 -200 68 -60 -26 21 -46
3372 -46 166 84 -92 39 -103 -244 -72 -64 156 -215 -226 -74 -55 -186 23 49 -185 -5 -37 -213 57 253 193
3395 193 -117 48 -23 -82 -63 67 -211 51 84 8 8 358 -242 -81 -37 204 170 -136 -124 -96 19 33 -49 -71 196
3420 196 -137 -34 -203 214 116 -203 29 -110 -114 -59 88 7 43 95 99 -183 -112 66 -199 -132 106 35 111 -47
3444 -47 -231 80 -56 30 71 -86 -149 -198 -137 -58 89 96 119 -101 51 72 4 63 468 -225 -88 1 62 50 -2 185
3470 185 -138 -96 143 66 44 23 348 252 129 -43 110 18 75 211 -107 -19 86 210 27 208 251 125 77
$$ packed form
3301a97K25j93p7J44K5J4R0k77Q2K12j51k30K30P8k4O4k02J87qk8o8K41j97nk62
3326c27M50j69Pj03J75N5j46O4j46J47Qj62Q2o4j58K64j11J2Q1J81k02K00k32
3349i4K38k2k41q3J06K07k35Q7l3K50j63k22L00j79K12r3j1k24K68j28L4M7o7
3372d6K12q2j76J31j42j41J72QK20l71j1J52J9j31K09K6k34J80l2j76K70J96o0
3395A93l10J65p1n9J9J30k78K62L3p6%L50o00J61M4K41l4l06J2K8J15J4q2k2K67
3420A96l33J03j69M17r8l19K32j39mN5J47q1L6N2Mk82P1J78k65O7K38p1P6j58
3444d7j84L11j36Q6M1j57o3m9O1P9J47PK3k20J52K1o8N9M05o93J37Q9O1j2n2J87
3470A85l23M2K39p7k2k1L25r6j23j72J53r2N7J36l18Q8J05J24j83J81M3j26m8
$$ plain form
3493 77 202 47 25 23 241 -200 -43 -127 147 110 -207 70 166 -134 71 -26 -15 -9 232 -264 2 -277 201 -113
3517 -113 234 -6 15 51 62 138 75 -128 139 190 40 46 -98 0 119 297 -160 62 218 -116 -89 -114 185 89
3541 89 88 -22 95 170 -33 43 140 -22 86 0 40 342 254 109 -5 -28 187 61 164 70 118 -64 -168 174
3565 174 -70 165 76 267 252 -23 56 121 44 361 134 167 242 146 231 -53 98 -31 132 52 -111 57 35 14
3589 14 33 -125 -78 148 5 67 -112 405 65 -13 6 -142 81 81 114 72 21 164 156 -214 -143 151 107 170 292
3614 292 -77 28 43 136 95 115 209 57 93 108 -56 -120 -253 212 110 81 -49 20 34 -11 76 87 -155 -110 360
3639 360 3 261 35 -23 -18 -56 -139 109 50 42 150 -39 14 102 169 161 4 110 -61 40 78 -68 -151 195 92
3664 92 81 62 77 -24 132 150 59 53 -161 135 63 -243 20 19 -4 55 182 -24 -86 -11 188 9 80 139 -58 -55
$$ packed form
3493G7J25j55k2kK18m41J57q4K74l7l17K77R6l00K05r7J1OK41m96K66k79M78l14
3517a13L47k40K1L6J1P6o3k03K67N1j50Oj44R8J19J78m57K22J56l34K7k5K99r6
3541H9jj10J17P5k03P6R7j62J08q6M0L02q8j45j14k3K15j26J03r4M8j82j04L42
3565A74k44K35q9J91j5k75P9O5p7L17k27L3P5r6Q5k84J51j29J63q0j63J68k2k1
3589A4J9j58M7K26j43O2j79N17l40p8J9j48K23%L3m2n1J43ql70P1K94m4O3J22
3614B92l69J05J5R3m1K0R4j52L6J5j64o4j33M65j02k9j30O9J4m5Q7J1k42M5M70
3639C60l57K58k26n8Nl8q3K48n9qJ08j89N3Q8O7qj57J06j71J01L8j46q3L46j03
3664I2j1j9J5j01J56J8r1ok14K96p2l06K63jk3N9J27k06o2P5J99j79P1N9j97L
$$ plain form
3690 -55 -13 142 -50 39 -32 61 4 -19 -13 -126 61 20 -114 -108 6 -5 112 216 -55 46 -72 -153 123 214 80
3715 80 -44 258 -120 -136 150 98 113 16 8 -83 -55 -61 -73 219 -121 -76 -117 -63 92 -54 -150 53 -7 -107 -70 46
3741 46 -55 -220 100 39 8 -126 146 142 79 195 52 -214 -252 -52 133 109 -32 -65 238 -82 -187 44 79
3764 79 -53 9 -45 -77 36 80 198 -79 -64 -90 84 -3 17 123 -192 14 -40 29 -234 -112 108 204 313 -130
3788 -130 11 -170 -66 -113 -75 -29 -137 -29 246 -13 -107 -58 -75 -206 -66 33 -18 -112 83 -129 -186 -237 -137 92
3812 92 103 -109 -70 0 -166 -136 -211 217 80 -59 -148 -41 -300 2 66 -72 -131 -189 -135 15 -282 -350 -42 -55
3836 -55 -207 -140 -241 -96 -116 -154 -5 -102 -42 25 -249 -192 271 -222 7 34 -111 178 -58 34 -100 -100 241 82
3860 82 60 -77 -170 -128 -114 -23 -42 -102 -113 107 -245 339 48 57 -126 96 -237 -55 -168 -15 -15 -54 14 63 -110
$$ packed form
3690e5M2J55j92Q9p1R3n7k3Oj13J87m1j34OJ14j1J17J04k71J01j18q1K76R1j34
3715H0j24L02l78j6K86n2J5r7qr1K8oj2K92l40M5m1N4J55j46r6K03o0j00L7J16
3741D6j01j65L20o1l1j34K72mo3J16j43k66l8K00J85k4j41l3L03l20j05K31L5
3764G9j32O2n4l2J13M4J18k77J5k6J74q7K0J06l15K06n4O9k63J22K20R6J09m43
3788a30J41j81J04m7L8M6j08J08K75k59r4M9j7j31J40R9n1r4J95k12n7n1J00K29
3812I2J1k12L9P0j66L0p5M28j37j39q9J07k59L02O4j38n9n8N4J50k97o8L08j3
3836e5j52O7j01J45k0l8J49r7O0O7k74N7M63m93K29K7j45K89k36R2j34%L41j59
3860H2k2j37r3M2J4R1j9o0j1K20l52N84k91Rj83K22l33J82j13J53%l9O8M9j73
$$ plain form
3885 -110 -131 -19 -75 74 -205 1 -86 127 43 84 -188 40 -226 -124 227 -2 -72 113 -104 54 84 -86
3907 -86 232 -47 -162 -149 -98 46 73 -95 81 0 -113 -75 -137 248 -171 -13 -226 -111 -101 -183 -56 -6 24 59
3931 59 84 -225 -57 84 109 63 10 -71 -15 -86 -52 -216 -238 -41 105 221 -106 51 -55 363 -10 -32 -101 -66
3955 -66 203 -192 -100 187 292 -75 -17 7 -151 -37 163 42 79 16 47 -96 -78 -215 -160 60 62 -139 -21 -32
3979 -32 -32 -285 -122 -154 -166 -12 -106 -4 -37 -88 -215 -61 11 -31 90 -151 -78 65 56 52 -2 -143 -28 0 85 85 140
4006 140 139 30 -17 -63 149 145 120 105 -83 137 49 110 -4 99 -168 119 -47 -13 267 57 -209 -74 104 177
4030 177 -107 -359 -181 -149 213 -351 110 -46 -124 -279 -235 206 39 -92 -165 85 92 227 -18 -127 -269 -96
4052 -96 -92 7 -70 3 -39 34 34 -251 -80 -92 41 63 139 31 82 -12 -312 78 -24 -154 -46 149 96 -109 -12 -42
$$ packed form
3885a10k1J12n6J49k79K06q7K13q4M1k72K28k66J02L51k29p0J85k17J58L0j70
3907h6L18k79j15J3N1J44K7j68J76q1j13L8o2L85m19J58k13J15J0q2J27N0L0L5
3931E9K5l09J68J41K5m6n3q1N6p1L4j64k2J97J46J16l27J57j06M18l73k2o9L5
3955f6K69l95R2K87J05l67N8K4j58J14K00j21L7o3L1j43J8j37N5K20Kk01J18j1
3979c2%k53J63l2j2J54r4J02l3n1j27J54P2m2J21k41P3J43rmn4j41J15K8Q5%N5
4006A40jj09m7m6K12mk5j5j88K20q8O1j14J03k67K87j66L4K80k10k66J35J78P3
4030A77k84k52J78L2L62n64M61j56p8j55M4M41j67j31p3K50PJ35k45j09j42J73
4052i6MR9p7P3m2P3%k85J71j2J33K2P6j08N1r4l00L90j02j30J08J95n3k05R7l0
$$ plain form
4078 -42 71 19 208 184 -71 138 -52 -175 -51 133 -26 -278 194 93 -36 -48 -100 264 77 -2 26 11 95
4101 95 -326 55 -19 54 -172 -34 123 4 83 25 25 212 175 -35 -252 -4 154 -121 -57 60 70 -110 61
4124 61 82 -5 -45 51 -111 84 49 101 148 -128 97 -217 -43 234 48 -94 -17 157 77 267 -134 -45 -351 167
4148 167 40 237 37 134 225 -68 -10 47 21 223 -71 265 45 -11 11 -60 107 -17 171 179 -53 44 115 123 103
4173 103 380 195 26 -52 166 -46 186 -119 -43 62 58 142 102 -208 -74 31 170 45 137 -57 -78 42 192
4196 192 -155 23 136 -114 182 -88 -89 -17 109 -206 102 64 8 8 55 -21 315 -133 -27 -73 -145 -8 119 79
4220 79 59 -168 -82 -12 -208 -79 -171 411 7 -82 33 115 -198 113 -55 158 -186 -32 -157 -244 176 10 67
4243 67 103 219 93 142 207 52 19 -39 -146 122 270 159 -95 205 100 83 22 -28 -195 30 23 -143 -181 209
$$ packed form
4078d2J13n2J89k4k55K09j90j23J24J84j59k52M72j01j29j2n2L64j87p9K8j5Q4
4101I5m21L81p4P3k26J38J57j19P9n8%J87l7k10k17K48J58k75O4J17J0j80J71
4124F1K1q7m0R6j62J95l5N2M7k76K25l14J74K77j86j42P7J74q0J90m01Q9l06N18
4148A67j27J97k00R7R1k93N8N7k6K02k94L36k20n6K2p1J67j24J88Qk32R7P1Qk0
4173A03K77j85j69p8K18k12K32l05P6J05mQ4m0l10J34J05J39j25R2j94k1J20J50
4196A92l47J78J13k50K96k70jP2J26l15L08l8n6%M7p6L36m48J06m6p2J37J27m0
4220G9k0k27Q6P0j96J29r2N82m04q9J15Q2l13L11j68K13l44J54j25q7M20j66N7
4243F7L6J16j26M9O5j55l3n8j07K68J48j11k54L00j05j7o1n0j67K25pj66l8L90
$$ plain form
4267 209 -144 -159 -43 77 -80 122 -90 -151 38 -191 -128 0 -294 -85 -271 -125 5 109 -22 -199 -84
4288 -84 24 22 -41 124 45 24 72 186 -20 -4 203 -55 82 76 -24 24 -60 46 -29 -43 210 -122 -2 40 33 -120
4314 -120 -155 -100 -183 -37 -97 -34 157 96 -1 147 -140 47 203 -27 -179 -6 -24 33 8 -29 28 94 37 -23 8
4339 8 26 -5 -108 48 128 -14 -33 -55 141 -74 48 391 -39 156 27 -307 -36 159 -59 66 54 9 -23
4362 -23 -160 115 -27 -47 -86 190 -107 56 -124 -231 -47 85 -42 -69 127 88 -112 186 -93 -60 -198 -31
4384 -31 79 -247 83 -83 115 -135 40 -87 20 -161 27 -61 -34 -40 -47 -28 -89 275 7 -85 94 -168 72
4407 72 54 212 360 -267 -65 -35 69 -138 -27 -41 -265 1 46 -41 108 -72 -44 203 -87 -92 -245 -302 -263 -253
4431 -253 -8 -126 45 -48 -154 25 61 -67 -40 -81 -42 -67 -16 -14 140 -122 -49 16 -61 -66 -247 200 -122 69 49
$$ packed form
4267B09l53j5J16J20j57K02k12o1J89k29O3J28k94K09j86J46J30J04j31j77J15
4288h4J08ko3J65p9k1M8J14k06J6K07k58J37oj00M8q4J06p5j4K53l32J20M2pj53
4314a20l5N5q3J46o0O3J91o1r7J48k87J87J56k30j52J73j8N7k5l7N7O6n7o0L1
4339HJ8l1j03J56Q0j42j9k2J96k15J22L43m30J95j29l34K71J95k18J25j2m5l2
4362b3j37K75j42k0l9K76k97J63j80j07J84J32j27k7J96l9k00K98k79L3j38J67
4384c1J10l26L30j66J98k50J75j27J07j81J88q8K7opJ9o1L64k68r2J79k62K40
4407G2j8J58J48o27K02L0J04k07J11j4k24K66M5q7J49j80K8K47k90nj53n7L9J0
4431b53K45j18J71r3j06J79L6j28K7m1L9k5N1KJ54k62P3O5p7nj81M47l22J91k0
$$ plain form
4456 49 -62 143 25 23 -13 46 203 150 133 -88 55 -249 52 -2 166 162 -211 49 178 -134 -11 -75 -27 127
4480 127 167 30 -151 91 22 -104 -134 -85 -83 103 -218 -87 -210 107 13 -127 -8 -125 77 -98 33 -202
4502 -202 254 -194 86 1 143 -72 -72 12 143 -190 -112 109 -42 -55 -124 44 56 -51 -1 -135 -96 202 -10
4525 -10 -107 -10 -66 16 -3 -114 72 -43 -42 41 -130 -107 -327 -218 19 58 70 -177 -203 -125 82 -11 126 -47 37
4550 37 42 -124 -107 -181 304 6 76 -173 -341 16 -188 150 -144 -20 73 27 144 -50 -78 -9 -175 104 -72
4573 -72 207 161 47 242 100 47 11 91 -183 208 -63 -47 -134 79 268 63 -17 108 -94 -258 67 243 103
4596 103 61 -167 -2 -17 -35 42 120 72 -230 9 120 103 114 -231 219 44 96 76 90 309 -228 -40 115 104
4620 104 -15 -51 161 -25 174 114 15 -75 -36 33 -290 -30 -89 98 284 61 -22 32 -122 77 -47 40 57 148
$$ packed form
4456D9j11K05j18kl6N9J57n3j7k21J43l04L01n4J68ml73K60J29l12J23o4M8J54
4480A27M0j37j81K42o9j26l0M9KJ86l21J31j23L17r4j40J19j17K02j75J31k35
4502b02M56m48K80q5J42k15%Q4J31l33P8K21j51j3o9J68J2j07N0j34L9K98k12
4525a0r7R7n6Q2j9j11J86j15JQ3j71K3k20J09K37L9J2k47k6P8K07r3J37j73Q4
4550C7Nj66J7p4M85k98P0k49j68L57k04L38k94J24R3m6J17j94k8O9j66K79j76
4573g2K79m6j14J95j42n3l6Q0k74L91k71J6q7K13J89k05q0J25k02j64L25J76j40
4596A03m2k28J65j5j8P7P8m8l02K39J11j7J1l45M50j75N2k0J4K19n37J88J55j1
4620A04j19l6K12j86J99o0r9r0L9O9l23K60n9J87J86k23q3N4j54J99j24Q7J7R1
$$ plain form
4644 148 82 103 -56 -105 104 -40 -15 -224 139 -96 106 -31 -238 19 174 43 -31 -134 10 27 99 -166
4666 -166 57 147 61 -89 -144 -143 -116 6 -71 103 -64 -53 -144 64 16 -168 -37 176 -134 30 198 -152 -6
4689 -6 92 -306 -142 15 79 -64 156 289 71 -141 184 68 -117 252 -43 74 91 -3 -340 -61 140 85
4711 85 38 66 92 -38 132 114 -24 35 -3 -91 256 -165 282 -274 -85 116 354 71 277 6 -223 176 12
4734 12 26 -79 -94 50 34 -8 227 32 87 238 -17 -29 -138 117 191 156 96 -24 -96 -48 -133 15 108 132 190
4759 190 -33 -89 90 -111 28 137 83 -155 29 131 -16 -133 -88 104 3 -108 -241 36 -25 -119 -114 80
4781 80 28 25 -172 83 141 257 56 83 88 216 33 -97 40 -3 315 -108 45 119 -19 2 -197 41 -128 67
4805 67 -140 -10 -51 34 80 -145 5 258 -41 -1 -48 124 46 -100 -60 163 256 55 60 57 -5 17 -1 -11 -245 4
$$ packed form
4644A48o6K1j59m9K09j44K5k09L63k35K02j37k07K57J55j31p4j03J44J7P2k65
4666a66K23R0q6j50n5JK7J22p7J74j67J1r1K08m8j84J31K13l10J64J68l50J46
4689fR8l98J64J57O4j43K20J33k18k12L25j16j85L69k95J17J7r4l37K79K01n5
4711H5m7K8K6j30J70j8j38N9l8q8L47m21M47n56J89K01K38k83K06k71k29L99j64
4734A2J4j05j5J44j6m2K35j95N5J51k55j2j09K55P4l5o0j20p2M8q5J48R3K4N8
4759A90k23n6J79k01J39J09n4k38J84J02j47j17M5J92j01j11j33K77o1r4NJ94
4781H0n2lj97K55N8J16k01K7NJ28j83j30J37m3L18m23J53P4j38K1j99K38j69J95
4805F7k07J30m1Q5M6k25J50K53k99M0m7J72p8j46M0K23R3k01Nlo2K2j8j0k34K49
$$ plain form
4831 4 108 -16 -189 -99 -152 -168 -27 -199 84 158 -32 6 -385 231 59 -25 66 -110 312 -87 349 -22 -91
4854 -91 258 2 -41 -189 165 66 123 13 -228 190 -139 -57 -61 17 -27 85 -278 8 7 50 -170 177 -206 -54
4878 -54 31 109 -39 -138 -8 -82 -69 72 10 235 100 -191 -2 121 -97 -5 84 135 -110 -4 31 60 40 -34 -47
4903 -47 26 9 -212 20 175 196 100 -49 111 69 37 26 -77 -13 -16 35 2 153 -73 -70 -219 52 -89 -1 88 -148
4929 -148 -74 -220 -47 156 -201 116 -1 -31 -181 -148 -5 154 -51 -24 146 -221 150 -162 242 -92 -9 35
4951 35 -146 -72 -244 73 117 -192 36 -88 100 -93 3 -183 -81 -133 78 -237 135 -188 -202 -212 80 -195
4973 -195 -297 143 146 49 -222 -86 180 148 -104 48 -232 138 120 191 134 -150 -2 174 -160 -78 -89 38 -67
4996 -67 -58 -6 -42 111 -158 -7 -89 -79 10 61 260 -241 189 -160 -109 41 -210 69 -65 29 135 49 21 269
$$ packed form
4831DJ04j24j73R0n3j6J41j72K83P4j90L8l91O16j72q4R1j76M22l99M36l71o9
4854i1L49k56m3j48L54r9N7j10k41M18l29Q2mP8m4J12l63K86jM3k20L47l83J52
4878e4Q5P8j48r9J30p4J3J41o2K25j35k91J89J23k18R2Q9N1k45J06L5K9k0p4j3
4903d7P3j7k21K32J55K1r6j49J60m2l2j1j03O4lN1l3J51k26Lj49K71j41Q8Q9k36
4929a48P4j46J73K03l57L17j17l0j50L3J43J59k05K7J70l67L71l12M04l34Q3M4
4951C5j81P4j72L17M4l09K28j24J88j93R6j86J02n2K11l15L72l23j4j0K92k75
4973a95j02M40Lr7k71J36K66l2k52J52k80L70j8P1n7k84J48J76l34Q2j1J27j05
4996f7RN2l6J53k69J51q2J0Q9N1J99n01M30l49N1J50k51K79j34R4J06q6k8K48
$$ plain form
5020 269 24 -108 209 -242 185 -78 -97 -225 -151 -123 -226 -77 -172 -47 -14 129 -22 -317 -75 -77 6 34 -85
5043 -85 40 -330 -13 29 139 8 86 3 -322 71 92 -116 -25 -15 -108 104 125 95 75 201 -156 -121 -48 30 113
5068 113 -118 -58 78 169 -120 -41 -9 61 31 166 -87 -143 8 142 -61 -23 55 -228 92 15 126 -1 -23 -106
5092 -106 76 0 -59 -45 -59 78 -25 -72 3 168 66 -32 -38 117 -116 47 -67 -30 -29 26 -68 172 178 -48 264
5117 264 3 33 -85 -61 105 -71 -100 65 -87 -89 -83 182 158 277 -94 -7 211 -21 189 85 -133 -166 17
5140 17 -84 44 106 -123 128 84 -17 244 51 3 54 64 -33 70 -104 -281 -44 -242 56 87 4 54 -21 110
5164 110 -7 -51 -13 -18 -153 -55 -287 -120 264 -75 -94 120 69 87 -41 135 46 -75 88 172 -145 145 -291
5187 -291 241 49 -202 -144 -354 118 159 -47 -146 61 89 211 -6 91 9 9 -17 196 196 -97 -34 67 -161 89
$$ packed form
5020B69k45j32L17m51M27k63j9j28P4K8j03J49r5J25L3J43j51k95K42kQ3K8j19
5043h5J25l70L17M2J10j31P8q3l25L93K1k08R1J0r3K12K1l0k0J26l57L5P3P8Q3
5068A13k31O0J36R1k89P9L2P0l0J35k53n6J51J34k03L8P8k83L20p7J11j27k2q3
5092a06J82p6n9J4j4J37j03m7P5J65j02r8oJ55k33J63j14L7JN5r4K40Ok26L12
5117B64k61L0j18K4J66j76k9J65j52kOK65k4J19l71Q7K18k32K10j04k18l3J83
5140A7j01J28O2k29K51m4j01K61j93m8N1J0r7J03j74j77K37j98K98L1q3N0p5J31
5164A10j17m4L8nj35R8k32J67L84l39j9K14n1J8j28J76q9j21J63Q4l17K90m36
5187b91N32j92k51N8k10M72M1k06r9K07K8J22k17R7q2%k6K13%k93O3J01k28K50
$$ plain form
5211 89 89 -78 66 -10 47 78 -53 -83 -85 -11 109 112 84 142 -363 -4 -121 -53 -39 21 -105 94 67 -51 -54 -125 71
5238 71 199 -32 -47 56 -91 -212 -43 9 156 -160 82 -48 15 -261 -22 -116 -40 -68 102 -103 27 -124
5260 -124 -47 -24 -78 197 138 189 29 -22 -72 234 191 226 75 -20 116 -100 -42 -191 69 116 -40 -91 -154 -10 4
5285 4 1 413 -7 233 35 37 -59 212 82 77 -114 138 -128 144 50 173 157 -217 -255 -24 -13 -30 88 -78 72
5310 72 -125 -44 257 -245 330 -130 77 18 112 79 7 -2 -146 200 -44 115 3 87 163 92 101 -159 90 -209
5334 -209 -127 119 -29 -77 52 -103 -191 -62 257 -67 -309 184 -177 -59 -104 128 117 -134 -93 231 -110 -14
5356 -14 117 62 17 -234 27 82 274 225 98 74 20 1 -278 -222 -247 -164 140 -170 66 72 128 40 159 -89 52
5381 52 49 -92 -14 -21 43 31 53 383 70 59 46 -69 -4 -109 99 102 149 43 6 95 -10 64 108 3 309 101
$$ packed form
5211H9%j67J44p6N7L1j31l0kP4J20Lk8N8n05L59j17O8J4O0j26J99k7j18lp1J96
5238G1J28k31j5J03j47j21J69N2J47l16K42j30O3k76K39r4P6k8J70k05J30j51
5260a24P7K3n4K75n9N1j60n1n0L06m3L5j51r5J36k16N8j49K60M7j56n1o3J44J4
5285DlM12m20K40j98Kr6K71j30nj91K52k66K72r4J23j6l74l8K31J1j7J18j66J50
5310G2j97Q1L01n02N75m60K07n9R4l3p2rj44L46k44J59j12Q4P6p1Rk60K49k99
5334b09Q2K46j48m8J29j55q8J29L19l24k42M93l61J18m5K32j1k51M1L24l41R6
5356a4J31n5m5k51K61N5J92m9j27k4n4j9k79N6k5Q3L04l10K36ON6q8J19k48J41
5381E2lj41P8pO4j2K2L30l13j1j3j15O5j05K08LM7j06l7Q9j05P4M4j05L06k08
$$ plain form
5407 101 -128 -47 -60 -85 19 -60 107 28 99 142 -133 182 -46 -149 3 -197 -21 193 165 -119 74 70 -20 199
5431 199 91 -108 -49 -99 -60 81 60 -320 213 -153 -120 -121 -98 -36 198 -67 186 -290 1 138 -119 149 168
5454 168 178 -47 71 74 191 -158 -75 -177 131 -65 -172 160 83 106 -190 -267 -43 -17 -94 115 35 56 -102 -107
5478 -107 38 3 220 -281 -101 -48 40 75 -246 -34 9 -8 92 -290 -114 -137 61 50 -44 126 15 -146 74
5501 74 86 -106 110 -252 213 33 136 -146 -204 79 -143 197 130 66 50 183 -20 -137 -141 45 -141 61 -207
5524 -207 18 -27 -90 -76 -12 122 56 60 46 152 -166 128 -105 12 -329 88 1 123 -103 140 -44 -45 -112 10
5548 10 -44 128 171 11 -76 66 202 41 0 -56 -170 134 116 80 109 11 68 71 19 89 -162 -266 63 151 -192
5573 -192 65 -138 -6 96 149 2 143 -43 -52 -54 -13 67 -7 -7 -15 51 -146 115 139 -142 199 56 0 -116 18
$$ packed form
5407A01k29Q1j3k5J04p9J67p9P1M3k75L15k28j03J52k00J76K14k8k84J93mr0K19
5431A99j08j99N9n0L9J41k1l80N33l66L3jK3O2K34k65K53m76K91J37k57K68J9
5454A68J0k25J18LJ17l49Q3j02L08j96j07L32p7K3k96p7K24K6p7K09q0K1j58n
5478a07J45l5K17n01J80N3Q8L5l21K12M3j7J00l82J76k3J98j1r4J70j11j61K20
5501G4J2j92K16l62M65j80J03k82n8K83k22L40o7o4j6J33k03j17mJ86j86K02k68
5524b07K25m5o3J4O4J34o6Mj4J06l18K94k33J17l41M17q7J22k26K43j84jo7J22
5548A0n4J72M3j60q7J42J36j61m1n6j14L04j8l6K9r8N7Ln2P0k51j04L29Q8l43
5573a92K57k03J32J02N3j47J41j86rkM1Q0p4%qO6j97K61K4k81L41j43n6j16J34
$$ plain form
5598 18 59 4 -174 -36 -91 -117 176 -130 12 -29 22 73 351 24 -28 -216 -45 51 -152 148 73 -62 -97 -141
5622 -141 321 107 -44 148 110 -163 -32 -125 73 26 -39 33 -89 31 -60 -141 -77 46 25 -95 -110 61 177
5645 177 31 -106 121 243 26 -63 -120 -129 238 -151 77 42 11 199 13 -69 51 -175 156 -3 -211 -28
5667 -28 -154 -103 26 -49 52 24 -231 99 -31 1 78 122 -167 135 -100 -211 -52 135 161 -40 -98 72 -50
5690 -50 -91 -94 175 164 -63 -167 -83 28 40 -79 -41 76 180 -54 170 -240 12 -198 -20 -94 -80 -67 -156 -7
5714 -7 142 187 -56 47 85 -90 -161 206 -29 42 -113 86 130 -35 -194 17 150 -22 60 130 -26 66 -56
5737 -56 -65 -66 -105 -55 49 -92 48 -253 71 -30 7 81 99 -176 66 138 219 -101 126 -51 -200 -211 -33 56 -83
5762 -83 7 149 144 -21 158 19 114 98 154 194 37 -286 -57 98 -107 121 -74 -150 -203 -48 109 -150 -206 -127
$$ packed form
5598A8M1n5j78J38n5k6K93l06J42m1N1N1K78l27n2j88J71R6k03L00p5j35l5m4
5622a41M62k14j51J92l8k73J31r3J98m7o5P2j22J20r1q1O4J23k1j20j5J71J16
5645A77j46j37K27J22k17q9n7rL67l89K28l5l1J88j86q2J20k26L31j59k08J83
5667b8j26N1J29p5J01k8k55L30j30L2P7M4k89L02k35j11J59J87K6k01n8J70j22
5690e0m1lK69j1k27j04Q4J11J2j19L8J17J04k34K24m10K52k10J78p4J4J3q9J49
5714gJ49M5k43J03L8j75p1L67k35P1j55J99M4j65j59K11J33j72Q2P0j56R2j22
5737e6rjl9N0J04j41J40l01L24j01L7P4J8k75K42P2Q1l20K27j77j49j1J78Q9j39
5762h3R0J42nj65J79j39R5j6N6M0j57l23K29J55k05K28j95p6n3J55J57k59n6P9
$$ plain form
5786 -127 24 184 -26 -174 -74 -28 53 110 -22 -65 -93 -142 -108 -68 173 -83 147 200 107 57 -229 13 -25 -66
5810 -66 60 41 -124 274 83 -69 119 -161 -141 194 -48 180 -143 -116 73 -36 -6 268 -45 75 -68 -113
5832 -113 -27 114 77 35 -84 130 78 -69 17 -25 154 17 -41 79 -86 110 155 117 -126 -171 -51 127 -80
5855 -80 -261 -2 -137 115 -44 169 -70 29 147 158 -164 55 125 -6 -273 92 -72 -104 -11 153 -185 -39
5877 -39 -154 -269 -80 142 169 119 236 63 26 -67 166 -49 -312 38 -35 -153 9 -119 -62 -90 6 289 54
5900 54 10 -143 155 -131 -203 40 62 158 54 -82 225 -15 -112 267 -81 -76 -188 -111 -145 -50 67 48 111 343
5924 343 149 55 15 -134 -25 -56 1 -17 88 24 290 -158 -79 -227 -49 234 -38 79 62 61 -37 -10 -80 34
5948 34 -18 -101 -52 35 41 -56 220 6 38 -22 -127 -199 -15 -56 128 -16 97 262 -10 12 -39 141 40 138 -65
$$ packed form
5786a27J51J60k10j48J00M6Q1N7j32m3k8m9L4M0K41k56K30N3r3n0k86K42l8m1
5810f6J26j9j65L98j91j52J88k80K0L35k42K28l23K7J89j09L0K74l13J20j43m5
5832a13Q6J41l7m2j19K14n2j47Q6m2J79j37n8J20j65J96M5l8k43m5J20J78k07
5855h0j81K59j35K52j59K13k39R9J18J1l22K19P0j31k67L65j64l2R3J64l38J46
5877c9j15j15J89K22K7n0J17j73l7r3K33k15k63L50p3j18J62j28N7k8R6K83k35
5900E4m4j53K98k86p2K43K2R6j04j36L07k40r7L79l48Nj12P7l4R5J17j9O3K32
5924C43j94r4m0j49J09l1N7j8J05o4K66m48P9j48J78K83k72J17j7jr8K7p0J14
5948C4n2q3M9Q7Or7K76k14L2o0j05p2J84m1J84j44J13J65k72K2n1J80j01R8k03
$$ plain form
5973 -65 -117 19 94 -2 -19 71 73 167 157 -186 -180 -90 -36 -101 145 13 255 26 -82 114 198 -1 26 -38 112 52
5999 52 85 -20 -32 95 -125 -201 73 99 -242 33 55 -191 104 127 9 368 191 -126 67 -132 -118 34 -40
6022 -40 -134 23 -116 -24 -98 149 -237 -55 92 -147 54 -105 -24 -60 -13 -13 -104 -141 34 -319 34 -17 62 -175
6046 -175 128 -46 95 231 120 -15 86 16 229 9 -42 217 -36 73 206 174 33 -109 -82 0 -67 58
6068 58 -18 -30 -210 10 31 -152 50 13 81 -35 -51 147 -78 -87 -238 75 -239 -54 -153 -166 43 -56 -212 23
6092 23 150 57 16 36 50 -62 7 -64 -3 -162 54 -170 140 5 -22 -27 -11 127 -150 253 -4 -33 -32 -31 -1 -126
6118 -126 5 -130 -126 66 69 99 -89 106 44 -114 -153 157 -245 35 -107 186 -90 30 -17 -123 62 -116 -139
6141 -139 29 78 148 -82 -131 -295 -98 53 -89 -78 121 -52 27 153 79 78 21 81 -23 33 -103 120 -128 166
$$ packed form
5973f5n2J36P5r6j7R0KR4j0l43OR0N4o5K46j32K42k29j08J96Q4j99K7o4J50o0
5999E2L3j05j2J27k20p6K74K6l41K75K2k46K95K3j18L59j77l17J93j99J4J52p4
6022d0r4J57j39R2p4K47l86J82J47k39K01j59Q1l6M7%r1l7J75l53L53n1P9k37
6046a75L03j74J41J36j11j35J01p0K13k20n1K59k53J09J33l2j41j42K7Q2o7J25
6068E8p6j2j80K20K1j83K02l7O8j16j6J98k25rj51L13l14J85r9j3K09r9j56K35
6092B3J27r3m1K0J4j12O9p1O1j59K16k24L10j35k7nJ6J38k77M03k57k9JJL0j25
6118a26J31j35MJ92LL0j88J95o2j58l9L10m02K80j42K93k76J20m7j06J85j78k3
6141a39J68M9P0k30m9j64J97J51j42J1J99j73P9J26p4jn7O0j04N6j36K23k48K94
$$ plain form
6165 166 52 -117 167 -86 46 -113 202 -12 -10 -104 -83 39 -86 135 -108 70 -66 -8 296 139 161 191
6187 191 -102 5 92 -24 130 -219 -167 49 -78 22 10 -132 161 -2 -118 144 -64 38 23 287 -1
6208 -1 -88 86 15 57 -179 5 -33 326 194 241 113 20 97 -48 83 -132 95 -28 99 101 24 -88 36 -93
6232 -93 89 110 120 61 166 -14 -94 -28 128 19 92 -128 -36 -152 -106 -116 28 178 43 -68 -171 -41 -18 227
6256 227 -7 291 2 62 249 283 -46 106 66 91 -38 -149 -150 -319 89 -20 153 266 82 -127 -163 43
6278 43 225 11 -90 149 58 -88 47 196 66 -127 21 129 118 -30 -98 24 -7 58 -74 -35 130 -62
6300 -62 205 28 -43 66 -209 33 243 -89 -88 70 58 142 113 -27 92 31 -17 122 29 -146 51 -135 164
6323 164 41 -28 190 0 -51 89 -45 104 11 29 112 -127 -118 199 135 55 -35 -67 6 -182 66 -230 151 -59
$$ packed form
6165A66j14j69K84k53J32j59L15k14Kr4K1J22j25K21k43J78j36N8L04j57K2L0
6187A91k93J07Q7j16J54l49N2K16j27J00j2j42K93j63j16K62k08J02j5K64k88
6208aq7J74p1M2k36J84l8L59j32M7j28r3P7j45J31k15K27j23J27Kp7j12J24j29
6232i3J82K1J0n9J05j80q0O6J56j09P3k20R2j16M6j0J44J50j35j11j03J30K3K45
6256B27k34K98k89O0J87L4l29J52m0K5j29j11jj69M08j09J73J13j84k09l6K06
6278D3J82k14j01K39r1j46J35J49j30j93J48J08j1j48o8J22l1O5j32L9J65j92
6300f2K67j77p1J09k75K42K10l32JJ58j2Q4k9j40J19o1m8J39r3j75J97j86K99
6323A64j23o9K18j90n1J40j34J49r3J8Q3k39RL17o4q0r0l2P3j88K48k96L81k10
$$ plain form
6347 -59 240 -112 -228 -16 132 50 -6 -53 -207 180 -2 -8 -81 115 -80 -118 -169 103 -111 230 -2 -83 6 -43
6371 -43 0 208 52 -63 -133 141 128 307 67 -25 39 39 -6 -127 38 48 116 171 13 -104 39 -97 64 -242
6395 -242 88 -30 60 -11 50 -196 -123 270 202 -29 51 40 -156 3 321 -204 15 209 -115 -109 29 -53 -38 -129
6419 -129 8 -71 -34 13 -92 45 141 -10 63 122 178 -26 80 230 -112 263 -32 -59 48 125 21 15 -164 -107
6443 -107 -19 145 -51 -72 -20 18 92 43 66 37 -3 176 -233 -16 148 -12 10 12 -42 -62 -29 14 25 -153 244 79
6469 79 80 -82 -213 -12 -180 162 57 -35 -4 -32 134 145 -152 8 -118 -122 72 -90 21 -98 -51 -125 -20 101
6493 101 -62 -90 66 -113 98 -110 -58 3 -65 -62 436 120 164 251 104 -109 42 149 -80 -18 -13 17 145 -65
6517 -65 -103 -38 269 141 -95 -189 -3 -32 -8 128 -96 -170 44 218 -34 47 62 27 279 -9 40 -145 82 -2
$$ packed form
6347e9K99l52j16K12J48q2n6m7j54L87j82op3J96j95l8n1K72k14L41k32q1Q9m9
6371d3M3K08j56j15p0K74j3J79k40r2O4%m5j21J65J0O8N5j58j17J43j36J61l06
6395b42L30j18R0p1O1k46P3L93o8k31Q0j1j96J59L18n25K19J94l24OJ38q2J5r1
6419a29J37p9L7M7j05J37R6j51P3N9N6k04J06J50l42L75k95k7J07P7j04oj79N7
6443a07Q8J64j96k1N2L8P4m9K3k9m0J79m09K17J64j60K2Kn4k0L3M3J1j78L97j65
6469G9Jj62j31K01j68L42j05r2L1k8J66J1k97J60j26mJ94j62J11j19M7p4J05J21
6493A01j63k8J56j79K11k08N2O1o8LM98l16M4Q7j47k13J51J07k29O2NL0J28k10
6517f5l8O5L07j28k36r4J86k9K4J36k24p4K14J74k52Q1J5l5K52k88M9j85K27q4
$$ plain form
6541 -2 -171 -29 -34 87 -214 19 126 -26 131 206 -13 82 35 -171 100 -11 13 111 88 179 -152 109 15 -60
6565 -60 -19 -185 -54 237 102 70 -41 25 58 109 18 149 27 -55 -148 9 22 -106 8 -84 -138 -73 -188 -50
6589 -50 -95 128 68 63 -154 68 -177 158 154 -75 -47 -7 132 4 48 -5 49 -43 113 -88 171 -130 -36 -7 -138
6614 -138 -89 46 -39 -44 -26 1 -123 80 -36 147 102 34 90 54 -183 -26 -71 153 8 -41 87 17 -195 -78
6638 -78 32 -3 -117 -11 -55 -87 36 1 41 -18 81 80 -84 -93 142 270 -86 201 -156 107 100 70 103 -163 -290
6663 -290 -216 150 152 127 36 -42 43 -117 80 217 22 -54 71 159 -147 88 -52 167 -78 59 45 13 88 84 -105
6688 -105 68 4 137 -172 -171 135 87 -44 -226 -2 -196 73 75 -125 -248 -41 86 -86 43 -292 328 75
6710 75 -143 3 33 29 23 -135 231 -16 -125 56 -11 -140 55 80 102 -77 185 -50 -36 -116 264 142 228 19
$$ packed form
6541bj69J42nJ21l01K33J07j52J57P5k19R5m7k06K71j11K4R8k3R1l31K61r4p5
6565f0M1j66J31K91j35l2j11O6L3N1r1J31j22q2r3J57J3j28J14r2n4O5j15J38
6589e0m5K23o0nk17K22k45L35mk29K8M0J39j28M4n3N4r2J56k01K59l01R4K9j31
6614a38M9J35q5nJ8K7j24K03j16J83m5o8N6l6k37J57m5K24j45m9J28p0k12J17
6638g8J10l5j14J06m4l2J23l5M0n9R9jj64rK35J28l56K87l57K63pl0L3k66j27
6663b90P4L66Kk5r1p8Q5j60J97J37j95p6J25Q8l06K35j40K19k45J37j4l2P5mj89
6688a05J73o4J33l09JL06m8j31j82K24j94K69Kk00j23K07J27j72J29l35O20k53
6710G5k18J46L0moj58L66k47j09J81o7j29J95K5K2j79K62k35J4q0L80j22Q6k09
$$ plain form
6734 19 -138 63 51 -80 278 5 -295 135 -262 -11 71 160 -159 -100 2 -13 -37 -200 200 -46 -16 19 -215
6757 -215 -120 -51 73 -45 78 23 -179 135 -12 -164 56 -25 -1 -126 118 -11 -71 130 87 -26 6 -17 111
6780 111 -123 -201 188 17 -55 244 -48 148 128 -49 86 139 -159 -167 51 55 6 -1 -102 -79 -28 -50 -106 53 78
6805 78 -74 -111 -214 75 -160 80 17 143 101 -188 20 -85 119 -26 -51 -37 -96 68 -138 -90 -63 -184 -15
6828 -15 -11 -42 18 103 17 -194 -83 161 12 124 39 -23 -104 -77 278 19 -36 53 30 121 -259 51 149 -81 -45 -154
6854 -154 -18 -58 -64 75 -90 1 2 19 170 -60 6 148 283 53 -19 -44 -35 -106 -265 105 8 23 84 55 25 96
6880 96 130 -88 148 5 -32 -161 148 161 -106 -61 75 -13 -97 -20 -6 -97 -132 -122 26 54 81 77 -58 69 31 -178
6906 -178 -214 149 67 4 174 19 -119 -187 -125 215 -156 181 99 28 59 -39 -13 -165 -61 230 36 -152 149
$$ packed form
6734A9j57K01j2j31L58k73l00M30l97K51Q2Q9l19N9J02j5k4j63M00k46L0L5k34
6757b15R5O9J24j18J23n5k02L14j47j52K20q1K4j25K44j29o0K01m3j13L2k3J28
6780A11k34p8L89j71p2K99k92J96k0j77J35N3k98qK18Mm9pj01K3N1k2n6J59K5
6805G8j52l7j03K89k35K40o3J26m2k89K08j05K04j45k5J4n9J64k06M8K7j21J69
6828a5Ml1O0Q5q6k11J11K44j49J12q5o2q1K7L55k59n5Q9k3R1l80L10R8k30L6j09
6854a54J36m0oJ39j65R1JJ7J51k30O6J42J35k30p2k5Rp1j59L70r7J5O1k9l0P1
6880I6L4k18K36j43l7j29L09J3k67M5J36q8q4P7J4r1l5J0J48K8K7mj35J27l8k09
6906a78l6L63q2o3J70j55j38o8O2L40l71L37q2p1L1r8K6j52J04K91j94j88L01
$$ plain form
6929 149 -93 -290 60 -19 -50 -220 -191 -74 21 13 -15 30 -3 195 31 109 18 7 61 23 165 40 292 68 122
6954 122 -190 -139 -27 -82 78 -129 -150 -216 -154 83 -139 48 1 171 -131 63 169 156 146 -25 -121 -7 176
6977 176 104 52 67 -6 -27 151 24 7 -66 37 89 173 48 84 225 59 -301 -40 -96 17 142 169 158 -21
7001 -21 -132 181 -76 166 -110 257 37 -123 -85 -23 -130 91 8 54 -98 -191 -62 215 15 -150 -45 -114
7023 -114 -94 -200 -11 -9 -93 -234 -65 -8 -103 -146 -69 198 59 -27 278 -38 -59 -73 -104 192 57 -50 -75 36
7047 36 -117 84 218 102 27 -2 87 -61 -113 -148 53 -72 -205 18 -57 154 50 -158 -50 185 -29 63 123
7070 123 -165 -217 17 -102 1 232 50 -5 -170 -74 30 -62 -64 -56 -9 159 168 84 175 98 -146 62 -128 61 -29
7095 -29 2 -56 122 61 140 -35 168 124 161 -109 75 -72 14 69 -99 184 26 80 -55 22 2 68 -206 49
$$ packed form
6929A49k42j97L50p9l1j70K9J17R5qk8M5l3J98j64P8r1j1N4l8J42j25K52k24N4
6954A22l12N1J12n5J60k07k1o6O2K37k22J87m7J70l02J94J06j3j0j71r6J14J83
6977A76p2n2J5p3k1J78j27j7p3J03N2Q4j25L6J41j66l60K61n6J13J25K7j1j79
7001b1j11L13k57K42k76L67k20j60L8O2j07K21q3M6j52r3J29K77k00j65J05o9
7023a14K0j06J89Kq4j41J69N7r5m3P7K67j39q6L05l16k1j4l1K96j35j07k5J11
7047C6j53K01J34j16p5k9Q9j48n2l5K01j25j33K23p5K11j04k08J08K35k14R2O0
7070A23k88n2K34j19J03K31j82n5j65R6J04r2kQM7J68Rq4R1p7k44K08j90J89r0
7095b9L1n8J78o1P9j75K03m4L7k70J84j47Q6N5j68K83j58N4j35P7k0O6k74K55
$$ plain form
7119 49 35 87 84 62 -68 104 -27 47 226 73 -54 -177 -113 -55 -182 86 90 2 77 101 -100 -191 23 189 -88
7144 -88 90 0 -77 178 -127 -66 158 156 -237 38 188 177 174 -186 48 180 112 159 92 34 -177 -192 143 -6 -169
7169 -169 -54 243 -27 13 48 -47 39 289 112 -71 194 94 -124 -185 -43 -25 66 -75 -207 -68 -75 -105 47
7192 47 -74 -83 -144 157 -132 31 -77 12 168 21 20 -101 -99 77 40 -15 -197 -85 122 -214 -58 -49 -21 -6 49
7217 49 -28 -189 194 3 -298 -92 78 96 -249 88 -38 -9 16 100 75 -61 131 40 -21 76 29 103 -121 40
7241 40 -43 202 -131 94 -8 50 -61 -145 -20 -56 28 258 73 -78 252 114 87 49 210 -75 169 -144 194
7264 194 1 117 -67 89 -16 -117 438 -23 17 -38 47 -182 24 120 21 100 -12 -18 -50 -8 -180 -19 62 -127
7288 -127 226 -195 104 28 -43 106 -151 -31 169 -7 174 81 31 -359 -85 -145 193 -107 -3 140 130 -140
$$ packed form
7119D9j4N2lk2j30J72j31P4J79j53j27j23O4N8j27K68Mq8P5K4k01r1K14J66k77
7144h8J78r0p7K55l05O1K24kl93K75J50j1ll60K34J32o8M7o7n8k11j5L35j49j63
7169a69J15K97k70M0L5r5Q6K50j77j83K65j00k18o1J42J8R1j41j32J39pl0J52
7192D7j21ro1L01k89J63j08Q9J56j47jj21KJ76l7n5j82J12K07l36J56RK8J5N5
7217D9p7j61L83j91l01K06J70J8l45L37j26K9K5Q4k5j36J92r1o1R7m7P4k24J61
7241D0q3K45l33K25j02N8j11q4J25l6Q4K30j85j51L30j38k7l8J61k85K44l13L38
7264A94j93J16j84J56j05j01N55m61M0n5Q5k29K06R6r9P9j12ol2M2j72J61Q1j89
7288a27L53m21K99p6p1J49k57J20K00j76J81r3n0l90K74o0L38l00J04J43j0k70
$$ plain form
7310 -140 84 -32 -66 99 171 -42 75 97 79 -98 -3 -72 175 -287 49 107 82 195 -24 37 -12 -48 -54 51
7334 51 -30 101 155 77 137 -29 -7 120 -184 -40 5 29 137 101 237 113 78 -24 -94 267 36 -24 66 108 -209
7359 -209 61 -154 -322 11 -57 -52 -55 111 -19 121 235 -274 21 -6 29 206 -47 15 -47 32 66 85 -24 156
7383 156 10 68 -119 279 49 -73 64 -244 41 15 131 175 52 -120 155 -82 -149 21 -23 77 -21 -230
7405 -230 6 -15 -115 75 215 -192 5 -78 -14 -60 -122 -80 -34 266 75 168 -137 17 49 184 -68 -120 -29 139
7429 139 -69 -45 -53 -134 -13 -41 170 11 -139 231 36 -91 -35 68 18 -167 211 -50 -174 38 113 1 117
7452 117 12 -28 170 -123 30 -35 -110 73 45 -62 -9 6 -42 -169 -30 -117 -171 -66 193 -49 -186 -23 -201
7475 -201 169 31 -216 217 -45 -5 154 -17 102 72 -53 4 -68 73 90 146 -116 -8 191 -89 -50 91
$$ packed form
7310a40K24j16l4J65P2k13J17K2j8j77R5o9K47m62L36N8k5J13k19O1m9l6oJ05
7334E1q1J31N4p8O0j66K2J27l04J44M5K4J08l6J36j24l5j02p0L61k31o0R0M2l17
7359b09K70k15j68L33o8NlJ66j30J40J14n09K95k7L5J77k53O2o2P9L4J9j09J80
7383A56j46N8j87L98k30j22J37l08K85k6J16M4j23j72K75k37o7J70m4J00r8k09
7405b30K36k1j00J90J40m07J97q3O4m6o2M2M6L00j91R3l05J54L2J35k52n2R1J68
7429A39k08K4qq1J21k8K11j59j50L70j95j27N6J03n0j85L78k61j24K12P5j12J16
7452A17j05m0J98k93J53o5p5J83k8j07N3J5m8j27J39q7n4J05K59k42j37J63j78
7475b01L70j38k47M33k62M0J59j71J19l0j25N7p2J41J7N6k62J08J99k80L9J41
$$ plain form
7497 91 46 -86 -26 56 -222 -138 141 -191 63 -125 171 -79 100 -85 -45 -44 -21 272 323 183 8 171 -120
7520 -120 -184 11 215 110 -36 121 75 102 -34 39 252 56 -136 214 -39 29 -188 22 127 5 -111 -78
7542 -78 10 -38 -194 -193 -100 -104 -184 -139 131 -149 -391 -25 -139 -91 133 -41 -192 134 -253 -104 -95 -26 110 37 287
7567 287 115 -144 112 6 55 47 -22 151 -78 -51 105 62 86 -62 -20 10 -119 267 88 26 -71 36 -101 -222
7591 -222 121 89 135 -37 208 1 -69 34 136 94 -178 -52 -120 -7 -13 207 -66 94 42 -79 -91 93 -26
7614 -26 169 -58 15 3 5 -40 -183 103 -274 163 170 16 76 36 -75 -81 -80 -44 17 83 190 -156 66 20 -68 -6 148
7641 148 30 -8 -99 -184 139 -81 43 -51 74 202 195 -7 75 -94 48 -95 -107 -8 39 35 112 201 115 30 118 -43
7667 -43 -232 90 -3 -124 193 304 116 35 104 -29 -35 -305 -11 28 50 37 -153 -56 51 234 294 72 -126 41
$$ packed form
7497I1m5j32O0Q2k78Q4K79l32K54j88K96k50J79j85M0JK3K93N1j40j75J63k91
7520a20o4J95K04j05j46J57m6K7j36P3K13j96j92L50k53O8k17K10J05j22j16L3
7542g8Q8m8j56JR3mq0M5K70k80k42L66j14M8K24j74j51L26l87J49RO9J36p3K50
7567B87j72k59K56j06M9qo9J73k29K7J56m3K4j48M2L0j29L86j79o2r7J07j37j21
7591b22L43l2M6j72K45k07p0J03J02m2k72J26o8J13oK20k73J60n2j21j2J84j19
7614b6J95k27P3j2Km5j43K86l77M37Pj54O0m0j11oJL6O1O6J07l46K22m6q8O2J54
7641A48j18l8r1q5L23k20J24r4J25J28pk02Q2j69J42j43j2R9M7mP7Q9q6q5Q8j61
7667d3j89L22r3j21L17J11j88q1O9j33ok70K94L9K2j3j90R7J07J83O0k22j98J67
$$ plain form
7691 41 -381 -20 104 -31 -20 -117 14 -39 350 -47 -282 -91 -322 26 -84 175 12 36 203 -102 112 168
7713 168 146 10 97 -49 272 108 49 -126 39 109 -64 -176 108 -45 6 -167 -156 276 18 84 -125 -161 -184
7736 -184 70 -86 69 -127 -160 -185 -73 48 92 72 208 -83 4 -11 63 191 77 31 -48 111 -128 52 -66
7759 -66 184 -237 80 -142 -240 66 124 154 -53 -167 -98 -91 -80 52 58 21 -101 -78 -111 3 41 48 90 -55 -68 -123
7785 -123 -45 12 5 123 -8 -143 109 -11 43 -186 87 -234 196 -30 40 19 -16 224 -122 -99 160 -59 -334
7808 -334 7 -30 -196 -146 -57 -15 -44 -192 41 147 -130 -144 219 -142 99 149 -79 -131 -16 -142 200 204 352
7831 352 198 -129 -36 388 -27 46 135 47 135 85 100 28 -9 27 -98 -72 -77 82 -8 149 -6 -135 123 56 -272
7856 -272 87 -53 -32 -50 6 136 -37 94 -26 59 274 -27 -56 29 -70 82 -85 38 173 -53 -180 204
$$ packed form
7691D1m22L61J24j35J1r7J31n3L89l97k35J91k31L48j10K59j63K4J67l05K14N6
7713A68k2j36Q7j46L21j64n9j75J65P0j73j12K84j53N1j73J1M32k58O6k09l6k3
7736a84K54j56J55j96l3k5J12J21M4k0J36k91Q7j5P4J28j14m6p9J59k39J80j18
7759f6K50m21L17k22r8L06N8L0k07j14O9PJ1J32Ol7j22K3l3J14L8PM2j45j3n5
7785a23P8N7pJ18j31j35K52j20N4k29K73l21M30k26P0k1l5K40l46K3K59k19k75
7808c34L41l7j66N0Q9M2k9j48K33J06k77j4L63l61K41N0k28n2J15j26L42MJ48
7831C52j54l27R3M24m15P3Q9q8Q8n0J5p2l7L6j25K6nJ59r0J57j55j29K58o7l28
7856b72L59j40K1j8N6J30j73J31j20Q5K15l01k9Q5r9J52j67J23J35k26j27L84
$$ plain form
7878 204 373 136 133 71 -27 -154 56 160 158 133 -171 -52 -36 194 170 75 0 151 15 215 160 -60 103 2
7902 2 -19 -24 164 119 -75 -16 141 46 7 -77 4 74 123 -152 40 -103 -119 -29 -26 -162 10 -8 21 121 25 -34 -10
7929 -10 120 -194 43 24 -142 -44 214 56 130 20 -143 19 -283 20 -91 -266 -83 -58 -10 62 52 -81 215
7952 215 84 60 -95 -96 48 39 -60 336 26 -90 70 90 -53 -12 -143 133 -57 75 -87 -33 -155 61 -62
7975 -62 -247 188 109 -182 21 93 62 -87 -12 42 96 58 6 -64 46 -124 25 186 -202 15 -104 98 -85
7998 -85 -20 -119 375 -4 9 119 78 -139 47 124 169 2 151 87 105 32 -84 256 -34 149 -268 -100 -31 8
8022 8 -80 -197 80 -166 139 70 -20 -117 -12 55 246 117 64 100 -64 -175 32 158 110 40 125 -49 -114 -167 54
8047 54 -98 96 126 -152 -8 -170 110 2 133 145 -74 157 -25 36 144 -150 31 -150 101 123 -51 18
$$ packed form
7878B04J69k37lo2r8j27K10J04kk5l04J19J6K30k4r5p5J51j36K00n5k20J63j01
7902Bk1nJ88m5j94N9J57r5l9q4Q1P0M9k75J92j43j6R0Lj36J72j8K9J00r6n9K4
7929a0J30l14K37j9j66R8K58j58P4j10j63J62l02L03j11j75J83K5M8P2j0j33K96
7952B15j31k4j55jJ44rr9L96l10j16J60K0j43M1j31K76j90J32j62N4j22K16j23
7975f2j85M35p9k91K03P2l1j49P5N4N4l8n2p0J10j70J49J61l88K17j19K02j83
7998h5O5r9M94l79J3J10m1k17J86P7M5j67J49o4J8p3j16L40k90J83m17J68O9L9
8022Hq8j17K77k46L05o9r0r7J05O7J91j29n3L6j64j11K07J26m8p0Q5j74o5n3K21
8047E4j52J94L0k78J44j62K80j08J31J2k19K31j82O1J08k94J81j81K51K2j74O9
$$ plain form
8069 18 8 297 50 111 -31 46 -162 154 46 6 207 2 -93 63 80 83 43 -194 31 -114 106 -3 -13 -271
8093 -271 -16 -48 -37 -133 44 1 10 -101 -187 139 -120 268 -48 -116 -29 58 285 -200 199 181 -100 -217 -39 160
8117 160 91 6 -43 96 -113 -63 87 -7 117 133 -68 16 -58 -11 56 -118 93 9 -92 -31 -115 17 -99 21
8141 21 -62 -156 -51 47 112 48 19 48 255 -172 5 -48 112 90 122 -46 -59 243 75 -103 -59 -55 37 -72 152
8166 152 -44 366 -2 40 -46 -19 134 47 32 -46 -26 71 -132 82 70 106 198 -188 7 -88 -122 34 73 -39 -174
$$ packed form
8069A8j0K89k47O1j42P7k08L16j08m0K01k05r5J56J7Lm0k37K25j45K20j09j0k58
8093b71K55l2J1r6J77m3Rj11q6L26k59L88l16o8Q7Q7K27m85L99j8k81j17J78J99
8117A60o9q5m9J39k09N0J50r4J24J6k01Q4p4M7O7j74K11q4j01O1q4J32j16J20
8141B1q3r4J05R8O5o4k9K9K07m27J77n3J60k2L2j68j3L02j68j78M4MR2j09K24
8166A52j96M10l68M2q6K7J53q7j5p8K0R7k03K14j2L6R2l86J95r5l4J56L9j12j35
8191a74
$$ Imaginary data points
##PAGE= N=2
##DATA TABLE= (X++(I..I)), XYDATA
$$ plain form
0 0 0 0 0 0 0 0 0 0 0 0 0 0 0 0 0 0 -8 8 -8 8 -8 16 -16 16 -24 24 -32 32 -40 44 -49 57 -65 73 -83 95 -105 120
38 120 -133 149 -165 183 -204 225 -248 275 -303 334 -369 406 -447 493 -544 599 -664 734 -816
57 -816 907 -1015 1144 -1294 1481 -1716 2025 -2445 3059 -4048 5904 -10664 54712 86800 35702
72 35702 21200 1392 14739 29581 55349 69303 76541 61266 43024 14571 -2826 -15968
84 -15968 -11995 492 15621 29065 35022 30112 18333 3970 -9558 -16284 -12178 -4749 10114
97 10114 20726 29704 29762 25629 18290 10881 8205 10819 18157 27012 38594 43860 46231 45283 38508
112 38508 35083 30668 31497 33980 39603 44808 47673 47768 44888 40274 33068 30365 26318 26391 28095 28630
128 28630 29998 28537 25735 20188 15999 10990 8256 6958 6505 8204 7281 8299 5896 3379 1078
$$ packed form
0@%%%%%%%%%%%%%%%%qJ6j6J6j6K4l2L2m0M8n6O4p2Q4r3J06j22J38j56J78k00K25
38A20k53K82l14L48l87M29m73N23n78O37p03P75q53R40j037J143j263J398j550
57h16J723j922K159k438K775l197L741m470N504p107R952j6568O5376L2088n1098
72C5702j4502j9808J3347J4842K5768J3954P238j5275j8242k8453j7397j3142
84a5968L973J2487J5129J3444N957m910j1779j4363j3528o726M106P429J4863
97A0114J0612Q978N8m133p339p409k676K614P338Q855J1582N266K371r48o775
112C8508l425m415Q29K483N623N205K865R5k880m614p206k703m047P3J704N35
128B8630J368j461k802n547m189n009k734j298m53J699r23J018k403k517k301
$$ plain form
143 1078 -1584 -3264 -3040 -1245 -936 1989 2356 3204 2816 2464 2683 1749 3836 4685 6793 9027 10907
160 10907 11095 11821 12256 10822 12033 11433 12427 13162 14362 14795 14160 14355 12659 11800 10486 10281 8730 8586
178 8586 8780 6985 7191 5132 3954 2026 1178 -471 -1565 -1593 -2995 -2838 -4348 -4144 -6056 -6233 -6572
195 -6572 -7984 -7157 -7629 -7160 -7516 -6181 -7128 -6441 -5893 -6700 -5413 -5545 -4030 -4343 -3282 -2361 -2205 -1602
213 -1602 -1328 -998 -1380 -37 -738 238 485 391 675 141 611 -434 -299 -436 -1022 -1316 -1288 -2027 -3165 -2439
233 -2439 -3938 -4186 -4775 -5684 -6008 -6511 -6755 -7630 -7497 -8575 -8454 -9508 -9623 -9711 -10468 -10032 -10970 -10915 -10995 -10998 -11586
254 -11586 -11334 -11098 -11984 -11267 -11933 -11364 -11883 -11429 -11508 -11791 -10962 -11678 -11247 -11565 -10773 -11464 -10685 -10529 -10995 -10150
274 -10150 -10774 -10231 -10504 -9805 -9936 -9718 -9291 -9467 -8914 -8917 -8015 -8896 -7951 -7716 -8018 -7001 -7508 -6929 -7033 -6448
$$ packed form
143A078k662j680K24J795L09K925L67Q48l88l52K19r34K087Q49K108K234J880
160A0907J88P26M35j434J211o00R94P35J200M33o35J95j696q59j314k05j551j44
178H586J94j795K06k059j178j928q48j649j094k8j402J57j510K04j912j77l39
195f572j412Q27m72M69l56J335r47O87N48q07J287j32J515l13J061R21J56O03
213a602K74L30l82J343p01R76K47r4K84n34M70j045J35j37n86k94K8p39j138P26
233b439j499k48n89r09l24n03k44q75J33j078J21j054j15q8p57M36r38N5q0ln88
254a1586K52K36q86P17o66N69n19M54p9k83Q29p16M31l18P92o91P79J56m66Q45
274a0150o24N43k73O99j31K18M27j76N53lR02q81R45K35l02J017n07N79j04N85
$$ plain form
294 -6448 -6797 -6499 -6465 -6544 -6192 -6319 -6006 -6818 -6395 -6677 -6892 -7162 -7574 -7596 -8449 -8030 -9118 -9326 -9968 -10232 -10480
315 -10480 -11413 -11167 -12457 -12620 -12997 -13243 -14038 -14282 -14230 -15104 -14631 -15761 -15239 -15094 -15060 -15098 -14944 -14769 -14977 -13788
335 -13788 -13763 -13091 -12875 -12241 -11629 -11408 -10363 -10221 -8926 -8598 -8089 -7498 -6821 -6105 -5855 -4936 -4809 -3813 -4177
354 -4177 -3182 -3206 -3195 -2703 -3091 -2887 -3133 -2953 -3580 -3257 -3680 -4787 -4621 -5111 -5542 -6227 -6727 -7273 -7768 -8097
374 -8097 -8700 -9039 -9597 -9634 -10453 -10316 -10780 -11095 -10994 -11352 -10814 -11512 -10793 -11181 -10715 -10010 -10185 -9737 -9463 -8529
394 -8529 -8536 -7398 -7133 -6629 -5981 -5400 -4803 -4367 -3636 -3426 -2613 -2199 -1997 -1818 -1576 -1133 -1564 -723 -979 -1131
414 -1131 -1184 -1249 -1351 -1781 -1872 -2716 -2314 -3030 -2978 -3459 -3929 -4188 -4775 -4267 -4915 -5053 -5593 -5467 -5653 -6000 -5533
435 -5533 -6065 -5863 -5749 -5536 -5476 -5153 -4737 -4769 -4184 -4077 -3221 -3289 -2247 -2196 -1694 -645 -627 -223 141 611 649
$$ packed form
294f448l49K98L4p9L52j27L13q12M23k82k15k70m12k2q53M19j088k08o42k64k48
315a0480r33K46j290j63l77k46p95k44N2q74M73j130N22J45L4l8J54J75k08J189
335a3788K5O72K16O34O12K21J045J42J295L28N09N91O77P16K50R19J27R96l64
354d177R95k4J1M92l88K04k46J80o27L23m23j107J66m90m31o85n00n46m95l29
374h097o03l39n58l7q19J37m64l15J01l58N38o98P19l88M66P05j75M48K74R34
394h529pJ138K65N04O48N81N97M36P31K10Q13M14K02J79K42M43m31Q41k56j52
414a131n3o5j02m30r1q44M02p16N2m81m70k59n87N08o48j38n40J26j86l47M67
435e533n32K02J14K13O0L23M16l2N85J07Q56o8J042N1N02J049J8M04L64M70L8
$$ plain form
456 649 1331 1654 1844 2155 2071 2474 2133 2628 2458 2377 2359 1974 1866 1562 1549 787 1040 379 -45 43 -335 -796
478 -796 -1409 -1474 -1892 -2080 -2441 -2341 -2926 -3069 -2856 -3340 -2974 -3033 -2881 -2624 -2706 -2313 -2384 -1524 -1860 -967 -949 -397
500 -397 -196 322 1090 947 1869 2048 2351 2977 3301 3547 3735 4337 4054 4856 4785 5049 4896 5001 5402 4935 5312
521 5312 5084 4990 4365 4917 4459 4215 4067 3491 3346 3059 3062 2624 2305 1828 1528 1898 1318 994 723 923 496
542 496 825 731 312 491 365 430 259 614 487 644 695 904 1150 1021 1434 1410 1790 2018 1918 2341 2505 2627
564 2627 2472 3196 2968 3272 3289 3400 3712 3436 3951 3828 3699 3701 3706 3697 3810 3843 3595 3907 3759 3718 3574 3696 3685
587 3685 3437 3716 3449 3396 3411 3146 3058 3126 3403 3108 3310 2802 2950 2647 2813 2948 2702 2887 2840 2707 2685 2688 2311
610 2311 2574 2652 2000 2237 2211 2178 2103 2202 2001 1847 1971 1655 1789 1699 1957 1353 1727 1391 1436 1608 1619 1274 1185
$$ packed form
456F49O82L23J90L11q4M03l41M95j70q1j8l85j08l04j3p62K53o61m24Q8l78m61
478g96o13o5m18j88l61J00n85j43K13m84L66n9J52K57q2L93p1Q60l36Q93J8N52
500c97K01N18P68j43R22J79L03O26L24K46J88O02k83Q02p1K64j53J05M01m67L77
521E312k28r4o25N52m58k44j48n76j45k87Lm38l19m77l00L70n80l24k71K00m27
542D96L29r4m19J79j26O5j71L55j27J57N1K09K46j29M13k4L80K28j00M23J64J22
564B627j55P24k28L04J7J11L12k76N15j23j29KNrJ13L3k48L12j48m1j44J22j1
587C685k48K79k67n3J5k65q8O8K77k95K02n08J48l03J66J35k46J85m7j33k2Ll77
610B311K63P8o52K37k6l3p5R9k01j54J24l16J34r0K58o04L74l36M5J72J1l45q9
$$ plain form
633 1185 1430 1138 1342 1405 1135 1350 1297 1400 1093 1669 1277 1331 1488 1455 1493 1429 1528 1414 1616 1381 1668 1686 1694
656 1694 1730 1639 1988 1734 1603 1933 1671 1585 1573 1665 1413 1613 1558 1143 1412 1310 1288 1244 1419 933 1189 768 980
679 980 791 541 862 150 329 367 429 53 321 449 17 365 -209 -234 -222 -459 -384 -538 -159 -562 -193 -765
701 -765 -1003 -1088 -907 -904 -1063 -910 -1350 -845 -1066 -1129 -1331 -1240 -1029 -1273 -1292 -1410 -1191 -1553 -1308 -1314 -1350 -1149 -1555
724 -1555 -1397 -1519 -1192 -1262 -1211 -1147 -1215 -1135 -1388 -988 -1319 -1030 -1060 -879 -1047 -1255 -1039 -1058 -753 -1287 -1098 -1177 -1175
747 -1175 -1356 -1309 -1024 -1525 -1247 -1235 -1549 -1405 -1364 -1419 -1699 -1655 -1922 -1763 -2076 -2091 -2155 -2205 -2281 -2430 -2267 -2536 -2394
770 -2394 -2439 -2773 -2845 -2971 -2921 -2711 -2910 -2962 -3130 -2914 -2918 -3048 -3093 -3151 -3259 -3113 -3264 -3151 -3304 -3228 -3179 -3352 -3104
793 -3104 -3365 -3150 -3260 -3311 -3005 -3181 -2993 -3121 -3130 -2948 -3079 -2802 -2854 -2800 -2928 -2800 -2904 -2514 -2680 -2622 -2773 -2611
$$ packed form
633A185K45k92K04O3k70K15n3J03l07N76l92N4J57l3L8o4R9j14K02k35K87J8Q
656A694L6r1L49k54j31L30k62q6j2R2k52K00n5m15K69j02k2m4J75m86K56m21K12
679I80j89k50L21p12J79L8O2l76K68J28m32L48n74k5J2k37P5j54L79m03L69n72
701g65k38q5J81Lj59J53m40N05k21o3k02R1K11k44j9j18K19l62K45ol6K01m06
724a555J58j22L27p0N1O4o8Q0k53M00l31K89l0J81j68k08K16j9L05n34J89p9K
747a175j81M7K85n01K78J2l14J44M1n5k80M4k67J59l13j5o4n0p6j49J63k69J42
770b394m5l34p2j26N0K10j99n2j68K16mj30m5n8j08J46j51J13j53P6M9j73K48
793c104k61K15j10n1L06j76J88j28rJ82j31K77n2N4j28J28j04L90j66N8j51J62
$$ plain form
815 -2611 -2526 -2470 -2468 -2469 -2425 -2582 -2421 -2190 -2212 -2277 -2351 -2168 -2587 -2461 -2565 -2126 -2344 -2376 -2577 -2622 -2293 -2844 -2506 -2786
839 -2786 -2482 -2687 -2802 -3132 -3216 -3236 -3419 -3112 -3325 -3465 -3387 -3678 -3494 -3951 -3727 -3933 -3792 -3961 -3753 -3919 -4222
860 -4222 -3714 -3771 -3733 -3728 -3727 -3903 -3804 -3590 -3645 -3263 -3497 -3312 -3245 -3242 -2960 -3147 -2771 -2874 -2557 -2865 -2377 -2445 -2369 -2120
884 -2120 -2096 -1989 -2020 -1816 -2030 -1835 -1992 -1813 -1748 -1943 -1618 -1905 -1493 -1903 -1668 -1818 -1936 -1914 -2060 -2107 -2259 -2035
906 -2035 -2335 -2376 -2484 -2453 -2508 -2368 -2216 -2541 -2372 -2631 -2537 -2747 -2431 -2569 -2842 -2566 -2739 -2572 -2733 -2742 -2756 -2591
928 -2591 -2396 -2703 -2240 -2355 -2350 -2209 -2059 -2083 -2284 -1720 -1888 -1821 -1779 -1672 -1691 -1855 -1391 -1614 -1401 -1525 -1462 -1580
950 -1580 -1494 -1543 -1410 -1142 -1481 -1001 -1467 -1217 -1312 -1404 -846 -1310 -1213 -1137 -887 -1026 -1082 -1184 -1002 -867 -774 -911 -576
973 -576 -608 -785 -638 -721 -807 -409 -706 -562 -458 -574 -287 -321 -467 -419 -265 -632 -266 -339 -317 -247 -251 -265 -263 -326 -473
$$ packed form
815b611Q5N6KjM4j57J61K31k2o5p4J83m19J26j04M39k18l2k01m5L29n51L38k80
839b786L04k05j15l30q4k0j83L07k13j40P8k91J84m57K24k06J41j69K08j66l03
860d222N08n7L8NJj76R9K14n5L82k34J85O7LK82j87L76j03L17l08M88o8P6K49
884b120K4J07l1K04k14J95j57J79O5j95L25k87M12m10K35j50j18K2j46m7j52K24
906b035l00m1j08L1n5J40J52l25J69k59R4k10L16j38k73K76j73J67j61rj4J65
928b591J95l07M63j15NJ41J50k4k01N64j68O7M2J07j9j64M64k23K13j24O3j18
950a580Q6m9J33K68l39M80m66K50r5r2N58m64R7P6K50j39n6j02J82J35R3j37L35
973e76l2j77J47q3q6L98k97J44J04j16K87l4j46M8J54l67L66p3K2P0mj4Ko3j47
$$ plain form
998 -473 -152 -329 -245 -212 -399 -275 -675 -263 -649 -583 -640 -729 -471 -534 -696 -610 -516 -643 -419 -519 -496 -452 -462 -37
1022 -37 -189 -78 -351 -78 -123 -9 113 119 188 107 412 337 628 233 497 859 690 892 809 825 849 945 1081 1015
1046 1015 1227 1220 1202 1224 1415 1201 1149 1095 1332 1136 1224 1182 1085 1315 1102 1149 1640 871 683 1044 963 869 918 975
1070 975 743 954 1027 1127 916 1091 828 816 782 737 928 819 584 574 725 1013 613 926 719 858 813 915
1092 915 872 877 820 804 874 761 1043 783 999 942 1107 1254 1143 1368 1327 1230 1218 1398 1331 1509 1621 1747 1792 1774
1116 1774 1945 1921 1866 1868 2087 2025 2088 2387 2158 2143 2168 2087 2305 1891 1926 1868 1901 1950 2077 1793 1968 1805 1460 1760
1140 1760 1786 1645 1667 1349 1247 1666 1200 1207 1484 1165 1187 1279 1002 1113 960 1166 873 1123 1264 991 1042 1092
1162 1092 1176 1030 1271 1300 1263 1404 1432 1430 1166 1165 1253 1563 1317 1698 1610 1669 1893 1709 1856 1644 1778 1794 1894 1557
$$ packed form
998d73L21j77Q4L3j87J24m00M12l86O6n7q9K58o3j62Q6R4j27K24j00K3M4j0M25
1022c7j52J11k73K73m5J14J22OO9q1L05p5K91l95K64L62j69K02q3J6K4R6J36o6
1046A015K12pj8K2J91k14n2n4K37j96Q8m2r7K30k13M7M91p69j88L61q1r4M9N7
1070I75k32K11P3J00k11J75k63j2l4m5J91j09k35j0J51K88m00L13k07J39m5J02
1092I15m3Nn7j6P0j13K82k60K16n7J65J47j11K25m1r7j2J80o7J78J12J26M5j8
1116A774J71k4n5KK19o2O3K99k29j5K5q1K18m14L5n8L3M9J27k84J75j63l45L00
1140A760K6j41K2l18j02M19m66PK77l19K2R2k77J11j53K06k93K50J41k73N1N0
1162A092Q4j46K41K9l7J41K8kk64jQ8L10k46L81q8N9K24j84J47k12J34J6J00l37
$$ plain form
1186 1557 1907 2085 1841 1816 1654 1660 1630 1845 1804 1593 1742 1735 1753 1665 1707 1630 1463 1474 1443 1310 1591 1488 1484 1463 1354
1211 1354 1215 1254 1458 1365 1306 1278 1280 1282 1103 1380 1353 1064 1411 1107 1023 1303 1228 1309 1149 1145 1204 948 950 1270 1298 1069
1237 1069 975 1020 1066 984 900 967 1038 1025 987 836 993 933 785 930 622 902 804 1043 895 888 985 768 940 720
1261 720 742 635 985 971 796 878 836 993 1177 1026 1097 874 1016 1225 1167 1069 1143 931 1171 1209 1103 1143 1286
1284 1286 1140 1175 1273 1005 1098 785 947 945 715 852 977 956 683 907 687 392 632 618 214 292 194 258 309
1307 309 167 49 -12 -27 20 -149 -2 43 198 157 60 285 216 302 200 344 158 184 143 89 357 82 294 409
1331 409 384 212 170 240 354 634 461 408 560 619 669 396 416 314 317 406 406 429 234 477 457 257 334 310 268 165
1357 165 267 315 184 193 36 27 58 245 -54 53 105 -126 -108 124 -159 -122 82 -159 -157 -106 -174 -60 -308 -129
$$ packed form
1186A557L50J78k44k5j62Ol0K15m1k11J49pJ8q8M2p7j67J1l1j33K81j03mk1j09
1211A354j39L9K04r3n9k8KKj79K77k7k89L47l04q4K80p5Q1j60mN9k56KL20K8k29
1237A069r4M5M6q2q4O7P1j3l8j51J57o0j48J45l08K80r8K39j48pR7k17J72k20
1261G20K2j07L50j4j75Q2m2J57J84j51P1k23J42K09n8r8P4k12K40L8j06M0J43
1284A286j46L5R8k68R3l13J62kk30J37J25k1k73K24k20k95K40j4m04P8r8O4N1
1307C09j42j18o1j5M7j69J47M5J55m1r7K25o9Q6j02J44j86K6m1n4K68k75K12J15
1331D09k5j72m2P0J14K80j73n3J52N9N0k73K0j02LQ9%K3j95K43k0k00P7k4m2j03
1357A65J02M8j31Rj57rL1J87k99J07N2k31J8K32k83L7K04k41KN1o8J14k48J79
$$ plain form
1381 -129 -240 -273 -408 -367 -530 -205 -446 -162 -566 -281 -481 -212 -242 -263 -256 -179 -287 -314 -187 -506 -260 -155 -476
1404 -476 -177 -227 -262 -274 -192 -298 -139 -289 -40 -316 -122 -287 17 -186 -375 -69 105 -151 24 -133 -13
1425 -13 -221 -224 -52 -175 213 -159 -74 -231 -255 -210 3 -18 -144 -193 -28 -100 -126 -445 -144 -401 -3 -442 -308
1448 -308 -173 -475 -194 -527 -192 -301 -426 -653 -496 -522 -554 -345 -653 -502 -618 -380 -573 -527 -608 -602 -783 -433
1470 -433 -446 -682 -306 -397 -360 -308 -306 -340 -646 -233 -359 -355 -329 -175 -360 44 57 -165 -134 -286 28 -252 -296 -136
1494 -136 24 -117 -306 64 195 -137 -165 -104 94 -97 -113 -255 -128 37 -63 -280 -58 73 -90 -153 16
1515 16 121 -161 -129 -257 -36 -189 -315 -280 -67 -137 -275 -160 -360 -252 -242 -225 -262 -375 -444 -401 -456 -260 -539
1538 -539 -266 -171 -444 -402 -286 -247 -428 -350 -191 -210 -397 -371 36 -31 -294 -104 -66 -8 -130 -199 123 22 -173
$$ packed form
1381a29j11l3j35M1j63L25k41K84m04K85k00K69l0k1PP7j08k7J27l19K46J05l21
1404d76K99n0l5j2Q2j06J59j50K49k76J94j65L04k03j89L06J74k56J75j57J20
1425a3k08lJ72j23L88l72Q5j57k4M5K13k1j26m9J65p2k6l19L01k57L98m39J34
1448c08J35l02K81l33L35j09j25k27J57k6l2K09l08J51j16K38j93M6q1Oj81L50
1470d33j3k36L76r1L7N2Kl4l06M13j26MK6J54j85M04J3k22L1j52L14k80m4J60
1494a36J60j41j89L70J31l32k8O1J98j91j6j42J27J65j00k17K22J31j63o3J69
1515A6J05k82L2j28K21j53j26L5K13p0j38J15k00J08J0J7l7j13o9M3n5J96k79
1538e39K73R5k73M2J16L9j81P8J59j9j87K6M07o7k63J90L8N8j22o9L22j01j95
$$ plain form
1561 -173 149 -109 30 -169 -77 38 336 166 96 -24 279 283 228 122 214 359 51 300 181 446 396 104
1583 104 124 -101 108 181 55 62 283 -123 -12 -73 69 29 19 253 -239 -17 56 -6 32 269 63 -48 6 -51
1607 -51 177 -116 12 -116 -76 147 -284 16 334 -204 64 7 1 73 -30 -23 -20 74 40 162 3 185 46 176
1631 176 -32 125 257 88 92 189 -57 354 223 138 189 306 485 54 330 212 165 229 215 472 166 141 406
1654 406 605 199 332 420 388 340 387 443 67 181 297 364 363 418 409 278 421 163 356 446 498 272 367 86 255
1679 255 311 208 -9 -22 226 201 330 260 211 98 327 65 241 107 191 146 148 179 0 136 29 140 251
1702 251 451 338 98 299 256 338 133 384 154 175 249 558 474 298 521 307 331 465 411 488 549 789 571
1725 571 588 462 499 664 379 484 413 308 562 624 359 441 459 334 270 442 112 589 242 388 124 320
$$ packed form
1561a73L22k58J39j99R2J15K98j70p0j20L03Mn5j06R2J45l08K49j19K65n0k92
1583A04K0k25K09P3j26PK21m06J11o1J42m0j0K34m92K22P3o2L8K37k06j11N4n7
1607e1K28k93J28j28M0K23m31L00L18n38K68n7oP2j03PLR4l4J22j59J82j39J30
1631A76k08J57J32j69MR7k46M11j31q5N1J17J79m31K76j18m7O4j4K57l06k5K65
1654D06J99m06J33Q8l2m8M7N6l76J14J16O7jN5rj31J43k58J93R0N2k26R5k81J69
1679B55N6j03k17j3K48k5J29p0m9j13K29k62J76j34Q4m5KL1j79J36j07J11J11
1702B51K00j13k40K01m3Q2k05K51k30K1P4L09q4j76K23k14K4J34n4P7O1K40k18
1725E71J7j26L7J65k85J05p1j05K54O2k65Q2J8j25o4J72l30M77l47J46k64J96
$$ plain form
1747 320 302 173 235 516 73 262 191 19 128 160 53 -97 268 148 34 -23 -97 -74 -64 76 223 -29 112
1770 112 202 296 49 -40 -41 79 -20 138 96 355 153 -126 -41 294 235 119 170 344 288 70 176 89 358 179
1794 179 14 -29 259 367 129 99 268 452 117 289 148 271 45 156 110 134 175 372 34 185 328 106
1816 106 -2 57 81 205 -136 -14 -61 1 -306 77 55 -305 -48 -156 71 55 5 137 -183 -236 -55 -274 -183
1839 -183 -46 -255 -88 -57 -150 107 -335 -248 -285 94 -167 39 -175 -251 -171 -122 73 -17 -209 -209 59 -341 -166
1862 -166 -30 -15 -333 -78 26 -112 3 -266 -84 -11 -182 -49 133 -226 -49 -148 75 2 75 101 -181 -229
1884 -229 -40 -173 -49 -152 32 -155 -236 -127 -261 -42 -206 -66 -127 -56 -153 -189 -421 -408 -326 -362 -305 -294 -335 -220
1908 -220 -384 -19 -359 -358 -232 -267 -531 -448 -479 -529 -326 -212 -443 -378 -267 -392 -524 -163 -241 -309 -361 -341 -546 -355
$$ packed form
1747C20j8j29O2K81m43J89p1j72J09L2j07j50L65j20j14n7p4K3J0J40J47k52J41
1770A12R0R4k47q9jJ20r9J58m2K59k02k79Q5L35n9j16N1J74n6k18J06q7K69j79
1794A79j65m3K88J08k38l0J69J84l35J72j41J23k26J11m6K4M1J97l38J51J43k22
1816A06j08N9K4J24l41J22m7O2l07L83k2l60K57j08K27j6n0J32l20n3J81k19R1
1839a83J37k09J67L1r3K57m42Q7l7L79k61K06k14p6Q0M9J95r0j92%K68m00J75
1862a66J36J5l18K55J04j38J15k69J82P3j71J33J82l59J77r9K23p3P3K6k82m8
1884b29J89j33J24j03J84j87q1J09j34K19j64J40o1P1r7l6k32J3Q2l6N7J1m1J15
1908b20j64L65l40JJ26l5k64Q3l1n0K03J14k31O5J11j25j32L61p8o8n2K0k05J91
$$ plain form
1932 -355 -444 -294 -361 -392 -158 -162 -216 -296 -337 -420 -453 -478 -288 -166 -401 -249 -287 -171 -13 -337 -176 -213 -222 -79 -266
1957 -266 -206 -253 -363 -291 -229 -368 -440 -482 -372 -403 -333 -215 -513 -176 -480 -414 -557 -234 -367 -134 -402 -593 -374
1980 -374 -442 -518 -227 -304 -580 -372 -432 -708 -542 -709 -573 -518 -501 -408 -607 -591 -549 -585 -290 -552 -245 -595 -551 -541
2004 -541 -534 -604 -469 -480 -456 -691 -530 -277 -541 -326 -556 -447 -313 -297 -229 -442 -369 -334 -515 -265 -136 -63 -213
2027 -213 -221 -372 -412 -347 -218 -397 -401 -172 -232 -318 -490 -334 -334 -387 -276 -334 -241 -211 50 -256 -376 -310 -181 -495 -526
2052 -526 -286 -372 -377 -393 -226 -519 -312 -340 -648 -205 -326 -521 -496 -251 -378 -580 -299 -394 -531 -500 -252 -554 -253
2075 -253 -461 -209 -265 -256 -313 -323 -211 11 -348 -454 -152 -209 -268 -79 -410 -185 12 -230 -226 -391 -355 -177 -226 -213
2099 -213 -224 -55 -25 -82 -214 -47 -186 -142 -260 -15 -312 78 -416 -164 -102 -440 -369 -126 -261 -136 35 -214
$$ packed form
1932c55q9J50o7l1K34mn4q0m1q3l3k5J90J22k35J52l8J16J58l24J61l7rJ43j87
1957b66O0m7j10P2O2j39p2m2J10l1P0J18k98L37l04O6j43L23j33K33k68j91K19
1980c74o8p6K91p7k76K08o0k76J66j67J36N5J7R3j99J6M2l6K95k62L07l50M4J0
2004e41Pp0J35j1K4k35J61K53k64K15k30J09J34J6O8k13P3L5j81K50J29P3j50
2027b13qj51m0O5J29j79mK29o0q6j72J56%n3J11n8R3L0K61l06j20O6J29l14l1
2052e26K40q6nj6J67k93K07k8l08M43j21j95K5K45j27k02K81r5j37L1K48l02L01
2075b53k08K52n6Rn7j0J12K22l59j06L02n7n9J89l31K25J97k42Mj65L6J78m9J3
2099b13j1J69L0n7j32J67j39M4j18K45k97L90m94K52O2l38P1K43j35J25J71k49
$$ plain form
2121 -214 -57 -40 -158 -240 115 -230 -238 -14 -288 -286 13 -194 -190 -258 -203 -126 -328 -175 -404 30 -437 -138 -247 -337
2145 -337 -155 -277 38 -178 -43 -140 -276 -264 -172 -23 -56 66 -119 -120 -52 75 -66 -126 29 -4 -27 140 -204
2168 -204 -102 -110 -77 96 23 15 -45 48 166 30 228 119 -102 326 133 293 -109 217 104 120 163 150 229 -82
2192 -82 -202 135 52 2 -35 82 -12 -146 240 -64 21 105 -124 177 -81 70 -50 -145 -92 102 -157 -3 -105
2215 -105 -40 -64 60 137 37 -13 27 57 62 81 75 6 107 98 42 301 325 176 95 64 176 131 57 -95 -60 212 345
2242 345 365 175 343 235 264 247 272 415 209 227 186 18 498 218 189 163 98 208 167 314 372 326 294 328 321
2267 321 125 237 136 101 304 390 10 113 239 42 -6 296 206 251 103 118 250 51 217 180 -90 -107 93
2290 93 31 275 -132 73 117 59 1 175 -54 225 322 116 285 11 110 -92 199 26 117 198 26 -125 120
$$ packed form
2121b14J57J7j18q2L55l45qK24k74KK99k07Mo8N5P7k02J53k29M34m67K99j09r0
2145c37J82j22L15k16J35r7j36J2R2J49l3J22j85jO8J27j41o0J55l3k3J67l44
2168b04J02qL3J73p3qo0R3J18j36J98j09k21M28j93J60m02L26j13J6M3j3P9l11
2192h2j20L37q3n0l7J17r4j34L86l04Q5Q4k29L01k58J51j20r5N3J94k59J54j02
2215a05O5k4J24P7j00n0M0L0NJ9oo9J01rn6K59K4j49q1l1J12m5p4j52L5K72J33
2242C45K0j90J68j08K9j7K5J43k06J8m1j68M80k80k9k6o5J10m1J47N8m6l2L4p
2267C21j96J12j01l5K03Q6l80J03J26j97m8L02r0M5j48J5J32j99J66l7k70j7K00
2290I3o2K44m07K05M4n8n8J74k29K79R7k06J69k74R9k02K91j73R1Q1j72j51K45
$$ plain form
2313 120 221 -9 200 153 18 13 -189 101 161 380 138 443 383 452 248 3 363 509 256 196 369 168
2335 168 303 359 281 273 46 430 312 106 448 353 65 42 247 63 188 212 -89 117 323 170 205 -19 130
2358 130 179 47 -72 17 315 192 157 -102 5 -26 354 -12 -8 -89 8 149 193 80 109 121 -33 106 116 -50
2382 -50 53 253 144 200 156 152 97 31 251 233 215 -54 306 382 39 278 203 275 220 -169 50 442 75 83 -35
2407 -35 308 305 218 140 17 16 262 250 94 283 167 -108 -72 56 190 132 -17 162 -85 88 8 6 309 200
2431 200 53 163 208 -32 -33 109 79 213 -199 -288 167 131 5 33 100 -73 103 191 -151 -79 45 30 72 41
2455 41 -11 -43 44 15 -219 -16 -100 -105 -168 -136 -106 136 102 138 84 53 -158 82 296 84 182 227 -233 108 299 -56
2481 -56 -84 208 84 -25 -185 172 148 -49 115 285 54 14 -93 -60 -41 67 102 159 -6 -33 -64 -52 -39 -102
$$ packed form
2313A20J01k30K09m7j35nk02K90O0K19k42L05o0O9k04k45L60J46k53o0J73k01
2335A68J35N6p8qk27L84j18k06L42r5k88k3K05j84J25K4l01K06K06j53L5k24J49
2358A30M9j32j19Q9K98j23l5k59J07l1L80l66Mq1R7J41M4j13K9J2j54J39J0j66
2382e0J03K00j09N6m4mn5o6K20j8j8k69L60P6l43K39p5P2n5l89K19L92l67Qj18
2407c5L43lq7p8j23jK46j2j56J89j16k75L6J28J34n8j49J79k47J73q0kL03j09
2431B00j47J10M5k40jJ42l0J34m12q9M55l6j26K8O7j73J76Q8l42P2J24j5M2l1
2455D1n2l2Q7k9k34K03q4no3L2L0K42l4L6n4l1k11K40K14k12R8M5m60L41J91l55
2481e6k8K92j24j09j60L57k4j97J64J70k31m0j07L3J9J08L5N7j65k7l1J2J3o3
$$ plain form
2505 -102 11 234 -8 91 -244 -36 44 11 -59 -185 1 -134 -176 -123 -333 -240 -160 -56 -213 -148 -2 -8 -101 75
2529 75 -315 -23 -238 -137 -260 108 -281 -16 99 -366 189 95 -156 88 159 15 -133 129 5 -10 -7 -38
2551 -38 -13 -173 -129 -168 -112 -20 -78 -272 -35 -91 74 -58 -54 100 39 124 -222 -80 69 -107 72 -271 101 -89
2575 -89 -184 74 38 59 -28 -86 -330 6 35 -168 -59 50 -85 -358 -159 -152 -362 -205 -278 -144 -102 20 -301 -191
2599 -191 -31 -189 29 -160 72 -79 -72 -188 -101 23 -265 -231 -90 -96 71 -112 -157 -11 79 -138 -167 51 -103
2622 -103 -167 126 48 -91 9 237 71 -56 4 -55 168 -199 -93 103 -90 -15 104 -6 250 62 191 -48
2644 -48 -13 -90 201 -64 -48 -96 -71 95 -212 -154 73 172 57 -36 -54 1 146 -237 -347 117 -236 -85 22 -226
2668 -226 -141 -105 97 -57 -99 -152 -61 -147 -334 -35 78 -122 -190 31 -3 -141 29 -116 -41 -134 -126 29 -67 26 -161
$$ packed form
2505a02J13K23k42R9l35K08Q0l3p0j26J86j35m2N3k10R3Q0J04j57O5J46or3J76
2529G5l90K92k15J01j23L68l89K65J15m65N55r4k51K44P1j44j48K62j24j5Ll1
2551c8K5j60M4l9N6R2n8j94K37n6J65j32MJ54o1Q5l46J42J49j76J79l43L72j90
2575h9r5K58l6K1q7n8k44L36K9k03J09J09j35k73J99Pk10J57p3J34M2J22l21J10
2599a91J60j58K18j89K32j51Pj16Q7J24k88L4J41oJ67j83m5J46R0k17k9K18j54
2622a03o4K93p8j39J00K28j66j27O0n9K23l67J06J96j93P5J19j10K56j88J29k39
2644d8L5p7K91k65J6m8K5J66l07N8K27R9j15r3j8N5J45l83j10M64l53J51J07k48
2668b26Q5L6K02j54m2n3R1q6j87K99J13k00o8K21l4j38J70j45P5r3QJ55r6R3j87
$$ plain form
2693 -161 100 -245 57 -63 271 81 4 13 68 31 -186 -54 237 -26 -64 132 5 6 43 29 -27 176 3 199
2717 199 229 -73 -143 233 25 -28 -148 220 183 97 71 62 93 -174 99 368 -173 116 -126 -97 89 -230 -108
2740 -108 9 -48 -167 -114 -91 36 37 87 -186 -72 -180 -98 60 -63 -259 9 21 83 -322 100 -30 69 175
2763 175 273 111 51 128 207 122 70 223 -4 108 229 144 160 206 122 210 143 12 186 305 109 106 224 123 183
2788 183 -28 267 -63 179 -24 155 332 142 60 347 -63 171 69 87 45 56 -7 111 -88 95 302 120
2810 120 -126 204 76 77 39 -263 -3 18 121 -17 -133 71 89 -109 378 64 88 197 89 82 202 -86 75
2833 75 -180 340 198 255 63 41 122 122 72 172 244 32 141 197 -118 202 159 224 53 54 138 289 123 249 91
2858 91 259 -92 145 150 144 176 -37 80 121 91 47 177 254 339 59 267 -163 32 57 258 143 -77 101 408
$$ packed form
2693a61K61l45L02j20L34j90p7RN5l7k17J32K91k63l8J96j27JL7j4n6K03j73J96
2717A99L0l02p0L76k08n3j20L68l7q6k6rL1k67K73K69n41K89k42K9J86l19J22
2740a08J17n7j19N3K3J27JN0k73J14j08Q2J58j23j96K68J2O2m05M22j30R9J06
2763A75R8j62o0P7P9q5n2J53k27J12J21q5J6M6q4Q8o7j31J74J19j96lJ18j01O0
2788A83k11K95l30K42k03J79J77j90q2K87m10K34j02J8m2J1o3J18j99J83K07j82
2810A20k46L30j28Jl8l02K60K1J03j38j16K04J8j98M87l14K4J09j08pJ20k88J61
2833G5k55N20j42N7j92k2Q1%n0J00P2k12J09N6l15L20m3O5j71JQ4J51j66J26j58
2858I1J68l51K37NoL2k13J17M1l0m4J30P7Q5k80K08m30J95K5K01j15k20J78L07
$$ plain form
2882 408 343 287 69 172 195 -21 136 132 295 9 162 8 -3 286 144 27 314 114 -4 104 211 205 60
2905 60 7 387 361 268 152 214 265 -160 223 190 -50 -32 89 -66 227 67 -171 59 219 108 -20 201 85
2928 85 82 202 8 113 140 261 256 -117 134 346 229 127 131 162 -98 69 66 63 -101 25 261 237 18 199 136
2953 136 233 103 25 -82 13 48 -150 -28 250 -237 15 -56 -26 -57 -150 10 -101 8 41 81 4 -242 183 54
2977 54 -7 48 60 1 -85 133 126 191 -57 217 -133 -29 123 65 -45 10 20 68 -118 162 10 35 87 -19 88
3002 88 137 -29 190 83 140 153 74 113 -159 -110 40 -16 -39 -177 106 173 -153 302 100 -181 118 105 47 49 -20
3027 -20 -36 43 -33 -131 -83 -50 1 -79 -34 -146 -119 -232 -344 121 132 -131 7 -208 168 17 -131 -18 -1 -109
3051 -109 76 61 -112 -136 -90 79 -49 86 -171 -187 -14 59 -5 49 -2 -205 25 -219 -91 -59 -13 3 29 -54
$$ packed form
2882D08o5n6k18J03K3k16J57mJ63k86J53j54j1K89j42j17K87k00j18J08J07oj45
2905F0n3L80k6r3j16O2N1m25L83l3k40J8J21j55K93j60k38K30J60j11j28K21j16
2928H5lJ20j94J05K7J21nl73K51K12j17j02ML1k60J67llj64J26K36k4k19J81o3
2953A36R7j30p8j07R5L5j98J22K78m87K52p1L0l1r3J60j11J09L3M0p7k46M25j29
2977E4o1N5J2n9q6K18pO5k48K74l50J04J52n8j10N5J0M8j86K80j52K5N2j06J07
3002H8M9j66K19j07N7J3p9L9k72M9J50n6k3j38K83O7l26M55k02k81K99j3n8Ko9
3027b0j6P9p6r8M8L3N1q0M5j12K7j13j12M65J1k63J38k15L76j51j48J13J7j08
3051a09J85j5j73k4M6J69j28J35k57j6J73P3o4N4n1k03K30k44J28L2M6J6K6q3
$$ plain form
3075 -54 -129 -123 -36 -31 45 -20 -26 -159 204 -185 -197 -134 83 -190 -45 -117 -47 116 -97 -60 157 -273 -61 19 40 -217
3101 -217 -196 -129 -62 64 -92 -81 -211 42 -255 -37 106 -67 -216 -288 -111 -146 -151 -95 4 -198 73 -323 39
3124 39 -79 -64 -91 -154 -354 -52 14 1 -148 -129 -142 -319 -78 -142 -95 -85 -180 -31 -151 11 -82 -237 -164 -390 -191
3149 -191 110 -134 -243 257 -120 -119 -56 89 0 -211 17 151 -201 -8 -126 -111 19 27 45 -283 114 120 -7
3172 -7 98 -19 -101 -282 -195 -253 -132 -107 -77 -63 -159 -63 -97 -23 -34 -61 -140 81 -15 -176 -109 -180 -1 -186 -60 -329
3198 -329 -235 -369 -220 -308 -20 -177 -95 13 -126 -147 -149 -154 -175 -178 67 -163 -357 -141 -327 -186 -66 -177 -28 -83
3222 -83 -60 -33 5 56 -98 187 -185 -39 -29 -81 -52 159 -219 -101 -173 48 -160 157 -226 -5 10 -5 61 46
3246 46 -3 10 -136 -126 -138 -86 78 -60 -222 -99 81 -69 -145 -145 -140 -68 -196 -28 -99 -14 -52 -197 -149 -340 -176
$$ packed form
3075e4p5OQ7NP6o5oj33L63l89j2O3K17k73J45p2P0J63k13L7K17m30K12Q0K1k57
3101b17K1O7O7J26j56J1j30K53k97K18J43j73j49p2J77l5nN6R9k02K71l96L62
3124C9j18J5k7o3k00L02O6j3j49J9j3j77K41o4M7J0r5J49j20J62r3j55P3k26J99
3149a91L01k44j09N00l77JO3J45q9k11K28J34l52J93j18J5J30QJ8l28L97Oj27
3172gJ05j17q2j81Q7n8J21K5L0J4r6R6l4P4j1k7p9K21r6j61O7p1J79j85J26k69
3198c29R4j34J49q8K88j57Q2J08j39k1knk1lK45k30j94K16j86J41J20j11J49n5
3222h3K3K7L8N1j54K85l72J46J0n2K9K11l78J18p2K21k08L17l83K21J5j5O6j5
3246D6m9J3j46J0j2N2J64j38j62J23J80j50p6%NP2j28J68p1Q5l8j45M8j91J64
$$ plain form
3271 -176 -138 -84 89 -69 -178 -222 59 -89 -16 137 -104 -170 10 -1 -76 88 21 -34 -216 182 -32 53 -45 -117
3295 -117 22 352 97 68 143 231 155 297 13 -111 -1 348 148 -183 -113 141 18 233 28 -65 89 28
3317 28 -35 -145 253 57 24 -11 -59 -3 -115 145 -280 109 -129 19 142 -24 -179 -284 -74 -127 117 -96
3339 -96 -63 -26 256 100 -263 -68 18 1 286 41 -141 -63 -138 -33 -178 -103 73 97 -113 -97 19 177 -11
3362 -11 118 -25 -73 19 -171 2 -104 213 46 3 89 15 -110 28 -67 -190 -55 -234 95 -114 -48 110 9
3385 9 138 199 158 -48 194 -15 121 210 185 43 57 203 65 272 205 137 293 -31 111 18 56 -312 57 -110
3409 -110 81 211 170 -17 -122 -186 64 179 -30 -177 -12 -162 -3 321 4 61 145 -99 63 267 -146
3430 -146 -98 -43 -65 168 92 -190 -217 -158 222 104 -3 -115 117 9 0 -237 55 -17 216 141 125 -103 144 254
$$ packed form
3271a76L8N4J73j58j09m4K81j48P3J53k41o6J80j1p5J64o7n5j82L98k14Q5r8p2
3295a17J39L30k55k9P5Q8p6J42k84j24J10L49k00l31P0K54j23K15k05r3J54o1
3317B8o3j10L98j96l3l5m8N6j12K60m25L89k38J48J23j66j55j05K10n3K44k13
3339i6L3L7K82j56l63J95Q6j7K85k45j82P8p5J05j45P5J76K4k10J6J16J58j88
3362a1J29j43m8R2j90J73j06L17j67m3Q6p4j25J38r5j23J35j79L29k09O6J58j01
3385IJ29O1m1k06K42k09J36Q9k5j42J4J46j38K07o7o8J56l24J42r3L8l68L69j67
3409a10J91J30m1j87j05o4K50J15k09j47J65j50J59L24l17N7Q4k44J62K04m13
3430a46M8N5k2K33p6k82k7N9L80j18j07j12K32j08rk37K92p2K33p5j6k28K47J10
$$ plain form
3454 254 147 163 56 82 43 198 80 162 173 -36 330 336 -10 277 -64 45 71 154 99 175 -57 18 184 141
3478 141 83 143 193 146 243 -109 -75 -19 159 83 -51 76 -241 137 237 59 199 164 173 206 2 39 79 3 81
3503 81 9 255 8 -259 -97 -76 72 104 -99 -2 152 -62 74 -5 63 79 348 10 -84 130 62 29 -121 165
3527 165 -5 105 -152 -141 161 283 95 -137 2 201 9 125 55 41 131 175 156 111 -124 -7 124 -210
3549 -210 21 54 194 154 -130 56 -7 224 107 -14 -75 52 8 -158 -12 257 -63 -54 -104 -54 -22 178 -300
3572 -300 -107 277 -106 50 -177 -146 -43 -29 -231 91 -135 -74 12 259 -125 117 -108 -248 -23 -74 -8 74
3594 74 305 32 72 -138 26 296 -3 3 145 94 199 312 55 93 -61 30 10 -26 110 140 144 -21 115 50
3618 50 -53 60 2 -157 116 -76 -37 20 -83 22 -14 43 -312 -33 9 175 -232 -251 1 -74 -56 -381 -192
$$ packed form
3454B54j07J6j07K6l9J55j18Q2J1k09L66Ol46K87l41J09K6Q3n5P6k32P5J66m3
3478A41n8O0N0m7R7l52L4N6J78p6j34J27l17L78J00j78J40l5RL3k04L7M0p6P8
3503H1p2K46k47k67J62K1J48L2k03R7J54k14J36p9O8J6K69l38r4K14o8l3j50K86
3527A65j70J10k57J1L02J22j88k32J39J99j92J16p0j4R0M4j9m5k35J17J31l34
3549b10K31L3J40m0k84J86o3K31j17j21o1J27m4j66J46K69l20Rn0N0L2K00m78
3572c00J93L84l83J56k27L1J03J4k02L22k26O1Q6K47l84K42k25j40K25n1O6Q2
3594G4K31k73M0k10J64K70k99OJ42n1J05J13k57L8j54R1k0l6J36L0Mj65J36o5
3618E0j03J13n8j59K73j92L9N7j03J05l6N7l55K79M2J66m07j9K52p5J8l25J89
$$ plain form
3641 -192 -11 133 -284 118 4 -188 89 -194 -87 45 -145 -48 46 -156 -156 -52 -35 -142 125 -233 5 56
3663 56 39 -113 -34 16 169 -161 -264 -150 99 -297 151 -80 105 -73 -272 42 -205 -64 -225 27 -152
3684 -152 -6 -30 -114 175 -154 -198 -16 5 133 64 109 106 27 -136 -316 51 149 -2 66 -40 89 -153 -238 106
3708 106 -62 280 27 74 -15 -249 -110 -203 1 141 -98 -96 -30 306 -127 -100 16 -262 6 -39 -197 -78 -264
3731 -264 -107 -125 -101 -41 -15 275 -186 -169 163 44 -59 -45 -168 -89 -223 -4 -90 -36 21 -169 49 112 52 163
3755 163 202 -134 4 -130 -31 43 68 -239 -155 -161 22 -166 -79 64 -33 -160 53 192 119 9 77 -58 -9 -92
3779 -92 48 0 75 -27 -81 -213 20 -36 -32 7 -32 174 -37 -51 25 94 95 -41 -35 20 22 -193 -172 -107 96 -92 -132
3806 -132 100 -100 27 -149 -225 -19 -95 -66 -183 112 -83 -76 129 -125 -225 -230 210 -39 172 -50 14 -207 -52
$$ packed form
3641a92J81J44m17M02j14j92K77k83J07J32j90R7R4k02%J04J7j07K67l58K38N1
3663E6j7j52P9N0J53l30j03J14K49l96M48k31J85j78j99L14k47J41j61K52j79
3684a52J46k4q4K89l29m4J82K1J28o9M5lp9j63j80L67R8j51O8j06J29k42q5L44
3708A06j68L42k53M7q9k34J39r3K04J40k39KO6L36m33K7J16k78K68m5j58J19j86
3731b64J57j8K4O0K6K90m61J7L32j19j03J4j23P9j34K19q6N4N7j90K18O3o0J11
3755A63L9l36J38j34R9P4K5l07Q4oJ83j88Q7J43r7j27K13J39p3j10O8j35M9q3
3779i2J40m8P5j02n4j32K33n6ML9l9K06k11j4P6O9Jj36ON5Kk15K1O5K03j88m0
3806a32K32k00J27j76p6K06p6K9j17K95j95PK05k54j00nM40k49K11k22O4k21J55
$$ plain form
3829 -52 -6 -109 -146 -80 86 56 -95 50 94 178 -69 -184 -104 142 165 68 -63 -41 312 15 153 -75 90 24
3853 24 -24 204 195 134 37 100 -105 -166 108 -62 -8 -135 -82 77 -227 154 186 -210 -93 -145 57 191 237 -122
3877 -122 372 133 -192 -227 42 132 -221 128 18 -28 -12 95 112 0 56 20 -59 266 147 -47 -65 2 -88 -59
3901 -59 156 162 -293 -117 116 68 139 48 164 123 150 6 32 127 92 36 152 61 123 152 183 -28 37 226 252 329
3927 329 61 -66 173 24 -212 -152 311 273 8 281 95 92 330 177 -31 120 55 14 15 -64 -103 55 99 -142
3951 -142 114 -99 106 187 -164 -150 -20 1 -42 -112 168 -24 83 149 -210 48 -36 69 -227 117 -71 -29 -159
3974 -159 9 277 -165 -191 146 -90 -98 121 165 -1 160 39 185 14 -10 228 152 -17 39 122 133 219 -9
3997 -9 37 28 236 41 66 176 141 -57 82 119 10 82 106 436 -6 6 68 142 65 91 23 -110 169 39 77 -61
$$ packed form
3829e2M6j03l7O6J66l0j51J45M4Q4k47j15Q0K46K3r7j31K2L53k97J38k28J65o6
3853B4m8K28ro1r7O3k05o1K74j70N4j27N3J59l04L81L2l96J17n2K02J34M6l59
3877a22M94k39l25l5K69R0l53L49j10m6J6J07J7j12N6l6p9L25j19j94j8O7r0K9
3901e9K15Om55J76K33m8P1r1J16m1K7j44K6R5l5n6J16r1O2K9L1k11O5J89K6P7
3927C29k68j27K39j49k36O0M63l8k65K73j86lK38j53k08J51o5m1Jp9l9J58M4k41
3951a42K56k13K05Q1l51J4J30K1m3p0K80j92J07O6l59K58q4J05k96L44j88M2j30
3974a59J68K68m42k6L37k36qK19M4j66J61j21J46j71k4K38p6j69N6Q3J1Q6k28
3997iM6rK08j95K5J10l5j98J39L7j09P2K4L30m42J2O2P4p7K6o8j33K79j30L8j38
$$ plain form
4023 -61 170 -90 81 -131 -122 -58 46 25 130 -71 25 -33 -10 3 78 -55 77 -118 -268 -28 -34 246 -19 154
4047 154 68 61 241 -37 160 59 117 219 211 55 92 -160 59 42 -330 -50 116 123 -4 -6 404 105 7 -184
4071 -184 125 173 -35 187 188 -77 -24 -240 43 -120 231 271 71 106 -219 -11 -137 298 368 -71 -142 168 -279
4094 -279 85 133 15 -29 -98 -81 -216 -130 -230 45 94 62 -152 -125 35 -205 -71 34 -13 92 50 195 174 -42
4118 -42 59 42 -225 91 -55 -83 48 -68 44 156 146 15 26 -33 -35 108 2 -173 -145 -246 299 -198 76
4141 76 -97 15 131 96 100 -4 53 243 -77 -92 6 -5 9 -62 127 242 143 5 -15 -50 52 -162 233 20
4165 20 162 67 -120 -198 195 88 -186 48 -65 154 7 -37 59 63 -83 -14 144 -129 8 30 157 63 12 -154
4189 -154 -44 -30 -230 132 50 129 -181 4 -150 23 75 -167 -153 -32 -130 -45 -158 99 -75 -78 -163 -60 -4 86
$$ packed form
4023f1K31k60J71k12RO4J04k1J05k01R6n8K3J3P5j33J32j95j50K40oK80k65J73
4047A54q6pJ80k78J97j01N8J02qj56L7k52K19j7l72K80J66Pj27kM10k99r8j91
4071a84L09M8k08K22Jk65N3k16K83j63L51M0k00L5l25K08j26M35P0m39p1L10m47
4094b79L64M8j18m4o9J7j35Q6j00K75M9l2k14K7J60k40J34J05m7J05m2J45k1k16
4118d2J01j7k67L16j46k8J31j16J12J12j0j31J1n9kJ43j06j75K8j01N45m97K74
4141G6j73J12J16l5Mj04N7J90l20j5R8j1J4p1J89J15r9j38k0l5J02k14L95k13
4165B0J42r5j87p8L93j07k74K34j13K19j47m4R6Mj46O9J58k73J37K2J27r4n1j66
4189a54J10J4k00L62q2P9l10J85j54J73N2k42J4J21r8Q5j13K57j74lq5J03N6R0
$$ plain form
4213 86 -10 -138 -91 68 -64 -64 94 -163 -45 -38 -26 119 8 6 -158 -63 129 52 99 -61 3 -151 125 -290 -25
4238 -25 -72 -51 -218 -126 304 -101 -136 1 -21 -224 -153 -64 31 -117 -80 241 129 -52 -85 -119 83 106 114 -170 -63
$$ packed form
4213H6r6j28M7J59j32%J58k57J18PJ2J45j11kj64R5J92p7M7j60O4j54K76m15K65
4238b5m7K1j67R2M30m05l5J37k2k03P1Q9R5j48L7L21j12j81l3l4K02K3Qk84J07
$$ [...]
8191H8
##END NTUPLES=NMR FID
##END=
