##TITLE=1H_Pr 45
 CDCl3
 8 sc, 
 19.09.2022
##JCAMPDX= 6.0         $$ Bruker NMR JCAMP-DX V2.0
##DATA TYPE= NMR FID
##DATA CLASS= NTUPLES
##ORIGIN= UXNMR, Bruker Analytische Messtechnik GmbH
##OWNER= root
$$ XWIN-NMR		Version 3.5
$$ Mon Sep 19 14:22:58 2022 Russian Standard Time (UT+4h)  she@DPX200
##.OBSERVE FREQUENCY= 200.1313499994
##.OBSERVE NUCLEUS= ^1H
##.DELAY= (6, 6)
##.ACQUISITION MODE= SIMULTANEOUS
##.ACQUISITION SCHEME= undefined
##.AVERAGES= 8
##.DIGITISER RES= 18
##SPECTROMETER/DATA SYSTEM= spect
##.PULSE SEQUENCE= zg30
##.SOLVENT NAME= CDCl3
##.SHIFT REFERENCE= (INTERNAL, CDCl3, 0, 15.7039)
##AUDIT TRAIL= $$ (NUMBER, WHEN, WHO, WHERE, WHAT)
$$ ##TITLE= Audit trail, XWIN-NMR		Version 3.5
$$ ##JCAMPDX= 5.01
$$ ##ORIGIN= Bruker BioSpin GmbH
$$ ##OWNER= she
$$ F:/spectra/data/she/nmr/H-F/1/audita.txt
$$ ##AUDIT TRAIL=  $$ (NUMBER, WHEN, WHO, WHERE, WHAT)
(   1,<2022-09-19 14:21:53.37 +0400>,<she>,<DPX200>,
      <created by zg, POWCHK disabled, PULCHK disabled
       configuration hash MD5:
       00 E9 B6 7A A2 85 ED C7 34 08 36 98 17 FE 4E 26
       data hash MD5: 16K
       97 79 85 21 55 52 E2 57 D9 A2 22 1B 4D DE 61 11>)
$$ ##END=
$$ 
$$ hash MD5
$$ 69 DD 30 04 9A 65 88 83 1D 4B 39 EA 5D 50 FB 9A
##$RELAX= 
##$RELAX= 
##$RELAX= 
##$RELAX= 
##$RELAX= 
##$RELAX= 
$$ Bruker specific parameters
$$ --------------------------
##$DU= <F:/spectra>
##$EXPNO= 1
##$NAME= <H-F>
##$PROCNO= 1
##$TYPE= <nmr>
##$USER= <she>
##$AMP= (0..31)
100 100 100 100 100 100 100 100 100 100 100 100 100 100 100 100 100 100 
100 100 100 100 100 100 100 100 100 100 100 100 100 100 
##$AQSEQ= 0
##$AQ_mod= 1
##$AUNM= <au_zg>
##$AUTOPOS= <>
##$BF1= 200.13
##$BF2= 200.13
##$BF3= 200.13
##$BF4= 200.13
##$BF5= 200.13
##$BF6= 200.13
##$BF7= 200.13
##$BF8= 200.13
##$BYTORDA= 1
##$CFDGTYP= 0
##$CFRGTYP= 5
##$CHEMSTR= <none>
##$CNST= (0..31)
1 1 145 1 1 1 1 1 1 1 1 1 1 1 1 1 1 1 1 1 1 1 1 1 1 1 1 1 1 1 1 1 
##$CPDPRG= <>
##$CPDPRG1= <>
##$CPDPRG2= <>
##$CPDPRG3= <>
##$CPDPRG4= <mlev>
##$CPDPRG5= <mlev>
##$CPDPRG6= <mlev>
##$CPDPRG7= <mlev>
##$CPDPRG8= <mlev>
##$CPDPRGB= <>
##$CPDPRGT= <>
##$D= (0..31)
0 1.2 0 0 0 0 0 0 0 0.06 0 0.03 0 0 0 0 0.0002 0 0 0 0 0 0 0 0 0 0 0 0 
0 0 0 
##$DATE= 1663582912
##$DBL= (0..7)
120 120 120 120 120 120 120 120 
##$DBP= (0..7)
150 150 150 150 150 150 150 150 
##$DBP07= 0
##$DBPNAM0= <>
##$DBPNAM1= <>
##$DBPNAM2= <>
##$DBPNAM3= <>
##$DBPNAM4= <>
##$DBPNAM5= <>
##$DBPNAM6= <>
##$DBPNAM7= <>
##$DBPOAL= (0..7)
0.5 0.5 0.5 0.5 0.5 0.5 0.5 0.5 
##$DBPOFFS= (0..7)
0 0 0 0 0 0 0 0 
##$DE= 6
##$DECBNUC= <off>
##$DECIM= 32
##$DECNUC= <off>
##$DECSTAT= 4
##$DIGMOD= 1
##$DIGTYP= 9
##$DL= (0..7)
0 120 120 120 120 120 120 120 
##$DP= (0..7)
150 150 150 150 150 150 150 150 
##$DP07= 0
##$DPNAME0= <>
##$DPNAME1= <>
##$DPNAME2= <>
##$DPNAME3= <>
##$DPNAME4= <>
##$DPNAME5= <>
##$DPNAME6= <>
##$DPNAME7= <>
##$DPOAL= (0..7)
0.5 0.5 0.5 0.5 0.5 0.5 0.5 0.5 
##$DPOFFS= (0..7)
0 0 0 0 0 0 0 0 
##$DQDMODE= 0
##$DR= 18
##$DS= 0
##$DSLIST= <SSSSSSSSSSSSSSS>
$$ [...]
##$SUBNAM2= <"">
##$SUBNAM3= <"">
##$SUBNAM4= <"">
##$SUBNAM5= <"">
##$SUBNAM6= <"">
##$SUBNAM7= <"">
##$SUBNAM8= <"">
##$SUBNAM9= <"">
##$SW= 18.0517283424941
##$SWIBOX= (0..15)
0 0 2 0 0 0 0 0 0 0 0 0 0 0 0 0 
##$SW_h= 3612.71676300578
##$TD= 16384
##$TD0= 1
##$TE= 0
##$TE2= 300
##$TE3= 300
##$TEG= 300
##$TL= (0..7)
0 120 120 120 120 120 120 120 
##$TP= (0..7)
150 150 150 150 150 150 150 150 
##$TP07= 0
##$TPNAME0= <>
##$TPNAME1= <>
##$TPNAME2= <>
##$TPNAME3= <>
##$TPNAME4= <>
##$TPNAME5= <>
##$TPNAME6= <>
##$TPNAME7= <>
##$TPOAL= (0..7)
0.5 0.5 0.5 0.5 0.5 0.5 0.5 0.5 
##$TPOFFS= (0..7)
0 0 0 0 0 0 0 0 
##$TUNHIN= 0
##$TUNHOUT= 0
##$TUNXOUT= 0
##$USERA1= <user>
##$USERA2= <user>
##$USERA3= <user>
##$USERA4= <user>
##$USERA5= <user>
##$V9= 5
##$VALIST= <valist>
##$VCLIST= <CCCCCCCCCCCCCCC>
##$VD= 0
##$VDLIST= <DDDDDDDDDDDDDDD>
##$VPLIST= <PPPPPPPPPPPPPPP>
##$VTLIST= <TTTTTTTTTTTTTTT>
##$WBST= 1024
##$WBSW= 4
##$XGAIN= (0..3)
0 0 0 0 
##$XL= 0
##$YL= 0
##$YMAX_a= 487974
##$YMIN_a= -588271
##$ZGOPTNS= <>
##$ZL1= 120
##$ZL2= 120
##$ZL3= 120
##$ZL4= 120
##$ABSF1= 10
##$ABSF2= 0
##$ABSG= 5
##$ABSL= 3
##$ALPHA= 0
##$AQORDER= 0
##$ASSFAC= 0
##$ASSFACI= 0
##$ASSFACX= 0
##$ASSWID= 0
##$AUNMP= <proc_1d>
##$AZFE= 0.1
##$AZFW= 0.1
##$BCFW= 1
##$BC_mod= 2
##$BYTORDP= 1
##$COROFFS= 0
##$CY= 11.3945322036743
##$DATMOD= 1
##$DC= 2
##$DFILT= <>
##$DTYPP= 0
##$F1P= 2.36226072786647
##$F2P= -0.459571619588291
##$FCOR= 0.5
##$FTSIZE= 0
##$FT_mod= 4
##$GAMMA= 1
##$GB= 0.15
##$INTBC= 1
##$INTSCL= 1
##$ISEN= 128
##$LB= 0.24
##$LEV0= 0
##$LPBIN= 0
##$MAXI= 10000
##$MC2= 0
##$MEAN= 0
##$ME_mod= 0
##$MI= 1.114404
##$NCOEF= 0
##$NC_proc= 0
##$NLEV= 6
##$NOISF1= 3.799351
##$NOISF2= 2.8
##$NSP= 1
##$NTH_PI= 0
##$NZP= 0
##$OFFSET= 15.70392
##$PC= 1
##$PHC0= -18045.2
##$PHC1= 24.80069
##$PH_mod= 1
##$PKNL= yes
##$PPARMOD= 0
##$PSCAL= 0
##$PSIGN= 0
##$REVERSE= no
##$SF= 200.130013532006
##$SI= 16384
##$SIGF1= 3
##$SIGF2= 2
##$SINO= 400
##$SIOLD= 16384
##$SREGLST= <1H.CDCl3>
##$SSB= 0
##$STSI= 0
##$STSR= 0
##$SW_p= 3612.71676300578
##$SYMM= 0
##$S_DEV= 0
##$TDeff= 0
##$TDoff= 0
##$TI= <>
##$TILT= no
##$TM1= 0
##$TM2= 0
##$TOPLEV= 0
##$USERP1= <user>
##$USERP2= <user>
##$USERP3= <user>
##$USERP4= <user>
##$USERP5= <user>
##$WDW= 1
##$XDIM= 8192
##$YMAX_p= 0
##$YMIN_p= 0
$$ End of Bruker specific parameters
$$ ---------------------------------
##NTUPLES= NMR FID
##VAR_NAME=  TIME,          FID/REAL,        FID/IMAG
##SYMBOL=    X,             R,               I
##VAR_TYPE=  INDEPENDENT,   DEPENDENT,       DEPENDENT
##VAR_FORM=  AFFN,          ASDF,            ASDF
##VAR_DIM=   8192,          8192,            8192
##UNITS=     SECONDS,       ARBITRARY UNITS, ARBITRARY UNITS
##FACTOR=    0.0002768,     1,               1
##FIRST=     0,             0,               0
##LAST=      2.2672688,     0,               0
##MIN=       0,             -588271,         0
##MAX=       2.2672688,     487974,          0
$$ Real data points
##PAGE= N=1
##DATA TABLE= (X++(R..R)), XYDATA
$$ [...]
1861B00j52l79l41M61O65k79j071R41R67j371o63J685K08j134o5Q38k20n96O36
1880C30M4j98m5k69K23k9m57PP36p93o42J390J20j003p8J395m00j126J43R70K
1901C20m89J14K60N24o94j43N48P0m96j65N67j98M3k4m28j60L88L43o82o0L02
1922f0lk8o50N27N14k76q32N88R77r66o73Q01L04k62J33J58k38J42K98k31k90
1943f7N27l8m06K54n21O35k2m02q19J167L87j538N5J783p61j362Q67O87o54j12
1963c40J96k5M1K51l55K92N14n14l54J155o61q64J189K33j252J76J224j061q24
1982i79J137O48j153k33L99n9M30k41r24J020Q10j383j82J557n90j242J195M17
2000F27j048M08P36p87l45J176P6j492Q13L42q63O60j68n54O14L22j176OJ517
$$ y = [200, 48, -331, -672, -211, 454, 175, -896, 45, 1012, -359, -1022, 663, 871, -263, -328, 510, 290, -306, 330, 374, 176, 131, -138, 85, 56, -401, -394, 342, -451, -1093, 297, 417, -586, -664, 731, 331, -795, -652, 318, 320, -169, -55, 205, 729, 35, -108, 440, 510, 14, -151, 416, 218, 261, 237, -191, -351, 37, 380, -302, -362, -60, -63, -91, -741, -214, 300, 24, -808, -220, 757, -209, -882, -81, 223, -39, 94, 252, 14, 156, 454, 223, -67, 460, 422, 16, 270, -251, 384, 362, -40, -859, 308, 695, -843, -788, 995, 234, -1128, -261, 426, -228, -340, -144, -169, -128, 123, -232, 60, 574, 60, -294, 861, 200, -664, 525, 758, -494, -318, 906, -155, -979, 158, 806, -347, -580, -181, -240, 190, -51, -975, 45, 855, -528, -710, 847, 257, -985, 210, 627, -421, -13, 723, -64, -409, 767, 843, -649, 164, 506, -357, 303, 135, -419, 195, 517, -659, -653, 864]
2019H64p53j339J461L98j469N08O46p56Q4P18m35n38J240j88o31K77M66o81O4
2038f4L95o56N31R22j466l73J538k61j589J046R30j129p62J059m4n88O49R8q01
2057e65O23K35q31O94K90q44K09O84p67r6J467p91j268J187Q43j246o07J641l54
2076E04r70M43J15k50M46k63o05Q01J67q99L2Q76o37l86O87j03q94P80J064j262
2096c54j43J014j54q05M46L19j99J43k72j52M29%q03M51R65r80q97J059L27p42
2116c48n7N86l02j77O43m06m60M69R2n73L43N35l70K96j6m01L37P32j054l47R18
2137D40K94j068L23N87n41l49L74J96n96K68L01q37K89L49j35l55J68K82q6J99
2157A03j55KN29m12n55M51P34r21l78J332k36j124N75O93n13m69P27l03j31L27
$$ y = [864, 111, -1228, 233, 631, -838, -330, 316, -440, -356, 362, -73, -611, 629, 441, -190, 87, 553, -128, -64, 331, -325, 206, 1128, -338, -711, 827, 566, -1023, 23, 953, -176, -938, 121, 77, -511, 138, 236, -565, 58, 293, -538, 156, 446, -398, -189, 495, -272, -368, 1099, 308, -960, 227, 1070, -176, -783, 858, 504, -466, -23, 92, -158, 288, 25, -580, 221, 388, -511, -479, 397, -240, -626, 61, -42, -936, -156, 908, -354, -497, 517, 363, -442, 4, 323, 124, 267, -5, -157, 272, 272, -531, -80, 885, -95, -992, 67, 394, -348, -405, 181, -121, -298, 345, -61, -521, -52, 40, -533, -190, 345, -25, 271, 255, -146, 191, 923, -131, -478, 440, 734, -334, -11, 576, 35, -314, 60, 256, -340, -72, 229, -608, -319, 30, -105, -460, -292, -10, -96, 103, -52, -50, 479, 67, -488, -37, 697, -224, -602, 730, 494, -630, -55, 638, 125, -344, 383, 80, -51, 276]
2177B76k47l36M95M7o59O69j54q26P25N32j016j01J052K8j127K64J132p20m62
2196d28Q04k17lK15m34nQ35o20m73N08L31j014K99P07p42k96R61j25r57N00O70
2217E16j099pJ017m04k98J83k10K12O00m22p58J327R1j133L39Q76o22m11M05P7
2237B79o16O38J19q46k0J150j023j12O66k21j85N36n58l75R02k98q15O54P04q23
2257b44l48J072r5q76O93K62o25K68K03k98k15O20j82m58K42j29K38l8k60l83
2277e53R49P0j302K54J407r28p13O73O45r30M29K00k88j44M52k02R7K99m16j9
2297b0M51l05n14P27L2o25K80O31p76l33Q11L9q39J18K49Q4o7m4m77O49R6q23
2319f56K78O89k56j84oL07j67P7K38l81J42K47R4l78J54o8p4O7k19J24L07n03
$$ y = [276, 29, -307, 188, 235, -424, 245, 91, -735, -10, 522, -494, -595, 457, 485, -642, -378, 754, 34, -428, 376, 159, 156, 371, -63, -68, 767, 147, -326, 182, 513, -501, -202, 505, -237, -533, 428, 303, -654, -154, 516, -583, -590, 427, 23, -275, -92, -302, -90, 510, 88, -670, 657, 748, -385, -46, 830, 208, -203, 202, 279, -337, 301, 420, -426, -446, 704, -319, -431, 235, 14, -171, 365, -193, -568, 334, 36, -779, -125, 579, -244, -592, 480, 385, -491, 202, 464, -161, 107, 310, 12, -203, 417, 235, -223, 19, -110, 128, 90, -170, -553, 396, 466, -836, -582, 825, -103, -816, -143, 502, -428, 1, 201, -87, -231, 221, 19, 116, 415, -1, -20, 431, 126, -388, 339, 371, -254, 26, 657, -119, -452, 359, 398, -441, -323, -74, 10, -57, -101, -578, 71, 167, -656, -378, 311, 55, -129, -135, 172, 5, 82, 320, -61, 81, 328, 422, 44, 198, 130, 56, 123, -96, 28, 335, -168]
2341a68m42N79M32o33j36M06j83q8K00j17o1J47J12j08J55K97l03j7K88k09J86
2362C37k00l19M23l7Lm31N0K60j30m75N59J18k12l9k75OL79j24m0L53m09k06K42
2385a67K14l24N27L62o67k21Q36k22n24J55M09J19n24J22j09L73k4q89M05P90
2405F41r99J65N36r5q70K87N60l61R0K44l27n4L85j1j79K46j84Q5N05j80q23N17
2427A78M91q55j82J169m38j171Q37L53p05J62J87k35J44L38p55jP26k58k75K57
2447c3M8m89N63M48j000M50P36p31p07J120M52r10P1M95m33l66O3q1J47O20n03
2468d0m57P65o6o60N78Jo87K71P94q96k37J282o46o35O18N55o21J03M50n05K14
2489A81N7l18jQ03p72q25R57L98q06L30N36o71l72P28j21p78Q52N9n54J43L88
$$ y = [-168, -610, -31, 401, -232, -368, 38, -145, -233, -33, -150, -211, -64, 48, -60, 95, 392, 89, 72, 360, 151, 337, 137, -182, 241, 204, 207, -224, -174, 86, -44, -519, 40, 158, -54, -93, -368, -362, 17, -107, -147, 206, -203, -409, -167, 47, -277, 250, 612, -55, -276, 560, 338, -186, -31, 378, 497, -27, 95, -14, 359, 335, -554, -149, 641, -358, -193, 343, 248, -622, -335, 225, -136, -46, 198, -129, -183, 202, 191, 12, 258, 74, 159, 664, 484, -339, 178, 669, -186, -368, 801, 363, -808, 29, 382, -323, -161, 26, -209, -65, 273, -482, -483, 243, -15, -290, -33, 15, -474, 89, 537, -463, -13, 723, -8, -715, 405, 857, -53, 18, 513, 80, -286, -223, -304, -157, 463, -40, -497, 268, 202, -458, 120, 121, -566, -295, 499, -397, -634, 648, 2, -633, -15, 540, -81, 22, 472, -33, 181, 238, -80, -81, 722, -50, -875, 82, 480, -326, 4, 540, -131, -503, 225, 104, -674, 178, 237, -317, -174, 214]
2510B14m41K38M22o99PP69o05k51R02j96q59L81N81o43RN38m05k53M86q1n91N13
2532C6L03q38M47K99o95J86N36n10k68J126m84q34P61M34q57M5P33p0o00Q05n23
2553C2J02J77q3o62N16L90n99j47Q66n22l60M84l72k40N08J36q53L55M91k81j97
2574b59N72l49j80J75J46l13J75J74m75N79L73n69j60O48k40m01M36r7l33pL80
2595B75l16k01N23j14n60L56j09K51j80k54o6O16N4p25P9O66m6m81L01J72k69
2616b8NM12k04j31L03q2k93J50j62q1j16K12P7J60k46l92K84K85k76k37L80J58
2638A78k07k79K79L27o64L35J56N1J3j93M9J64l7l2k10J44P3j10j96K85k33L62
2660B55R8n73P9K28O5k75l29L18L12p16N50P9q6j61M0J36p3J69m25K36M55l82
$$ y = [214, -227, 11, 433, -266, -259, 510, -95, -346, 556, 360, -499, -118, 463, -180, -171, 367, -38, -291, 195, 114, -477, 36, 339, -499, -52, 247, -448, -262, 274, -236, -504, 622, 138, -696, 65, 499, -358, -313, 420, 350, -250, 555, 32, 134, 311, 228, -434, 82, 472, -127, -274, 592, 70, -290, 194, -178, -418, 90, 226, -627, -272, 219, -62, -259, 313, -36, -216, -41, 105, -208, -33, 141, -334, 245, 618, 49, -111, 537, 297, -104, 332, 235, -98, -105, 275, -41, -242, 281, 167, -393, -37, -146, 105, -75, -329, -395, 221, 275, -450, -371, 295, 249, -232, 69, 241, -28, -23, 389, 185, 54, 357, 275, -18, 132, -30, -111, -227, -15, 62, 222, -24, -416, -132, 153, -123, -360, 20, 178, -29, -308, -29, 298, -366, -31, 125, 176, 189, -4, 45, 209, 172, 140, -70, 74, 147, 37, -159, 126, -107, 255, 353, -220, -141, 87, 152, -123, -452, -134, 178, -538, 12, 91, 5, -156, -116, 20, -53, 116, -309, -73, 382, 0]
2682@K28R0l54n6L08j02k45K85M60p53k62K48O55p74J08L29l86J30R5k49K37K42
2704B34o09O4L12r0nL91k83j80L60J30m05q4L66j12k06K55J28R1k77k06K48j6
2726A06j45l39K93K64l05m14O17N1l77j26L43l38K46M38m24J8M25k35k93J76K43
2747B24l7q2Q0k78M97m27l3k53O17P2n75J7K63l6l28J48o2J11J97k54qL96p6p0
2771A03j80K7K54j03l62M56l79M18j85k86L62K45k53l80N34j40k54j07M41j75
2791C6j02L9k91L18j74p5L90l32L8L39j13k23NM84k78m29L14M75m04k40L06L02
2813C85k69j74J41K30j10l77J26K25j31mk49J33J66n09N07q3m97K72K53j30j74
2834b69J53K68k96k33M13M00l58l48J01O39l55j21p8K38Nk17J87K06m23J27L5
$$ y = [0, 228, 318, -36, -92, 216, 114, -131, 154, 614, -139, -401, -153, 502, -272, -164, 165, -221, -91, 4, -245, -8, 234, -375, -311, 1, -89, -94, 297, 14, -166, 194, 324, -81, -165, 201, 89, -117, 138, 266, 357, 80, -126, 122, 106, -39, -378, -85, 179, -126, -540, 77, 128, -249, -375, -32, -370, -124, 314, -110, -92, 333, 98, -195, -19, 224, 187, 105, 185, -93, 404, -23, -56, -309, 308, 380, -195, -178, 85, 49, -279, -131, -193, -82, 115, -139, -147, 249, 173, 103, -77, -50, 204, 101, -261, 195, -184, 234, 49, -237, 125, 370, 117, -263, 271, 131, -123, -230, 211, 36, -66, -27, -318, 0, -174, -249, 141, -191, -153, 186, 73, -150, -145, 339, 61, -368, -54, 421, 17, -223, 83, 385, 116, -58, 83, 313, 203, -174, -48, 177, 46, 42, -207, -74, 92, -417, 90, 7, -490, -218, 35, -95, -269, -116, 152, -144, -377, 36, 436, 78, -270, -169, 470, 115, -6, -84, 154, 159, -58, 129, 335, -88, 39, 74]
2855G4m7J13m52P3R2j95L88J69n33J08N28l91k62L54k9j69L44j89M7J43j8j86
2877c8O2L59n00q4N45m29M3J84k8n48L76N61o25m2K49l24j35K77J70l37L11k0
2899B7l65K53L25n32M3N98k97n7K61O2o8o7j2l59K64K68m28l22M45J84l67J86
2921D2m1l29O88j50q17M96N03l72q19R95L87r20K36N03l78K86rl60L40j9j28m07
2943b73N20J22l08j29Q2m84N01L91p26K96O40n30m83L54J70m99K00Q7l26J93M70
2964B68m67Q0M82l88m30O44J92o84M04M20n72J16M52j74o47R27m93l88K67J91
2984B00j56k11J83j36J16K76n13l40O98J50o14J25N64o16j41N02j21RN22l51n38
3005c92O13L18o33K21P3j08l1J86n76J94N76k01p00P11m0m42j84O19n28q3L48
$$ y = [74, 27, 140, -312, -239, -147, -342, 46, 215, -318, -210, 318, -73, -335, 19, -10, -179, 165, -24, 23, 166, 148, -38, 24, 383, -117, -201, 344, -85, -42, 142, 114, -434, -58, 503, -122, -164, 85, -239, -374, -97, 73, -264, 47, 27, -338, -85, 240, -292, -249, 349, 52, -5, 256, 318, 250, 183, 171, -188, 76, 344, -84, -406, 39, 223, -144, 42, 1, -328, 360, 210, -607, -111, 392, 20, -799, 196, 583, -337, -101, 402, 24, 310, 301, -59, 281, 262, 134, -273, 247, 369, 61, -68, 14, -470, 31, 422, -304, -8, 632, 102, -381, -27, 143, -356, -156, -69, -395, -202, 268, -199, -119, 363, -25, -455, 189, 381, -303, 101, 521, -51, 65, 517, 343, -304, 623, 130, -258, 9, 200, 44, -167, 16, -120, -4, 272, -241, -581, 117, 267, -347, -222, 342, -274, -415, 87, -34, -25, 497, 146, -392, 221, 539, -94, 127, 200, 92, 61, 247, -329, -135, 441, 240, -460, 251, 211, -231, -415, 204, -324, -407, -59]
3026e9Q2k64L07o3m73M12K96m61L55K26m65L22L74l18l57L23n5o16O26K99n31
3047d0j32J42J97k58N6%j27L85l89l02M11L15k58m2PO6j24L83j49j54J06m8k27
3070a82L2L98j54j27K52r8j94K89l23PJ65M8n43M10L07n33l1J16j50L22o2q6j41
3093b78L68J76k90m06M29L5l20M39l5L3K00l83j62L58L38n38P8k20K04n2Q7j17
3115e6n3J65k12n1M1J18j37L3K59j39O2l9j35P6L75l26m76J62N72j92J52j34N5
3138A20j4j3M4q3K9j81p3L88k80L2j32J80j64Q9m8K25l71K68J89N8p9n2q7K5k83
3163b13M39J88l46k60K44K64l13j61K54J98l86n1J68J33o7k40Pp9J89p5k05M89
3185A77j93l7n3k5j36K63K35l85J40K97l3n16L94J09k26L11l06Q1RJ97m64M9Q8
$$ y = [-59, 23, -241, 66, 3, -470, -58, 238, -223, 132, 358, -107, 215, 589, 271, -86, 237, 182, -434, 192, 491, -40, -172, -30, 167, -91, -35, -35, -162, 223, -166, -468, -57, 258, 0, -42, -35, 31, -93, 290, 141, -13, 93, 45, -182, -150, 248, 94, -33, 219, 121, -73, 216, -107, -100, 65, 113, -430, -20, 287, -246, -277, -161, -311, 11, -51, -137, -278, 90, 266, -24, -430, -1, 34, -286, 153, 118, 151, 351, -32, -194, 164, 502, -36, 42, -178, 26, -26, 61, -56, -109, 56, -156, -207, -166, -48, -185, -152, 107, -32, 30, -9, -144, -68, 307, -19, -495, -333, 239, 47, 199, 65, 120, 106, 93, 137, 54, 83, -98, -171, 217, -63, -31, -163, 17, -147, -58, -106, 119, -252, 16, 205, 263, 184, 132, 45, 70, -213, 226, 414, 68, -192, 52, 316, 3, -158, 96, 294, -92, -143, 25, 158, 91, -149, -142, -221, -32, -107, -312, 177, -16, -53, -106, -131, -267, -4, 231, -154, -14, 283, 250, -266, 128, 237, 11, 322, 16, 97, 106, 303, -161, -112, -24]
3208b4N0n2K84m93K72J30o5k98M7J4j80J72L08j65J73L6l94K07M4J32n28N05k2
3231A53l63Q9L29%m42L82n5n6j1K98k33l08M55l96l99M31J99j26J09k06q6J01
3253a35k0J66k15L66l30j08J45L06l40K85Oq3p4J20j09K59j28K9l10J00m1K5J06
3276B0j94J37J26j78k01J62L05N4n27J98j7p2J30K56k83K77K3k04nJ41j22j08
3298h2J75J11k70LJ52J4l01N04k08l11K41N7l37J94Q1K67m46K60mJ41m1k32m4
3321g6n8N20n25q8L95j51qK5R8r9p6L35l44j29L16j33k27K75J11l40K21j62J40
3344B0l4j41n6N4J13m6p4J46J58j57k16K18PQ0J87l4j35J19J64n07J86K32n9k01
3368B4j29K25j0k38J77k17K90M9l04%K28j02l89M74Lj49J77k18l2K92N4k17N0
$$ y = [-24, 26, -26, 258, -235, 37, 167, 102, -196, -149, -135, -315, -143, 165, 0, 173, 209, -185, 22, 66, 198, -330, 175, 153, -210, -121, 208, 208, -234, 148, 93, 37, 26, 324, 91, -217, 238, -158, -557, -126, 73, -53, 56, -150, -236, -135, -155, 11, -204, 162, -168, -276, -131, 175, -165, 120, 126, 43, -31, 89, -20, 239, 111, 140, -170, -70, -111, -86, 20, -174, -37, 89, -89, -290, -128, 177, 231, -296, -98, -115, -187, -57, 199, -84, 193, 216, 12, 7, 148, 26, -82, 93, 204, -66, -63, 89, 103, -198, 306, 98, -213, 28, 85, -252, -58, 23, 290, -156, 104, 100, 241, 200, -32, -76, -134, 386, -139, -227, 168, 17, 9, 34, 132, 33, -43, 292, -52, -181, 135, 2, -225, 50, 161, -179, 42, -120, 20, -14, -155, -211, -157, -44, -90, -164, -18, 140, -17, -233, -15, -8, 72, 259, 225, 90, 209, 373, -134, 52, 284, 225, 24, -105, 120, 110, -128, 49, -168, 122, 171, -133, -133, 95, -7, -396, 78, 81, -68, 109, -109, -141, 151, 205, -12, 38]
3391C8K74l55P8L21l61J0J21k32k71L67L72n30O3J76j00j08J19j25kj16Q9k01
3413c73K97o3k0p8J66J04n3J69J46n07M88j47O6k04l2J66m64M56o4n2n8Lk2J15
3437C9j81M4J18J37k94k06K43K37l51J85L3m10K47L37o8k96K86L9k91o9M05k11
3459b7J25p7k20K37K95l07j57M82m04k11L76Q4l01k55K82O0k18L73l7l15K92Q9
3481A66l62O0L15m11J74J00j34J45M5q5o3K18J49m51j76N56l05R5Q6k16l9L79
3503B46m04m3J23r0J33n4Q5j24J66J38l36MK31m5l20K26M58k43j25L1L8p4j5J05
3527A11m6K54m59J01J5J03q3J99j14l10J59K30k78k47K93P6j94N2Q9r6J59M9J5
3550G8lj66p4J44L10m02J30j41K77l81J60J03j19J03O4j23j21M28k60j63nK52
$$ y = [38, 312, -43, 35, 356, -5, 5, 126, -106, -377, -10, 362, -168, -105, 71, -29, -137, -18, -143, -145, -261, -172, -373, -76, -139, -159, -237, -71, 33, -20, 149, 295, -212, 276, 129, 195, -9, -41, 125, -339, 117, 53, 1, -57, -54, -76, 39, -142, -98, 20, 157, -137, -343, -100, 137, -214, -29, 4, -406, -159, 178, 110, -186, 100, 139, -152, -221, 184, -27, 98, 21, -199, 38, 333, 26, -131, 351, -53, -264, 112, 196, -105, -360, -78, -18, -236, 137, 100, -215, 77, 166, -196, -136, 179, -232, -58, 42, -92, 53, 98, 13, -50, 168, 317, -134, -310, 246, -59, 36, 122, -94, -133, 246, -158, -201, -78, -168, -35, -89, -4, -128, 38, 176, -160, -156, 75, 30, -290, -64, 394, 151, 26, 57, 95, 21, 6, 111, 65, 319, -140, -39, -24, 79, -4, 195, 81, -229, -70, 160, -118, -365, -72, 4, -190, -138, -49, -145, 14, 63, 78, 75, -91, -165, -21, 289, -113, 17, -124, 153, -228, -68, 35, -84, 19, 83, -40, -161, 267, 7, -156, -161, 91]
3572I1J37j83Q9l21P8K90n64m5P65m52j82L00m4l7J94r2J04j65J71l46J25K67
3594A80Pn18M14J19o3j06J5q1K64k45o7r4K3M64n21P4R7k0Q6lJ32k52L40l32J8
3619f9K90j76K6L8J10l83K34Ro7J5K78n98L00R7rj05j98n0q0O02k31m00N42O1
3643B36l15j67M31K2k89J43K3j31J72N3l10O3L85m23K9R5K08j94K99m52j2J98
3665F4K01j69m42N26l00m2J12O1q9K51k79k5O6K88l54o2L84j54n5M7N6l43L67
3688A09ll11N3N12k52l03M37j14o03P83j02k31R8j85j54J93O4j79J00M65j43p80
3710e46M82K4l21N49j82j42K45J21k79j95M16J98n14K1K3M0K2L8l37J91J0J35
3732ak91L73L04o11L38j60R2j57J64j22o4M03j70m34M96j32k48M44l21jL04P3
$$ y = [91, 228, 45, 134, -187, -109, 181, -383, -428, 337, -115, -297, 3, -41, -78, 116, 24, 128, -37, 134, -212, -87, 180, 187, -331, 83, 202, 139, 33, 48, -33, 231, -14, -81, -175, -152, 312, -209, -135, -38, -58, 28, 25, 157, -95, 245, -87, -69, 221, 45, 71, 109, 219, -164, 70, 79, 12, 27, 305, -293, 7, 104, 95, -10, -208, -258, -338, 264, 33, -367, 175, 236, -79, -246, 185, 207, -82, 61, 84, -47, 125, 178, -132, -69, 316, -107, -78, 17, 225, 31, 330, -122, -134, 64, 265, 96, -346, 180, -120, -162, -50, 11, -78, 173, -106, -131, -65, 223, -131, -193, 191, 37, -18, 29, 85, -258, 109, 106, -205, -152, 360, 108, -195, 242, 128, -475, 308, 206, -25, 73, -112, -266, -73, -9, -188, -88, 377, 234, -546, -64, -40, -361, 188, 6, -136, 109, 230, -49, -244, 172, 370, -144, -123, -100, -60, -38, 0, -337, -146, -136, -1, -292, 81, 385, -226, 112, -48, 44, -113, 51, -71, -135, 268, 98, -336, 160, 28, -220, 224, -97, -98, 206, 279]
3754B79q8j02J04j01j66p2O10n54P6j6j13j03M63m98J55K08Q9l00n3L4j14N4J50
3777e8L1J00N3lj36N3J39k93R6P8J9j35P8J42j0J36n26K67o9J55m41N1M00k10
3801h3K4J03j07K0J59j95J40n0L9n6j09J01O9nk9j06q9L76j42M2p7J07k57l3N8
3826a00N6j7K50k72O9O8K19k93M2K9n2j41M9oK27m1j77o2J34K51k39j52K32N9
3850A33n40M09M0l9n1L11n45M17k29J46k4R8k02o7O7j45J74q9L44m50L35m9j77
3873a33J78p7J19m4k46J22L86k85J64j68j47K39L6J58j74k92K3o6N6j31K09rl4
3896a16J62j85K5k02K59J52J24n08J88J90j86o3K13p2J5J80j02N6m0J22qp8m95
3919c69L77l2k7R7k84M00j70n2J55J45m77J02K17j5J53l07K21j05J65p0k84N86
$$ y = [279, 191, 89, 193, 92, -74, -146, 464, -90, -14, -30, -143, -246, 217, -281, -126, 82, 171, -129, -182, -148, -262, -208, -58, -27, 73, 126, 123, -13, 40, 179, -114, -18, 60, 79, -56, 22, 164, 154, 290, -236, 31, -38, 117, -324, -273, 127, -83, -59, 44, -63, -43, 116, -79, 61, 11, 50, -6, -115, -14, 55, 50, 21, -85, -174, 202, 60, 102, 25, 132, -125, -158, -100, -44, -61, 189, -83, -14, 54, 273, -20, 22, 51, -1, -142, -93, -99, 128, 87, -90, -152, -18, 233, -6, -158, 74, 133, -407, 2, 42, 3, -48, 263, -282, 135, -94, 52, 28, 126, -76, -143, -76, -221, -47, -136, 208, -242, 93, 44, -133, 45, -32, 87, 43, -203, -81, 305, 20, 184, 16, -131, 108, 144, 302, 128, -164, -141, -207, -151, -282, -73, -82, -116, 46, -139, -114, -316, -57, 95, 219, -289, -101, 89, -97, -160, 53, -19, -4, 176, 74, 130, 90, 212, 204, 126, -369, 8, -24, -51, 46, -238, 162, -8, -60, 95, 240, -237, -135, 82, 67, 220, -87, 134, 29, 194, 124, -160, 426]
3941D26k08l45K43p6Q3k01J24R0r1J10r2J22k03K90l04j13K65n1r1N2j45J4L69
3964B68o04M7L41J36m77J36L79j67j66L58k14k16K48l15L27qN8k7j92J56k71O7
3986a36J91Q6l75JL15k26J31Q2j95L2j5L82n64L21j0r4K95p9j40Q5J13k58k7M2
4010d3J85M0r6k00J68j43J31j07m7J41m7k67M07j99j65J81n1J38J63l06K28m23
4032c12N31l54K78K0l99N64l67Q6j59K90j51j25RJ34j52R0j5j87J44J61l1L0J02
4055A87l01J8j9KK52j94j33K01J08m03R8J75K29k16m6K11j02r3L3j66K1K95j87
4078c0j4p6J85j16L74l32j48j9K93l60J59K85j60j19kJ48ol96L94n0R6Q4k58O6
4102bo4J07n9j01J07N1J17J59m16K22N4j88N3m6J01J0k26K71j95K44j95N6o3j1
$$ y = [426, 218, -127, 116, 40, 123, -78, 46, 136, 45, 155, 63, 185, -18, 272, -32, -145, 120, 69, -22, 30, -115, -101, 268, -336, -289, 52, 188, -289, -153, 226, 59, -107, 251, 37, -179, 69, -246, 81, 73, 131, 104, -88, 68, -203, -136, 55, 141, -234, -233, 82, -144, -13, 69, -126, -94, -109, 273, -291, 30, 20, -74, 221, 142, 2, 87, 200, -58, -85, -43, 142, 182, 86, -114, 54, -89, 42, -65, -112, 29, -18, -285, 122, -77, -242, -61, -112, 26, 189, -117, 111, -312, 219, -135, 143, 163, -236, 328, -39, 47, -112, 178, 27, -98, -89, 45, -107, -17, -32, -219, -75, 86, 55, 85, 187, -114, -96, -115, -113, 139, -55, -188, 13, 121, -282, -184, -9, 220, 4, -42, 169, 67, -26, 7, -159, -138, 157, -30, -44, -120, 65, -51, 323, -9, -157, -176, 117, -243, -84, 201, 41, -78, -80, 68, 62, -334, 60, 10, 106, 190, -68, -2, -66, 41, -18, -119, -12, 39, 156, 315, -101, 121, 175, -13, 40, -6, 95, 105, -121, 150, -45, 199, 4, 60, -3, -14]
4126a4m2o5O6K39n07K42J14O3n6j28J65k38l4L85l71L64j73Q1L1K49l49j00K07
4149A29Pq0j36J84l14K07l2J34k52K19j7l21J92J58j37J07J13l71J95K17j51j30
4171g9J66L4k25J93q9p8K72j0l32J09J15q0k14K64nP3l6J0k88Q8L76k48j70J68
4195A4K94n47K36L05k54K38o7k73R5j78R5l8%L04l65Q1L91n22J52J7j94L20RJ0
4219A23l17Q9j44J71R5K42k80N2o4m9j9K79k26K33j13R0j04J4K6O9k32j4J99j34
4243a4J46q4j66oJ34l9K31n55J68K95L3j84K06l6m6r4l7J26l65J73J90l9J39n
4267A71K3j47m5P7k43K62j98jN2j25K33j6Oj10K5j51K73r8n2Q9K4j01l3j84K17
4292e2o9R0j32K40q3O1j70J91l20K50K23L2j96Ro1l0N8j94L2J84j05r8L61m11
$$ y = [-14, -56, -121, -55, 184, -323, -81, 33, 96, 40, -88, 77, -161, -195, 190, -181, 183, 10, 91, 122, 371, 22, -78, 129, 136, 56, -80, 104, -210, -3, -35, 99, -153, 66, 49, -272, -80, 78, -59, 48, 161, -210, -15, 202, 51, -79, 87, 121, -104, 89, 0, -78, 194, 184, -148, -39, 76, -4, -218, 46, 41, 114, 78, 88, -200, -112, 264, 16, -154, 14, 308, -239, -3, 302, 48, 286, 219, -54, 41, -137, -42, -80, -80, 224, -141, -60, 331, -191, -39, -22, -216, 104, 113, 123, -194, -105, -249, -78, 17, 259, -21, 31, -33, -82, -101, 178, -48, 185, 72, 162, 58, 72, 98, 167, -65, -79, 120, -14, 132, 48, -118, -124, 10, -29, 202, -353, -185, 110, 143, -41, 165, 129, 83, -11, -48, 78, -287, -114, 76, 37, 176, 171, 194, 47, 2, 79, -164, 98, -100, -101, -49, -174, 59, 43, 49, -61, -36, -187, 86, -12, -64, 25, 49, -52, -85, -269, -52, -121, -31, -163, 77, -6, 55, -115, 76, -244, 6, 229, 261, 65, 74, 13, -17, 41, -153, -121, 63, -42, -140, 221, -190]
4316a90m7P7K77k01J07Q1m9r3q3K10L0q0j37LO3J04J61k95J86j36J87j19k39K4
4340a59J0K07k56J23n9K99j71K40l67j28J39P5j53J97j90PJ51J35j07l8l8Q0K3
4363B0k2j53Q8j3K49k67K27j61r4K7J34j3R4k78L13k13P1j12R9J42k05L02j73
4386F2j00N5j89K90M2j36l5J82k75J54n2R5q0J1k57L16j31M42n29J78K05k47Q3
4409H4j47L4K5k13j41K70K28q9o4q7k7J31K6p3K81o2j06J04R4k49j42K07k01L12
4433A95l26J08J28J50k20Mm63L00J99j19k21K86o7lM7J67p6k86M1K51j57K1j43
4456a84R1J29n0k9P7O0l77M56k90n2K81k84K35k0n4q1l7J14j70M09L4k26j63Q1
4480e0nj2p6L23k82M5J95j23J6J4j24J82q5P1k6m0j62J45Lj98o8K08J12k2j41
$$ y = [-190, -237, -160, 117, -84, 23, 104, 55, -38, -121, 89, 119, 39, -98, -95, -32, 72, 233, -62, 124, -12, 175, 56, -183, -159, -149, 58, -198, -75, -134, 165, -6, 234, -133, -261, -122, -47, -200, -3, -193, -186, -35, 100, -7, -45, -83, -3, 20, -2, -155, -67, -80, 169, -98, 129, -32, -126, -99, 35, 22, 116, -162, 151, -62, 9, -103, -4, 138, -67, 235, 62, -38, 17, -172, 118, 160, 24, -11, 171, -104, 50, -2, 93, 13, 24, -233, 83, -48, 394, -135, 43, 248, 1, 84, -63, -29, -4, -217, -358, -88, 140, 51, -13, -100, -127, 4, 30, -43, 238, 176, 70, 174, 268, 19, -123, 84, -117, 195, -131, -23, 105, 255, 35, 39, -424, -124, 75, -44, -265, 21, -46, -49, -2, 165, 89, -197, -156, 95, -62, -41, -184, -93, 36, -14, -43, 34, 94, -283, 173, -117, -169, 112, -172, 63, 43, -11, -92, -129, -15, -185, 224, 258, 32, -131, -50, -55, -67, -143, 180, -102, -57, 138, 15, 31, 45, -79, 103, 18, 89, 63, 23, -139, 6, 9, -189, -257, -49, 63, 41, -100]
4505a00N0k04L81j39MJ91j83J98k34k09j0N19l48k3p4J50J04kj45k07J02J35M9
4528ER3k09K39o7n8M8m2K9k49K73L7j15j61M69l61J35j45l10L95l6M1j22J91k27
4552a47K71pr5O4l5%j86K78r8k84K91k56J81K43k82O1J16k27j88k3k7M87l79R9
4576a43O7j59K10k4pJ02k21M0L48m8l7J40j32l74K55j8NL43k93K20k30o5O6j23
4600g8K81k29m7K%k55K67k03J44M09j04j45mL6l05K30J05k60j48K88JK67k05m5
4624BJ3r1j05J44R4L3k1J16L3k64K12j45J50l28j9J14r7L46l52K3J36Q6J99m24
4648a45K55M2m4k77N29k20j62K2k2r6j30N0j9J78P5M6l05K83j46n3L91l54j4J21
4672Eoj2j54L41j74j50J76l3r3J15n2J24l3QL6j46l8L5k3M9p6k57M82K26j55m55
$$ y = [-100, -50, -254, 127, -12, -8, 183, 0, 198, -36, -245, -255, 264, -84, -107, -181, -31, 73, 71, -74, -281, -179, -44, 5, 98, -111, 128, 61, 3, 51, 9, 38, -211, 62, 99, -16, -177, 292, -69, 66, -79, -389, 6, -30, 11, -111, 80, -147, 124, 117, 22, 86, 51, 51, -135, 143, 45, -239, 52, -204, -23, 220, -62, -1, 115, -112, -300, -323, -350, 137, -242, -143, -76, -235, -25, -49, -56, 46, -175, -135, 213, 165, 128, 268, 136, -238, 17, -1, 4, 347, 54, 274, 44, -21, 45, -78, 203, -26, -73, -71, -71, -326, -59, -262, -118, 291, 187, 42, 38, 74, -231, -1, 104, -156, -304, -16, -15, 252, 47, 2, 15, -76, -181, -37, 57, 90, 69, 185, 218, -46, 166, 21, 171, -157, -176, -62, -159, 187, -165, -142, -6, 80, 279, -145, 110, 152, 108, -169, 360, 140, -22, 0, -22, -118, -248, -198, -217, -39, 36, 82, -223, 60, -86, -139, 252, -102, -116, 5, -1, -13, -167, 174, 0, -150, 26, -7, -100, 15, -37, 87, 54, 62, 98, -48, -86, -51, -74, -25, -101, -358, 124, 350, 195, -260]
4698b60L30j28O8J72m03J89J5j20J96nj99J40j53J71L8M5j86n4K3L3M6o4l5K75
4722A34n1M2j43j11l18L49M6n7K64j42l2k62J78K26j85K02l12R5J23j67J76r2
4744c7l8J16k33M10j38j53J89j93J92m1K28k81K4j3J58j10j61K29r7O2k0j11K18
4767B00q8j47O1j18j07L15R1k37o9j25J32J46J15j26J7N2k2J60k54o0J64k3r1
4790a4KJ51P7k20J41k54K05Q1l04R3J81KQ5k92J41p8j30J42R6mj24J52k18K02
4814A13k18J82J42k72j19J41j36J32rL3r0k7J26k6L0j76J18o2J10J20j99j33J56
4837f4p2q5J65J46n6r0l2oJ47KJ67Kk34J93j21j92K99Q9l39K28k8N6k66J73j54
4862g2J30l26K21o7K2J88j25l1J19l9J29k57j25N4L00r3j03K44k02k69J50K32
$$ y = [-260, 70, -58, 10, 182, -221, -32, -17, -137, 59, 54, -145, -5, -158, 13, 51, 96, -90, -144, -121, -88, -42, -106, -141, 134, 83, 125, -18, -129, -447, -98, -52, -109, 155, 13, -19, -281, -103, 123, -62, 140, -172, -77, 46, -121, 55, -37, -75, 41, -192, 218, 80, -73, 116, -77, 115, 74, 302, 21, 45, 32, 190, 80, -81, 148, 51, 113, 93, -18, 200, 112, -35, 26, -92, -199, 116, 207, -30, -99, -224, -92, 54, 169, 43, 60, 112, 90, 250, -4, -64, 100, 77, -14, -12, 139, 216, -4, 137, -117, 88, 169, -135, -42, 139, 141, 226, -66, 75, -3, -133, 9, 105, 101, -23, 129, -89, 113, -105, 77, 219, -53, -172, -31, -167, -35, -44, -11, -101, -128, -2, -28, 2, -174, -56, -118, -8, 112, -87, -220, -64, -136, -221, -56, 90, 34, -56, -88, -94, 53, 55, 222, 224, -10, 183, 62, -130, 169, 258, -81, 147, 119, 175, -91, 82, -72, 58, -268, -47, -114, -92, 96, -29, -60, 59, 20, 149, -108, -233, -179, 121, 28, -75, 169, -33, -302, -152, 80]
4884H0q6q7K14l4j41n3K78j39j80J35KK72j61O6k12n5J53J5j24O8J73k94L15j42
4908F3M6j21K32k21j5j49J62j53R4l2Q9Q3J48r2k03q9q8L58j57j02K85K9m89K1
4932c01N53k85j46k0K98k90J12J29l6J72k12J5J08L3k35K69N0Km41L8L31l46K80
4955G8k46K13j11J06l09L73j24M0l3j3K5Nj64L04k26j40M10r4l12K10l4m2J82
4978I8j40j22K77N8q7j70K21j12k51P8K39k79L05J09k78j49K53p2j33L30j68O2
5000F9J8j06k42K57J15k12j6K70l6Pj50J55l5j77N1%J75k1j61j49J54q7N4J02
5024C5J22p0k55J86ql7j29Q9j22J35K48j7k14mL2Rj42K5J64Q7p7M8K05j56J12
5049B66m03Q0Jk31L37L3o6R8k5K50k70l6j09J04j2j53N2m1J16R0j68O7j01K1K28
$$ y = [80, -6, -93, 121, 87, -54, -107, 171, 32, -148, -13, -11, 261, 100, 166, -46, -101, 52, 67, -57, 11, 184, -110, 205, 63, 109, -12, 220, -1, -16, -165, -3, -156, -62, -94, -5, 78, 226, 134, -69, -158, -246, 112, -45, -147, 138, 167, -322, -301, 252, -33, -179, -199, 99, -191, -79, 50, 14, 186, -26, -11, 97, 130, -105, 164, 214, 216, -225, -187, 144, -202, 78, -168, 45, -66, 40, -269, 104, -20, 20, -13, -26, -1, 4, -160, 144, -82, -222, 188, 94, -218, -8, -42, -84, 98, -42, -164, 113, 171, 84, -86, 135, 23, -228, -150, 89, -190, 115, 224, -54, -203, 50, -22, -155, 175, 7, 69, 87, -19, -261, -4, 111, -101, -117, 153, 117, 124, -26, 129, 94, -83, -32, -32, 143, 122, -39, -188, -34, -121, -67, 35, 157, 87, -168, 18, 10, -27, -156, -67, -189, -54, 194, 177, -37, -41, -9, 0, -142, -117, 47, 134, 57, 105, 310, 154, 266, -137, -57, -56, -287, 50, 83, 17, 115, 90, 340, 70, 34, -75, 29, 17, -136, -84, -125, -9, 81, -87, -20, -121, -100, 128]
5074A28o7j35J0L63l79J36j77L90k02k59J90q5j08J27QM5J37n9j93J20K63l95
5096a42L21j27j41j4K7%Q0j99J50j6J88j17j0Q1r1N8M0kp2%j24j20M70k2k03j51
5122a36J71l6J11j17Q7j66R3J46m14K71q2J27p8p9J61nj61L0J51j2l2K0j57K00
5146I3p5k24J12K88k69O6O1p1k54L47j58K48l82K76j66J31k33J62R9J53j11l54
5168b61O47j95o16L50J90j92J78j82k57J83J05q4N9J02P2j51m4j27K27j89N6j27
5190b56L54K66m67N2K81k36O0j55J76R2k80J84J30J37l43k27K53J02J0k42N2J97
5212A40Jjl3p6J37k86P5l9J86q1J5l4O4q4O2p8J53m9o7J4q3j35J72J74k76L51
5238B22k01j52J62L2j99N3O7k15PQ5K0P9J20j81K37q9j77J96R8k2k22J85pJ8R1
$$ y = [128, 61, -74, -64, 299, -80, 56, -121, 269, 67, -192, -2, -87, -195, -68, -60, -15, 122, 63, -130, -10, 253, -142, 179, 52, -89, -103, -76, -76, 4, -195, -45, -61, 127, 10, 0, 81, -10, 48, 88, 86, 14, 14, -110, -230, 240, 218, 15, -136, 35, -1, 110, -7, 80, -86, 7, 153, -261, 10, -72, 55, -23, -102, 59, 54, -107, -77, 74, 62, 30, 50, -107, 93, 18, -206, -94, 194, -75, -9, 52, -19, -273, 74, -84, 164, -218, 58, -108, 23, -210, -48, 51, 204, 93, -261, 386, 191, -425, -75, 115, -77, 101, -81, -338, -155, -50, -134, -75, 27, 99, -52, -96, -223, 4, -185, -129, -256, 98, 364, -103, -51, 230, -6, 54, -101, 75, 167, -113, 71, 201, 338, -5, -232, 21, 123, 133, -109, -57, 140, 141, 140, 107, 31, 168, -118, -43, -82, 104, 23, 38, 4, 68, -16, 46, -32, 121, 72, 5, 19, -64, -199, -27, 147, -129, 222, 21, -131, 31, 63, -136, -83, -16, -231, -224, -139, -119, -40, 80, -101, 136, 47, -130, 66, 164, 142, -80, 105, 98, 116, 207]
5263B07k93J18Q5j26K45k66j28kJ80N7o2Pj48K38n4j22O3L2P8j90j27N35l22O9
5287G4K16j38Pk6nn0j39L12m03J42J62k14J16k78J96K64l15r5M85m75J68l0l7
5310f3R7L47k19k62P0J05j38l1J52R3k50N2N4p0O7k48K88l2o3J03n6J33j92O8
5334Ej8k19K62J86j98l3L5J48k83Q4j47J70o4j59J48l3J21K9j71K91k5k23L5J11
5358E2Pl31M66l17K72R4j87j93L4J96p3k3J32J4j56k01L38L1J79m19O6J92l37
5381a64M10k74q9K8Q1j19K24k60O0QM1J25j82L4j5J89j74L79j12j03k03J25L06
5404C15l65O2N0k18P6K22k3j01j1j6O4J54l71K11l20N32k73K16j26J14k07N9m5
5427aK5lj90K27j01K4k28M39j36j03N1j05p9M16r3l15M72k82m0j97J82M6J45j07
$$ y = [207, -86, 32, 117, -9, 236, -30, -158, -160, 20, 77, 15, 22, -126, 112, 58, -64, -1, 31, 109, -81, -208, 327, 5, 74, 290, 152, 159, 133, 128, 78, -61, 251, -152, -10, 152, -62, 54, -224, -28, 236, -79, -174, 311, -164, 4, -26, -63, 34, 381, 162, -100, -30, 75, -63, -94, 58, 151, -99, -47, 7, -63, 4, -244, 44, 12, -51, 52, -4, 129, -63, 5, -13, -232, 30, 216, 18, -15, 20, 168, -115, -31, -178, -8, -72, -231, -83, -116, 5, 34, -137, 154, 129, -94, -59, 52, 59, -272, 194, -123, 149, 243, 56, -137, -103, 93, 20, -3, 129, 143, -13, -214, 124, 155, 334, -85, -19, 173, -164, 246, -28, -117, -89, -8, -127, 97, -163, -103, -95, -54, 71, -111, -77, -92, 97, -77, 302, 190, 87, -116, 9, 315, -50, 12, 62, -156, -80, 142, 119, 18, 7, -9, 55, 209, -162, 49, -271, 261, -12, 204, 78, 192, -15, 44, -1, 24, 21, -169, 58, -43, -19, -247, 192, 56, -47, 4, -101, -180, 236, 143, -172, 300, 18, -22, -219, -37, 9, 154, 47]
5451D7l2o5o5L20j3r6j96J9j40J70J93k67O5k59L81k8N9j13J30j53L52j52k3j84
5475e0Q3k2M4Q1k87J03L9m6j11K98j1j72M2J07l4j00K6J61j22k8k2%K77m13J88
5500C1L26j78r8j36N5q0mK37j13m7nO0p7l1j50O0N7j2l41M15K3L4N5l39K66o6
5526e8R3n8K28j82q0J42j54j41P6J31J22J82k50j85L1O6J20J42k29k01J54J22
5548G1Mj21J45j20J7J73o7P7l18L02j73j3k34M74j85jN5L7j24O5j16m3p4l2N4
5573a47J10Q3j58K39j18R4p5J63k57K24o6j29N6N4k07J20J77l48N6K8K09R6k75
5596g1M2p8K61k67K3j9j4kl2J73j43Q8q1N4L48l66K24m3j36j72R3K91j3j70R4
5621H4j09O8J39j68p8j91K28J08k0k5p0k9n8J33N9j27rOQ0L7j94J68R5k9k01J49
$$ y = [47, 15, -50, -115, 205, 192, 96, -100, -81, -221, -51, 142, -125, -60, -319, 62, 34, 93, -20, 110, -43, 309, 157, 134, -50, 33, 11, 55, 136, -151, -48, -9, -55, -166, 132, 121, -51, -9, 98, 64, -36, -10, 151, 29, 1, -21, -21, 256, -157, 31, 357, 179, 81, -55, 0, -80, -84, 153, 40, -7, -12, 48, -29, -60, -210, -150, -93, -105, -446, -31, -8, 26, 81, -258, 8, -58, 35, -23, 205, 23, -57, 85, -69, -210, -134, -3, 119, 301, 51, -134, -103, -37, 83, 225, -4, -205, -51, 71, 75, -46, 99, -21, -4, 169, 102, 179, -139, 163, -10, -23, -257, 217, 32, 31, 86, 123, -1, 64, -52, -95, -169, -201, -147, -37, 46, -112, 127, 9, 103, 28, 191, -66, 158, 92, -37, 19, 73, -134, -14, 163, -185, -129, -101, 108, 204, -71, -29, -107, 154, -113, -90, -109, -123, -125, -157, 16, -127, -39, -120, -66, 282, -84, 140, 97, -39, -211, -118, 173, 160, -10, 84, -25, 43, 182, 14, -64, -255, -27, 81, 61, 36, -34, -63, -121, 12, 71, -56, -65, -59, 21, 58, -136, 32, 127, 98, -103, 46]
5647D6k29J52k16K66O4k8K30j98m3N0J06m3p0J9L00k41L7q1q5k01N3o7J91J19
5671A31K07k17j65oj6LM4n6J68k68J92J13k27M4O4N9l0q0R5r4l9K86k69J17J15
5696A71r1j18N6M5p2L44m53J74L4j67J3l9R8j78K71m7Pj86J69j94R3K0J14K49
5720C13k16J1j02K27l29J34J46l10J53m9Pp3j0R6j55LJ92P5j95J75M8l00K39O7
5744A47J19k93J99m02J97j8J05QqQ7k44L5j1K17R9l89J03J69k5k65L4M03j75N9
5768A51j67j10O8J08n5o3P3k44L84j99l8K18Kj54N8l13L49O2p8k87L10k58J1P1
5792a01J69l8o6p4j6K22k13P5j92K25P5j57L19k23p0N9n0p4k3K50k87R6L40k60
5816a4J44n8p7j2q1j39n1L95kj27O0O2J5J8j20R2J13m27J42J38L8M1k47j03K22
$$ y = [46, -183, -31, -247, 19, 83, 55, 285, 87, 44, 94, 200, 157, 87, 106, 406, 165, 202, 121, 36, -165, -112, -179, 12, 131, 338, 121, -44, -50, -66, -63, -19, -75, 93, -175, 17, 130, -97, -53, 11, 70, 40, -40, 55, -39, -78, 208, -61, 56, 171, 80, -38, 18, 63, -9, 335, -118, 56, 90, -77, -64, -103, -5, -183, 88, 41, 48, -138, 31, -163, -70, -50, 64, 313, 97, 108, 6, 233, -96, 38, 184, -126, 27, -22, -15, -88, -98, -2, -157, -154, 38, 113, -82, 93, 141, -159, 80, 147, 266, -27, 172, -230, -33, -51, 54, 62, 54, 141, -103, -68, -79, 138, 237, -152, -49, 120, 95, -170, -136, 267, 92, 151, -16, -126, -58, 50, -5, -68, 5, -239, 145, -54, -92, 126, 128, -26, 32, -281, 68, 130, 52, -235, 75, -183, -172, -101, 68, 30, -36, -110, -126, 96, -117, -42, -234, -9, 66, -91, 228, 5, -65, -6, -56, -130, -153, 97, -190, -94, 246, -14, 130, 72, -5, -17, -98, -237, -288, 107, 105, -22, 38, 100, 115, 133, 13, 105, 218, -209, -67, 71, 109, 150, -97, -200, 22]
5841B2j60J14oK90j52r0N6R7k50K79k96J37Lj56j04K01Q3r4rP8k36K95m3K82l26
5866A5M0q3J6k13K09j03%J68r6K03k44K43j71L10k82o3q9K05k65P7K24j68j02
5889a69J00J79J29l48j08M32j57k28R4L9N3j3J50r5K90k03j43J9m7J86j6k42K6
5912g2J33L45k50l5L9l78K80j9j55Oj1M9P7K29k22j36R5J33l44J10N0nL8L1j1
5937b3k3J56k42M60l49J18O8Qj61K1o6N0j01L1K6LP9J26j51Ql6J64j43J33j20
5962C6p8K13O2m05O3P3J34r2l4J4l8j47J54J46P9n88L85p3P3j95L34N1k25P6o8
5987e0j7OK0j48J52Kp1L40k77K3nj13J87q0o5Q7j6q2J83M1j06k1K3L09k84M5r7
6014a4J44j09R7Q4l38Q2K55j92k03Q7LJ79l6j6j12R3k0L6j75k0Q7P6J36j42M8
$$ y = [22, -138, -24, -30, 260, 108, 18, 74, 171, -79, 200, -96, 41, 44, -112, -216, -15, 68, -26, -35, 43, -193, 102, 59, 341, 15, 55, -28, -12, -225, -16, -119, -119, 49, -47, 156, -88, 155, -16, 294, 12, -51, -140, 65, -200, -123, 101, -67, -169, -69, 110, 239, -109, -217, 215, 58, -170, -76, -37, 16, 3, 153, 58, 348, 145, 2, 21, -26, 160, 144, -98, -72, 61, 406, 156, 121, 160, -218, 62, 43, -112, -106, -117, -68, 9, 238, 16, -120, -25, 108, -236, -126, -76, -81, -43, -12, -23, -46, 110, -132, 328, -21, 97, 165, 173, 12, 33, -33, 17, -84, -53, -27, -24, 55, 181, 30, 38, 2, 166, 23, 156, 36, -42, 171, 233, -172, -109, -36, 98, 6, -28, -14, -52, -199, -45, 101, 180, -408, -23, -96, -23, -218, 116, 167, -58, 18, -50, -67, -61, -41, -189, -37, -35, -106, 234, -43, -20, -25, -138, 49, -31, -96, -9, -25, -107, 76, 117, 11, -10, 13, 322, 38, 83, -14, 130, 21, 118, 202, -136, -54, 201, 9, -194, -107, -104, 75, 39, 23, -89, 4, -16, 20, -155, -175, -88, -12, 124, -18, 30]
6039C0j70J48Nk1M2q1P8m8M3j22o8L31j59m6J85k07j2k21J81J51J23n2j05j30
6063a25J29p9K38k60M7L62k31m2k1Pk09J54j8R6o4K58j1m24L36j09n2rP1R2k3
6088A13Kj12R4qJ23j47j16K0J4j36O6R7k28L28jr4J51r8om4o2K42k14k67J94J55
6114F6j3k05J55K7nN6k8j83j06J99jJ59j2k57J15JJ49j16k42PJ37Q7p4J95k92
6139a81R8L26l87p7M35k46j30MK27J37k48J67J0j10J69p8m20K58J89j95oo2K5
6162i5kQ3o9m9J16O9k20K05J21j69Q8K26l37l28L52p9J9J72J01l72J12J0j21J
6186a66Q9J99m2j44oj3J96k56J43M4J0K8j87J94j58J43o9j21P2m7n7K67l14M08
6210B13k04J7J29j48O7J33j11j6K9j46o1j08K26o4j91N26l65K70j66N9K5j64L31
$$ y = [30, -140, 8, 13, -8, 34, -47, 31, -17, 26, -96, -164, 167, 8, -38, 147, -60, -72, -293, -112, 39, 162, 110, 5, -125, 4, -75, 163, -97, -50, 312, 81, 39, 18, 25, -184, -30, -48, 48, -16, 242, 231, -193, 143, 34, -18, -27, 44, 136, 113, 115, 3, 97, 89, 212, 65, -51, -31, -17, -153, -87, 10, -218, 110, 109, 15, 166, 68, 62, 18, -44, 198, -16, -283, -89, 66, 53, -152, 3, 30, 25, 81, 53, -130, -236, -37, -38, 121, 109, -148, -33, -32, 117, 1, -241, -234, -97, -10, -84, 111, -181, -83, 243, -144, -221, 214, -32, -162, -158, 69, 206, -42, 125, 135, 25, 194, 116, -304, -46, 143, -52, -58, -120, -95, -97, -14, -83, -132, -16, 53, -167, 38, 159, -10, 78, 304, -33, -361, -9, -88, -69, 103, 204, -168, -56, -46, -167, -166, -77, 122, 80, -64, -70, -83, 113, -143, 0, 44, 54, 82, -105, 89, -69, 74, 5, -116, -44, -91, -148, 119, -195, 213, 9, 26, 155, 7, 74, 207, 96, 80, 109, -37, -98, -206, 20, -44, -235, 291, -74, 196, 30, 89, 114, -50, 281]
6233B81l12J82k26J46p3j41Q6l0l8J2J22k71M34k63M0L35j80j9m4j1J65k81l5
6256a21J65k40L26j85j46K91k05K61k21Q0K45k31l6k6K6N2o1R7j09R1N6j76j65
6279b32M06r0j94r3K70q6R1k5J60k20o7L44l01R4k34J50M34m06q6J6J85j23J8
6302A1j76j35M91o3l10M89k26J38k43M6l3j79K22l4Q8l4j05L83k49LJ9j19L5k8
6326in2K18j37j81K41P2n5M4q9j47j01Q9K3J18l8J78l76J59K4k1k42L67O9N0o6
6351A38k11K4J20J36l10J10J2l68O74m89J93Q9k88K58k55M51j30j21J15k10l8
6372a00n2J03R9j64M15n04J06L9p8P8Kj17J29K33l53K01q8J92p7o2L14k43l57
6395b84K56j2m0O8K51j33N4j36o2l0p4J00o4K57q7o7k04N19l38j42n2J50j62M54
$$ y = [281, -31, 151, -75, 71, -2, -143, -57, -87, -125, -113, 9, -262, 172, -91, -51, 284, 104, 85, 41, 30, 195, -86, -121, 44, -196, 130, -55, -201, 90, -115, 146, -75, 5, 250, 19, -17, -43, -17, 35, -26, 71, -38, 53, 109, -67, -232, 174, 84, -110, -203, 67, -19, 72, 47, 207, -13, -80, 264, -37, 57, -177, -27, 407, 1, -85, -69, 116, -7, 11, -165, -300, 191, 128, -182, 307, 81, 219, -24, 22, -11, -190, 32, -2, 86, 52, -53, 330, 81, 84, 103, -16, 19, -9, -61, 157, 20, -161, 80, 152, 97, 141, 52, -95, -196, -107, -84, 34, -4, 174, -202, -43, -19, -40, -282, 85, 154, 204, 138, -73, -49, 71, 207, -103, 7, 19, -349, 325, -164, 29, 118, -170, 88, -167, 284, 154, 33, 148, -62, -100, -152, -49, 50, -114, 301, -203, -97, -58, -136, -58, -56, -173, -44, 189, -164, 37, -51, 141, 64, 2, 316, 73, -284, -28, -40, -80, -12, 239, 106, 160, 24, -38, -68, -142, -42, -106, 151, 64, -3, -207, 312, -26, -168, -220, -70, -232, 222]
6419B22m87N37l01m3J81j50J60k75J96n3J00q2J4K25j41j13J22l73OK73J1j75
6441a46R4J77jM1Qk05J57n1j10O3j45K17m99K13N13k59k12n6J48k52L80j7j27
6464f9K27k98J7L33l49N3J40k28J36k23M42k93J86j99L5K44k65K11N5J9j46j11
6486h3j49L17R0l29J27R8k78R3M54l41r6j90K73j23L8Rj95K16J66j02j4M57m22
6509A6q6J36K2K3J23k90J0O9P9J20j31N1l29K98k77M12k51k07L04j7J58l37L42
6532B38l25J47K36l51J2L0pp1O8m4j27J18J68k4k01k0K24j81J0j33L06j02j20
6555a49p1J00K07j5K28m60J51q8J61j46J80K0m6J31o3j27R9q1l24L27moQ0m4m29
6580c69L36J23l50J36J87kj37k8J88j88m3J80m7j86K19j98L73J18m84L22p3J66
$$ y = [222, -265, 272, -29, -72, 109, -41, 119, -156, 40, -13, 87, 5, 19, 244, 103, -10, 112, -261, -255, 18, 29, -146, -52, 125, 124, 165, 173, -32, 125, 74, -36, 27, -118, 99, -400, -187, 326, 67, -145, -201, -53, -305, 75, 58, -69, 158, -140, -123, 210, -139, -86, 54, -174, -38, -261, 181, -112, 74, -125, -90, 154, -111, 100, 155, 174, 28, -83, -232, 85, 175, -154, -27, 71, -207, -114, 340, -1, -97, -287, -14, -137, -99, -90, -285, -69, 97, -5, -19, 438, 16, -70, 66, 88, 111, 234, -56, -46, 23, 102, 222, 91, 142, -187, 111, -166, 246, -5, -212, 92, 75, 233, -104, 238, -87, 60, 296, -55, -43, -13, -20, -91, -23, -67, -194, -76, 92, 68, -133, -153, 71, -110, -100, -233, 73, -29, -149, -220, -120, 87, 72, 300, -160, -9, -97, 64, -82, 98, 118, 72, 203, 140, 13, 112, 31, -293, 34, 30, 24, 104, 60, -369, -33, 90, -260, -124, 63, 61, -76, -104, 84, -104, -147, 33, -14, -200, 19, -179, 194, 312, -172, 150, 77, 243]
6602B43k82O3J55l76L27Q1q5j54J87k75J65k03L27j70P6rj05Jk13P2J54K84nl5
6626B23k76K9K03l02L75p8k28R3k5o6qp9J17J08pj87K9L8K44k72J88j59r1J06
6650b5P0j02J70l6j43K50k26J71j40N0K1o5k86N43l77k4l2J38j34L18k75M1K72
6673A79l12Q6Q5J7j52M45k74r6j18J71J45j9l7Ok96L65l48J87J2K30k83J29Mj02
6697B4J32j90J59j48J7R6p7k63J97o0j43J11L74j14j91mR7J83m1p6j33j55L36
6720A31j21k08M87l17k21M30p4j77K04l1Mj31K26l86J29J91j39l4K61j97n5N0
6742B2k05J07N7O5j89l6J15K4mk45K99j82M91m54J66j16M8N0K24n06K58J63mj03
6766D5k73K02m7J83k33K32j22L2q5Q2j87L44r1r0j06P2R5K51l92J63L5o2j73K67
$$ y = [243, -39, 24, 179, -197, 130, 211, 126, -28, 159, -116, 49, -154, 173, 3, 79, 70, -35, -34, -247, -175, -21, 263, 258, 223, -53, -24, 179, -123, 252, 174, -54, 39, 14, -52, -60, -139, -22, 86, 79, -108, -79, -41, 203, -69, 119, -40, -131, -25, 45, -57, 113, 77, -66, 184, -42, 129, -11, 39, 60, -5, -291, 252, -125, -149, -181, -43, -177, 141, -134, -93, 179, -133, -47, 38, 55, -97, 348, 74, -22, -140, 31, 176, 157, 120, 126, -170, 195, -153, 34, 46, 276, -7, 122, 126, 24, 156, -34, 125, -23, -6, 90, 13, -250, -53, -113, -256, -145, 229, 115, -76, -80, 17, 200, 159, 83, -50, -205, 131, 10, -198, 289, -28, -249, 181, 107, -70, 134, 103, 107, -24, 202, -184, -55, 136, -3, -37, 224, 27, -28, 22, -183, -76, -19, 46, -143, -179, -64, -40, -44, -289, 10, -172, 319, -135, 31, -85, -37, 13, 237, -269, -11, 152, 148, 45, -228, -26, -73, 110, -123, 109, -13, 19, -66, 16, -171, 173, 82, -8, -114, -42, 53, 304, -88, 75, 110, 48, -125, 142]
6790A42j15r6j7L09J33l36K41m20L01j28J13j06Q7m8q7k31L45j58J85j89N6p2
6812i1kj21J16R4J91j9J43j08o0Nj81Q5K9l5j32J09N0j48K50j28k3L9l48J96J00
6837A1j71r2J54Mm0L53k04k09J72mJ02j49J38J73j38j16J84q5K11k64O9J9l3j55
6861g0J83l8M1r4q8n7K52k32J32j9j75N2K24j11N2J16l9Jk00r3K79n9J92m78L17
6886H8J44k51K4j41L69l45K94k82J15k85K66J64k71kL59l25J25j06Q7K14j72q7
6908a8J71k73j08L06k87J92p2L1N1j03L39r7k1l23K69JN4k27m8K85k34n2K81J03
6932B20l15J34N7j7o8K8K6m63L33o7M09j02l02L10o21N56j36O4J13L3l97J08L5
6955f2k6L35n17L57l90K83R3l10n6O5J25J48J58j30j71k1K25J1k03J22Q1n5j25
$$ y = [142, 27, -69, -86, 223, 356, 20, 261, -159, 142, 14, 127, 21, 108, 60, -27, -258, 87, -71, 114, -75, -19, -91, -93, -214, -98, -4, 187, 168, 311, 203, 143, 148, -33, 52, 81, 46, -86, 23, 73, -75, 175, 47, 24, 63, -285, -89, 11, -160, -252, -98, -94, -134, 219, 15, -194, -22, -26, 76, -73, 65, 238, 100, -16, 168, 83, 294, 30, 99, 118, 85, -70, 113, 75, 116, 22, -66, -123, 129, -103, 29, 10, -165, -113, 111, 0, 52, 168, 129, 130, -70, -163, 116, 57, 249, -229, 88, 232, -19, 5, -136, 233, -112, 182, -100, 15, -270, -4, 160, -111, -113, 246, -79, 46, -60, 27, 241, 69, -18, 153, -120, -228, 78, -209, -17, -89, -58, -7, -110, 229, 132, 111, -212, 57, 58, 112, -115, -163, 122, -112, -164, 117, 220, -95, 39, 96, 79, 11, 39, 65, -398, -65, -132, 277, 175, -127, 183, -438, 118, -18, 46, 159, 192, -205, -97, -62, -88, 247, -270, 87, -303, -20, 73, -237, -293, -228, -103, 45, 203, 73, -98, -119, 106, 117, -86, 36, 117, 62, -63]
6978f3JL7J12J60m72K76lj27m5K26j35Q9j22J22m7p6m0m7K65j41k9O5J89l12K12
7003I5j50QK57l17K0J14k05L58m09K28k0N4j43J32k02J02M9J59k97K97j3k95L32
7026A54k11N2J01Rjo1qj52J57k10J95M9J87k9l10J1J42j42j63J23K23J9L8k51
7050g8j2p9J40j56J59K44k62J80o3R3k35J57j44J09j70M14P5n21R4k4K06L0l14
7073a57R3K02k4l50M10j54M5O8Q9j91j40M3k5l5K32J46k13k46K36J49j08j61J40
7096D9j43L8M7p9JJ41J26j7j2k11K55l75K73J3oon0j12L07l31LK81j68J49r8j23
7122d8P7j35N0K6l1J51m68J98P9K0J29j41K05n9N0p0M0l2pK95q9k6p4j69K12L5
7148B18j15j81l0Q3L70j97l48l01N03m2j12K9K28l35K26jj34J78j09J96j89J76
$$ y = [-63, -62, -25, 87, 247, -225, 51, 48, -79, -124, 102, -33, 56, -66, 56, 9, -67, -107, -154, 111, -30, -59, 6, 195, -117, 95, -55, -47, 210, -107, -87, 27, -178, 180, -229, -1, -21, 33, -110, 22, -180, -78, -29, 130, -167, 130, 117, -178, 154, -57, -5, 96, 105, 104, 43, 35, -117, 40, -170, 25, 74, 261, 232, -78, -67, 75, -67, -230, -107, 116, 135, 173, -78, -90, -169, -29, -185, -26, 218, -44, 136, 73, 166, -69, 88, -56, 53, -117, 297, 372, -149, -55, -79, 127, 157, -157, -64, 138, 114, -236, 174, 20, 65, 133, 222, 31, -109, -66, -91, -126, 106, 252, 39, -207, 29, 178, 70, -91, 49, -94, -56, -9, -88, -87, 54, 180, 163, 151, -60, 195, -180, 93, 106, 100, 94, 44, -68, 239, -92, -89, 192, 24, 173, 75, -48, 29, -106, -56, -30, -61, 90, -378, -180, -101, -81, 48, -93, 112, 53, 103, 33, 73, 41, 34, 329, 240, 214, 140, -29, 183, 218, 103, -78, -108, -25, 345, 148, -200, -501, 2, -40, -152, -123, 105, -230, -4, -5, -139, 39, -70, 126, -63, 113]
7170A13n2j16R0n6K02l40L70j41k44J98J91j77j75K60j13O9L3O0l14J08O5J68
7192A99k71O6j75L79n3k52m6J30j52J12n1M6r9L5N12j08k80P6j64J34pm6J97j43
7216C9k20K54j46O6j55j69J56J73K04l86O2J03M2j50M51n26J90J7J69j46Q3k28
7238a17K44j23R0j21K03j52j19R9k42K73l8j18K60k50J11n9K71o3l8j47j45M8
7260a33J1J40n4J72j55N6J8J18j37L7J33j53r2J11l49J25K86l2k3K3j71P5j14
7283a08J57n9P1k76J84K7k70K47k05J25n9J96l5O3J00k15J60P6k73R3j58J36O1
7306C8j83P7q5K01l6j24J43Mq4O5l18K23j83M54l90J51L6O7n4K41l25J01K8l7
7330A0K74j89J55o2k51J73l0k51J09k0K25k89K30j67q6J22j54K96k09J42K47l03
$$ y = [113, 61, -55, 35, -21, 181, -159, 211, 70, -174, 24, 215, 38, -137, 123, 10, 79, 112, 172, -142, -34, 31, 199, -72, -6, -181, 198, 145, -107, -153, -23, -175, -63, -114, -68, -167, -132, 380, 272, -8, 68, -96, 38, 31, -15, 182, 39, -181, 73, -73, -7, -162, -331, -175, -2, 202, -184, -122, -19, 23, -127, 324, -202, -12, 5, 174, 28, 111, -117, 127, 4, 94, -27, 176, 24, -95, 4, -238, 35, -3, -121, 139, -111, 0, -59, 212, 149, 111, -36, -181, -133, -122, 18, -36, 136, -19, 37, 55, 173, 36, 73, 206, 53, -39, 72, -277, -152, 134, 102, 79, 102, -69, 6, -108, 49, -10, 61, -215, -31, -4, -274, -27, -232, -107, -166, 30, -5, 58, 158, -57, 103, 179, -94, -1, -159, -23, 38, -145, -68, -153, 48, 12, -112, 31, 35, -49, 16, -302, -79, -262, 192, -198, -47, -11, 56, 2, 243, -82, 19, 47, 10, 284, 95, 250, 188, -63, 110, 80, -171, -62, -82, 143, -146, 84, -83, -169, -47, -201, 95, -114, 28, 275, -28]
7352b8m12L41J31K9j29K42j87q7J32J92k99K9N9j86M01j19k35J06J92m6J6k94
7374a52J40Q8j8P7m33J27J91J72k67K41j02j0k78J53J35l1j9l6n1K4K05n2j17
7397a3N3qJ66j73O1j33P4j81J25J31k18M2J06J16l48K72j5l2o5O6K21l87m5M9
7421a36j04J99%j54K56O0K00k52j25J33k68N54m46Nm1K1K77j18j98L34j08j51
7443f2j0L42l80R8J5qk44L49J28j60J17k89J34R7l96K72j09K49m0l16K01K90j27
7466A51q8j16M9l76M51q1l6j15J41o8K05k02K06k45J70j61M7Pn0J93p8j04l2n3
7490a85L10Lk30J20j02J46k72K42k32Q1RJ05p2J89l22J56J56k25jn9MJ83O0qQ2
7515A38p8o1j3j2JJ29M3l11L27j62k47J29J75j30j6m4k2J34J22j5J62m56J10K10
$$ y = [-28, -440, -99, 32, 61, -68, 174, -13, -100, 32, 224, -75, -46, 13, -173, 228, 109, -126, -20, 172, 126, 142, -152, -12, 76, 58, 135, -298, -171, 20, 192, -75, 166, 64, 54, -224, -71, 64, 33, 14, -22, -73, -49, 156, 104, -13, 40, 32, 198, 25, 86, -47, 27, -154, -29, 102, -116, -74, 32, 148, -200, 72, 57, 25, -40, 26, 247, -140, -185, -136, -240, -41, -41, -195, 61, 121, 321, 69, -56, 77, -191, 363, -83, -78, -119, -98, 179, 61, -137, 197, 89, -62, -72, 270, -110, -12, 3, -5, -249, 100, 228, 68, 185, -104, 30, 127, -269, 3, -106, 143, 103, -213, -12, 278, 151, 63, -53, -4, -380, 71, -10, -46, -161, -20, -88, 117, -85, 121, -124, 46, -115, -68, -61, -111, 82, 4, -100, -132, -185, 125, 128, -102, 18, -84, 62, -210, 32, -200, -119, -110, -5, -77, 112, -210, -54, 102, -123, -124, -183, -179, 4, 64, 56, 138, 60, -1, -14, -26, -25, 104, 147, -164, 163, 1, -246, -117, 58, -72, -88, -132, -154, -20, 102, 87, 249, -207, -97, 113]
7539A13l8l3n1k07J30nK74m42L47j12M7p2K77k61K70l81M06k17j54K11j26K46
7561B22m56J89L7J0k01j9M03l54M0J64o6K56r9q7J26q5j98K09j04M0J56l16R3
7584d0K51k79k9K65j88q1j5J72J79k37J88j33Q7k22j77Q8J96k09mL22r4o9J97
7607A68j80k23K86j85K57k67J19n7K20k06O3K3j04J28k59K82J60j60N8l40K45
7628B8j49J06rl1P2N7o0J45l11K15J8j44j02L8p9J19J50r1K38k20J58m45L82J15
7652B00l53J81J80m5k26J03K32k44M8J25j32j8o5j40K45m9J42k27j05K24Kj03
7674b5p7L1K56k40Q1J14n7j87K8P5l1LL18k96K45k71j93K95j40J96l74R2R3J93
7698A29j06J76l16L4j32L34l1J68k88o3j6J08J12n4k7j56K59j30Q1q6Q4Q2P9r1
$$ y = [113, 75, 42, -9, -216, -86, -91, 183, -259, 88, -24, 23, -49, 228, -33, 237, -144, 262, 45, -109, 102, -24, 222, -234, -45, -8, 2, -199, -218, 185, -169, -129, 35, -31, 225, 126, 39, 165, 80, -118, 91, -13, 27, 183, -133, -40, 211, -68, -97, 168, -20, -101, -116, 56, 235, -2, 186, 53, 140, -82, -259, -171, 25, -184, -188, 134, 40, -29, 168, -12, -235, 51, -134, 123, -144, -25, -82, 138, -68, -5, 18, -86, 42, -217, 65, 225, 65, 123, -217, 28, -121, -15, -24, -55, 17, 74, 14, 159, -152, 63, 81, -63, -165, -127, -206, -87, 63, -28, 210, -10, 148, -297, 85, 200, -153, 28, 208, 163, -63, 40, 272, 28, 76, 201, 69, 51, -14, -154, 91, 42, 184, -43, -148, 76, 78, -25, -102, -71, 185, -55, 26, 140, 83, -104, -76, -1, -32, -29, 289, -7, 238, -33, -226, 69, -71, 125, -249, -157, -64, 129, 23, 199, -117, -83, -215, 119, 88, 256, -32, -95, -111, -3, 109, 55, 28, -128, 131, 1, 82, -4, 80, 162, 241, 150]
7722A50j94k31M23K37r9k5k12r6P9M6l2n6o8j3KON9j23J0J1n0K60j91L5n0K50
7748A28J37k95j74K81Jj91j5R2N0k4R3j61J32j62P6J33n4j54M1J65Q7p5J30l10
7772f9J29j07NJ15nj14R6Lj5J31k27L1J00m8q3l5R5O3J34k55P7J32l30J58J6j81
7798a84J92J03j24j45J75j96K3R0N0R9Q8j89J59rk86J85M1J56m46L14k85K87q8
7821A0k1K77k11n3j57l4K32J5Pp8J09j25o4P8j37K6K03r8rK78l32K72k9m0l59
7846b40M13k43j82N56l53n8j7J37R0j90K0N1k58J45M23l39K5L3M7j41K07O2k45
7869e7p7K98k70M4O7J48m9j37J73k20K22qj8k17J94p6nJ15o7J86l30Q5j62K71
7893A10Pm0j33K21j79k34Q9J92k0r6j07L59n5k96M8K79O4l11J50o6o1Q6J82K4
$$ y = [150, -44, -275, 148, 385, 286, 261, 49, -47, 32, 78, 46, -10, -78, -91, -89, -83, -24, -147, -137, -126, -176, 84, -107, -72, -122, 128, 265, -30, -204, 77, 78, -113, -128, -36, 14, -10, 83, -78, 54, -108, -32, 101, 47, -107, -66, 99, 186, 111, 241, -69, 60, -47, -42, 73, 68, -46, 50, 53, 38, 169, -58, -27, 73, 25, -58, -93, 2, 65, 199, -56, 21, 153, -177, -19, -3, -184, 8, 111, -13, -158, 17, -179, -156, -66, -16, 83, 171, -18, 141, 132, -154, 31, 72, 228, -218, 96, -189, 98, 10, -11, 266, 55, 2, -155, -189, 43, 58, 65, -13, 96, -29, -93, -15, -152, -126, 77, -21, -30, 248, -84, 188, 159, 119, -240, 173, -70, -252, 304, -49, -107, -124, 13, 103, -87, -67, -16, -274, -129, 294, -45, -20, 13, 60, -81, 126, 188, -57, -134, 164, -106, -62, 5, 153, 104, -33, 140, -80, 142, 134, 116, -101, 93, 17, 12, 127, 60, 246, -84, 1, -161, 110, 117, 77, -56, 165, -14, -248, -159, 33, 13, -83, -190, 169, 114, -182, -134, 145, 209, -102, 48, -18, -79, 7, 189, 213]
7917B13m50J56M7K91m3j40K3j23p5P1j39K39k12O5K55m90J57Q4K30j07j0l12L29
7940E9k3O9K3l02K19j21R0J25k83J59kL2q3J98k51J87p4n0K29q8j85J60m9k6J22
7965A35j59j27J13L52n87M58o1j82K11o5j17j3r3r9K13k1R7K7k57J27J18j38n2
7988a20j42L39n8J54n2l63K17K12k33J61n6k7j97J52J26k76J40j97J17J77J43
8009B17j01j19N8L4J34m7k87L86m10K03p0Rj14K11l41K77j83M28j46j45o9J40
8031F5J72l18J01K1O0ro8O2k35p3K73Jn9J73j87N4p8m1M8J26J54k77L0J10j66
8056f1n6K04j43K50j36j42o4K7O2J02K11k94L7R0J16j83O6j40J8P2r2J27k8K41
8080B84k21j67L56l96K2j2Q4J22J43j22K8l38K95j04P0j76J21p4j4O8k66L15k1
$$ y = [213, -237, -81, -34, 257, 214, 74, 97, -26, -101, -30, -169, 70, -142, -77, 178, -312, -155, -71, 159, 52, 42, -270, 59, 36, 105, 128, -174, 45, -76, 14, 139, -144, 15, 13, 45, -38, 160, -91, 96, 22, -28, 201, 113, -72, 88, 39, 13, 135, -24, -151, -38, 314, -273, 185, 124, -58, 153, 88, -29, -42, -135, -234, -21, -42, 55, 82, -175, -48, 70, -68, -120, -262, 77, 19, 173, 121, -242, -25, 187, -46, 115, 59, 32, -165, -13, 113, -163, -23, -220, -103, 74, 217, 116, -3, 55, 89, 223, 176, -111, 275, -135, 68, -2, 7, -107, 104, -237, 40, -143, 285, 139, -6, -75, 65, 237, -81, 20, 41, 101, 92, 24, 86, -149, -222, 51, 52, -7, 166, -21, 33, -45, -86, -38, 88, 242, -35, -5, 105, -61, -117, 87, -56, 194, 58, -84, -148, -121, -59, 43, 254, -40, -3, 87, 203, 20, 86, -54, -36, 36, -56, 71, 43, 284, 63, -104, 252, -144, -122, -134, -50, 72, 215, 93, 121, -217, 78, -26, 44, -132, -11, -85, -99, -31, -297, 18, -3]
8103cM0p5L10l54o9J32N9j1P9j25J39k33R1L7j2j25K83m2j97J50j97P4j71K50
8127C0J3l5J37j98j21K42O9k4k32J57j42R5Q0n9j68J86k41J01J41k82J22J63P0
8150A04J12K5k33Np8K19j42J72k09J00j26J88j93j6J44NK7j85K76j33j64lMK46
8174A45j01L30m05n2J35j04L35l63P3l4M9K3o6K3Qn3J80
$$ y = [-3, 37, -38, 272, -82, -151, -19, 40, 29, 108, -17, 122, -111, -20, 17, 5, -120, 163, 121, -76, 74, -123, -49, -220, 30, 43, 8, 145, -53, -174, 68, 137, 113, -119, 38, -104, -9, 71, 12, -156, 30, -211, -110, 31, -251, -129, 34, 104, 216, 241, 8, 13, -65, 154, 12, 184, -25, 75, -51, 137, -56, -72, 72, 77, 104, -81, 195, 62, -102, -105, -101, 145, 44, 374, -31, -83, 52, -52, 283, -80, -7, -41, 8, 31, -35, -12, -4, -57, 123]
8191A23
$$ Imaginary data points
##PAGE= N=2
##DATA TABLE= (X++(I..I)), XYDATA
0@%%%%%%%%%%Qj6J6j6J6k4L2m0M8n6P2q5R6j15J36j55J79k08K41k76L16l59M06
33B16m61N22n87O55p34Q22r14J017j132J258j390J534j696J872k063K273k504
50a312K757l038L348l697M089m528N028n606O281p080Q043r228J0731j2705J5426
65H509j9422K5860l7882O7563k69754l63145Q04471K71774o03263k54324M05963
76C6350J33559j72088m7796L2091j9202J28833J04935j77703k05947J66542K38612
87B18186j58861l16160J08553L22210m4442k69500J4259J72202O876n8985j0260
98a5922l9713M8550J40548o9418j95411Q7634J87665j04774j50731Q5221N9898
109C3547o0334L2337L1631r2931J9498J32517n8988j36527Q9438J27748r3567
$$ y = [0, 0, 0, 0, 0, 0, 0, 0, 0, 0, 0, 8, -8, 8, -8, 8, -16, 16, -24, 24, -32, 40, -45, 51, -64, 72, -83, 96, -112, 129, -147, 169, -190, 216, -245, 277, -310, 345, -389, 433, -481, 536, -596, 662, -728, 806, -890, 982, -1081, 1192, -1312, 1445, -1593, 1755, -1942, 2147, -2381, 2647, -2959, 3322, -3758, 4285, -4943, 5788, -6917, 8509, -10913, 14947, -22935, 44628, -225126, -588271, 216200, 487974, -115289, -369613, 36350, 169909, -2179, -49975, -17884, -37086, 91747, 196682, 18979, -186968, -20426, 218186, 59325, -256835, -148282, 173928, 129486, -140014, -125755, 46447, 53323, -5662, -15922, -55635, -7085, 133463, 64045, -131366, -43732, 143933, 39159, -111572, -26351, 33547, -26787, 5550, 37181, -55750, -36252, 96265, 37277, -99250, -9812, 117936, 24369]
120B4369j09851Q0183Q0415q4672p0360Q8402N2704j11843l8499J37920K0396
131F9164j47953K0901J53752n6274j31757Q7282R6966r4250m8281Q1975m806o1555
143c4836M1240K8296o6835J347P3087k7148p0917M1932P1941l6558p0193K5436
155b3208O8769j4984o9431N551O3963p050n7817P384L8963r338q165J3598j8759
168a0524j1024M3132J3207m8743j2811M3916J6562k8777k7961O322M1205J3442
180C7946n6921l3365O0833M2585n5778m5537M2486M3746k3328l6826N289K9884
192A1014J1066k1227k2617P829K5281N524k1085j9549J4210L0842m368l5959L07
205a8732M0915N142m0301o499L5460M269k7676j773J7493m838j2042R508O298
$$ y = [24369, -85482, -5299, 75116, -9556, -79916, 8486, 61190, -50653, -89152, 48768, 69164, -78789, -57888, 95864, 39590, -92167, -4885, 92081, -2169, -50450, 31525, 26719, -34836, 6404, 34700, -32135, -30788, 42299, 15151, -55766, -13834, 58107, 21549, -48644, -23208, 45561, 30577, -38854, -33303, 30660, 23610, -34207, -26823, 12140, 2802, -5363, 8235, -10524, -21548, 21584, 34791, -13952, -26763, 17153, 33715, 4938, -23023, -16701, 24504, 37946, -18975, -52340, 8493, 51078, -4700, -50237, -7751, 35995, 12667, -24159, -18870, 11014, 22080, 853, -21764, -13935, 11346, 16870, -4215, -23764, -9554, 21288, 16920, -19039, -18732, 22183, 27325, -12976, -19475, 15985, 20254, -7422, -9195, 8298, 3460, -8582, 926, 7224]
218G224j5320l642J8176K420k1827k122K5122L631k6238l682K7538L570k6135
231a1285j113K5209k611k4520P335K1940j1822j5426J7700Q238k0250o3K2187
244A5519p989k0603J1733J5481j5607j2074J4230R125j2082j0033R053J1534q281
257Fj2083J0640J0843j3864o922J7981K258j9109O430J8652j2286j5601J4657
270A602J2692j2583j1341O673J3443q88j8096k453K4250K043l0318Q50L1547q392
284I029k8499J4536J9176j9857q835K0680L41j7908O473J4737q453j2118Q101
297b597J3398m994j7220N213K2718p809k5405J4809K4161k1760j9157K5971R350
310A6678k6782J105K1439j0508j3744J3453N692j2430k85P657j418l775j398J397
$$ y = [7224, -8096, -11738, 6438, 8858, -12969, -15091, 10031, 13662, -12576, -16258, 11280, 14850, -11285, -12398, 12811, 10200, -14320, -6985, 14955, 3133, -12293, 5407, 13645, -6605, -6668, 15519, 7530, -13073, -1340, 14141, -1466, -13540, 690, 9815, -2267, -12300, -3247, 8287, 6, -12077, -1437, 9406, -4458, -11380, 6601, 8859, -10250, -3820, 14832, 2546, -13055, 1602, 14294, 1711, -9630, -2957, 10486, 9598, -8498, -10951, 13299, 15342, -14976, -14126, 17421, 9029, -19470, -4934, 14242, -5615, -14450, 6230, 6571, -11337, -4864, 9873, 1420, -10698, -2597, 10801, 5807, -11413, -6200, 16518, 8709, -16696, -1887, 22274, 514, -18643, 7328, 16678, -10104, -8999, 12440, 1932, -11812, 1641, 7333, -5097, -5382, 2275, 857, -2918, -4316, -2919]
324b919O237k597j0022Q032J2235j3087p913J7522K251j7555L964J4595q065r000
338f322Q571L569n271j091O26R86K866n210m680R059K29j1884N669J0989j3134
353e028n929J8938j412k0945R830J9332j5950j4902J8716J0350j6110o823J3593
366C660P299r758q907Q611J0665r891j1437J2102R409j6123m908J8004l137j7541
380a1952R944J3813j6076r515J8357N062j8518k038J6160K418j2315l983J0603
393A960Q123j0230j0759J2134J1682j4046r385J5768N394j5670Q54J3357o204
406B978j0189R972N169j2268k679J0559J178r578k047P955M490p756o875R318
420B27Q371j2620p153J5770L951j6996J684J6891n635j3286J0144Q562j0732l674
$$ y = [-2919, 3318, 721, -9301, -1269, 10966, -2121, -10034, 7488, 9739, -7816, -3852, 10743, 2678, -6322, 2249, 5818, 547, -544, 82, 1068, 3934, -1276, -5956, 3103, 3332, -8552, -2883, 8106, -5028, -10957, 7981, 6569, -14376, -4546, 14786, -1164, -16066, 2650, 13000, -3110, -9933, 3660, 10959, 1201, -7706, 905, 11570, 1679, -9758, 2344, 11753, -4370, -9278, 8726, 5589, -11952, -2008, 11805, -4271, -13786, 4571, 9633, -8885, -10923, 5237, 7655, -4660, -8643, 1960, 10083, -147, -10906, 1228, 12910, -1136, -10521, 5247, 10641, -5029, -4175, 9182, 2978, -7211, 2761, 7930, -4338, -7017, 3542, 4720, -4858, -6905, 1050, 5540, -2216, -9091, 227, 8598, -4022, -11175, 4595, 8546, -8450, -6766, 10125, 4490, -8796, 1348, 9910, -822, -4496]
434d496R119q55n752K359K099k555q05Q33J801K64n961j12R643l345j4016P612
450d167J5333j2700j2603J5872Q647j5729j930J3337k987p787N876K979n113J73
464g99K789Q75l05m650M36R665l883j4521R195J4916j5910j2485K0117N912k1993
479a0641J138J9325o785j3809Q173Q299n763m986J500N652L167q641m150J4404
493F883J884j7145M343J7304j2900j1572J9035K792k1209N284J8982j0973j3705
506a0997J1077Q131q169n967J780O168M022j1321n612J6200L011j9080M434J7991
520A1668j1555j1562J6990K632j7628O240J4478j1176p658J1785J916p226O28
533d68J159R79L063o951m222J2211L89j6594O423J4937j2912r373J6611N85j5605
$$ y = [-4496, 4623, 3768, -1984, 375, 2474, -81, -886, -53, 1748, 2012, -3949, -4061, 5582, 2237, -11779, -4167, 11166, -1534, -14137, 1735, 10382, -5347, -7277, 6060, 3073, -4714, 1162, 4141, -972, -799, 1990, 2865, 2560, -2090, -1654, 8011, 4128, -10393, -1198, 13718, -2192, -14677, 5440, 11352, -10641, -9503, 9822, 3037, -10772, -2599, 5700, -63, -5049, -3549, 2103, 5270, -3371, -7521, 6883, 8767, -8378, -4035, 13269, 369, -11203, 7832, 10624, -10585, -5301, 13681, 2708, -10997, 80, 8211, 42, -5925, -4145, 2023, 6045, -5276, -10888, 5312, 8323, -10757, -6323, 11668, 113, -11449, 5541, 8173, -9455, -3215, 11263, 87, -7571, 4214, 6130, -1096, -468, 691, 1670, 4733, -2218, -6440, 5771, 6160, -10434, -4011, 10926, -1986, -11359, 5252, 5837, -9768]
548i768O439J0099j0325k521J0443k630n817M552J475j559K279l478j017Q260
562F432l980j0953J1160R305j7078k909J8120m763j6623J1031J0674j4318m804
575h706J1731J94p475J134K970J416l01n502J451Q963n226q602J0287N332j4059
590f393J772J5865q701j2764J3844P536j4345l703J1349J495p117l011J848O366
604D041M97r859j52J1664l934j1316Q197O629j0582J41J0367o424q149J0812O307
619H239j0236m078Q280L396m666m841K403Q125k280j0485L559J0941o235q145
633f023Q510K550j0187K003Q942o118o429P594K945p432q48N887P31l180k168
648c223K150K584j108k906L579K073m826l24O669k066n869M873M180o779l238
$$ y = [-9768, -3329, 6770, -3555, -6076, 4367, 1737, -4080, 472, 1947, 388, 2667, -811, -1828, 6432, 2452, -8501, 2659, 11964, -5114, -8023, 10097, 5334, -11289, -258, 10416, -3902, -8706, 3025, 3219, -4256, -3122, -152, 1264, 963, -4539, -3088, 5875, 649, -7953, 2334, 7666, -6393, -4621, 11244, 2543, -10221, 3623, 11159, -3186, -6889, 4460, 5955, -1162, -4173, -2325, 4041, 4538, -5321, -5473, 6191, 2257, -9059, -862, 5767, -4815, -4674, 5693, -731, -8880, 1932, 8239, -1997, -6075, 2205, 5601, 935, -3906, -1503, 6622, 4342, -6143, -2584, 8357, 2122, -6023, 2487, 5037, -5150, -3147, 5795, -323, -6752, 842, 3787, -3645, -4493, 1394, 2125, -1055, -3223, -1073, 1511, 403, -2503, 1076, 3149, -1677, -2001, 4668, 2602, -3267, 1606, 5786, -993, -4231]
663d231O349K289m763k184K663J971k473k484K438L142m492k275M894J79n552
678d529K961O010m865n479O021N778o149m836O095N134n937n707O456O737p360
693C30o019Q354L494r075n74Q065k120p726L578N293m671l372N271K486m942l229
709d857M233N103m683o188O227O183q160m247R873L188r981K7Q350k565n253L458
725G08K305k503j360N6J896J181l528j344N572q23p797L868P020p452m173Q782
741B408O73q882L693O636m643l296M354R73k365K88o2J405J893m046j453O616
757D192q08p065M075N032p774j449Q434l592o871O627L689q167j8O964k510m024
773c265K436P81l40J030k881M09O031l658o101P599M221r669J87R707m484p174
$$ y = [-4231, 2118, 4407, -356, -2540, 123, 2094, -379, -2863, -425, 2717, -1775, -4050, 844, 1023, -4529, -1568, 4442, -423, -5902, 119, 5897, -252, -5088, 1007, 6141, 204, -5503, 953, 7690, 330, -5689, 2665, 6159, -2916, -3490, 4575, 2455, -5271, -1693, 3600, -1071, -4443, 828, 3314, -1628, -4857, -624, 4479, -204, -6392, -165, 6018, -2142, -6389, 3484, 6672, -3309, -3282, 5068, 2503, -2750, 708, 3013, 510, -850, -794, 1102, 2283, -1245, -2589, 2983, 2160, -5637, -1769, 5251, -2201, -6374, 2408, 3081, -5801, -2108, 4528, -115, -3411, 943, 1916, -449, -161, -223, 1182, 3075, -971, -2424, 4192, 3384, -3681, 394, 5426, -2348, -3797, 4637, 1045, -5826, 801, 4490, -3677, -3695, 3269, 759, -3265, -829, -48, -388, 642, -2239, -1830, 4201, 543, -5558, 2041, 6262, -3407, -3220, 6487, 2003, -5171]
789e171P409L054q033Q31O109l229l399K800N73l22n86l585K115N730n977n451
805g132R871K480j1929K179J1424n659p797P639L747p221K99M767j063k029R99
820E75n71K020L05m535J374O147n461n322Q390J871j0398K406R395n749o986P392
836H53K422n965Q1L340r80J29m62j266L269J447n201Q91O368m143m808O521J369
853C865p132K442N919n302l512O290L84n869J855L135k675r27R89m45J001O9k869
870b782J821L682m289k257O324m05o081L472M974n552k087O706o44n673K818L774
886C801l565j840K694J00r95j177j73K399Q60m656k86O328k223o925M237N564
902D143o048l230O954J222n860R73M326j321k846J751J666n63j707j27K708M47
$$ y = [-5171, 2238, 5292, -2741, -1910, 4199, 970, -2429, 371, 944, 622, 36, -3549, -1434, 4296, -1681, -7132, 2739, 5219, -6710, -4531, 6893, 1234, -6563, 1076, 4823, -2398, -2099, 2668, 1605, -424, 575, 4, 2024, 2329, -2206, -832, 5315, -146, -5468, 2922, 4793, -5605, -3199, 6196, 447, -6539, 853, 3275, -2690, -2609, 731, -249, -120, -582, -1848, 1421, 2868, -2333, -1442, 4926, 783, -4025, 2496, 3865, -3267, -825, 5094, -208, -3720, 2570, 2954, -2915, -1060, 2075, -600, -1527, -538, -983, 18, 87, -2782, -961, 2721, -1568, -3825, 2499, 2094, -3987, -515, 4459, -1093, -3180, 3526, 2882, -2791, 27, 3801, 236, -1604, 1090, 1190, 195, -982, -1155, 1244, 2104, -2552, -2838, 3490, 1267, -5658, -1421, 4143, -1905, -5135, 1819, 3041, -2819, -1846, 2480, 1159, -1687, 64, 1730, 1167, -540, -667, 2041, 2488]
918B488m400O64N697k331o611M251N806o056n016O938K354o726q54N481j51l719
934b185L36K325L84j712p49J525J559k419p98L585L12m481K211M407l983l522
950c205N207J743n769l6M800j186l812J897J718j246p31l1K23P90j296j266K363
967A63J091l640P46M030k422k668M559N20m794J585M449l491k934M594J168m112
983a156L05K751l58j214j139J31K163o65l843K102L899l719k960M837P96n371
999c441J639M761m019k691N398N98m341P21L438j76k201n01J441K233j929l609
1015b679K966M244n176l382O502J123p078J177O021l467l718L362J426k862l62
1030a903J825k1k12p56K43K456j082l314L236L254n240k040O593O06o517J871
$$ y = [2488, -1912, -1248, 4449, 2118, -4493, -242, 5564, -492, -5508, 1430, 3784, -2942, -3796, 1685, 1534, -2185, -1849, 476, 860, -852, -1601, -76, 1483, -936, -1734, 1851, 2163, -2318, -107, 4300, 317, -3205, 2002, 3745, -2024, -2060, 2740, 1554, -2258, -361, 1357, 111, -620, -651, -428, 362, -934, -2200, 163, 1254, -2386, -1640, 2390, -32, -2700, 1859, 2379, -2415, -830, 3619, 128, -2806, 1788, 2956, -1156, -851, 1900, 1542, 328, -811, -680, 1483, 818, -3025, -923, 2976, -743, -3703, 1134, 1930, -3441, -1802, 2959, -1060, -3751, 1647, 2245, -2096, -1375, 2063, 1887, -314, -815, 626, 2859, 930, -2679, 287, 4531, -645, -4027, 2475, 3598, -3480, -2303, 3718, 251, -3467, -105, 1321, -1541, -1903, -78, -99, -311, -1067, -824, 1632, 550, -2764, 472, 3726, -1514, -3554, 3039, 3645, -2872, -1001]
1046a001N217k909l613L064J516k178o36n7N58Q28j336j303K595k16l035J812
1062f94K894l622j078M279q71m160L075K753l488j096L417O00k583O59P20L0N3
1079H88j213l60K483n64k847J734J840k747o85L263j799k421K724Q80l489M96
1095a817L618j361k486J066K050l26j821j70K035J300k913j409M101N04l563N71
1111f21L534j864k842K062J805k589j071K399o0k073J30K239k98k430mK775L9
1128A131l828R71L853j008m054J676M243j925l387K052K559j342k499J744K067
1143B253j517k282J876J578k218o88K504o35k441Q96J710j543j663J945J216j098
1159a07k136J550K025r29k316R07L029k072k403K802J983k725p15K557m64j450
$$ y = [-1001, 4216, 1307, -2306, 758, 2274, 96, -540, -597, -39, 789, -547, -1850, 745, 529, -2506, -694, 2200, -1422, -2500, 1779, 908, -3252, -177, 2576, -912, -2008, 1409, 2009, -574, 85, 805, 835, 888, -325, -685, 1798, 1234, -1613, 121, 1961, -786, -1471, 1792, -7, -2428, 296, 1176, -2313, -1817, 1801, 440, -2046, -980, 1070, 744, -1077, -1247, 788, 2088, -825, -2234, 1867, 2371, -1192, -621, 2913, 1049, -1793, 269, 2074, -515, -1586, 813, 753, -1320, -1190, 1049, 751, -1679, -1683, 1092, 1131, -2697, -1726, 2127, 1119, -2935, -1259, 2984, 1059, -2328, -276, 2283, 941, -1558, 186, 2253, 736, -1546, 330, 1908, -310, -998, 1506, 871, -1570, -674, 1036, -507, -2170, -225, 991, -107, -2243, -693, 1332, 403, -1913, -1006, 2023, -49, -2452, 350, 2333, -392, -1107, 1450, 986, -464]
1175d64J381l21p10M24O26j209Q9N90l09J35l79j414J404J743k683j585M108k71
1193A155m430J953L747k500j973K736L63j913J331N59j376Q19M71j161M44Q26
1209A051j182R07J349l621k05M414j566m736L300L507m750j982M891R6l167Q60
1225h34J028j70J65r22n26K698k64l331K125L118l819r15M606j622m249L947K415
1242C450m891k73L905j143k799J318R72l42L48k004l09L416p76m443L266L366
1258C061m882j614N933j209l750L063J365l546J135K528k462o26K651r46j360
1273f59J874o56j108K467j295l265L264K015m936K01M903k355l584L204J381l093
1289a642J455J344k425J16K555k046p95K889r28j478K048o78j762L084N48m725
$$ y = [-464, 917, 596, -114, 310, 936, -273, -184, 406, 97, 232, -147, -1561, -157, 1586, -1097, -2682, 1426, 1155, -3275, -1322, 2425, -75, -2048, 688, 1051, -862, 469, 1028, -348, 471, 942, -219, 225, 1051, -131, 776, 2125, -1496, -1701, 2713, 1147, -3589, -289, 3218, -1532, -3514, 1377, 1473, -1694, -834, 194, 24, 189, -733, -1259, 1439, 1175, -2156, -31, 3087, -732, -1647, 2959, 1337, -2912, 1035, 3450, -1441, -1714, 2191, 1048, -1751, -433, 539, 197, 545, -1459, -1768, 1648, 872, -3571, -305, 3061, -1821, -3435, 2498, 1289, -2461, 602, 1967, -1579, -444, 2084, -378, -1004, 1647, 701, -659, 1215, 559, -549, 1918, 623, -2642, 622, 2637, -2299, -2098, 2805, 450, -3134, 70, 1451, -1642, -187, 1157, -1268, -1152, 1403, -643, -1438, 1451, 523, -955, 1093, 415, -1347, 1737, 2285, -2440]
1305b440K091L866l860k606N150P7m754J565K607k151m44J263j196j29J566j605
1321a000k65K522j458j670K973K00l850K705L051m663r09N125j071m308K549K807
1337B738k348j185J013K67J20Mk176J094K716k902k148L959L86l805J424K349
1353A506k704q33L242q76k338J808J554j988J56J091j15K68n51j295J660J712
1369B297l236n55L396r8l968J773K476k339j255J885q2j206R44j28r62J115K19
1386B76r30J43P28o37N65K45j322M45J952j313j824K165J741k403p50K299n6j967
1404f43N08O78o62J01L11l62j90M31m65K00k04n51Q40L93j515k70K041k2k367
1423a748J022K428j163k047J200K023r98j468L78J685q03j152L67J324l21j123
$$ y = [-2440, -349, 3517, -343, -2949, 2201, 2278, -2476, -911, 1696, -455, -899, 364, -832, -961, 605, -1000, -1265, 1257, -201, -1871, 1102, 1302, -2548, 157, 3208, -1455, -2364, 2761, 1690, -2618, -69, 2738, 390, -795, 218, 485, 605, 609, -1567, -473, 2243, -659, -2807, 1152, 1538, -2267, -843, 1506, -1198, -2031, 1211, 335, -2003, -195, 1359, -629, -473, 618, 503, 771, 220, -1075, 585, 2297, -939, -1494, 1902, 1804, -2164, -391, 2085, -254, -1509, 376, 294, -912, 32, -96, -1058, 57, 276, -654, -511, 217, -420, 145, 390, -932, -487, 1465, 152, -1672, 493, 2234, -169, -919, 1380, 1324, -643, -135, 543, -119, -18, 293, -69, -259, 172, -293, -93, -297, -848, -8, 385, -1130, -1400, 641, 619, -1748, -726, 1702, 539, -1508, -308, 1715, 717, -751, -373, 1312, 509, -643, -276, 1048, 727, -396]
1439c96L33O70o37n87R38L4j464K90J734q87j733R74K143j375j780J222K355j675
1457A59j850J403J563q74j350J295J015p49j289L48J787q95j364Q41P53j186o1
1474d54J242n67j729J387J104k199j78J815k7j237l31J400L07n84r37P72J418
1491A202p14j435J009J159j238o02J631l68o52P02k5r98K51J245j399r56J233
1508D5P33j497N3K63Q18j93q27m98J687J71k087M68J996p99j766J693P72j436
1526d04O79P38j233l77J499m53o64r5Q73j24k89p55K27J532q98k196J350K324
1544A734k317j856K517J251k380k49J867j82r78K78N04k67K24l12K19M95m08k00
1562f0R31j85j587R65J556j800j068J893O35k643K42J884l20j433J37J117L26
$$ y = [-396, -63, 607, -30, -617, 321, 355, -1109, -819, 915, 28, -1705, -731, 1412, 37, -1743, -521, 1834, 159, -1691, -288, 1275, 401, -949, 346, 1361, 612, -677, -329, 1458, 563, -801, 40, 793, -393, -454, 788, 221, -1508, -121, 983, -1216, -1394, 421, 394, -843, -1174, 226, 533, -51, -988, -216, 1202, 488, -947, 62, 1221, -17, -619, 1012, 644, -8, 694, 669, -329, -78, 1167, -232, -1188, 45, 778, -719, -666, -403, 415, 222, -605, -1103, 584, 755, -1332, -864, 1132, 333, -1433, 260, 1032, -404, 275, 1013, -220, -597, 902, 449, -215, -310, 563, 439, 150, -605, -378, 1154, 256, -1940, -590, 1734, -583, -2439, 78, 1329, -1051, -1300, 567, 385, -593, -315, 189, -78, 146, -166, 53, 548, 140, -60, 871, 686, -901, 64, 1620, -180, -1248, 645, 1280, -1363, -1121, 763, 443, -990, -853, 264, 590]
1579E90q77q02N15J368q40j236J274J141j239l39J301l99q93J008J14j064L75
1596cJ082p74r88J115L21n79o51J08P50m65m29K7M77K65r96k05J350k04q50M53
1616a96O44r94K00R31q16n20J398M81j751O7J619j34j473K23R55j05m96n81O11
1635F3R44j278o63P01J269j747k50J229k04q58M58P98q75J01R82l57j103P21J082
1654A013n23q12K30L06O50j039q07J752J072k442p43K412R8k555O60J574q71r53
1672i78J080l9q55P52J32r25R38J19o98N76M13j259J113Q37j672m04K260n68k264
1691a442J580J607j969r02J914l00r39O39r9o75J315n87j212J198O42j678M33
1708d75J311j386j25J416p57j527K559K32k667R80J937j467r53J482J66q30O36
$$ y = [590, -287, -1089, -574, 794, -46, -1282, -8, 1133, -106, -445, 856, 457, -436, 572, 686, -378, -3, 1079, 305, -683, 432, 753, 174, -477, -369, 381, -84, -513, -486, -9, 256, -740, -945, 405, 201, -649, -196, 448, -546, -346, 585, -231, -751, 647, 1128, -623, -556, 1063, 929, -544, -321, 634, 529, 33, -548, 63, 1007, -271, -934, -233, 1036, -711, -961, 268, 64, -794, -336, 462, -413, -312, 670, 313, -790, -69, 1013, 490, -322, -92, 214, 864, -175, -982, 770, 1842, -600, -1343, 1069, 1167, -1388, -728, 846, -25, -978, 102, 63, -792, -40, 92, -833, 105, 224, -474, 102, 515, -744, 369, 1206, -466, -870, 1390, 822, -1442, 138, 1745, -224, -1126, 788, 488, -451, 188, 89, -586, 729, 142, -1070, 128, 770, -908, -475, 836, -550, -675, 741, -16, -1543, 1016, 1248, -1419, -439, 1498, 31, -922, 560, 726, -104, 532]
1725E32j80p11J419j18j992P56J492j918j52J827j083j165K129J28k678J559J841
1742A686k461q09K312n6j255N51Lj87J000m29j598K379M20k623M12K539j487j655
1760a258K020L59k298J122J221j730R7J307p68j017J181k83l97O83n91p69J838
1777G17L33k702J287K461k255j803K791L79k070O83R34p91L40N37j216K93J124
1794A042j139r05J551m55j083J518k69j483J057R33j798j84K055l35j964J549
1810I0Q48j265R7Q09p56L16O36j376K36J757r64j031J395j35j297R42O80j673
1828f91K88J472j401p58J498M00j806J64J088l17m9j38j96N85N06j469K28J215
1846F19j89j333J010P41j314L85J305q51r12J336k59j058J47Q27m74j20m03L72
$$ y = [532, 352, -359, 1060, 942, -1050, -294, 1198, -720, -872, 955, -128, -1293, 836, 964, -1714, -155, 1686, -775, -1584, 728, 672, -583, -32, -29, -216, 784, 355, -1243, 1136, 1556, -1067, -655, 1884, 397, -1258, 762, 1121, -1177, -55, 1166, -564, -467, 840, 72, -945, 236, -47, -444, 239, -352, -1121, 717, 1050, -1652, -365, 2096, -159, -1962, 829, 1208, -862, -179, 755, -36, 304, 841, -375, -82, 1042, -97, -1002, 549, 94, -989, 529, 260, -1223, -166, 767, -1031, -1215, 840, 505, -1459, 90, 938, -327, -230, 579, -177, 139, 775, -601, -365, 1392, 428, -603, 792, 657, -640, 302, 982, -691, -403, 1069, -332, -1090, 408, 808, -998, -834, 254, -63, -112, -250, -446, 139, 645, -824, -596, 619, 430, -903, 107, 848, -466, -81, 1224, 373, -539, 797, 538, -520, -373, 454, -20, -140, -543, -171]
1864a71L77m49p70R39J093j652q27J673O28j431k3Q66k0l32N3L46k0k82K4L35
1884C57j00k77j3P59q22l39R99K67j193l13J255l30j006J21R21J68r98J55K93
1903i6N07p26k04O18K16q00J72O72l77J9N37l51l62N71L15j012M16J59K55q62
1923c33L34j10N41l7j020L28R01m69j057O53N52q13J53K65No0M08l56j59M98Q6
1944C10l9j04j0l31P07k89p87Q72P23j337m22J604r7j547N06J003r22m02M98j26
1964a90m2M13m93r2O48m58m95P97K59j085P46O26j151J42J457m43j502J107Q14
1983A058j226l74Q32j48p8P0n24M98O28j174m89J418l78j390Q78R63j159N3J006
2002D64o75n74J171J75j119N15Q65q50j86L93l07M28L47p37m20J609o21j307Q45
$$ y = [-171, 206, -243, -1013, -74, 1019, -633, -1460, 213, 841, -590, -613, 253, 233, -99, -46, 300, 280, -2, 22, 357, 257, -20, -33, 726, -96, -435, 564, 831, -362, -675, 580, 250, -756, -635, 286, 454, -544, -389, -96, 411, -315, -519, 99, 315, -485, -313, 359, -18, 1, 538, 187, -175, 396, 711, -301, 115, 274, 529, -333, 1, -109, 432, 395, -625, -297, 604, 135, -922, -269, 283, -530, -377, -112, -107, -167, 241, -115, -274, 224, 310, 271, 167, 157, -174, 533, 244, -543, 329, 1052, -285, -707, 897, 800, -747, -241, 762, -160, -562, -64, -190, -232, 181, -312, -404, 244, -214, -709, 88, 347, -738, 8, 634, -517, -375, 1082, 639, -863, 244, 1058, -168, -542, 290, 142, 64, 134, -390, 108, 736, -438, -927, 491, 113, -1277, -399, 564, -595, -542, 464, -211, -785, 386, 561, -558, -43, 822, -28, -214, 179, -128, 300, 647, -90, -510, 1099, 478, -829, 16]
2021A6P16j164j28J163n10n62O99l80p32Q12N20j099L15Q10r55K95L06l62K0Q25
2041F05o38q65J420O86j669O3J270m77j027P00M70r74L63O04o45r7L72p12J98
2060c53M78n27O7M55j63m12Q98P0j484P51J134q63j027J378Q0o80o1Q63l59N2
2080B97j97m44Q53j3p31j45R24k19j068O83M22q78L75O82j305PJ015J20j018L72
2100b68M33k91P2N8K51M0j8o50N95N46o10q85J157K33o18j17O51n08k46O07l97
2121C5o03O15J73o28J12N43k26l49J37j80L44M57o86n40J243k0o98M3J136k63
2141F45p70nM97o42N52J96o93R9K80k55Q0J00O3n9j65l91J69O51l60n45K23Q05
2163D75n38p08Q71N11j172M03L44j08k92K15P1j37K19j01r5K41J45m38L14m0m33
$$ y = [16, 732, -432, -560, 603, 93, -469, 230, -150, -882, -70, 450, -649, -334, 476, -479, -184, 122, -240, -220, 605, -33, -898, 522, 1208, -461, -398, 872, 395, -632, 68, 538, -436, -73, 531, -114, -211, 161, -551, -353, 125, -402, -335, 120, -43, -455, 443, 513, -971, -220, 914, 51, -976, 402, 482, -198, -259, 604, 245, 297, 100, -344, 509, 496, -235, -380, 544, 325, -743, -60, 362, -516, -141, 541, -764, -757, 258, 378, -640, -268, 165, -126, -54, 4, 255, 295, 277, -373, 222, 768, 158, -727, 430, 663, 45, -72, 579, 71, -175, 432, 35, -568, 47, 220, -408, -296, 247, 21, -328, -191, -371, -27, 430, -256, -796, 447, 427, -271, -228, 908, 645, -125, -130, 367, -275, 277, 473, -220, -121, 159, -96, -16, 84, 147, 88, -77, -468, -299, 352, -8, -553, -330, 475, -63, -771, 100, 611, -561, -158, 186, 78, -214, 1, 72, -65, 154, 53, -42, 199, 344, -94, 220, 180, -253]
2184b53j8R70j046l70J219o7j295M03P29k54o07M78K36k68K34k15J61K00K04r99
2204e58Q77K67p30j08R30n73o10R58J07j228O59R33j044l35Q16l49m46P24n34
2223b44o2L66l35m11Q59L50r08J7P65k79o68Q18J40r59N52O60j311M24J049m94
2243C29m66M33M1n63K58O8m75O13m1o26L49P30o85p56Q54J05o26J81N01o05N4
2264c27P98o92l20J181l43k08O1J7j3k8k08j38M96M74j460M47R15k66j226R14
2284G4N02p16k15K25N3j09M15j91J4j4J89m59N57m64r1L07L30m54r8J121q18o78
2306e20Q75L59r32j84P07k0k31l46j68M31N00p24k96O67j46o37K58M77m72J66
2326b36M65n50Q6M23K12n07K08J98m2k57J3L47L1j26o41P29J06m19n17N52K74
$$ y = [-253, -271, 699, -347, -717, 502, 435, -860, -457, 272, 18, -589, -111, 125, -143, 91, -124, 37, 237, 441, -558, 319, 586, -144, -252, 678, 105, -505, 453, 560, -668, -9, 924, -120, -455, 361, 12, -434, 290, -244, -306, 60, -275, -686, 173, 523, -385, -368, 397, 118, -550, 268, 408, -551, 1, 661, -650, -226, 823, 329, -137, 296, 337, -226, 32, 100, -375, 238, 197, -429, -80, 650, -35, -791, 63, 168, -458, -277, 224, -381, -327, 471, -221, -541, 640, 297, 89, 150, 167, 154, 126, -82, -220, 276, 750, -710, -263, 652, 386, -840, 74, 576, -140, -355, -130, -77, -186, 229, 38, 52, 38, 227, -232, 325, -139, -230, 77, 407, -47, -145, 976, 158, -520, 355, 714, -218, -402, 305, 285, 54, -292, -460, -29, 471, -253, -549, 118, -28, -665, -407, 70, -402, -236, 229, -321, -235, 188, 400, -107, 101, 299, 257, 0, 13, 360, 391, 265, -376, 353, 459, 40, -477, 75, 349]
2347C49n62m0L10l45J44M5k34J93J24K13n32L15j70J80J38j82J49L35N5o84L05
2368A06K80k43l24N02M7j08l84K17R8Q0n39J63J88k67Q8J53o3k74k8M92p23J96
2390c43N05J35l81j26L87j83l86L82K52K13J39j003K63J282r82n33R35K2r26M15
2410F7K96p91R6N14m56j36O63k7n33J23J30l52O86q6n39K99Q88j109l20J215j34
2431D94p40OJ008q69o2M41m11O8O58o33k07N79k57l52N4M00o25K31M61q67K13
2452d10O25k41q42J074M11q86n9N89k74k45N61k25q1K92l81k76M25M90j094M87
2472f0N23o63j32R41r03l87Q11p1q88N65Q73p28j80M69j83j89L70m42k44J165
2492F47l56n73N66N55j327L02P00n56o97J174k64p93R46L62j067K7P57l54m6K20
$$ y = [349, -213, -253, 57, -288, -144, -99, -333, -140, -16, 197, -335, -20, -190, -10, 128, -54, 95, 430, 485, -199, 106, 386, 143, -181, 321, 368, 260, -124, 93, 191, 271, -268, -105, 83, -184, -96, 57, -6, -280, -308, 184, -539, -343, 162, 297, -84, -210, 177, -6, -392, -10, 242, 455, 594, -409, -146, 1136, 154, -379, 556, 578, -348, 67, 363, -428, -332, 182, -274, -410, 253, 226, -307, -184, -54, -406, 280, 194, -345, -46, 842, -267, -587, 628, 494, -246, -240, 768, -101, -163, 278, -133, -65, 593, -40, -247, 332, 75, -277, -223, 177, -448, -217, 244, -623, -410, 215, -26, -868, 206, 617, -269, -328, 261, -13, -258, 303, 78, -3, 289, -92, -368, 57, 547, -547, -60, 463, -200, -332, 609, -294, -681, 130, 59, -829, -264, 609, -119, -299, 170, -13, -202, 168, -274, -518, 647, 291, -282, 284, 839, -488, -186, 514, -42, -739, 435, 171, -622, 324, 686, -381, -354, 403, 49, 3, 223]
2512B23m42m91J115p01o32J028N34j532J91J289m24m59O88l34k73N27N1o33L87
2531A12N91o84p0O42o96l8L09l63j34N42J14r98N83O64r23m81R99k99l67M16J64
2552H3k29L49k5p14N74L60m46k53P51k96m65N83k43l82O76J94q67J21R71n69n87
2573d14K88M75n84R5J25k90L44lj83J31M24o22rM54o9j38J59K86n84K12L91k39
2595B49l66L62J41m88K3L04L6m35L07m30M92Q9o79R4N62m18l39K41L85l19j33
2616c22P02m11l5J67L16l80Q9K46n06J91m0O4L25k50k06L6P28o35l61L53M5l26
2638b10k62M96qmk47J64l2K23k55K00j21n8k8n0M83j69j20K64k15M7J39K45l47
2661A35r4j61L32l47J34K89J11m92M0K4j80K00k79J08J26o0m4k79K78K33jR6Q1
$$ y = [223, -219, -710, 405, -296, -928, 100, 634, -898, -707, 582, 158, -301, 387, 53, -220, 307, 358, -275, 112, 703, 19, -51, 591, -105, -143, 166, -197, -331, 211, 325, -673, -90, 574, -349, -830, 169, -130, -497, -81, 83, -146, 203, 178, -536, 38, 398, -48, -301, 450, 154, -311, 272, 29, -353, 323, 517, -350, -229, 742, 173, -414, -126, 349, -235, -140, -15, -305, 39, 36, -147, -16, 408, -214, -223, 231, 162, 24, 183, 469, -115, 97, 488, 249, -117, 245, 386, -102, -79, 225, 261, -174, 133, -297, 195, 284, -395, -301, 261, -157, -496, -255, 130, -189, -322, 380, -31, -66, 101, 417, 37, 126, 372, -134, 57, 17, 81, 406, 156, -50, -14, 714, 79, -282, 71, 116, -210, -472, 24, 16, 12, -235, -71, -103, 120, -135, 65, -56, -114, -142, -192, 291, 122, 2, 266, 51, 98, 237, 482, 135, 41, -120, 212, -135, -1, 288, 399, -93, -53, -29, -209, -9, -288, -180, -54, -114, -158, -437, -159, 74, 73, 169, 250]
2684B50l16L04L8n75N55Jl39j83M78L10n63J80j30PJ66n39N58k99K03k83j69M74
2706A28R7k46j23K39k47R0K99n43m9P01k7n31L07j2Q3j24j38P6K75l33M1k8L68
2729C03k72m52N03L95p42ML30m5k39J65k84Q7M75k70j93jM08l40J80Pj01K14N4
2752A86l92p4P69m4l69l6L70k17n42L40P7k77M79n36L12K1K32o95J12J78l2J88
2774E0k45r0J39J87o3j60J71L82m84l50P13j56j92j1K79j34q4K31j26k7l7J25
2796A18q9l67K59K28j58j95j8K45K72o30J29M56j62l85K4L75J56l76j77M45J08
2817B58k59R9J53k3k29j1J65j9j31M1k74K93j08J26k60k47K66N50m43r4j21L81
2839A13k76j08K98L8j3L3R4L9k61O2l7J96J29n30P2K50J98m74K96J03k60L62l7
$$ y = [250, -66, 238, 276, -299, 256, 257, -82, -265, 213, 523, -40, 140, 10, 17, 183, -356, 202, -97, 106, -177, -346, 128, 225, -21, -144, 95, -152, -62, 237, -306, -355, 346, 319, -212, 95, 83, 166, 42, -96, -20, 255, -78, -37, -65, 303, 31, -421, 82, 477, -265, -261, 69, 24, -215, -50, -334, -247, 228, -42, -235, -236, 172, -168, 12, 19, -82, 132, 186, -206, -280, 489, 445, 76, 40, 410, 193, -349, -9, 68, -209, 270, -266, 46, 67, 299, -396, -284, -106, -138, 50, -195, -285, -146, 41, -22, -182, -11, 371, -113, -463, 250, 94, -98, -109, 170, 36, -48, 183, 57, 30, -7, 118, 29, -338, -79, 149, -9, -204, -222, 23, 295, -335, -206, 250, 88, -297, -273, 102, 258, -118, -295, 150, 258, -1, 98, 251, 228, -1, -12, 153, 134, 3, 44, -230, 63, -45, 81, -179, -426, -160, 390, -53, -147, -268, 113, -163, -271, 27, 65, 52, 85, 179, 218, -43, 19, -18, 178, 307, -223, -151, 99, 297, -177, 119, 222, -38, 324, 287]
2862B87j75k52J53K21o75M82n2k30Q4L30n2l41L21m36L44J77Ql20J59M9l02M19
2884A99l8j03j56O27o33o1K91J08m00L27J16k51J7j27l47M76R6k88j87N69n6r11
2906g32O24K86k58l46P95m73J40K12j34m73M63K50n91J79J84l94J36L87n51J86
2926a10L64k96j66RM41n89K05L76k01m16L92k23j71O58m06n8M42k6l81J22M70
2947D36p95K68N29k10o88J017k99o95L55N93m44j93N59m90J23K87m53l37O25j57
2967C1l76J77N74n38j32O47m90l1M14n3n48O20J86p28K89L47k66k70M21n89L91
2988G6L24k35o43Q75k73k42o5O45n10m83L82K80l66M04k11k00J93L85n66j8M74
3009B26l42R8J78l51J71J91q4n28R38k27l60k1N80l34n59N06O6m17M73j89k21
$$ y = [287, 112, -140, 13, 234, -441, 41, -11, -241, -157, 173, 121, -220, 101, -335, 9, 186, 194, -126, 33, 82, -220, 199, 161, 58, -98, 529, -104, -165, 126, 234, -166, 161, 277, 26, 43, -84, -431, 45, 141, -147, -334, 235, 179, -732, -108, 178, -80, -426, 369, -104, 36, 248, 114, -359, 104, 354, -237, -58, 126, -268, -132, 255, -296, -110, 254, -42, -208, -199, 242, -347, -142, 234, 33, -383, 9, -214, -385, 273, -133, -191, 251, 225, -156, -34, 436, -359, -91, 438, 228, -460, 557, 258, -437, -82, 511, 67, -126, 433, -57, 66, 353, -100, -437, 188, 31, -345, -168, 406, -132, -264, 383, -107, -138, 276, 223, -325, 295, 481, -247, 42, 389, 123, -147, 274, -315, 76, 400, 165, -478, 397, 124, -118, -183, 462, -48, -531, -149, 131, -235, 169, -42, -242, -49, 336, -230, -248, 226, -116, -18, 160, -191, -20, 171, 87, -441, 497, 270, -90, -111, 469, 135, -424, 82, 148, -269, 204, 15, -206]
3030b06L52l04m2n3N80k36m33M01o3m32N32O9m82K5J106o65o38N11K81k88P7O
3052I8j1Q9J3n90K83R8J4k25L36J64p2j25l51Q0K1M81o65K09J98p0j86K39M7r0
3076a5J78l37J86K80L6n79J11L13L6n31M77R0l62J21L9l29P7N1R7k3J10K2k47
3099a99m5m4M82l23L0k50M83n2j26J87J17q9j88j35L95m0k01J9p2J57l3k05o1
3122a93K74j20q3mj69K40K08l90o6J21K95p3l29K16K48j3j53K90p0J65m27R5M6
3145A08J94m4l34Q0nj7L36k96j80J42K91m24j6R9J37k19J41l52L98j06l43K01
3167b09M57j67k55J63J07q4J56l72J75K0J13l74K28L77n67j7K53J78m31J95Pj10
3189a57M13m76K0j58N18k20m27K80L74m4o2j36m7J89K28m85J25M23m51K08k3p4
$$ y = [-206, 146, -158, -200, -253, 327, 91, -342, 59, -4, -436, 96, 165, -317, -292, 814, 149, -489, 22, 303, 15, 92, 98, 87, 176, 189, -401, -118, -20, -6, -231, 105, 269, 197, 72, -279, -199, -178, 303, -362, -153, 45, -25, -211, 28, 75, -15, 163, -174, 12, 292, 328, -251, -140, 173, 209, -322, 155, 245, -117, 4, 43, -286, -209, -158, -61, -84, 26, 48, -199, -244, -288, 194, -129, -99, -349, 134, 82, -44, 143, 260, 171, -17, -152, 243, 203, 2, 21, -51, 106, 73, -132, -193, 81, -39, -122, -126, -295, -55, 153, -237, -303, -182, 113, 40, -289, -73, 175, 162, 9, 299, 229, 394, -33, 62, 108, 302, 258, -76, 4, -1, -18, 318, 22, -158, -16, 275, -149, -165, -66, 71, -148, -7, -359, 39, -67, -410, -209, 248, 81, -174, -11, 96, 12, 168, -204, -29, -9, 104, -270, -42, 335, -232, -249, 4, 182, -249, -54, -47, -157, 256, -220, -200, -358, 160, -60, -487, -207, 167, 123, 61, -75, -122, 67, 295, -190, -65, 358, -93, 115, 92, 18]
3211A8l9L66r4n30J93M00m31r4L30R2n69K46J28Q6l93K65j32j9L85l23K5L23j25
3234A08l66N06K7n36K52L8j84j2N42l67j16K11j55J38j41K35k52J27r8j46k2M79
3256B68m91j26M76j10k63K16K35m3j47m2J2j11L88j68l32K58J9k25J07N73m97
3277cJ52rl12M2J4L60m01O6L07k89N3m0r9j37M26k98J21Q0K15n17J45M35j97k27
3301a13K19j54%P2R6m24N89k42mr0K74j38r5L3K27l22J55m13J83j75M35j73q1
3324a41J91MO0J07l21J6k3P6j2k07P00m02o0J82L9k04r2Q8M0K91l17j28J55K38
3348B80l21k53J57J07k01j61P30l84j1m1j20R1k4P8K35m43L73l5r1K06j82J23
3370A13P4k84J93L01j89k58N6J81l64k39L89J77l63J41J81j73JK04l10J79m8J93
$$ y = [18, -21, 345, 251, -279, -86, 314, -117, -211, 119, 211, -358, -112, 16, 102, -291, -26, -158, -177, 208, -115, -90, 233, 108, -258, 248, 275, -261, -9, 29, -155, -167, 375, 8, -108, 103, -52, 86, -55, 180, -72, 55, -43, -189, -211, 268, -223, -349, 127, 17, -246, -30, 205, 162, 15, -27, -15, -126, 262, 94, -238, 20, 39, -186, -79, 494, -3, 149, 140, -172, -130, -116, 244, -157, -91, 216, -73, -20, -60, -159, -296, 130, -168, -47, 33, 248, -269, -124, 311, 114, -113, 106, -48, -48, 24, 120, -304, 285, 43, 39, -51, 223, 85, -10, 23, 250, -72, 83, -330, -147, -322, 113, -60, -141, 50, 54, 114, 221, -100, -84, -107, -31, -43, -250, 450, 48, -12, 170, 209, 5, -87, 1, 41, 332, 15, -113, 42, 280, -41, -294, -137, -30, -231, -392, 338, -46, -57, -98, -218, -127, -151, -73, 162, -281, 92, 57, -34, 172, -10, 113, 187, -97, 96, 397, 208, -50, 6, 187, -177, -416, -27, 150, -213, -72, 109, -64, -63, 141, -169, 10, -38, 155]
3392A55l35K21j71L04j41J32j68J29M56o42N9L22m5j72J54j75k06J06Q1j23j0
3413f9N00m07l48M99r7j96o9J72k06N5K93j70k26O07l42o5R7K42j72m77M16L07
3435C44j69k86O8M6K82K23n14N1J90l68M8Q2j61J71L03n15PM17k47l73L96q9J07
3458A3k69L28K04m75L72l73J33M15j34n50O57j56j38J12N4J34o25L68p6j60R4
3479g2K30n02J66K92k37k3J06L1k36M89m17j90L19L71o71K10L35j54l04K53L62
3500C58k94J47N7n22L76Jk50lJ75pj03K67m10J11J04N8n39J92K64J46k62L44j75
3523C5k07J78J74k64L67k91o0o9Q4m7K8K31Kk02k48N38k75k7K17l19J30K61l22
3546h6k74N21j79KJ96l03l04M39J72k03J04j6k7j85J61J05L1j41o4K4K86m1j71
$$ y = [155, -180, 41, -130, 174, 33, 165, -3, 126, 582, -60, -1, 321, 276, 104, 258, 83, -123, -17, 64, -59, -69, 431, 24, -324, 175, 78, -118, -187, -15, -221, -166, 127, -43, -269, 338, -4, -69, 28, 270, 98, -379, 37, 344, 175, -111, -43, 3, 285, 508, -6, 45, 235, -133, -85, -3, -164, 7, 310, -205, -198, 219, -28, -401, -5, -94, 13, -256, 72, 276, -199, 173, -200, -67, 348, 214, -336, 321, 165, 27, 139, 193, 327, -298, 70, -6, -166, -72, 158, -344, -178, 114, -123, -146, -40, -9, -245, 244, -173, -363, -44, 327, -344, -134, 201, 47, -257, -4, 358, 64, 211, 268, -254, 122, 123, -127, -130, 45, 38, -65, 202, -208, -97, 7, 65, -474, -282, -18, 128, -134, 210, 35, -172, 6, 180, -84, 283, -8, -68, -137, -53, -100, -72, 159, 161, -41, -289, 249, -26, -53, 164, -155, -25, 236, -86, -360, 161, -18, -16, 180, -123, -427, 12, 184, -19, 85, 69, 42, -143, 18, 123, 154, 13, -51, -27, 259, 218, 47]
3569D7k16K32J05k70J1n8L6J82k12J51pjm34L56j08J14j93K87r7J05j68K46j71
3592f3J84q3j26L8J66j17K22M4l31M15l47k5k09N02j13l05OK80p2j76J58p6%L16
3616B88l87N5J18j34j04J85n9j55J32j46M3L23m8Q8j65J10k39j94M61l17J10K9
3638fr5j49M73k26j85l6N4K88m11J41J18k21L09Lj68L12k7j19m16N12K6j35L54
3661C96k68j04J16o1k21n3M74k49m37M99k1l31K59k7J6j10J39Ok27K09L7k24L41
3684A59r0j72J48k2j41J48J88k54l14M85J9k07j03K61j42l5R6j45N6K29k23j76
3706b35K98K5j1p8K17k94J57p5l8m7M04m07k74L94K10n16M39J10j64q2L54m12
3728b5K0J52Q9k88K85j64j73N2p8J89O0j7k0l18M87j89m6K1k88R7J16j08J14J15
$$ y = [47, -169, 63, 168, -102, -91, -149, -113, 69, -143, 8, 1, 0, -434, -78, -186, -72, -265, 22, -75, 30, -138, 108, -63, 121, 38, -88, -50, 116, -1, 221, 265, -66, 349, 2, -23, -232, 270, 157, -148, -142, 138, 66, -110, 48, -28, -28, 288, -99, -44, 74, -60, -164, 21, -38, -193, -61, -207, -164, 159, 111, 199, 34, 144, -95, -289, 172, -145, -35, -6, -101, -250, 223, -3, -188, -224, -170, 118, -293, -152, -34, -255, 54, 57, -111, 201, 174, 55, -361, 151, 177, 42, 396, 128, 24, 140, 79, -142, -195, 279, 30, -407, 92, 71, -260, -1, -28, -12, -122, 17, 23, -204, 5, 42, -182, 159, 69, -103, 45, 23, -118, 30, 218, -36, -350, 135, 154, -53, -156, 105, -37, -72, 24, -121, -65, 164, -59, -235, 63, 88, 77, -1, 216, -78, 79, 4, -34, -81, 323, -84, -358, 36, 246, -270, 169, 279, 115, 33, 387, -25, -5, 147, 236, -52, 233, 69, -104, -52, -130, 59, 119, 102, 82, -236, 251, 62, 16, 37, -251, -154, -38, -146, -32, 83]
3752H3K53l51j20L85q9k25J50J40k29k51L26j40r2J19J12j47K73Q2n84M12j3k53
3774a59L46r7k76L46j68J60n31L90Q9j72l0M8J21j05K74j88n3j35K53j11L19O0
3796C81j63m06L16k10J46j00l3Q0r7K52n48K74Q0J1k22K09j10r5L82J22k72L34
3818C31j31l60L6K00K1j94J56r1K16K5k09K07k14P9j23j79L71j45n0J99j60j8
3840c3J99j60Kj84J88l10J70J58Q9p1P1j99N4J08j82r0KK77n0j44L22p8j82R6
3864E3po4J22j31nQ4k16M09l58J19O7k17J12K97J4k49p5L98l59J3L11m23j89M80
3888A86k90j61K18m4Q4L80l18l54M19O6k76j6J59j68r4L7o8L52P6j85m2M1Q7m
3912H5r3j19J00M3J61k81R6P8N4k5j07K68j72k24L90k34j69K07k98K21k11M4Q4
$$ y = [83, 336, -15, -135, 250, 161, -64, 86, 226, -3, -254, 72, -68, -160, -41, 71, -76, 197, 279, -305, 107, 94, -159, 187, 90, -186, 160, -8, 152, -379, 11, 100, -72, -102, -54, 67, -38, 236, 48, -5, -140, 113, 2, 321, 381, 218, -188, 128, -82, 64, -36, -69, 11, -86, 166, -382, -108, -28, -17, -239, -30, -140, -235, 147, 269, -3, 331, 200, -160, -124, 76, 97, -97, 59, -32, 184, 209, 0, 207, -7, 72, -51, -230, 141, -4, -54, 145, -15, -33, 166, 6, 8, -176, 12, -298, -128, 30, 119, 48, 119, -80, -26, 82, -100, -190, -188, 89, 39, -105, 217, 139, -43, 53, 46, -18, 104, -27, -32, 52, -164, 245, -113, 6, 73, -144, -32, 265, 279, 30, -45, 353, -6, 7, 318, -105, -294, 186, -104, -265, -47, -91, -7, 373, 55, -299, 120, 186, -90, -106, 53, -115, -209, -172, -240, 112, 188, 3, -39, 2, 89, 85, -8, -127, -27, 16, 177, -104, -8, 70, 124, 99, -8, 260, 88, -136, 254, 20, -149, 58, -240, -19, -230, -186, -102]
3935a02RJ25r0Q1M2M9l61R7K58j12l24L51o8K40J9j52Q1k23K27q2o4K71j12j58
3959Bj43p7K85n9j7j1K00n7j74p7L02l8j40k8J89j50O9j37J22k25L02l12K93n4
3983F5K41j01k02m7O4J16k60L94m44L20k61Q6J96j09j36J33p2l11K71L82m88J34
4005b9j9P6q8k2p7J49j09J79j46JJ13o2m1L02j46j12J41M4k08L9L6j6n5J66o6
4030E0O9k9j11Nln1K16l51K15l2J40k16R5k29K21O6q3J10p5J39J66k82j60K22
4054I2l57j27K40L07k64M6k00K62J78k14k2rK20jj23j66N4J00k01K92q9k47M49
4077B20k5k11J56L6m55K44j6o9kpJM1J3M2Q0J91j99k94L43j32K4J50L0l94J09
4102a24K23l39J58p8K86l75J15J38K2l5J74o5q3M2k2j36J63R1k19J69M7l57K77
$$ y = [-102, -93, 32, -58, 23, 65, 114, -247, -150, 108, -4, -328, 23, -45, 195, 214, 62, 143, -80, 147, 65, 1, 272, 160, 2, -141, -218, 67, 8, -9, -20, 180, 123, -51, -128, 174, 136, -4, -32, 157, 7, 76, -61, 61, -164, 138, -174, 119, 65, 306, 205, 3, -44, 20, 136, -124, 270, -174, 146, -115, -29, 167, 58, -78, 55, -17, -328, -57, 325, -163, -29, -48, 28, -60, -82, -159, -10, -119, 60, -86, -85, 28, -34, -75, 227, 81, -31, 110, 154, -54, -15, 21, 5, -50, 116, 50, 119, 90, -21, -16, -19, -70, 146, -205, 10, -22, 118, -98, -3, -232, -11, 55, -28, 82, 7, 146, 312, 30, -130, 92, -265, -392, -152, 155, -109, -63, -263, -1, 177, -37, -59, -68, 152, 151, 28, -138, -84, 16, -185, 107, 18, -229, 220, 195, -16, 140, 176, -279, -35, -51, -120, -122, -129, -128, -87, -74, -32, 48, 239, 40, -254, 89, -43, -19, 131, 161, -233, -124, 99, -240, -82, -160, 126, -249, -134, 4, 26, -9, 165, 100, 17, 59, 37, -99, 64, 155, -64, 105, 152, -205, 72]
4125G2J55n10J09L83Kj72J34k1k65K97j66K4kj25QRL36k09k87L79j33j18n2L14
4149A62k80L71Mk54k49N02o6k41K07k49K09j98L70m81J64K22m60L79j13J8k42
4170b25J03J93k02K15k43P8J04J72k31k41L34K89l79J7m2L15Lj57k40m6L93l24
4192a14j60K78L16j33l16J17q4m5J38K3j37K05j77N3J5J84k13J89M9k81qk8L8
4215i1k6K80k72m5QL11q0Nk37N8J56Q1l39J63J22j82l08M24Jk8k5M3k37L32J52
4240B66l01L01k45l3K3J14j86J22L3l4j43J53K12l57o5K98kl17J63L15m19L26
4262B24j59L7J14k5k75J25K90k00j45K23r5j61k22L45O4J9j25j6O2j37K07n01
4284c51K58M47k74q8L26l03J22j99n5J45O4j37j7P6k19M42k47j09J62L8j79P8
$$ y = [72, 227, -283, -174, 209, 211, 39, 173, 152, -113, 184, 18, 42, 40, -85, -77, -68, 268, 59, -228, 151, 18, -100, -152, 162, -118, 253, 257, 3, -246, 256, 190, -51, 156, -93, 116, -82, 288, -193, -29, 193, -267, 112, -1, 17, -225, -122, 71, -131, 84, -159, -81, 23, 195, -36, -277, 57, 346, -33, -16, -58, 257, 260, 103, -137, -183, 210, -114, -274, 4, 320, 187, -129, -12, -96, -141, -3, 20, -117, 88, -89, -36, -21, 163, -50, 139, 188, -93, -101, -129, -91, -117, 163, -109, -154, -146, 165, 85, 90, -147, -89, 67, 148, -191, -28, 94, -88, -396, 28, 29, 1, -24, 19, -218, 114, 266, -35, 266, 21, -12, 11, 125, -61, 61, 94, 60, -83, 70, 282, -75, -140, 158, 156, -161, 2, 317, -102, 224, 65, 102, 216, 191, -84, 41, 331, 131, -14, 209, 114, -47, -269, 76, 140, 159, 34, 18, 80, -57, 150, -351, -93, 354, 80, -8, 318, 15, 137, -62, -117, 28, 92, -45, -62, 14, -205, 237, -10, -119, 43, 81, -98, -20]
4306b0J28l1J48O2l18J38j4R3j59Q3k0q0L8o4o9L51n54L66o1N7k1j46J22k5J07
4331A11j11K23k66M4j28J15k4J66m42M79l9o9o5p1K24j03o4j4n9j30J37K87n8
4354A43l44j02L69j69J17J96r6r0r3K8k01K99j44K9K52j58J52k65J97P1m14J41
4376h2K71p6j57L03j97k57M62n9l41J1J46k30j8L60k80L9N8n9j06L24j90j04j5
4399a97k5J94R3o8J04M8Q6k92k6M39k95p6q9K59l97J39n5J05J54k94K28k87J72
4422h0q3L06j86J42qJ23k84l8P2J85j99J55O0k89J52j4l1l4J48j39P9R9r8j12
4446g4K49n2l2k96R4N3j43K61n3l18L77Q7Q5l82K63J3k40K58k11J69J50k95J25
4469H8j34J71l3J20k1m31J80p6J34J59l56J03j79K66k04K97p8j46L0k0J05J12
$$ y = [-20, 108, 77, 225, 287, -31, 107, 93, 186, 27, 110, 90, 10, 48, -16, -85, 266, -288, 78, 17, 74, 53, -93, 29, 4, 111, 0, 223, -43, 1, -127, -12, -36, 130, -312, 167, 128, 59, -6, -77, 147, 44, -20, -34, -93, -223, -86, 201, 143, -201, -303, 66, -103, 14, 210, 114, 24, -69, -41, -242, 57, -87, -58, 194, 36, 188, -77, 120, 191, -223, -82, 189, 113, -44, 259, 62, -195, 267, 208, -133, -122, 24, -206, -224, 136, -144, -105, -47, -106, -212, 112, -78, -182, -197, -222, -28, 65, -3, 101, 149, 235, -57, -83, 356, 61, -15, -104, 155, -242, -103, -158, -53, 101, -193, 35, -252, -80, -163, 143, -43, 99, 91, 214, -70, -108, -36, 149, -50, 105, 165, -124, 28, 14, -17, -51, 97, -42, 37, 136, 38, -74, 175, 123, 91, -205, -111, -58, -201, 60, 7, -311, 66, 153, 238, -144, 119, 132, -108, 150, -61, 108, 258, -37, 88, -46, 125, 92, 212, 191, -240, -60, -136, -2, 157, -199, -96, -275, -9, -213, 84, 6, -140, -110, -130, -25, 87]
4491H7j07O2K47n57L34J77j24N3j96j89L98j40O4j77J63nO4k99L98k53k12J97
4513a5J20j8j69J79l11K14L4k06J22L7r4l8j8J99k33L56k42J0JK05k37O0K36k58
4537f6j3J26j90L45j16j12m4O3K4l63M60k72O8Q3P6j36K93J22k01j90J24J01k38
4560e6P7k23K83j38K35j8j29K9M0l18M58l18J20q0j66J93J94j46J0j73J91K7p5
4583A7J22j23L06j32l98M10k69O5O1L5J40l08J71o9M4l7j27J37n2J0p5K54k78
4606i6J13J0O9r7J07q7nn2%J53N6j38r1K65j74P2l35M04j48Q3j42j69K58J69n99
4631c74R2L09j8Q4J93k45Q2j36k05j62N07o2l5%j25J21j22J38n5o3M0J04j06J9
4655a9J43l10L09l7j61J24o2r8J63K7Q9k40P9Q7m2K33m69R1K10k6k67L16j89J00
$$ y = [87, -20, 42, 289, -268, 66, 243, 119, 172, -24, -213, 185, 45, 109, -68, 95, 90, 154, -145, 253, 0, -212, -15, 105, 87, -82, 97, -214, 0, 34, -172, -50, -13, -107, -145, -163, 36, -197, 159, -83, -73, -72, 133, -104, -44, 192, -66, -79, 47, -143, 202, 86, -26, -70, -7, 17, -346, 114, -158, -90, -7, 69, -67, 226, 348, 147, -43, 81, 182, -56, 21, -202, 81, -57, 178, 160, 31, 60, 100, -218, 240, -78, 42, -38, -204, -11, 183, 37, 47, -126, 65, 92, 17, 139, 16, 322, 190, -208, 202, -67, -2, 59, 94, 234, -74, 97, 28, 72, 35, -92, 45, -7, 3, -72, 182, -96, 17, 27, 96, -1, 106, 19, 14, -38, -38, 115, 171, 33, -58, 207, 33, 105, -230, 174, 26, 109, -33, -202, 56, 225, -374, -282, 27, 9, 93, 286, 41, 123, -13, -218, -380, 127, 65, 30, 30, -95, 26, -96, 42, -13, -76, -36, 68, -38, -19, 124, -186, 123, 86, -75, 49, -13, -111, 52, 79, 168, -72, 7, 94, 52, 285, -184, -93, 117, 91, -176, 140, -49, 51]
4679E1p7j7J72q8J98l74J36j71K6J3K54J34j01j71r2K85QN0r3q2j00J09j51J4
4703f7m1K38l73J74K08l9Q1k67KP9K30l62O2j7j8K63k62J58j86P9J5j71J55J78
4727A19p8j04J86j8j0j65K54m30K30Q9j62n8j05K06j8K0n2o0N0J55J2m1J4o2J01
4752G3k77j8L10J63l7l25K30J24j22j17P8m9j4K32m69K54r5L1r7j30L19j09R9
4775E4R9l14J27M7j92K72l30J57J75k27K33j00r2J06l1J31j40J55pj71J54r0N9
4798G5J8q9l5l08L73L4J09n7k51J27j35j10L02rj08p0J47M5nJ54j16j45J95J99
4822C40l55J89j70J80J03l72L13k43k15L28J6j62J05j09L0oK55k05Jk76N03p3
4844A77O6k12N9J16k21j00J93k17P5J73n16M58j43K13j20o1L4j63K04J90k20J02
$$ y = [51, -26, -43, 129, 41, 239, -135, 1, -170, -144, -131, 123, 257, 156, -15, -107, 178, 186, 236, 143, 61, -39, 70, -81, -67, -108, 130, -243, -69, 139, 100, 181, -86, -84, -5, 225, -137, -75, -92, -110, 153, -109, 49, -137, -58, -43, -214, -59, 119, 41, -63, 123, 105, 95, -70, 184, -246, -16, 73, -89, -147, -252, -46, -64, -44, -96, -156, -106, 49, 61, 20, 34, -28, 73, -204, -222, 88, 251, 214, -111, 119, 243, 121, 4, 82, 33, 19, 251, -218, 36, -59, -28, -125, -255, 64, -45, 54, 153, -161, -34, 13, -179, 93, -237, -80, 95, -132, 101, 1, -91, 15, -16, 115, -25, 130, 123, -48, 106, 16, 75, 93, 4, -31, -339, 34, 68, 177, 120, -131, -4, -139, -249, 53, 44, -64, -134, 13, 58, 53, 207, 91, -54, 141, 340, -15, 174, 4, 184, 287, -85, 228, -15, -230, 98, 114, -48, 57, -52, -22, -28, 227, 22, 23, -253, 250, 177, 243, 31, 90, 206, -15, -115, 78, -139, -64, 109, -407, 51, -92, 121, 1, -60, -26, -189, 15, 205, -15, 87]
4866H7r4l8m2R2j51M2m1K10j08L53j87j57K45l39J67j90J68J49k67J16O4k1J48
4889B06k21J72l62K14J87l47R6j23J35op7J11J01J17m4m13j04J30O4L62m53J89
4911f6o7K39k07M07l44r8O9J35k5j2J40k31k9J69q6J84l4n7o1j2l6q6O3J10J27
4936A92m08J91R5q1j32K5r7L30j18k00K38k2R5o9N3j29K9l0J77k66j89L20N4J1
4960F9J89j19l19J73P6l31J42K66m27N9Q2P4P0j33J61Q4k24K31%j56K00j21J9
4983F5j37J0P8j64K85j40J49r0q4R0M2k72q3N51j74l6k4m9j78K72j36o0J91M3
5007A49j23K27k07j40K77k22L66m15L30j40j31K15j85j31K65O4j46j02L4k0k8
5028f3P6k31J04J57j74j46L25l31J56J35K20k34n5j1J67j01K1p3J45j01O1K0k78
$$ y = [87, -7, -45, -87, 5, -146, -104, -145, 65, -43, 310, 123, -34, 211, -128, 39, -151, 17, 166, -101, 15, 79, 58, 206, -15, 157, -205, 9, 196, -151, -55, -178, -43, -49, -126, -15, 86, 203, 159, -254, -358, -228, -164, 198, -255, -66, -133, 106, -101, 306, -38, -136, -67, 68, 43, 31, 171, -60, -89, 80, -6, 178, 144, 87, 26, 14, -22, -108, -45, 65, 192, -216, -25, 70, -11, -143, -118, -215, 115, -3, -203, 35, 13, 108, 39, 92, -37, -8, -38, 139, -127, -316, 4, 58, 69, 258, 139, -180, -7, 69, -262, -120, 146, -281, -222, -140, -66, 4, -129, 32, 116, -108, 123, 123, -33, 167, 46, 65, -72, -62, 16, -148, 137, -3, 146, 56, -28, 62, 104, -168, -251, 300, 126, 90, 66, 17, -161, 111, -25, -85, 106, 149, 26, 253, 46, -94, 183, -39, 327, -88, 242, 102, -29, 186, 1, -130, 135, 199, 53, -49, -15, -35, -63, 13, -218, -114, 43, -131, -277, 48, -283, -127, 8, 228, -6, -61, -72, 95, -6, 15, -58, 87, -14, 47, 67, -211]
5051b11L09k6N8l8l3n6K04j67m1r5J37J13J5l53M0J47J66j6j54Pl35J77K16k4
5075D0j82J58J72j85j56K06m3K2j38j1R6n5P6J19k73M49m85n9L69j69O8P1k90
5098b00M08j75p2J67m02L97n7j69J64n2N3k95L81kl26L62j72k01J8J16J95j01
5120C7J21l54Q5K82q1j9j16J14O0j64r4J56j27j89L80k23K36j72q6L46k43K95
5142B44k75p9K10q8N0p6J35k61J11J36l1k21M30l88p5L83l54L82j00J45l11p4
5164a07K19k87P8N6j8q8J10jJ59l1j16j42K3J01J73j68j00k7J50m4J22L28m25
5187c5J11k54J72J23n9k43K37k08J97Q1j48Q3m20M00j28j48K47J45j22m7K00j18
5209F6j23J6Np9J10knP9P9j8P5k25K8J05l28J67j59L49n7j93K66j14%k3J23O3
$$ y = [-211, 98, 72, 130, 92, 59, 3, 207, 40, -1, -96, 41, 154, 169, -184, -144, 3, 169, 153, -1, 6, -329, -152, 64, 40, -142, 16, 188, 3, -153, 53, 10, 32, -106, -117, -21, -76, 0, 119, -154, 295, -190, -249, 120, -49, 19, 90, -200, 208, 33, -39, 128, -274, 123, 66, -103, 61, 9, 62, -233, 148, 146, -180, 182, 10, -191, -173, -57, 138, 37, 158, -196, -111, 171, 90, 71, -45, 69, 129, -35, -129, 27, -100, -289, 91, -132, 104, -68, -154, 192, -51, 244, -31, -110, 100, 12, 62, -14, 121, -140, -29, 107, 76, -145, 285, -103, -178, 205, -149, 233, 133, 278, -33, -107, 112, -175, -97, -41, -59, -147, -37, -38, 121, 90, -26, -168, -145, -44, 129, -39, -139, -166, -16, -60, 62, 390, -35, 76, -178, -6, 117, 58, -185, 52, -156, 41, 122, -26, 57, -363, 37, -91, -239, 8, 153, 31, -16, 184, 66, -57, -41, -36, -115, -5, -7, -12, 67, 146, 128, 203, -22, 6, 111, -217, -50, -209, 140, 83, -110, 156, 42, 42, 19, 142, 205]
5235B05r8Q3l8o8M9k03J4K15j25M9J39j11j57J69j03j57l8J32j01M51k35L3RO5
5259A79j9l63o9K88J47q1M3r3j10K12Mjj73k64K92K67l71N0J97j45OMM6K23m12
5284a43P6j42M69j73j00m0K3K00l26n4K05J05Rm15K06J06k59L62j86p9J81O9k90
5307a96Q1l2L16l4m9k71K2L12k76N5J83m05M62l26QJ45j56K00J06O7j17k11L7
5330g9J85j05J14M7O9l39J26J25p3k29L21k85q0k2O08m73J77o1l1Mj30l7O8L5
5354f5m9J11q3J92j50Q4m3K48k35K20j99J25k41j40J94p9K58j73o6J8RK55k79
5377h8k32L06J15k70K24k5J94n50N55n9j30m3n5K44j33n9q5K83k65k0P8O4P1k51
5401a31L05P5k06k39J92l3R0K2Nk55n7L28k15j1J66j67k16M65K4k67J04K45l72
$$ y = [205, 107, 190, 152, 84, 133, -70, -56, 159, 34, 83, 222, 111, -46, 123, 20, -137, -175, -43, -144, 307, 72, 105, 114, 179, 160, -203, -272, 16, 163, 82, 125, 32, -78, 134, 138, 137, -36, -300, -8, 259, -112, -62, 135, -10, -4, 0, 46, 269, -143, -67, -209, 260, 87, -13, -53, -30, 170, -156, -210, -5, 100, 109, -306, -100, 6, -253, 109, -77, -156, 25, 94, -196, -115, -147, 169, 135, 86, -185, -163, 149, -127, -72, 111, -294, 168, -158, -150, -5, -161, 39, 145, 212, 95, -116, -79, 106, 1, 115, 162, 231, -108, 18, 143, 70, -159, 162, -123, -203, -225, 383, -90, 87, 26, -5, -1, -131, -168, -100, -65, -114, -3, -86, 106, -44, 40, -3, 245, 10, 230, 31, 156, -85, -225, -31, -110, 148, -25, -91, -73, -64, 191, -88, -320, -14, 101, -169, 55, 30, 224, -326, 229, 170, 40, -3, -58, 186, 53, -6, -91, 192, -73, -93, -15, 49, 120, -131, 174, 249, 43, -196, -4, -37, 53, 75, 80, -175, -232, 96, -119, -130, 36, -131, -347, 118, 142, -125, -21, 224, -148]
5424a48K70j22k83J94k0K30l05K17K39l30Q7k4k40L88jM5l5j32J46k42J07j40
5446i9j15m9K27P7k1J85k56Q6J33l58M4K5J85J53l93L98l11q9K85j72J14N2j51
5469e0J70l47K85j69L20q6j11K75k61M0J27j16j6j60R3K4j19K0L20k39N4j28m3
5492a17L47k8o5j22l4j72K0K88j53L8k17M73l61L64m01r1L2K03M2ql5q1m4L3N3
5517c6N7j31m1K93p2j88P8QJ2n8L11k23R4m0%l9J36k89K9K42k2j46J40l20K93
5542H8q1j50Q1K01l82L79j42K30j87j87J13R2r4P0M0l93L63o1O0k1J33j71K1O7
5566F9L2j42j85M42o0M7j68J09r5j19MK55p8p2p9K43j91q2K62q8m3l7j98m6K39
5591A9k03L08j0j8k8o2P4K7m6p6j12K46o2j48K20M8j14j64J16j98K17O0j90J5
$$ y = [-148, 122, 0, -283, -89, -109, 121, -184, 33, 272, -58, 29, 5, -235, 153, 152, 197, 162, 30, 176, -66, 41, -99, -214, -263, -36, 41, 20, 205, -51, 35, 168, -190, -146, -121, 64, 217, -176, 222, -89, -178, 107, -65, 49, 101, -50, 120, -227, 58, -111, 209, 123, 12, 287, 26, 66, 193, 77, 61, -99, -6, 18, -101, -81, 239, 0, 54, -74, -117, 230, 202, 137, 15, -19, -191, -171, 117, -36, 2, -215, 258, -103, 261, -140, -231, -199, 4, 46, 38, 3, -78, -122, -89, -36, 21, -110, -151, 142, 70, -118, -40, -32, -20, -78, 233, 10, 104, 64, 64, 25, 161, -128, -99, 143, 121, -25, 115, -205, 88, 7, -143, -62, 139, -243, 136, -6, 224, 37, -150, -37, 55, -39, 31, 71, -322, 41, -20, 40, 19, 152, -19, 2, 69, 101, -41, -226, 216, 156, 203, 35, 144, 49, -70, -66, 189, 111, 39, -40, 203, 12, -70, 192, 104, 61, 24, -174, -220, 19, -184, 124, 114, 96, 68, 6, 80, 107, 61, -15, -127, 119, 57, -91, 129, 177, 63, -101, 15, -183, 34, 94, -96, -81]
5615h1n7j13j6K62K7J20lk23J80m80L18M41k50m00L01N3k8k47K22J0k63J09J60
5638D2J72m21M17l99K81J28l98J90q8j29J60J8J28j77L6R8n7j4J97n7k99M3J73
5661D4n8J0q9L61j53N6j16r7J99l24K68j65J95j1P3j64R3l66L40j83l1K50l17
$$ y = [-81, -138, -251, -267, -5, 22, 142, 139, -84, 96, -384, -66, 375, 125, -275, 26, 79, 51, -196, 26, 36, -227, -118, 42, 214, -207, 210, -189, 92, 220, -178, 12, -76, -205, -45, -27, 101, -76, -40, 58, 1, -13, 184, 127, -172, -129, 44, -14, -4, -93, 268, 115, 171, 55, -42, 157, -167, 101, -64, 131, 120, 193, 29, 122, -244, 96, -87, -118, 132, -185]
$$ [...]
8191G1
##END NTUPLES=NMR FID
##END=
