##TITLE=1H_Pr 4432
 CDCl3
 8 sc, 
 16.2.2023
##JCAMPDX= 6.0         $$ Bruker NMR JCAMP-DX V2.0
##DATA TYPE= NMR FID
##DATA CLASS= NTUPLES
##ORIGIN= UXNMR, Bruker Analytische Messtechnik GmbH
##OWNER= root
$$ XWIN-NMR		Version 3.5
$$ Thu Feb 16 16:31:08 2023 Russian Standard Time (UT+4h)  she@DPX200
##.OBSERVE FREQUENCY= 200.1316
##.OBSERVE NUCLEUS= ^1H
##.DELAY= (6, 6)
##.ACQUISITION MODE= SIMULTANEOUS
##.ACQUISITION SCHEME= undefined
##.AVERAGES= 8
##.DIGITISER RES= 18
##SPECTROMETER/DATA SYSTEM= spect
##.PULSE SEQUENCE= zg30
##.SOLVENT NAME= DMSO
##.SHIFT REFERENCE= (INTERNAL, DMSO, 0, 15.7039)
##AUDIT TRAIL= $$ (NUMBER, WHEN, WHO, WHERE, WHAT)
$$ ##TITLE= Audit trail, XWIN-NMR		Version 3.5
$$ ##JCAMPDX= 5.01
$$ ##ORIGIN= Bruker BioSpin GmbH
$$ ##OWNER= she
$$ F:/spectra/data/she/nmr/H-F/1/audita.txt
$$ ##AUDIT TRAIL=  $$ (NUMBER, WHEN, WHO, WHERE, WHAT)
(   1,<2023-02-16 16:29:52.53 +0400>,<she>,<DPX200>,
      <created by zg, POWCHK disabled, PULCHK disabled
       configuration hash MD5:
       00 E9 B6 7A A2 85 ED C7 34 08 36 98 17 FE 4E 26
       data hash MD5: 16K
       E2 EE 3F E1 05 B3 7A 0B 12 52 C2 D6 ED 2A B8 B0>)
$$ ##END=
$$ 
$$ hash MD5
$$ 5E 42 2E E7 4C A8 BA DD BD 4B 19 BE DF B9 CA 11
##$RELAX= 
##$RELAX= 
##$RELAX= 
##$RELAX= 
##$RELAX= 
##$RELAX= 
$$ Bruker specific parameters
$$ --------------------------
##$DU= <F:/spectra>
##$EXPNO= 1
##$NAME= <H-F>
##$PROCNO= 1
##$TYPE= <nmr>
##$USER= <she>
##$AMP= (0..31)
100 100 100 100 100 100 100 100 100 100 100 100 100 100 100 100 100 100 
100 100 100 100 100 100 100 100 100 100 100 100 100 100 
##$AQSEQ= 0
##$AQ_mod= 1
##$AUNM= <au_zg>
##$AUTOPOS= <>
##$BF1= 200.13
##$BF2= 200.13
##$BF3= 200.13
##$BF4= 200.13
##$BF5= 200.13
##$BF6= 200.13
##$BF7= 200.13
##$BF8= 200.13
##$BYTORDA= 1
##$CFDGTYP= 0
##$CFRGTYP= 5
##$CHEMSTR= <none>
##$CNST= (0..31)
1 1 145 1 1 1 1 1 1 1 1 1 1 1 1 1 1 1 1 1 1 1 1 1 1 1 1 1 1 1 1 1 
##$CPDPRG= <>
##$CPDPRG1= <>
##$CPDPRG2= <>
##$CPDPRG3= <>
##$CPDPRG4= <mlev>
##$CPDPRG5= <mlev>
##$CPDPRG6= <mlev>
##$CPDPRG7= <mlev>
##$CPDPRG8= <mlev>
##$CPDPRGB= <>
##$CPDPRGT= <>
##$D= (0..31)
0 1.2 0 0 0 0 0 0 0 0.06 0 0.03 0 0 0 0 0.0002 0 0 0 0 0 0 0 0 0 0 0 0 
0 0 0 
##$DATE= 1676550591
##$DBL= (0..7)
120 120 120 120 120 120 120 120 
##$DBP= (0..7)
150 150 150 150 150 150 150 150 
##$DBP07= 0
##$DBPNAM0= <>
##$DBPNAM1= <>
##$DBPNAM2= <>
##$DBPNAM3= <>
##$DBPNAM4= <>
##$DBPNAM5= <>
##$DBPNAM6= <>
##$DBPNAM7= <>
##$DBPOAL= (0..7)
0.5 0.5 0.5 0.5 0.5 0.5 0.5 0.5 
##$DBPOFFS= (0..7)
0 0 0 0 0 0 0 0 
##$DE= 6
##$DECBNUC= <off>
##$DECIM= 32
##$DECNUC= <off>
##$DECSTAT= 4
##$DIGMOD= 1
##$DIGTYP= 9
##$DL= (0..7)
0 120 120 120 120 120 120 120 
##$DP= (0..7)
150 150 150 150 150 150 150 150 
##$DP07= 0
##$DPNAME0= <>
##$DPNAME1= <>
##$DPNAME2= <>
##$DPNAME3= <>
##$DPNAME4= <>
##$DPNAME5= <>
##$DPNAME6= <>
##$DPNAME7= <>
##$DPOAL= (0..7)
0.5 0.5 0.5 0.5 0.5 0.5 0.5 0.5 
##$DPOFFS= (0..7)
0 0 0 0 0 0 0 0 
##$DQDMODE= 0
##$DR= 18
##$DS= 0
##$DSLIST= <SSSSSSSSSSSSSSS>
$$ [...]
##$SUBNAM2= <"">
##$SUBNAM3= <"">
##$SUBNAM4= <"">
##$SUBNAM5= <"">
##$SUBNAM6= <"">
##$SUBNAM7= <"">
##$SUBNAM8= <"">
##$SUBNAM9= <"">
##$SW= 18.0517057926174
##$SWIBOX= (0..15)
0 0 2 0 0 0 0 0 0 0 0 0 0 0 0 0 
##$SW_h= 3612.71676300578
##$TD= 16384
##$TD0= 1
##$TE= 0
##$TE2= 300
##$TE3= 300
##$TEG= 300
##$TL= (0..7)
0 120 120 120 120 120 120 120 
##$TP= (0..7)
150 150 150 150 150 150 150 150 
##$TP07= 0
##$TPNAME0= <>
##$TPNAME1= <>
##$TPNAME2= <>
##$TPNAME3= <>
##$TPNAME4= <>
##$TPNAME5= <>
##$TPNAME6= <>
##$TPNAME7= <>
##$TPOAL= (0..7)
0.5 0.5 0.5 0.5 0.5 0.5 0.5 0.5 
##$TPOFFS= (0..7)
0 0 0 0 0 0 0 0 
##$TUNHIN= 0
##$TUNHOUT= 0
##$TUNXOUT= 0
##$USERA1= <user>
##$USERA2= <user>
##$USERA3= <user>
##$USERA4= <user>
##$USERA5= <user>
##$V9= 5
##$VALIST= <valist>
##$VCLIST= <CCCCCCCCCCCCCCC>
##$VD= 0
##$VDLIST= <DDDDDDDDDDDDDDD>
##$VPLIST= <PPPPPPPPPPPPPPP>
##$VTLIST= <TTTTTTTTTTTTTTT>
##$WBST= 1024
##$WBSW= 4
##$XGAIN= (0..3)
0 0 0 0 
##$XL= 0
##$YL= 0
##$YMAX_a= 609544
##$YMIN_a= -592270
##$ZGOPTNS= <>
##$ZL1= 120
##$ZL2= 120
##$ZL3= 120
##$ZL4= 120
##$ABSF1= 10
##$ABSF2= 0
##$ABSG= 5
##$ABSL= 3
##$ALPHA= 0
##$AQORDER= 0
##$ASSFAC= 0
##$ASSFACI= 0
##$ASSFACX= 0
##$ASSWID= 0
##$AUNMP= <proc_1d>
##$AZFE= 0.1
##$AZFW= 0.1
##$BCFW= 1
##$BC_mod= 2
##$BYTORDP= 1
##$COROFFS= 0
##$CY= 11.3945322036743
##$DATMOD= 1
##$DC= 2
##$DFILT= <>
##$DTYPP= 0
##$F1P= 2.36226072786647
##$F2P= -0.459571619588291
##$FCOR= 0.5
##$FTSIZE= 0
##$FT_mod= 4
##$GAMMA= 1
##$GB= 0.15
##$INTBC= 1
##$INTSCL= 1
##$ISEN= 128
##$LB= 0.24
##$LEV0= 0
##$LPBIN= 0
##$MAXI= 10000
##$MC2= 0
##$MEAN= 0
##$ME_mod= 0
##$MI= 1.114404
##$NCOEF= 0
##$NC_proc= 0
##$NLEV= 6
##$NOISF1= 3.799351
##$NOISF2= 2.8
##$NSP= 1
##$NTH_PI= 0
##$NZP= 0
##$OFFSET= 15.70392
##$PC= 1
##$PHC0= -19114.22
##$PHC1= 14.20078
##$PH_mod= 1
##$PKNL= yes
##$PPARMOD= 0
##$PSCAL= 0
##$PSIGN= 0
##$REVERSE= no
##$SF= 200.130013532006
##$SI= 16384
##$SIGF1= 3
##$SIGF2= 2
##$SINO= 400
##$SIOLD= 16384
##$SREGLST= <1H.CDCl3>
##$SSB= 0
##$STSI= 0
##$STSR= 0
##$SW_p= 3612.71676300578
##$SYMM= 0
##$S_DEV= 0
##$TDeff= 0
##$TDoff= 0
##$TI= <>
##$TILT= no
##$TM1= 0
##$TM2= 0
##$TOPLEV= 0
##$USERP1= <user>
##$USERP2= <user>
##$USERP3= <user>
##$USERP4= <user>
##$USERP5= <user>
##$WDW= 1
##$XDIM= 8192
##$YMAX_p= 0
##$YMIN_p= 0
$$ End of Bruker specific parameters
$$ ---------------------------------
##NTUPLES= NMR FID
##VAR_NAME=  TIME,          FID/REAL,        FID/IMAG
##SYMBOL=    X,             R,               I
##VAR_TYPE=  INDEPENDENT,   DEPENDENT,       DEPENDENT
##VAR_FORM=  AFFN,          ASDF,            ASDF
##VAR_DIM=   8192,          8192,            8192
##UNITS=     SECONDS,       ARBITRARY UNITS, ARBITRARY UNITS
##FACTOR=    0.0002768,     1,               1
##FIRST=     0,             0,               0
##LAST=      2.2672688,     0,               0
##MIN=       0,             -592270,         0
##MAX=       2.2672688,     609544,          0
$$ Real data points
##PAGE= N=1
##DATA TABLE= (X++(R..R)), XYDATA
0@%%%%%%%Qj6J6j6J7k5M0m8N6p2R6j20J44j76K08k46K89l39M00m67N41o24P18
30C84q23R41j073J218j378J556j751J963k198K456k737L044l378L747m151M589
46B409n067N588o161O790p482Q242r078J0010j1050J2214j3529J5031j6759J8772
60I930k1157K4034k7585L2091l8031M6262n8485P8758j20271L43657n94291j05944
72d31032J040576o95937k39909N93737k46495k60500L99884j15308j38967J7587
82g6364P3599J88401k41291k50242N32908l0162n04546L21368K00379l56072J54856
93A2834J00117k17828J10402Q1897r0238P231j09512J43580J60815l74478J8242
104a56938M08157k67471j76712L02144j02970j01678J85347j05312o5372J14234
$$ y = [0, 0, 0, 0, 0, 0, 0, 0, 8, -8, 8, -8, 9, -16, 24, -24, 32, -40, 56, -64, 80, -96, 112, -134, 155, -184, 216, -251, 290, -334, 384, -439, 502, -571, 647, -731, 825, -926, 1037, -1161, 1295, -1442, 1602, -1776, 1971, -2180, 2409, -2658, 2930, -3231, 3559, -3923, 4319, -4759, 5251, -5799, 6415, -7114, 7917, -8842, 9930, -11227, 12807, -14778, 17313, -20718, 25544, -32941, 45817, -74454, 269203, -325088, -431032, 609544, -86393, -326302, 267435, 20940, -239560, 160324, 45016, -93951, -76364, -2765, 185636, -55655, -305897, 227011, 196849, -307697, 13671, 214050, -142022, 12834, 112951, -104877, 5525, 87422, -2816, 4415, -105097, 38483, 199298, -175180, -156938, 251219, -16252, -192964, 109180, 6210, -95468, 89879, -15433, -80805, 33429]
114C3429p706J9357r3765n2142K68828j11038k56627K97430L110k40440K45323
125A05759p8527k15132L61585j03071l20194L74820l7760l00119L51222q2104
135E6479l22482M23364m042m26220L06836J45845l07222J19230Q4430j40306J02785
146C8697K230q1633O5696m8686M8846O1917k09996Q9369K05308k53467k3644K28225
158A22862j64328k1831J61380j69091O630J74947j40690l0920J09303p0284M1851
169A9829K3530j21407J00518N8534j32569N0987L5357p0322Q0481k7522r0377
180g2961J06696l001p0253N2179m3189J4515Q5089j29283Q471J40370j35118P657
192c8828J36332j75021K9644K04505k14245n3306K54699j30973j16609J83693
$$ y = [33429, 25723, 45080, -48685, -100827, 168001, 56963, -199664, 97766, 100876, -139564, 105759, 27232, -187900, 173685, 70614, -249580, 125240, 87480, -212639, 138583, 56479, -266003, 157361, 153319, -272901, 33935, 179780, -127442, -8212, 76218, -64088, 38697, 40927, -40706, 24990, -23696, 25150, 87067, -122929, -33560, 171748, -81719, -105363, 122862, -41466, -63297, 98083, -71008, -64378, 110569, -30121, -61041, 48262, -22022, 19829, 43359, -78048, 22470, 81004, -51565, -578, 34779, -35543, 44938, 17416, -72961, 33735, 30734, -39519, 12660, -30529, -16014, 69075, -60208, -51737, 88633, -46485, -38828, 97504, -77517, -47873, 156632, -57613, -110919, 143780, 12807, -103802, 79891]
202G9891n8722r1686J24072k9694p9574N5908K2912p407n1828j4827J16114m8882
214A6277j14947J35446J4414j35183J12495K6574j37553J01337N6565j28986M2029
225a1532N5007n1938K7439k6098k5115Q7791n1188o3303R6646k6952o1308Q4503
237C3952k9513o2271Q0509J999n7821J9711J7125J6062j4622m7772O4359K2086
249D3804q7832N3480L8662r4679N5285N5247j15361L1010Q4332q4851p858N2677
261B3916l8662J2560J5072m6613L3175J9461m3426K6873L009k8682M3713o277
273A4119m3104L9675R674k5489J4600j6039P953L1237m8204j045M9936m6333m592
286a7612N0658n8195l239P0961n4762l2244O9376j7781l3490L4407q626p906K1230
$$ y = [79891, 21169, -70517, 53555, 23861, -55713, 195, 23107, 15700, -36128, -50955, 65159, 16277, -98670, 36776, 51190, -83993, 28502, 55076, -82477, 18860, 75425, -53561, -11532, 43475, -8463, 18976, -7122, -32237, 55554, 4366, -58937, 37709, 10757, -50551, 33952, 4439, -57832, 22677, 24676, -33145, -13434, 3691, 19753, 5131, -42641, 21718, 43804, -44028, 9452, 48114, -46565, 8720, 63967, -51394, -20384, 63948, -20903, -28761, 23916, -14746, -2186, 12886, -33727, -552, 18909, -24517, 2356, 5365, -23317, 20396, 14119, -28985, 10690, 20364, -5125, 9475, -6564, 1389, 32626, -15578, -16623, 33313, -13020, -17612, 33046, -25149, -28388, 42573, -12189, -44433, 24943, 7162, -26328, 8079, -547, -8453, 12777]
299A2777j3150j801P887n481J7134j2621k5248M0984J93m4865K8834J0469l1874
312a6762K2480R1l1168L0815M430l1325J9763J970j1944K3485j5549j6186L7997
325A8097q124k6130K5789j069j2338J7036j0020j0819J9269n672r388M945p850
338f274J0098K855k4178J1631J6300k2402N005J2220j9459J4211J2087k5825Q988
351d743K0072j7016O12R009j0037R689K752j5458P529N728r063L271m288n161
365g104J3671o914j3417J2781J919q456M825j159j300Q560m536j485N792m731
379a554P416L677j6668Q289J8216k0604q084K2586p151j5742J1864L640j4783
392h898K697J3257r347j5032J6626J3958k7063l102L2470j0382k4324K5445R133
$$ y = [12777, -373, -2174, 5713, 232, 17366, 4745, -20503, 20481, 20674, -24191, 4643, 15112, -16762, 5718, 5809, -25359, 5456, 9886, -21439, -1676, 294, -11650, 11835, -3714, -19900, 18097, 9973, -16157, 9632, 8563, -3775, 13261, 3241, -7578, 11691, 6019, -3369, 1576, -6274, 3824, 6679, -17499, -5868, 10432, -11970, -6965, 5255, -14204, 7, 12094, -13731, -4743, 15329, -1687, -1075, 7934, -2103, 7586, 10338, -5120, 2409, 8137, -926, 2345, -1943, -7104, 6567, -347, -13764, -983, 936, -7520, -2695, -3854, -5154, 3406, -1130, -2615, 3177, -1554, 5862, 9539, -7129, 1160, 19376, -1228, -9312, 13274, 6123, -9619, 2245, 5885, -8898, -6201, 7056, -2291, -17323, -697, 13261, -13802, -16904, 15566, 5184, -19140, 6305, 15438]
405A5438k6894J1906J7955k0777n426K1248l257j7858M449J3292m836j6950P109
418d601J4321j4658r214J8421k573j7141J5025Q741j9074K982J8941q661j0760
431h251J1369N410n180l690J441P227j786j1725N966J0202j6486l056J9011j1167
445g15j7244K1611O326k6941O169K2186j1645j4526J3467J2923j1438j2430J8226
458E969J3388l0660J063M1005k6846l5091N3851P189o7851L0870N1277o2829j6482
471c5147O7197k4058m8020M6813J6066m6037P534L4674j4602k4255J6578K5686
483B2429k0313k6584L7769J7020n2806J0354N1807m2904k9471O1809j1315n5311
495c7516M2136K4851n3077O213L8467k5136j4496K1348L53p681L01J666R274n312
$$ y = [15438, -11456, 450, 18405, -2372, -7798, 13450, 10193, -7665, -3216, 10076, 5240, -11710, -4601, 9720, -4938, -14152, 4269, 1696, -15445, -420, 8321, -10753, -7771, 11170, 2509, -8251, 3118, 8528, 3348, -342, 1099, 8326, 6540, -5185, 781, 10983, -5503, -8559, 10452, -715, -17959, 3652, 9978, -16963, -10794, 11392, -253, -14779, -1312, 11611, 173, -12257, 5969, 19357, -11303, -10240, 30765, 3919, -31172, 22679, 29868, -37983, -7113, 44164, -18665, -35147, 32050, 7992, -40028, 6785, 22851, -23186, -15652, 19022, 4420, -19835, -3257, 22429, 2116, -24468, 13301, 30321, -22485, -12131, 39676, -3228, -32699, 29110, 17795, -37516, 4620, 29471, -23606, -17393, 21074, -4062, -18558, 2790, 3143, -4538, -4237, -2571, 6703, 1391]
509A391j1920K0740K780k7370J7292J9900l2715J743K9081k3712p984K3067j6961
522d668m007K1499k4351j521L3612l3287j1228N1979l0537l4571O4521r019o0828
535d2406N4631K4749o6337K0259M5746m3091j0800L5618j0168j5783L696R085
547E199N546k4626j476M0077k6641l6826N8342L571o6404L9445M3628o4886K93
560b4758O1763l5377l1567M8395K377l8771J4972K3201j7622j3120J2102J1881
572A3476j4518j3889K0411P201k9999O333L0746k7251j7297M1226p295l7324L3060
585D880J6182m1335J6900K6028l3552N864K7078l0574K398K9134l1017k185L3282
598B3083k9359j0503L7032k1969k0526L5123q207k3861K0600L840j2839M923j18
$$ y = [1391, -10529, 10211, 12991, -14379, 2913, 22813, -9902, -8159, 20922, -2790, -10774, 12293, -4668, -8675, 12824, -11527, -13048, 20564, -12723, -23951, 28028, -2509, -37080, 27441, 18422, -42406, 12225, 36974, -29363, -9104, 36642, -6449, -17249, 18369, 8201, -7582, -3886, 5199, 10745, -13881, -15357, 24720, -1921, -38747, 19595, 23166, -43238, -3793, 39835, -25051, -24758, 37005, 1628, -29939, 18456, 20833, -17938, -2966, 20235, 2613, -10507, 1595, 13476, -1042, -14931, 5480, 12681, -17318, -10985, 19761, -7490, -24787, 16439, 9144, -28180, 4880, 21062, -20273, -3373, 22655, -10897, -5033, 22045, -8529, -6131, 23003, -8014, -10199, 23083, -6276, -16779, 20253, -1716, -22242, 12881, 4674, -19187, 1413, 5253, -7586, -2663, -2781]
611b781O282J495j7459J7146J3517l3133J0360L2752l5133j1387M4108j8265l1279
624b3777L3022P892l2541O778K1362j3827j3904J3770J1267j7938o723K3506q90
637G997k4812J4486K1180k3988q540K8873l662k6385J5960K0054k7466o939L1680
650A8438j2082k6902K6475Q962l2566J0856K0524k1843l088J8090r305m526R323
663B356m039J749J263m270P453M44j0051R912L839j3230N992N776q838J745K193
678B294m173K404k914k197P181o441l622J1390n263p720J2671o49r944R196K478
693D691o680L883K083k648J822j488m05L035m800k89M996n683j979N203k679l544
709d482K627J036p22k467K015L509n045O21P840m950m283J1027k756q376R755
$$ y = [-2781, 3501, 4996, -12463, 4683, 18200, -14933, -4573, 28179, -6954, -18341, 25767, 7502, -23777, 9245, 17137, -15404, -8626, 12736, -1091, -14995, -1225, 10042, -7896, -14619, 8887, 7997, -16815, -2329, 18851, -5137, -13677, 15196, 11534, -14851, 1109, 21163, -6303, -13242, 18438, 6356, -20546, 5929, 14891, -17675, -6819, 13705, -8138, -11226, 6864, -2441, -6967, 2356, -1683, 66, 1329, -2941, 4512, 4956, -5095, 4817, 8656, -4574, 1418, 7194, -1644, 101, 2294, -1879, 525, -2389, -4586, 2595, -3846, -7468, 3922, -1341, -9061, 3610, 2961, -6983, 2213, 4691, -1989, 1894, 3977, 1329, 3151, 1663, 1258, 4293, -507, -796, 4200, -1483, -3462, 1741, -938, -4482, -1855, -819, -1541, -4008, -1993, 1516, -3529, -2908, 4932, -18, -4301, 6726, 3970, -4406, 5349]
724E349R77j0178O436L482r092K585M161n951m98L011j234k785M49K730o26l274
740d458L560K831n517L344M370n733K005M940m866k05M253l724O66J633m030J473
756E42J653n210J294L224n602P82M119m123j224M474j70k889K371K428j063j723
772a117L221K217n006J960M325m362k414N567k679m413L864J59l555N17R84q39
788a571p72r67K365O69m132L664K667m632J525N776m375j418N337j240l047J630
804A479K125k231j891J724J095m357l65N001m839l250P131j721o442O026K435
819A920o717L408M354m350J90M554j635j783J943J655j555k602L232O90n550K325
835G9L182n513p84N187m511j899M660j766j937K180J50R0R29j444L065P15l578
$$ y = [5349, 6326, -3852, 2584, 6066, -3026, -441, 3720, -2231, -2729, 282, -952, -3737, -3288, -558, -1184, -4458, -898, 1933, -3584, -240, 4130, -1603, 402, 5342, 476, 271, 4524, 800, 1466, 3099, -931, 542, 2195, -3015, -1721, 1503, -4099, -3317, 802, -3321, -4545, -71, -241, -3130, -759, 1669, 606, -1117, 2104, 4321, -685, 1275, 5600, 1238, -1176, 4391, 1712, -2701, 1163, 1322, -2233, -1716, -732, -1571, -2343, -3310, -945, -276, -4408, -744, 1923, -2709, -1184, 4592, 217, -1201, 4136, 2896, -151, 1479, 3604, 1373, -518, 1206, 2301, -2056, -2421, 2580, -2259, -5509, 1622, -99, -6541, -515, 1920, -4797, -1389, 2965, -1385, -1195, 3359, 1724, -59, 1884, 3539, 1984, -618, 2614, 3304, -2246, 79, 3261, -2252, -3036, 2151, -2360, -4259, 401, -1365, -3302, -1122, -972, -882, 47, -1397, 1668, 2383, -1195]
852a195L559J651m986K511K848m496M44K378k905l50j22j02M63k247k38L480l242
869b549k142N924j769l007M449L57k446K051N58J79Q79k887L269J370o514L340
885A062M308q254L28P591o948k732O558k740l331K656O27pr31o28N144k477m338
902d112Q175k12p757O665L614q750K660N021n215j443K969n20j506j833J451K073
918A280n056P01M919m808l69M468k859L16K717l133L540R85n879O738J644r972
934d768P661M987j2696M574P008j0516J886N191o208J764J114m755O607k626p174
949g951J2904k559j3382J5570K860j7167J1118Q899j5744L809J0445q834j964
962a996N378j649r55k331K92N592p468k613J0393n086q312J0426J759j0304M505
$$ y = [-1195, 2364, 4015, -971, 1540, 4388, -108, 336, 2714, -191, -541, -663, -765, -302, -2549, -2787, 693, -2549, -4691, 1233, -536, -3543, 906, 1263, -1183, 868, 1426, 1605, 2484, -403, 2866, 4236, -2278, 1062, 5370, -2884, -2556, 5035, -1913, -4645, 1913, -827, -4158, -1502, -875, -882, -1813, -2441, 2703, 226, -4112, 4063, 3851, -3906, 2759, 6373, -2377, 283, 5304, 89, -1354, 1615, 1095, -411, -2244, -793, 1280, -3776, -3075, 1844, -2964, -3333, 1135, -1724, -1408, 1309, -1824, 1716, 2701, -3178, 3560, 5204, -4768, 2893, 7880, -4816, -242, 6766, -3750, -1864, 3327, -2881, -1117, -3, -4758, 1849, -777, -7951, 4953, 2394, -10988, 4582, 7442, -9725, 1393, 10292, -5452, -1643, 8802, -32, -1996, 3382, 1733, 778, -1553, -1261, 4331, -3137, -5750, 4643, -443, -8755, 1671, 3430, -6874, -2369]
977b369O785m773m474O903L739r176J621R931p899n417J2339m349q423J0347k805
992A980o521P914m263m478R901q141l379J4052j0573n646J7593r436q614J7985
1006H374p010q919J5534o713o227J3834r658l556J5370j3901l824J9261j5347
1019b782q232K1808j0525j3085J9234m081j2825J2572K7p305N567r13M53K670
1033B583n858M157O303j0917K325J0187r713l407J0599l364p874N151M550o327
1047a605m703R589R7j2596Q055Q411j4844K988J2897j2366q11J1848q416o95P500
1062E349p375L424M441j1002Q209M278j5979J0698P188j9127R401R913j9346P375
1076b553J0980j7881P061R309j5453P638P720j4946R059O573j4674R436N574j3941
$$ y = [-2369, 4416, -357, -4831, 2072, 5811, -3365, -1744, 8187, 288, -5129, 7210, 2861, -5562, 4785, 1980, -4541, 3373, -890, -5368, 4533, -3608, -6987, 7065, -3508, -9154, 8439, -997, -9611, 8374, 1364, -7555, 7979, 1266, -4961, 8873, -785, -4341, 11029, -2872, -6696, 12565, -2782, -11014, 10794, 269, -12816, 6418, 2337, -10488, 2084, 2111, -5194, 373, -540, -87, 2583, -3275, 882, 7185, -3732, -1407, 8780, -933, -4340, 6259, 2895, -4979, 172, 4722, -1605, -6308, 3281, 3378, -9218, -1163, 7248, -7596, -4608, 8289, -4077, -4888, 6960, -1456, -2151, 5349, -2026, 1398, 5839, -5163, 3046, 7324, -8655, 2043, 9231, -9896, -495, 9418, -9928, -2553, 8427, -9454, -2393, 6916, -8537, -899, 6821, -8125, 934, 7507, -7167, 2269, 7843, -6098]
1090f098P975N320j2172O903L021r690P104L00q464Q808j877p979R184j599p493
1105f757Q390o16n380N255p67j181K408k459L161J188o337O380J922r805O775
1120B177L809j1385N975M849j0868N253L298q552N560R19o578P398j783o085J0126
1135D113l478p182J2517m446p695J3055m357q140J2088m380p156J1203n470n259
1149d587J0093o580l431R539p852j975R753q872m48R356q806r4R351q866Q41Q759
1165F181q751J899O863q325K303N159p830L605L000p719N424R18p916P075k49
1180A637p578P535m22p551Q234p19o507P688j375m744P263k397l664P295m083
1195F12k647P390n342j857O668n834j362O453o545J37N372p061K384M392p417
$$ y = [-6098, 1877, 7197, -4975, 1928, 4949, -4741, 2363, 2663, -5801, 3007, 1130, -6849, 2335, 736, -6757, 1633, 1017, -4363, 892, 125, -1056, 1352, -1107, 2054, 3242, -3095, 3285, 5207, -4598, 2177, 5986, -5399, 576, 5425, -5443, -190, 3108, -5444, 116, 1035, -5543, 1855, 72, -6013, 4113, 635, -6547, 5970, 1524, -6171, 6884, 2527, -5613, 6475, 2095, -5061, 6142, 672, -4587, 5506, -1074, -4505, 5034, -2818, -4793, 4960, -3912, -4360, 4996, -3810, -3904, 5447, -3419, -2578, 6181, -2570, -671, 6192, -2133, 170, 5329, -2501, 1104, 4104, -3615, 1809, 2727, -5189, 1886, 1637, -5941, 1594, 1172, -6379, 1855, 1136, -5371, 2317, 942, -3802, 3461, 1064, -2600, 4695, 612, -2035, 5355, 13, -1844, 4824, -1010, -2372, 4081, -2464, -2327, 3045, -4016, -1632, 2760, -4657]
1210d657L508M194p797M369M344q248M964L806q010N208K503p103N310J065o587
1225c131N988n53o209O716j442o124O667j425n723P101k081m291O488k646k647
1240c312O222l667j830O747m597j486O840n417n91N781n140o94N140n425M8M280
1256B899n773K093K955n818K503K866n401K934K907n719L698J826m512L895N44
1271A897l896M642p23l827N316k069l715N309k185l706N652k568l948N530k258
1286e49k893M452k548j096M144l112K4L974l981P87M101m788J676L783n148J453
1302B79L458n053J644K356m998K438J413m416K476J428m631L512J013m300L842
1317D61O44m367M419J33l574L951K66l258L375j01k960L116p37k463L136j908
$$ y = [-4657, -1149, 3045, -4752, -383, 3961, -4287, 677, 4483, -3527, 1681, 4184, -2919, 2391, 3456, -3131, 2857, 2304, -3905, 2811, 1369, -4755, 1912, 487, -5236, 1865, -216, -4507, 1981, -665, -3312, 2910, -757, -2587, 4160, -437, -1923, 4917, -500, -1091, 4690, -450, -1144, 3996, -1429, -1381, 2899, -2874, -781, 2174, -3644, -1141, 1725, -3676, -742, 2165, -3554, 144, 1970, -2542, 1353, 1897, -1999, 2643, 1920, -1907, 3409, 1340, -2375, 2934, 749, -2957, 2695, 127, -3821, 1709, -549, -3442, 1010, -1538, -2634, 1510, -1602, -1578, 2396, -1585, -798, 3303, -1485, 191, 3974, -1174, 279, 3737, -1316, 328, 2684, -2314, 124, 1537, -2879, -403, 1025, -3606, -94, 919, -3381, 461, 1105, -3262, 1157, 1290, -2284, 1667, 1933, -1325, 2050, 1949, -1011, 2105, 1368, -1095, 2041, 133]
1333A33j548K967k404p09K232k031q32L059k427l87K978k223K71K374k540J485
1349C98J335k072J473Q99k875K181L23k437J867J34k796K519q91k573L085j033
1365d63k302L562j037k598L596o43k692L920n41k261L542p74k007K962r49k032
1381g17K608j610p83K157j954r39K261j696r35J879j022j183J488k73l79J114
1397A6q56P42N74q18R90K73j042J239K7j129J278k72j218J051o62r43J290j317
1415g77m13J576j622o36K496j472j386K702p71r99K297o84q92J978p65o82J849
1432A799j317m21J994j703j146K434j547j919K642q73k012J597L41j523Q63P32
1448e9r11M78P13j96J99L28l86N31L23r08N83O64j456M14P96j261j042J941j047
$$ y = [133, -1415, 1552, -852, -1561, 671, -1360, -2192, 867, -1560, -1947, 1031, -1192, -921, 1453, -1087, 398, 1733, -339, 1134, 2033, -842, 1339, 1662, -775, 1092, 1226, -1570, 949, 58, -2515, 570, -463, -2765, 797, -240, -2838, 758, 115, -2577, 1343, 802, -1459, 2083, 1309, -698, 2264, 1315, -717, 1891, 281, -502, 1655, -299, -1238, 1023, -673, -1608, 271, -751, -1934, -446, -719, -1098, 16, -840, -98, 476, -342, 648, 921, -121, 1118, 1145, 16, 1294, 1022, -196, 855, 193, -750, 540, -777, -1190, 386, -1236, -1872, 624, -848, -2234, 468, -303, -1302, 995, 311, -581, 1397, 632, -50, 1799, 482, 61, 2055, 352, -794, 1640, 93, -1826, 816, -57, -2069, -472, -131, -1654, -791, -59, -970, -492, 221, 25, 224, 552, 166, 697, 1020, 112, 695, 1359, -97, 317, 1113, -148, -1190, 751, -296]
1467b96j687J926k26j661J327Q32j810J315P16j398J084O28j081Q42R57j985J564
1484A047R22k348Q49J326k455M21J910k600l50K072k093l23K437j889m24J883
1500C85j246n29K185j256p89K651r34j435L038q33j922K420k13k521J938R6k084
1517a049J322K3j571J204K20j864J527K37j939J635P32k051J474J432j964M78
1533a54J978j996J35K065j475p90J786r49j389J467p05p85J343j077j120J578
1549h8m24j209J613j95j534K358R5j878J864K28j404J651L65k124J643Q74j981
1566a46P11Q36k265N90J071k146Q50R50j662P7J294j657O11J218r83j67J662r11
1584f7j91J559j012k90J615j281m01J461r87o98J219r34j102J504m56j002Q70
$$ y = [-296, -1983, -57, -283, -1944, -617, 215, -1595, -280, 436, -962, 122, 750, -331, 511, 1468, -517, 1047, 1969, -379, 470, 1796, -659, -238, 1672, -928, -1278, 794, -1299, -1622, 815, -1074, -1498, 385, -861, -1390, 795, -461, -1250, 1401, 467, -968, 2070, 1237, -685, 1735, 1522, -999, 939, 1035, -1049, 273, 296, -1275, -71, 149, -1715, -188, 49, -1890, -255, 477, -1574, -100, 1332, -632, -154, 1824, -172, -37, 2028, 553, -237, 1549, 600, -789, 678, -27, -812, 531, -546, -1666, -88, -512, -1721, -108, -303, -1837, 521, 616, -1262, 602, 830, -574, 1077, 1442, -682, 961, 1835, -146, 565, 1401, -864, -274, 797, -1349, -499, 451, -1211, -1134, 160, -1497, -886, 332, -651, -818, 844, -67, -258, 1301, 289, -1, 1614, 333, -68, 1393, 406, -292, 927, -7, -1109, 395, -61, -1063, -193]
1601a93m0j033O59L76p77L77O81p32O55P48r46O72O71r14J80L83n74J73M75q43
1621bj44O39r15m50J007j108L5J051p48m60Q86k9k28P05j16m80R25m5n12P21j08
1642F24k85M82J32r71K98Q1r82M95J15m03k11L20m48M7L71j13l7N14l10N7N43
1663C19j01K47L09k32k19M53l0k33K65n19m30N13l00m97O82q20mJ93j76j76M20
1684c36q1J3N7N78j17j53P15Ql24K94j58j48M77m05j05m3p2n70O98n60p22O68
1706b86j65p84P40M94o65M30L23l80L66N32l51O29j45n24M26K25p95M20J14j064
1726d60M93K18q74L19pl97o6M03k99pL20Q9o0M76j6N7K64k02RN66k05l70K91O0
1750F02m99K19Ok79j80J72o03K69k66K01k90M32M0m79M38J90Q2K51P0k43M19Q2
$$ y = [-193, -233, -1266, -607, -231, -1008, -631, 50, -682, -27, 721, -225, 447, 1118, 204, 384, 767, 193, 366, 841, -2, -146, 493, -422, -872, 135, -973, -938, 113, -635, -1095, -209, -238, -466, 239, 123, -357, 568, 523, 11, 732, 624, 339, 821, 953, -18, 280, 361, -621, -126, -11, -414, -625, -305, -753, -706, -335, -448, -485, 29, -281, -224, 319, 218, 465, 774, 542, 323, 776, 746, 513, 778, 259, -171, 342, 42, -455, 227, -593, -597, -404, -580, -756, -336, -417, -404, -347, 231, 114, -39, 676, 684, 360, 654, 496, 348, 825, 420, 315, 272, 200, -370, 328, -232, -954, -286, -451, -1235, -495, -1, -666, -236, 87, -293, 73, 605, 254, 883, 738, 214, 640, 865, 70, 490, 604, -460, 33, 251, -623, -304, -311, -708, -774, -371, -670, -677, -357, -268, -328, 148, 132, 189, 453, 251, 260, 826, 621, 251, 542, 602, 103, 322, 328, 49, -131, 41, -562, -293, -559, -358, -648, -216, -176, -655, -217, -27, 55, 306, 376, 133, 552, 634]
1772F34k70N51k63j16Rk41l48J56L2m89J4K40m79r4L05l16L57l2p4J10M18l24
1794b20M09L71n8j5J29j74p2j52J06j58o3j98o0k46J46j30p6J72j21j51J36K92
1816a33j08J89K13l21L45N7J72J40M1m49N06J10o75P17m29p99J90N67p72K21J64
1837e4q53K40N47q02J30Q28n45M50L06n99K36Q25o80L12P71r70Q0O65r32M1L94
1858C90k59o20L23l53k52O97l98n6L61k63J29L70n5j67J64P8R9k1L42p0j40M55
1880G54l91j06K64J09q64J48J37r95R68k40m38L87K90p91N78J63q01J189K2n69
1900a86O91M29j182O84J44m96N96m1q27L33M92r79K15L89r94O09L7n66l1P08o49
1921f24L98L63m36J59N12j46O4K42O8k82K21k11j72K28l32k98J52J20n17l3N21
$$ y = [634, 364, 915, 652, 536, 545, 304, -44, 112, 144, -345, -331, -91, -570, -664, -359, -675, -318, -350, -424, -314, 104, -220, 189, 560, 502, 487, 616, 442, 370, 218, 324, 166, 103, -95, -155, -401, -255, -385, -461, -289, -410, -561, -425, -133, -241, -52, 161, -160, 185, 242, 414, 554, 595, 146, 652, 762, 87, 804, 375, -424, -234, 333, -439, -218, -54, -907, -667, -120, -922, -792, 36, -509, -59, 247, -352, -116, 709, 29, 341, 1112, 142, 222, 887, -45, -4, 390, 131, -489, -166, -519, -771, -74, -472, -528, -167, -430, -301, 69, 14, -153, 11, 89, 188, 167, 509, 439, 299, 754, 363, 257, 521, 630, -234, -86, 51, -944, 24, -216, -654, -267, 23, -768, -190, -27, -828, 361, 383, -186, 505, 934, -248, 436, 580, 84, 680, 639, -188, 145, 637, -342, -127, 262, -732, -123, -86, -652, -683, 25, -624, -226, 137, -299, -140, 372, 226, 290, 532, 600, 318, 539, 328, 156, 384, 52, -246, -94, 26, -491, -524, -3]
1942cn01k67Q80n63m6O08l86k58R16j22n19R75Rn47O71l49n98Q56k72p75J031
1963G40n95p59P80k90o83O09L61j003O28L76p86P35L89q44O49k76l22P52J89o23
1983B7L26J43m57L44j65l70J45K81o01J2J6r6n5L20q6k77L24K52m77N78L5j86
2005C3K6N53n61K17N21o46m8M81n28j41O17r79j13R24o38k85N96o35k66J020p06
2026e58j1Q58m65l69J156n33l61J039k77n81P02l65k73O18n47j00J47m76k31O55
2046B8l72j92K25j05J49M6k24J87J23K66j19J35J85%R6j42K99m23J4K2k34K44
2068B08k71M4J6J49q37L54J29n40J61O90o31K78N10n07K21M71n33J10P85j035
2088b28L69M71n35j12O54p64M5O40j118M37J70l59j8M47p93L94K69k39J49L29
$$ y = [-3, -504, -771, 109, -454, -500, 108, -278, -536, 380, 258, -261, 714, 723, 176, 847, 498, -100, 756, 484, -291, 740, 145, -614, 166, -124, -807, -198, 163, -840, -212, 164, -622, 113, 502, -342, 307, 31, -291, 461, 650, 27, 353, 496, 39, 383, 218, -152, -7, 274, -327, -315, -299, -395, -450, -130, -216, -493, -169, 83, -394, 184, 219, 33, 59, 612, 51, 268, 789, 143, 95, 576, 48, -93, 524, -455, -568, 356, -282, -567, 29, -606, -872, 148, -558, -569, 289, -176, -545, 611, 78, -283, 756, 479, -102, 600, 235, -38, 580, 33, -67, 80, -396, -627, 28, -344, -536, -311, -416, -267, -221, -445, -258, -135, 131, 12, 147, 332, 332, 428, 286, 585, 162, 176, 198, -36, 208, -63, -19, -3, 146, -691, -337, -208, -748, -587, 103, -528, -250, 260, -247, -26, 445, -88, 22, 807, -228, 141, 612, 77, -35, 619, -145, -100, 540, -578, -141, 29, -330, -348, 99, -694, -300, -31, -270, -121, 208]
2108B08l81M93J62p49O74K16n14N86j64n65M22l91j25L17n62J03J39l62L18l3
2128b08k90K84K93n50L35K96m73K20P84q23O34L15r18N30J25j001Q36J32q90N15
2148A46j3r51P79K92j126J036l26p26P22L34r53R50Q6p08J065m43j21M14n2m89
2168h4O05j11n42P65o94j40K28k55m7J75n40J43M73l91l5N34o39N53L28o65N77
2189B38K02k61K59K48p26M54L8o28O21k29p07R14k85o84N41j14n68O78k33m74
2209g16J076m95l25J029l72o11J047o15j16R84o61k77R16q75R7M80o44p0M59n99
2229b88N9J49l04Q9J92k97R8M09p15N18M20n43M66K49l07L74m0p30P10l40k15
2250d6M05l17k84M95m03m75J014n90m20O62m79KN82o54Q0J071q58J52P18p38l0
$$ y = [208, -173, 320, 482, -267, 407, 623, 109, 695, 531, -34, 388, -3, -128, 189, -373, -270, -131, -493, -175, -208, -498, -214, 79, -471, -136, 160, -313, -93, 691, -132, 502, 817, -101, 429, 554, -447, 389, 521, -369, 146, 133, -818, -39, 253, -873, 163, -163, -889, -167, 167, -786, 164, 250, -458, 607, 164, 43, 457, 405, -84, 521, 410, -132, 633, -61, -201, 27, -228, -275, -100, -640, -497, -24, -415, -450, 84, -555, -2, 326, -339, 238, 440, 179, 438, 686, -40, 414, 452, -176, 445, 216, -491, 423, 138, -546, -5, -119, -687, -9, -242, -716, 360, -135, -460, 569, 197, -414, 633, 18, -98, 886, 225, -52, 864, -11, 86, 566, -78, -148, 311, -288, -229, -80, -384, -295, -103, -400, -302, 107, -608, -90, 330, -213, 253, 502, 195, 569, 529, -201, 509, 169, -46, 359, 42, -242, 253, -150, -625, 389, -201, -621, 41, -438, -436, 146, -508, -428, 643, -215, -63, 655, -83, -113]
2271a13Q45r72M57N10q42K51K81q66J62N59n61o0K73n39M28K67n81L90J02l59
2291c68M36q8M0M16m28M2N19j14l27K38n87K52K21m12l3M50p76j04Q34o35J59
2312b65N37o12L58O7m77N8N95m42L14L63n43J41M72m59O3L85p14M91N6p19J49
2333a82L18m12n2K83k53K16n2m46O50k38N0K31j45r0L77J59k77M48l50m14L52
2354A73l37K23K90k68k44Nj58J30K69o63L15L61m91O59l23k93L09K38k11K01K50
2375D35n56N94np62O51l2n78N72Pn98M62j87l77L35j86k68P65l68l41M82Kk10
2397a63K16q5n6M89j87P3j11K52l20J85k66N8L2l21N60k95l31K08j80j91N38l51
2419b46j36N56l27J52Np7J55L44j81l34N56j6p35M23J3l30O42n14l27O72n67k25
$$ y = [-113, 732, -240, 217, 727, -115, 136, 417, -449, -287, 272, -289, -349, -76, -615, -187, 80, -501, -111, -9, -368, 68, -20, 20, 436, 8, 50, 569, 455, 128, 366, -221, 31, 252, -160, -193, 257, -519, -623, 211, -424, -265, 272, -340, 18, 85, -392, -334, 261, -181, 133, 496, -47, 94, 566, 107, 170, 555, -159, 332, 388, -331, -182, 136, -276, -328, -45, -298, -82, -134, -580, 70, -168, -118, 113, -32, -122, 255, 414, 137, 585, 235, -179, 173, -164, 59, 349, 81, -163, -158, -316, -186, 83, -580, -265, 96, -395, 264, -59, -352, -43, 195, -16, 185, 435, -121, 473, 468, -294, 357, 325, -253, 319, 326, -272, 190, 3, -374, -39, -225, -493, 272, -96, -437, 45, 47, -163, 53, -32, -88, 401, 214, 287, 176, 428, 108, 293, 27, 85, 117, -204, 356, 61, -270, -62, -242, -433, 105, -246, -382, 174, -153, -1, 4, -73, 82, 426, 245, -89, 467, 451, -284, 139, 152, -178, 464, -50, -377, 295, -272, -497]
2441d97K90NQ0J09p2l10M78k44Q5O67n38j64O50l92p2L60k38n1O3j92N8m5k53
2464b23j42K92J3k0n6k98K72j32o3K94k15K04K84j13j30L28j06j5p7j5r7L41n64
2487b38N95j98l23J06J51k21n1l3k09M22j40j34L1L04L3R0l86LN19J27l18K92
2509D22J11m13j5L05k54o5j48l66K73L23m84J36J8k98M73mk56K79j07m1J24Q9
2531A02r8l6m2N0L47k12J44q3K03j41j62K26m09p5n1K18k34p3J18J82j55J12p9
2554a48L62j52q0j0J39J82p3k0r5J61J53k20j26j66J48j48J10j87j97J11j02J8
2576c40k4J85o2P0j15R8M41j09j40L54l68N60l00k4Q3k9K0n52K82k18J24M1rj44
2600a76P6k42p8L34n8J41J84k87K94O2j14q5J66p0j36M51k76r0k0L18m95J41j56
$$ y = [-497, -207, -202, -122, -13, -85, -395, 83, -161, -76, 591, 53, -111, 539, 147, 75, 435, 197, 146, 209, 17, 75, 30, -223, -365, -73, -60, -80, -136, -434, -162, -294, -357, -63, -278, -74, 210, 97, -33, 295, 189, 174, 97, 82, -15, 326, -238, 357, 159, -164, -58, 93, -128, -179, -212, -421, 1, -139, -273, -242, 62, 95, 185, -201, -198, 321, 448, 130, 422, 533, 120, 105, 410, 156, 91, -57, -423, -150, 173, -311, -175, -157, -455, 18, 14, -242, 37, -70, -111, 13, 102, 4, -32, -74, -24, 323, 111, 255, 172, 375, 234, 72, 298, -111, -186, -237, -19, -253, -326, -208, -26, -181, -69, -148, 214, 62, -18, -28, 111, 293, 220, 200, 105, 266, 419, 199, 73, -93, 55, -93, 17, -170, -367, -256, -358, -340, -364, -179, -241, -171, -286, -188, 253, 144, 4, 358, -10, 550, 250, 226, 309, 280, 300, -252, 30, -188, -64, -23, -32, -176, -100, -342, -420, -86, -144, -3, 181, -106, 188, 250, 136, 51, 217, 147, 11, 462, 186, 96, 76, 394, -101, 40, -116]
2623a16j21pP8o6K28j8j69J63qq1K14m4o6M9L68j05J23j81k73J4l5k6j45L66o
2648A36j31j83j12J51J39j20l12L85j85J75J04M1k56M29k34K70L4j44j16M17j88
2669C00k27o7Q4k69L43j59n00K00N5N9k6M8j63P9M30k13L7k7j5j9M46l22M8K41
2693C63m12L23p2k39J39R7j71r9K52n12J34K67k88j76J99J07p7Q8J92J8J48q1
2715B00p8J68j97l9K03L4o6k43j13K55k27L90m41k72M70l06m7K31j45j39J70K38
2737D6j17k36L16m6K97j21m6J21L2l25K73O2m33K62K7k29J51p4l61N97k74k04
2759b82J05K40l40J32L35q4k10K31l30K83P4j98M5L55l03O5O8j24l28J38J09l41
2781c60K7Q0R9J65q2j10K61j57j06L32q1lO4L71k02k08J13J5n0K4l36R8J11k08
$$ y = [-116, -237, -244, -166, -232, -4, -22, -191, -28, -36, -117, 97, 53, -13, 36, 404, 299, 422, 241, -32, -18, -53, -79, -224, 142, 136, 5, -178, -290, -139, 0, -120, -432, -47, -232, -57, 47, 88, -168, 261, 27, 297, 331, 187, 71, 488, 300, 73, 6, 90, -179, 164, 5, -495, -295, -240, -181, -207, -159, -322, -243, 187, -26, 11, -16, -31, -50, 396, 74, 122, 363, -49, 274, 202, -37, 102, 199, 28, -71, 181, -331, -197, 70, -218, -394, -195, -88, -165, -77, 115, 133, 281, 200, 122, 290, 93, 54, 257, 291, 225, -18, -131, 124, -103, 287, -154, -426, 44, -262, -309, -78, -223, -362, -192, 46, -71, -307, 9, -37, 260, 139, 93, 214, 246, -79, 194, 256, -177, 85, 112, -117, 34, -40, -401, 196, -78, -282, -177, 63, -277, -145, 190, 106, -104, 127, -203, 80, 154, -44, 1, 356, 53, 118, 186, 62, -266, -128, -19, -360, -333, -253, -154, 11, -71, -181, 80, -77, -183, 149, 68, 65, 129, 500, 298, 90, 203, 218, 168, 192, -144, -46, 65, -143]
2805a43J13K34l64l34M78l04J92Q5j32k29M05j16P1K33p0k48L68k69j2J83o8J14
2827A87O2l51K35p5j06j47J90J59m38j4K86j22j89M50l14J77J05k07J19j28Q3
2848c8m7L63k91k05O23k32k22J62l94J69M55n37j23L72k30k68M80J19k47K3J42
2869G4k04L22k04K3L33m23K44q0L11m87L97r4m24J53L62l90j39L27k52p4J53j55
2891b27j47M17P6m12K51K43q2J73j08j23Q0K76l31J87l61P2L7J47m93J94L21o35
2913d45J45M19l09j21O6K51l28K03J12K47k40N2J65J18m5j67M70o85M8K72j51
2934G7l00J00K4j7n9j03k9O02j82k38K39j25k55K60J6j20K69L40n13K99O0o50
2956c05M80j17j13o9M52l17k04K45n23M50j0k33J44J05j75R7J29j6j39L82k16
$$ y = [-143, -30, 204, -160, -494, -16, -320, -128, -43, -175, -404, 1, -115, -44, 189, 119, -129, 239, -30, -42, 141, 73, 187, 249, -102, 133, 58, -48, -195, -5, 154, -284, -298, -12, -134, -323, 127, -187, -10, 95, -112, 7, -121, -38, -85, 278, -13, -218, 405, 173, -49, 113, -281, -112, 343, -194, -317, 55, -175, -443, 37, 156, -91, -68, 74, -130, 192, -12, 11, 344, -79, 165, 85, 396, -91, 306, 212, -212, -59, 303, -87, -226, 101, -151, -225, -72, -227, -374, 43, 119, -293, -42, 201, 119, 292, 184, 61, 141, 417, 86, 273, -88, -16, 21, 168, -325, -131, 190, -445, -300, 119, -190, -311, -245, 6, -322, -119, -7, 240, 0, 52, 217, 335, 290, 123, 593, -92, -44, 228, 77, -223, -123, -99, -116, -175, -278, -307, 295, 113, -125, 114, -11, -266, -6, 10, -110, 159, 499, -14, 285, 345, -305, 175, 58, -55, -124, 328, 11, -193, 52, -471, -21, -31, -264, -120, -15, -190, -93, 36, 20, -119, 263, 47]
2977D7l0K38l75M04J9l2k58K82m62n2L12n5P8k34L5k1J70j67l4J03p6j6R1j63
3001a96J70R2K02k22L8K01j37L3n4J14j64p9p5lL1K9M1j01N5j69n9K94j75n4q
3026a96J24J8K62k97J35L5J01p7r3Q0J27J2j76K50l18n5j40K37k3m9r4l6o0K78
3050D5j85J5J17k28K72r7J11M9J67k13P9j20K3Q6j0j52k8O3n4J74j74o3J52o8
3074c9j00J15M9J3k09J62K2k7K27k88j9n4K07o1L04r0l14K28j9k4m1l92M21l70
3098b99L59j76K5MJ65l11J99L82l14L97m36K59J57j62j96Q9jk50J33j80m9R4J26
3121A5j91M7M7l52L92j66K34j21J04j29J49o1j24K53J66k36J84j09o4J69k32L4
3143IK00l17N1M4J5O2l99J01j24L70L2k45R1J25jJ61m1m3l8oj60K03K1J19o3P8
$$ y = [47, 17, 255, -120, 284, 303, 271, 13, 295, -167, -219, 93, 38, 116, -118, -83, -104, 66, -101, -135, -32, -108, -124, -33, -196, -26, 66, 268, 46, 84, 285, 148, 181, 127, 241, 77, -2, -77, -80, -49, -20, 21, -80, -25, -194, -253, 41, -134, -188, -196, -72, -54, 208, -89, 46, 81, 182, 105, 12, 92, 219, 231, 55, 305, -13, -68, -208, 29, 6, -43, -137, -173, -233, 45, -140, -125, -8, -236, 36, -61, 50, 99, 266, 53, 132, 12, 35, 121, 111, -41, -69, -6, -60, 114, -60, -123, 29, -39, -139, -24, 25, 38, -171, -9, 13, -14, 213, -75, -94, -148, 59, -2, 302, 212, -102, 126, 107, 83, 42, -350, 71, -299, 60, -116, -91, -87, 78, -233, -34, 348, 34, 431, -5, 254, 411, 249, 53, 142, 141, -109, 24, -156, -205, -111, 15, -176, -129, -82, -434, -42, -208, 26, -95, 9, -120, 29, -32, -156, 97, 263, 27, 211, 102, 38, 207, -25, 9, 209, -108, -57, -13, 2, 64, -335, -234, -358, 12, 44, -201, -110, 15, 14, 175, 134, 91, 53, 47, -113, 90, 111, 230, 167, 245]
3169B45J53n67L22j51j07j0J35n13M40J50k89j49K21j09J83L33m74K94k22J14
3189aK32l0j61J41K2j22j31O1m2K35k24r8l82J89RJ44P3k84J68J14K37J46k04
3212I2p7J36L7k81K97j47j47L86l09m4RJ13n6j53j43J77k03K1j8N7M3J38O5l6
3236d3L21j87o1K26k82K21r0j8k2J04K42l06p3M5j53j8l8p2J47n6j81L71m84K25
3260a82L78k33LJ36p3m22O63j21K5J34k35m18N63j52j36L94n91J60m0n9L6K98
3282A28j40n4J4J38q0j88O6J33j95J06J3M29m28M70k35r6q6P3j78J57o9q3K33
3305A28j08k77K66j55n4M5l55M21L50m03m0M74l32j82L38N2k48M00m45K10L4j53
3327c4O9j44m5n9J51j95m8K20k59L21o0mK11j09Pn1J97l15L83J7m42L84l35J17
$$ y = [245, 398, -169, 153, 2, -105, -115, 20, -493, -53, 97, -192, -341, -120, -229, -46, 287, -187, 107, -115, -1, 231, 201, 40, 181, 203, 81, -50, 11, -31, 204, -20, -118, -500, -311, -302, -158, -85, -369, -201, -87, 150, 296, 92, 15, 151, 188, -93, 204, 57, -90, 296, -13, -57, -48, 65, 9, -144, -287, -110, -313, -292, -310, -253, -210, -72, -7, -43, 278, 91, 30, 256, -26, 195, 105, 87, 65, 169, 411, 105, 32, 77, -76, -94, -132, -204, -57, -113, -294, 77, -407, -182, 196, -37, -34, 102, 29, -393, 270, 149, 174, 308, 73, -345, 218, 66, -70, 324, -267, -107, -147, -206, -170, 128, -12, -66, -52, 86, 6, -182, -116, 17, -178, -72, -59, 370, -58, 412, 177, 81, -5, 68, -110, 47, -22, -105, 128, 20, -257, 9, -146, -200, -155, -510, -89, 261, -142, -182, 292, -40, -222, 116, 168, -80, 320, -125, 85, 119, -34, 35, -109, -154, -213, -62, -257, -305, -85, -344, -23, -83, -87, 124, 15, 22, -29, 168, -147, 236, 253, -189, 195, -140, -23]
3351b3l5M5M1m35N08m25M20j80o4q2J56J06p0N8j57K88k68J51L2j44L74P7j73
3374B00j02r2JK71k64k57L64M2k67K7J10k78N8N35p01K15J27k04L12l1j91P2M47
3397C94m01L34k53k72K1N79l56K65m48P6l8K2j08O5J39k60L3J43o9K39J29k27
3419Gk56L61m9K24k31pK71o9k28J53K15l88q2j42L07k37j40L25j23J37Lj92O3
3442g8N8l4n5M72l73l1K81n6k14K82j99RJ38j2l40L00l65j15L49J12k74K83l93
3465b55K70J63j89l14J34K08l73L62K04l56L31m2q9N3K33k07K82l32r3J71m57
3486b96K94J34p9j33L4n3k6j66N74k84KJ95k72j35L92Q8%p8J96m76J30m2m6j08
3510a55K57j16J43j73p4L15k11j33j30N10m84J75J28k39K24K24k25j88K24Q3N2
$$ y = [-23, -58, -13, 28, -407, 101, -324, 96, -84, -148, -230, -74, 32, -38, 20, -137, 151, -117, 34, 66, -78, 296, 373, 200, 98, 6, 7, 278, 14, -243, 121, 163, -104, -77, 33, -245, -187, 348, -353, -138, -11, -215, 97, 66, -125, -53, 394, -7, 327, 74, -198, -177, 402, 46, 311, -137, -61, -99, -77, -185, -120, 19, -241, -208, -65, -134, 105, 234, 7, -249, 112, 63, 287, 56, 49, 320, 251, 23, 176, 391, 3, -79, -221, 86, -151, -291, 34, -89, 48, 51, -141, -78, -20, -54, -109, 363, -10, -41, 240, 184, -30, 252, 53, 62, 200, 188, -152, 148, -217, -332, 17, 129, -145, 138, -255, 15, 178, -11, -325, -191, 17, -356, 6, 210, -146, 185, 143, 54, 107, 340, 133, 415, 83, -10, 161, -296, -2, 132, 53, -80, -46, -99, -125, -291, 283, -1, 1, 196, -76, -211, 181, 269, 269, 191, 387, -89, 41, -1, -47, -155, 102, -14, 129, -44, -118, 197, -14, -147, -277, 233, -251, -76, 52, -187, 37, 261, 36, -152, 72, 155, 207]
3531B07l8k00K84J29m54J35Q1m37L58R7k78n8M10j74k14j8L22j44j18P9j07L29
3553A91j21m5N8J36j52n5J19P6l49L66n73N00j8M0k67j73J43P9O5r2k53N15k74
3576h4J65o7J05p2l12L79R1N9k03P7k6p7p1j4K53p7j79K44m25M0J61k65M4K19
3600c5k6J96k42%k2J7J46k3J57j87K30o2lj93K14l17K12R2rl64L41k47J48k00
3624a77o5j8K49k18J53J39j29K26N7j04j53J71M0K9j2j85qK16m65J28p6J99j11
3647a14P7k00K77J37k81J0j17Q6r6M01o3k61L23K6k69K99j1j36k37M70m94J0K80
3670A17l2l38M57l19l4J31r7O2j88N6nM64l87M4K37p8m23N79j83j86N51l96j22
3693i0k7M50l15J01k44N0k07J31l44O19j99Kj12J82j05M23k98l6K8J9j55J13j8
$$ y = [207, 169, -31, 253, 382, -72, 63, 144, -293, 65, 162, -116, -174, 236, 62, -152, -170, 152, 8, -110, -31, -138, 191, 70, 25, 83, 219, 67, 12, 131, 207, -142, 224, -349, 151, 133, 173, -94, -267, -124, -45, 20, -72, -325, 190, -84, 81, 14, 119, 47, -265, 114, 205, 264, 61, 138, 112, 35, -36, -50, 203, 126, -53, 191, -234, -194, -33, -298, -254, -35, -61, 135, -107, -107, -129, -112, 34, 11, 168, -19, 211, 149, 146, -47, 167, -150, 62, 154, 145, -219, 122, -125, 23, -177, -242, -260, -11, -229, -76, 63, -66, 160, 217, 113, -40, 131, 171, 200, 188, 3, -5, 211, -254, -126, -202, -3, -114, -37, -237, 40, 177, -104, -94, -211, -125, -221, 180, 117, -144, 179, 205, -64, 235, 224, 88, -149, 321, -173, -163, 117, 85, -253, 204, -115, -149, -18, -115, -53, -241, -185, -190, 274, -113, -69, 168, 90, -333, 246, 63, -123, 428, 32, -90, -117, 333, 18, 119, -125, -75, -282, -151, -495, 124, -75, -73, -185, -3, -108, 315, 17, -19, 9, 28, -127, -14, -32]
3716c2o7L23M8m55K46j45J41k09J42j26J38j00j5J21p6j46J48j54m0K00n3J19
3738HM1j6J86n9k39K39k44K31k20J19J89j59j97j40L1J62J01Ml52J91O9k8K88
3761B05j53m4P2L13n10K00P6k87N6r3K31m2rl2n6J59k32k7pJ17j0n2o5R3O1J66
3787A30m6j61l00M27k8K30QN9k26n6k29R4N8L00l73L0Q3l19Q6K25o6j47JL33j34
3812b1k78M32j58K6m7K66j67k50R8O0K73M5k66j52K74k04j4R2j44J61j26MJ66
3835G0m9j40J51j09J30J52m02K09K12k20J6K30m72K61K19m07L12O1k15r2M3m0
3857h0L26l34n0j03K59l16K55J14j65Q5k9J90j45j57J35K91k14J59J19m0l59J89
3879A30k34J55k33J68j50K75m19J16P1K30k87L90k52j46J81j85K09J81r9l1J76
$$ y = [-32, -99, 224, 272, -183, 63, -82, 59, -150, -8, -134, 4, -96, -111, 10, -66, -212, -64, -218, -258, -58, -111, 8, 49, 33, 219, 160, -79, 160, -84, 147, -73, 46, 235, 76, -121, -261, -230, -68, 33, 37, -315, -124, -55, -83, 205, 52, 8, 80, 393, -117, 83, 159, -128, -72, -165, 66, 24, 15, -17, -73, 86, -146, -173, -180, -63, -73, -125, -190, -97, -36, 130, 84, -77, -377, 50, 22, 252, 260, 319, 93, 37, -192, -98, -40, 260, -113, -83, 0, -319, -233, -8, -74, -221, -220, 113, -21, -299, 133, -25, 1, -46, 220, 53, -197, -99, -39, 234, 279, 13, -139, 135, -69, -83, 9, -135, 26, -100, -96, 70, 21, -119, 32, -77, 53, 205, -197, 12, 224, 4, 20, 250, -222, 39, 258, -149, 163, 224, 9, -83, -40, -80, 246, -88, -138, -241, 18, -298, -43, 71, -94, -9, -38, 152, 7, -150, -15, 276, 62, 221, 340, 300, -59, 130, -104, 51, -182, -14, -164, 111, -308, -192, -121, 109, -178, 212, -40, -186, -5, -190, 19, 200, 101, 70, 246]
3900B46j39J87ql6r2j48l3J87o4j17k02M36Lk99k01k6L56nJ01pJ69j46k34K42
3924A70k6K16l57K17j34k7M7l64N01l60N0J15j4Q7l9k68L59n04J66J53j04M8K52
3947A84p3m3J09k30J55N8k34J56l45K42j03O0M9n9p0K05J74n05K67R4k83J91k34
3970b35K43l19M93j35Q2K6o7J30N3j32P1k41N3J56k25K6Q8j15j42L43l10n5J67
3993d5j38k3J09p8L23j25j18J41J11N5l62M01j62J74l34M77m77L48Q2m06J46j93
4015i4j51K96l19K14R4M9o5L26k96jo5L08l43J7L1O1J80j41l04K69m3k26j97K49
4039a51J82j9j5j91O7Rk6K32j08L58l40P2K45k5j36k19M95l31q4O2o1l30L00J8
4063DJ39j05k2j81K54L3k52l04J37Q8J96Q0p8J43k25j34O3L16j11o2m8K31n1r9
$$ y = [246, 107, 294, 286, 250, 158, 10, -23, 164, 100, -17, -219, 217, 220, -79, -280, -306, 50, 45, 146, 139, 308, 162, -72, 170, 144, 360, 3, 220, 86, 59, 106, -258, 243, -117, -67, 48, 34, 121, 82, -186, 173, -331, -165, -12, -116, -68, 184, 111, 68, 177, -53, 102, 160, -74, 82, -263, -21, -124, -64, -15, -74, -144, 61, 235, -270, -3, 91, -192, -1, -235, 8, -311, 182, 47, 129, 155, 88, 218, 271, 139, 210, -31, 22, 178, -47, -21, 67, -48, -190, 153, -157, -212, -45, -183, -206, -97, -175, 148, 23, -95, 46, 157, 212, -150, 251, 89, 263, -71, 406, -71, 277, 359, -47, 99, -94, -245, 51, -268, -54, 40, 89, 24, 350, 54, 53, -12, 296, -47, -30, 1, 62, 242, 101, -203, 66, 23, -203, -400, -151, 31, 12, -3, -194, -127, -118, -144, 88, -20, 338, -2, 70, 315, 290, 154, -65, 430, 99, 15, 77, 16, -314, -14, 4, 143, 38, 16, -165, 89, 122, -130, -434, -297, -209, -13, 67, -11, 132, -93, -227, -164, 152, 41, -21, -69, 162, 111, 12]
4087A2r7l2J56J89k90PJ20L2l07K34m1J01n3r6M5pj39J27K20l69j00R2K36j1m9
4112b0Q2lo8k8m7K7J39l84J83O8j22M6j85J02J05j6n7J86j38J70J05J19j39j61
4136c6j12K14M7p1K1l7j89J27j72Q6J66k28O7M3R9N8k39J62m2K87k60j56K97j47
4160a5K24k36J70k36r3K29J32k11O9J65l84l08O13l10K24J5n9k03L5J22J82n3
4182G2p8k71K27o7L06N1q6o6o5L2L3k54k7K57l5m5k07M3J39R7k39k3O8J21J12
4207I5j35Q2J74j45k22M98k69J02k36J21j00K45l90lK28j22L6P6n9P0j29p5L43
4230A85k95J03M2l4j93L03m9j30K2K25J68l55l2j67K6L87j49N3l8j9r4r0k40K97
4254g4K4J43l88J78K48j63J11j27K24j59P5J58k91n6J13J11n9j45j03J75J15l86
$$ y = [12, -85, -117, 39, 228, -62, -55, 65, 97, -210, 24, -17, 84, 31, -65, -20, -27, -166, -39, 181, -188, -288, -196, 40, 29, -20, 62, 59, -9, -37, -84, -57, 82, -302, -119, -51, -173, -127, -312, -210, -105, -121, -178, 8, -130, 40, 145, 264, 125, -36, -148, 66, 113, 42, 63, 26, -163, -36, -208, -122, 44, -184, -117, -74, 25, 83, -156, 6, -36, 251, -9, -165, 132, -15, 209, -27, 143, -93, -186, 43, 175, -36, 33, 198, -186, -494, 119, -191, 33, 48, -11, -214, -179, -57, 125, 72, -6, -277, -50, -117, 189, 240, 154, 88, 23, 55, 88, -166, -193, 64, 29, -16, -223, -180, -41, 56, -183, -206, -138, -17, 95, -40, 42, 216, 71, -151, 347, 78, 180, -56, 65, -35, 210, -180, -183, 45, -77, -41, 35, -24, 46, -83, -158, 185, -110, -7, 35, 1, -192, 111, 62, -68, -46, 179, 347, -8, -40, -207, -181, 206, 57, 110, 72, 53, -41, -131, -371, -74, -50, 93, -295, -117, 131, -32, 79, -48, 176, 17, 92, 250, -41, -97, 16, 127, 68, -77, -180, -5, 110, -276]
4276b76K47j9k6R0j47k7M74o07K89N3K15l08K76j58m1L0k32J64j3l6K26m11K2
4299b15K85k76K4j1J79r9r1M58k19k23M47j67j23R0M5R9j24K8k9j51L15l30K19
4322A31j91j6P3k94K31r4P5J34l50K42nj27J72J60p3m0J48j00j16q1J81K4l8p1
4346b5o5o0K61m6j55j8Q5l4n3j09J81P4j37O1J08k49j80K73L40J8q2j08n5J11
4370A36j15J07l7j79J16M6j40P9J0l12P1jP1k25M10Nj5q6p4M1K05l70J26K14l5
4395D8p3p7K17m0Q6l69n4N66n03K29q3l5n1j63L48j90J28r4J22j20K39p2r7j38
4419a76K49Ol47R3M80j75k09k34P1K94j5kJ26M4m12L5K33K92m96L82m79L38r3
4442Ej6J47N0mk08Q9j01J17J08j43L38k96k13K98l72N48m25m2k25M22k81K17m3
$$ y = [-276, -29, -48, -74, 16, -131, -158, 316, -291, -2, 51, 266, -42, 234, 76, 35, 65, -167, -3, -16, -52, 174, -237, -215, 70, -206, -182, -193, -14, -113, -204, 254, 35, -188, 259, 92, -31, 59, 104, 203, 79, 107, 78, -73, 242, -88, 131, -60, -76, -3, -297, -66, -160, -85, 49, -301, -59, -64, -191, -19, 141, 68, 28, 176, 76, -40, -121, 60, 84, 46, -25, -90, -150, 111, 65, -90, -108, -23, -57, -110, -219, -38, 36, -101, -40, 68, -181, -361, -88, 252, 270, 188, 80, 25, 136, 21, 128, 91, -88, 28, 74, -66, 13, 23, -289, -218, -219, -148, -373, 37, 42, 27, -59, -133, -92, 113, -257, -131, 83, 48, -25, -102, 115, 75, 161, -208, -262, 304, -199, 30, -53, -88, -139, -302, 46, -144, -16, -110, 12, -108, 131, 59, -38, -176, 73, 79, -268, -175, 305, 130, -79, -313, -242, 52, 37, 35, 161, 205, -207, -172, 61, 353, -143, 239, -240, 98, 5, -11, 136, 186, 182, -26, 63, -38, 79, 187, 44, 382, 86, -127, 171, -201, 347, -78, -120, -345, 77, -204, 13, -30]
4465c0N3j98n1P5Q0K60k58j76J26K37j36J53Q0j79Q1k01k40J10J09N0j94K10J1
4488b8k66K85j43R3P7N7m7L5J65k01rJ88l12j64M61k30L6Q2J0P8n6q0N7k28j00
4513b40L1k5J56k3K83k9j72O9j65K13J6l44J63L52k11J42r9l3K64k17l47J28L96
4536C08l84J2L9n0O4l13J56J35l1j79J27J79l42L72M3j49J3K32k88m14L07K67
4558A04j86J79q4k02K50j51N1o4M9j83K53M2j92K02p5Q5l60M38j18j44J88J63
4580B45k44J09j83J2Q5J18r3P5j30j50K72l02oJ68J38l32L22k76Q7J28l9L05l18
4603ik6J61J5m9j00J21k11J93j38k71L90l17K55P5l80K58j35M01l18J07J02J04
4625B28M0j53K31k91K07j85J77j36J05j46p7j04R2k25M94o09K86j7O7L80n05K60
$$ y = [-30, 23, -175, -226, -151, -71, 189, -69, -245, -119, 118, -18, 135, 215, 36, 117, -84, -324, -214, -105, -55, -249, -39, -28, -294, -9, -152, -59, 18, 75, 28, 63, 228, 27, 18, 206, -106, -270, 191, -39, -3, 79, 89, 167, 111, 31, 88, -140, -240, -209, -234, -78, -101, 182, 153, -19, 50, -115, 98, 114, -230, -67, 285, 74, 216, 117, 84, 348, 131, -216, -88, 308, -76, -64, -25, -75, -11, -324, -168, -33, -64, -243, -116, 63, -279, 93, 136, -13, 0, 232, -56, -470, -163, 104, -82, 97, 13, -189, 61, -90, -39, -103, -54, -237, 16, 58, -134, 68, -7, 78, -282, 156, 38, -106, 82, 245, 1, 110, -73, -61, 24, 142, 49, 124, -6, -156, 116, -186, -192, -24, 114, -218, 104, -172, -85, 43, 4, 309, -9, -35, 126, 141, 92, -8, 113, -98, 95, -43, -314, 76, -241, 14, 89, -291, -33, -168, 233, -85, 22, 124, 228, 268, 115, 346, 55, 262, 77, 254, 118, 223, 77, 0, -104, -12, -237, 257, -352, -66, -83, -16, 364, -141, 119]
4647A19j75J79k85K52j27J7J57m8q7K17k52K00k4k6j43J89q8mn4N7j77j0J53m3
4671co0j07l9K32N5k52j65K79K59l73L36k52J61l33L43n5j6p3K38k67O8o6M8l0
4695g2q6j31K49k2k60J26L86j52n9L24k42QM0m2o6P4j81L20n7K1O5l7k26j83J40
4720f3k85N12k21O4j47J5J86j93L26j91k52J32K19j57k39L61K11k59J64j01J31
4741B13j70K57n33L79k13q6M18k03q2j8k81L61J74j74r9j58MJ5K70p7R6o5O6n2
4765D2l23N13j39J0j91m4J02J44q8j55k22L11M1k9p0K52l4j08m3L37j44Nk4l4
4789A09K8l33N25k16j76J50j74o0J52Q5mj80J64j59Q3k8R4j27KJ96k5L8q0K6J
4814I1L67o19L47k47L2m8J49L0j92J5j17n1P3K84j08j11P9K22j02nq3M5j95O7
$$ y = [119, -56, 123, -162, 90, -37, -20, 137, 89, 2, 219, -33, 167, 143, 117, -26, 163, 75, 71, 17, 74, -103, -113, 40, -3, -63, -170, -209, 23, 78, -174, -339, -60, 199, -174, 162, -90, 71, -262, 81, 26, 10, -63, 175, -92, -24, -90, -42, -72, -158, -289, -40, -62, -322, -196, 190, 38, -21, 303, 61, 69, 109, 67, 1, 75, -106, 214, 157, 178, 243, 206, -20, -203, -63, -348, 164, -57, 7, -140, -125, 61, -132, 194, 3, -249, -117, 102, -55, -294, 67, 278, 19, 183, 82, 213, 43, 300, -233, 146, -67, -153, 265, 62, -20, -38, -319, 42, 216, 42, -57, -215, -211, -196, 74, -3, 93, 28, 94, 42, -281, 232, 93, 103, -88, -132, -30, 114, 26, -129, -351, -40, 1, -28, -98, 154, 120, 12, -31, 306, 162, 167, 143, 109, 137, -196, 329, 113, -63, 87, -87, -147, 5, 90, 86, -94, 70, -89, -6, -34, 60, -67, -65, 131, 106, 144, 64, 90, 91, 458, -161, 186, -61, -29, -77, 72, 102, -90, -75, -192, -243, -170, 114, 6, -105, -26, 196, 94, 89, 6, 51, -144, -77]
4838g7L98j35l47Q1K43R8l49Q1j77P9j01J23J31j90RN7J6N2k85K87j48r8L18k94
4862b28K43J21qj1J38m0j69J87k00j17J21P0L4o0j52O7o7l9m7M30k22n9nL71l23
4887C5Q3L4k47K50m26M11j44l1L50j91n4j04L02l53pJ55j82J80n8j43k05K18J58
4910C1j41o4l5M3L9J83k5j31J55K22l16K2J40m7j74q5K67k88M3K46k67J45L8J06
4934A07j11Q8j1k44m4J18p7O8m2J65K78l80R5l3L06k48p4J15J47l1l65J51J75
4957A53l00K17l32P0M40l18m6J04K29k49J28j90j39L58k51K46M0j91L25n25J41
4978i0K05j79JK59l43K15j68m9J31j09NJ02R3lJ73j20j23l19O36m15L79m5J26
5001C62m28K18l23J12M3n4L2p7j8K03L9k33J79j0j08J0J36J07j40j45L94k68K41
$$ y = [-77, 321, 186, -161, -80, 163, 261, -88, -7, -184, -105, -206, -83, 48, -142, -133, -76, -60, -8, -293, -6, -154, -252, 66, -228, 15, 136, 128, 117, 255, 215, 46, 233, 33, -84, 37, 107, 141, 81, -71, -4, -71, -110, -157, 273, 51, -8, -13, 358, 35, 118, 152, -95, 155, -271, 140, -4, -35, 315, 124, 70, -34, 268, -85, -92, 63, -119, 61, 3, -140, -345, -127, 31, -110, -174, -209, -166, -127, 56, 31, -100, 55, 277, -39, -17, 123, 76, -98, -183, 84, -204, -161, 85, -182, -37, 1, 107, -4, 84, 73, -171, -215, -97, -174, -106, -148, 17, 295, -85, 10, -23, 283, 35, -39, 76, 223, 192, -173, -22, 153, -147, 70, -262, -192, 248, -70, -116, -12, 217, -32, 96, -94, -233, 125, -126, 120, 160, -31, 294, -231, -90, 115, -64, -63, 196, -147, 68, -100, -149, -18, -127, -122, -20, 73, 70, 243, 123, 0, -319, 317, -98, 281, 236, 362, -66, 152, -171, -59, -16, -70, -38, -115, -133, 70, 109, -124, 55, 45, -63, -53, 83, 190, 50, -95, 299, 31, 272]
5024B72k73j47M78m23K3J64k25%j5K56j76j94K28j46N6l8q8M45j88J24l19J3K83
5047A10j54K23l14L7L03pj65j39p2Q9K50m86J59L65j8K7j62m67M94j01o5j06l6
5070b35L33j37l0Q8P6j6j91K52j92J69M7j14j35k08K48O4k56J32L1P6j2p2p1N8
5094i5J66K05j97k65j12M19j27K29k99J63k77K66qk94K12j35K6m0q4J55J97j03
5116BJ27j57K43n60L49M3J67l11J43M1k60K93Rl68L58p8j41M39k91Om38J85o4
5139b63K81j68J24J59k45K8M7j52R8M67j40m08K64M6q9M6j59O3o1K85j41j1O3
5162A34k63J53l1j21k07J95j5J15o8j8M74l78N6M3l08J83L18K7k07j39J10M5k25
5185a27K52l59J87L93m30J67k81q2L1L45j48j30K35j02J09j45L8J35k37L19K3
$$ y = [272, -1, -148, 330, -93, -70, 94, -131, -131, -146, 110, -66, -260, -32, -178, -122, -160, -248, 197, 9, 133, -186, -173, 110, -44, 179, -135, -98, 205, 198, 33, -106, -178, -89, 161, -325, -166, 199, 181, 208, 46, -421, 73, -28, -93, -199, -235, 98, -39, -69, 19, 95, 79, -112, 140, -52, 117, 164, 50, -85, -293, -45, 19, -237, -105, -74, 2, -10, -82, -153, -95, 71, 276, 79, -186, -298, 121, -6, 223, -76, 87, -190, 76, 68, -226, -14, -149, -123, -163, -247, -92, 105, 2, 129, -28, 215, -345, 4, 47, 214, -97, 46, 87, -173, 120, 129, -239, 119, 41, -100, 339, 48, 54, -384, -199, -263, 18, -150, -26, 133, -112, -84, -37, -189, -91, 376, 236, -172, 92, 138, 49, 95, -64, -1, -62, 223, 82, 71, 134, -129, 24, -7, -128, -335, -140, -155, -40, -108, -126, 348, -30, 26, 69, -239, -56, 262, 289, 82, -57, 53, 98, -127, 125, -234, -47, 346, -84, 83, -198, -280, -249, 96, -52, -182, 53, -49, 60, -85, -47, 88, -149, 170, 193]
5206A93k01K30j2j57J25l25J81j43K66m88M49k62Q7L30k36N8j51K96k16J18m9
5227I3L4m5J70l35J30j48Q4J61l75J46K10K04k70j43j66K12J79k33K5N1j2j87
5249b15K54l38J0J03J49K29l06K12j51J68n2k40L20Q4j91Pn4L02m01J59j28k26
5271c05K94k29J80J67j30l01M65p0m31J65N06l02O4P9r5q8o3J36J16k03J03k9
5293B9J19l82J20n1j33M29j10p1J01K0k39K98k83R9L13m7J01k04q6k07J37K41
5315A94lj81k65L51M8k54K56j78M5K9k95K50K14m34L15j98q2P3P0K20J41l98J97
5338A15k92J19n3n8P3N7K16q6k1k67j4J50k27J3J42r9K09J06M3n1j52k1m4p5K84
5363F7n6J45k84N2M61l72km7p2K04j52M7K04l46K46j1l84K53k06M17j34k1m2l3
$$ y = [193, -8, 222, 210, 53, 178, -147, 34, -109, 157, -331, 118, -144, -57, 273, 37, 95, -56, 240, 24, 142, 93, 127, 82, 252, -83, 47, -101, -17, 144, -231, -85, 125, 329, 59, -84, -250, -38, 141, -92, -67, -16, -28, -215, 39, -299, -289, -186, -37, 192, -114, 98, -53, 115, 63, -177, 143, 227, 36, 43, -11, 291, -110, 49, -79, -305, -11, -240, -60, 107, -23, -324, 141, 71, -360, -195, 311, 9, 73, 152, 57, -31, -94, 42, 158, -45, 58, 29, 148, -234, -114, -165, -298, 131, 21, -50, 51, 71, -168, 130, -153, -54, 259, 212, 313, 109, 23, -184, -47, 194, 191, 10, -255, 96, 144, -110, 146, -32, 13, 42, -253, -3, 211, -223, 92, -106, -188, -115, -45, 175, 316, -82, 115, -177, -58, -111, -169, -96, -39, 177, 91, 70, -197, -211, -61, -288, -275, -133, -232, -23, 83, 126, 75, -77, -98, -142, -217, 67, 11, 156, -128, -76, 385, 13, 11, -36, -108, 96, -56, -9, 195, -151, 95, 84, -300, -47, -253, 164, 30, 9, -33, -66]
5387f6K11Q5l69N15k01j13J76k77J57j73J8J12j32J2m2J52J59l52N6P3p0k6J51
5410E6r4R8p0K38m92K27p4K27n8o8J28k58R0l9NP0%K56K5k67M3q0MM7J50j87K46
5437B23k53O9N9O4l41J78J2j24J47j63L5j69L46k89K07L0j10m5K30j34j9N1p9
5460g5k61M01o8J54o0j36K66o4l5j10K30J05k55J2p7j42J99K06l62K3m8q5K22
5483D0rJ8J18m6P9k97L27k22j91J92L7mj3J59j95O6Kr9J13j59J06j58o9J53P5
5508B3J91K9k78j1L3rJ01K2J00j52j11R0J81j47j92N9j18O6J08J58J1r8k88J21
5532a11J79n7k27L65q3m5J43j7J99k50J6j89L0J71j44J19j40J25P9l20m3K43k20
5555a77L8O7j3n2J47r4j76L55m04L38r6J92k16P3Lj35l6N6R3J05j37J28L0j59
$$ y = [-66, 145, 230, -139, 376, 175, 62, 238, -39, 118, -55, -37, 75, -57, -45, -87, 65, 224, -128, -72, 1, -69, -95, 56, -38, 60, -10, 228, -264, -37, -111, 116, 58, -10, 118, -140, -50, -89, -84, -14, -14, 242, 267, 0, 43, -37, -33, 14, 164, -23, 223, -30, 39, 98, 162, -179, -1, 11, -113, 34, -129, -94, -263, 83, -206, 1, 31, -79, -124, 106, -28, -47, 4, -75, -336, 65, -3, 151, 91, -45, 221, 157, 122, 12, 242, 347, 92, 104, 27, -115, 84, 290, -72, -49, -97, -182, 40, 31, 49, 167, 121, 200, -97, 230, 8, -183, 9, 46, 42, 29, 188, -7, 59, 61, -38, 75, -84, 22, -136, -205, -52, 23, 214, 243, -35, -46, -13, -22, 79, 101, 201, 49, -62, 28, 209, 62, -130, -71, -189, -123, -15, 143, 154, 56, -232, -111, 68, 11, -216, 149, 66, 21, 164, 147, 346, 96, 112, -77, -47, 124, -20, 99, -41, 84, 163, -157, -200, 43, -177, -139, -72, -85, -137, 10, -84, -260, 95, -309, 29, -67, 125, -91, -18, -15, -150, -186, -130, -37, 68, -69, 59, 89, -70]
5579g0K80j33k16Q4K8j5p5J07K2j35J2NL26k93p1M33m51K65K3Mp5j5J52j94mL32
5605C26j57k14L2J73j33j08k3QJ49n5J04J3k1j61K17j72r9K24l36K06j8J16j28
5628e7M7Q6j84J13o6J72l36J08n1L30O7k48KP9k63J67J63k80J16o9L16J4k33l
5652a0r9RJ8M1nR1L6r5K39j72P3j84L40j61k61J25NJk35K35l4J65J34p4l69P3
5678a14M7l9K14o6J61n4j89m6K72k07r6J14j2K4j71N8K20j32K41J2q5P2j40n5
5702B9k39L41k41J14K03l36L69j99j37J27L7k78J17J10J73m21N2L9K95k24J10
5723D1J76J2k43N7k41L31J9j64K90k02N9j30J62k47MJ01O3j41M8o2j9J12p9j57
5747b10j49L31j73K44k13N5L79l17K03j6j50J15O1l9k04J30J68l65J94p5j93P4
$$ y = [-70, 210, 77, -139, -55, -27, -42, -117, -10, 12, -123, -111, -106, 220, -73, -144, 289, -162, 103, 126, 130, 55, 40, 192, -2, -6, 326, 169, -45, -13, 160, 27, -81, -104, -96, 53, -2, 102, 115, 94, -67, 150, -22, -121, 103, -233, -27, -45, 71, -57, -10, 76, -108, 5, -61, 111, -225, -117, -168, 162, 229, -19, -17, 62, -201, -34, 129, -151, -35, -104, 212, 226, -7, -10, -109, -100, -82, -41, -46, 45, 81, -14, 225, 53, 126, -58, 282, 121, -140, -15, -10, -9, -244, -9, -43, 122, 256, 182, -187, -114, -67, -106, 108, 42, 203, 149, -40, -86, 186, -21, -117, -3, -15, 9, -162, -104, 116, -16, 225, 237, 152, 224, 84, 29, -210, 131, -110, 4, 207, -129, 240, 41, -96, 31, 68, -210, -93, 17, 190, -231, -179, -140, 155, -69, 41, 217, 229, -14, 43, -198, 133, 152, -12, 278, 76, 135, 5, 167, -80, -76, 25, 88, -53, -5, -67, -86, 26, -53, -210, -359, -28, -201, 43, -170, -115, 264, -53, 150, 134, -16, 99, 160, 121, -83, 47, 215, -150, 44, -31, -224, -150]
5769a50K62q4j83o8K46R6j42J18k39O0K27nj76LJ50j47j86J00J57o8N4j21O7m7
5793g6Q1m4PJ81j29k8k8m8L43k41J16m21L34m6K61l03j24K58N0l16Q5l5K58J13
5817B48j56p2j1l09M69r8o6P4J62q1l54K07k3K05l04n6O8J60J22j22O1k18Q3l1
5841d2n8K94j52N8L3m03J8j3L05j32K44k94K54r2l3Q1K70l50J93j38k43L34J10
5864B44q9j07j79Q2J0p5j18K45J45j63pk4p1J51J2L0J42k94K27j87J05j40K8o
5888c9K33j22k21J65J33j17k12L53k32J72l23Q1K51k06J38J10%j83K4Q5j27n0
5910h7K63j65M2j74N9ML8M6p1o3N6j30J45N6m18N93m73L09N0k64J78k38K45R3
5934I4K7j46j6n9L57k52M2j38l04P58m50mK21j19o6Q4j42m0O2P4J66j00r5p6M4
$$ y = [-150, 112, 28, -155, -223, 23, 119, -23, 95, -144, -84, 143, 138, -38, -35, 115, -32, -218, -118, 39, -29, 25, -96, -29, -76, 5, -39, -32, 149, 20, -8, -36, -84, 259, 18, 134, -287, 47, 1, 262, -41, -165, 93, 143, -173, -88, -123, 135, 248, 92, 20, 9, -300, 169, 71, 5, 79, 241, 160, -194, 13, -10, 195, -109, -165, -97, 63, 185, 63, 124, -94, -11, -42, -100, 194, 42, 100, 133, -270, -252, -265, 40, -92, 152, -142, 112, 20, -13, 68, 338, -12, 181, 43, -200, 134, 244, 155, 48, -131, -49, -39, -114, -232, 13, 158, -5, -12, -36, -107, 44, 56, 86, 228, -66, 161, -26, 79, -61, -33, -39, 194, 72, -149, 16, 149, 32, -180, 173, -59, 113, -210, -129, 122, -84, 54, 164, 164, -19, 5, 90, -37, -87, 176, 11, 53, -121, -62, -58, -20, 26, -45, -108, -52, -182, -37, 19, -399, 194, -279, 30, 80, -184, -6, -244, 1, 94, 121, -25, -41, -100, 257, 5, 47, -91, -395, 363, -87, -91, 130, 11, -55, 29, -113, -153, -91, -17, 149, 49, -46, -122, -78]
5959g8J84j56Q1j15M22l43J18j34K2J97j28J33j29j74R5j60K03j21K37k25j7k4
5981a12K14j40K50k6m9j76J18J76m70M73j31J57j85rj80K65l06R8k2J68o6O2l41
6004b32L63m20J18K67n0j5L9j87O8K75k06k8No3K56l6j80l53K86M4j03k47N98
6027A99K2l42L2k4K25J57j83k02K55k07J79j44R6J87l05J83k50J19m1P9k8J06
6049A13o2l7l63J64K59K3j29QJ17n0j06mj47J29j07L87l19j19K76n4J51q7k51
6072b08K16l5LN9j79q7J97l0l03K40Q6l0J15Q3j75K3Q4%j37J21Nq5N6J40Q1k39
6098Aj48J21J83o26M28j6n4J64q0J64k86J64oJ7j11P5k36J52J66m2l91L87q5P0
6122A1J93j59j18J27j73N5J61J6P7j35J19j69J36k23K28qo7l23L48j96N6L21k32
$$ y = [-78, 106, -50, 31, -84, 338, -5, 113, -21, 1, 198, 70, 203, 74, -100, -5, -165, 38, -83, 154, -71, -88, -112, 102, -38, 212, 186, 137, -39, 79, 255, -215, 258, 127, 284, 99, 90, -90, 175, -131, -33, -55, 113, 47, 109, -232, 131, -289, -171, 96, 46, 31, 70, -117, -49, 226, 20, -8, -3, -66, 190, 154, -26, -379, -93, -49, -152, -399, 199, 221, -121, -89, -113, 112, 269, 86, -116, 139, -68, 111, -33, 63, 250, -55, 128, -122, -3, -44, 35, 7, 113, 51, 14, -349, -185, 74, 97, -32, -24, 93, 43, -63, -67, -214, -85, -192, 195, -124, -243, 33, -21, 130, 43, -208, 8, -27, -24, 35, -144, -231, -34, -64, -367, -127, -41, -71, 44, 127, -48, -25, 59, 59, -78, 43, 48, -37, 19, 159, 240, 1, -147, -26, 157, -469, -41, -57, -111, 53, -27, 137, -149, 15, 9, 26, -85, -10, -246, -94, 72, 30, -361, 26, -59, 11, 204, 45, -73, 54, -119, -64, 97, 113, 190, 55, 174, 5, 141, -82, 146, 138, 71, -252, 96, -100, -44, 277, 45]
6145D5j08J21k69J85L36l01j98j3K67J1j12R4M4m87M60r3m2K5k1j59K91Q5j64
6168coJ85k52J13l9J23N9k5j01N2J1l21M12k16j27K66P7l65K47j64L23l90r7J52
6192h6p4L57j22KJ03l33J26k46L68j21j77K71j20k49M36p1K6P7l26mJ88n0j44
6215a69R0Q5k33O9L82k98J24n7K58j03j53K50j78K15j25q7O6m5m21J6M59k62K39
6238A22k20j43J90j68O7Q9r7J09n5J88j10q5J58j90R8nK69m5j64j32qJ72o7p3
6262a00K42l04K35m0j41N4J59o6j03Qr6L8j51L80J72l6k80qJ29p9J0l6P6k6J23
6287A60l14j91J36L73k58j10N3R6n4K52j95k05Q7K53J45l13O3O1Lq2K1%J9K28
6311B28j18j88P1J18j6l31K15j47J54k59L31j27L42l34o9jJ34k7m8j54M93l6m6
$$ y = [45, -63, 58, -211, -26, 310, 9, -189, -202, 65, 76, -36, 58, 102, -385, 75, -18, -60, -35, -56, -215, 76, 161, -3, -9, 176, -76, 37, -2, 121, 180, 155, 54, 106, 117, -204, 208, -8, -135, 131, 208, -157, 90, -74, 249, -141, -238, -86, -160, 197, 75, 77, 180, -153, -27, -273, 95, -26, -203, 68, -52, -301, 135, 64, 90, 167, -159, -163, 25, -25, -169, -79, 6, -227, -158, 224, -74, 50, -7, 251, 148, -5, 245, 67, 282, 157, 70, 136, 91, -330, -314, 145, -117, 122, -98, -241, -51, -219, -152, -63, -160, -51, -106, 82, -28, -113, 45, -145, -47, -52, 217, 172, 8, -124, -132, 40, -27, -100, 142, -162, 73, 33, -108, -54, 105, 39, -64, -56, -152, -114, -265, 115, 287, 251, -29, -37, 92, 13, 23, -13, 63, 37, 160, -154, -345, -209, 164, -94, -204, -151, -55, -109, 143, -52, -257, -170, 83, 228, -85, -22, 39, 42, -40, -19, -19, 0, 228, 110, -78, -7, 111, 95, -236, -21, -168, -14, -273, 58, -69, 273, -61, -130, -131, 3, -24, -72, -226, 267, 231, 185]
6334A85l22J66M01n38j90J24K40j7j25p0J84l22K75P0l1j19j70L97k47j36K14
6355c1J51o5p5r6K14k56K95j34j76O1lO3j45k4M50kl07j07O9R7Q8J7J24N6r4l23
6381a53J45O6k69L97k55J10r0L9J78q5q2o5J07j9J02k14J81k67J5j44M20J90m0
6404B67l17J24J15k11J15j17NQ4k04J69r9J03p4j3K51l52K05L46m06J46k35L60
6426B62j85k25P3J35j88J15L9J1R6K34n55J58J06Q0L9L1m30K31l93L32J60j91
6448f5J40J28j9k34j61K40l1k91P8L28L9j58j28J86N2j09J38l3k04j01J86J41
6470A22n0q5K16j14p0JJ76k30K34l06K54N3k39J98k26j6L47j50j61O7J51l47L46
6493A71j80j10j44J57%o3K03k64K10l0q0L08o3j62J56J8l3j72K98n6k78J50j55
$$ y = [185, -137, 29, 430, -108, -298, -174, 66, 49, -76, -146, 38, -284, -9, 61, 30, -89, -259, 138, -109, -245, -31, 120, 55, -20, -116, 98, -158, 137, 3, -173, -112, -115, -52, -197, -221, 229, 227, -80, -187, -118, -21, 67, 84, 208, 264, 170, -153, -8, 58, -211, 186, -69, 41, -49, -10, 168, 83, 1, -64, 43, 24, 126, -88, 93, -174, -159, -303, 117, 307, 267, -50, 74, 189, -22, 93, -24, -19, 65, -139, 30, -69, 34, -40, -53, 198, -154, 51, 397, -9, 137, -98, 262, 77, -148, -75, 60, -128, -13, 26, 37, 133, 367, -188, -30, 76, 156, 195, 226, -204, 27, -366, -34, 126, -65, 75, 203, 184, -50, -211, 29, -2, -293, -215, 113, 152, -6, -134, 52, 104, -5, 133, 100, -104, -205, -19, 122, 72, -13, 203, 89, 19, 20, 196, -34, 200, -106, 148, 201, -38, 160, -66, -82, 265, 115, -46, 21, 172, -175, 171, -9, -119, -263, -106, -106, -169, 34, -230, -20, -50, -130, 178, 115, -47, 109, 127, 94, -78, 220, 164, -114, 36, -119]
6516a19K00K85m80K14J10k22K7R6p6N1M4l13K08M3j85J40l04J47K76K5j96R8O7
6539A36J1l32L32J60p5M4l72J3o4J34l7M4l55O47m41J81J61l87K59J8J79l27j28
6562a99J45J6J9KO4j39R5Kj77N0n3O2Q8P4N3K7k35Q2J51l54NL42k22J26Q3j23
6588a6Pq0L40j69ln5j15K89k41m9k09N61l87J09N2j82J53O3j34j1j15R2L27j99
6612B8K45k58j49L26Q8or2m6j04RQ8j55j14J15J08k28J12K0m9q0J4J88q4J38j73
6637e9J70l89L11q0RP8K3L18m62K33Mj09k1J40r1J14K2p0l56J1J78Mj63n0J81
6662e4j78L53j26j68K7J04J69J32j68m0j22q9J10K7k2J39k17k7Q8l0J25m6NQ9
6686H1J14k04J56j1k33K8O3j9J2j35J15J19k03K83m5q0J0n4J24q6nJ15l04p0J2
$$ y = [-119, 81, 366, -114, 100, 210, -12, 15, 111, 35, 86, 130, -183, 25, 68, -117, 23, -281, -134, 142, 167, -29, 69, 136, 147, -185, 147, 307, 232, 276, -96, -83, -147, -13, -50, -6, -361, 286, -155, 26, 187, -200, 59, 77, 256, -71, -199, -54, -38, -19, -17, 47, -92, 3, 5, -172, -122, -175, -113, -25, 49, 102, 129, -106, -24, 127, -227, -222, 120, -102, 24, 107, -16, -9, -89, 251, 82, 79, 24, -91, 198, -43, -92, -301, 260, -127, -18, 34, -148, 5, 68, -66, -77, -192, -100, 227, 28, 273, 15, -134, 192, 280, 274, 182, 136, 32, 41, 129, -26, -140, -25, 83, -145, -33, -13, -62, -142, -128, 60, -24, 114, -59, 111, -278, 33, -47, -38, 40, 63, 381, -81, 152, 156, 47, 26, 166, 75, 189, 211, 141, -215, -204, -26, -22, -185, -235, -54, -232, 121, -5, -173, -146, -42, 127, 259, 91, 51, -71, -160, -50, -23, -45, 94, -123, -150, -62, -92, 33, -13, -8, 81, 195, -9, 147, 136, -97, -69, -6, -25, -13, -148, -33, 86, -117, 166, 121, 41, 51, -3, 121, 35, 30, 145, -159, -229, -217]
6711b17j18J67Q0K12k17J12o5N0N9k8J29k92K95j63J59k83j85P3K67j20m4J06
6733b3j25J32J45Kl83K23j72K08o2P0M6j72p4P2j5J83p2Rp4k0J13q1N5k43J54
6758a04L6k7r0J64j70P2K27r5J8J35j24l42M27j96Qj8K24o6K1j89J34J32q4j67
6782g4j24j28L05K94k99N9k14L45k59K70j74k2o6q4J78R5j58J69k10K19j41o3
6804h2K67k0m03K96o8J35k50K30j50l6J20M2r3J11P6j85K06l79J14J43k44k7J67
6827c0J03j76Q5L7j72O2o8j61J53L18j58Q3o1k3K07j83o8J59o1K57m25J4K13o5
6851D0o7J60m0r6j20k1K27k4j02j20M2M59l84j09Q2m6j18K50j82N2L43k19q2J66
6875I1L5j00N8r6j59R1N2J81P4o8j54o0J11M0k28Q6M2K20k56J02r3k66M18j68
$$ y = [-217, -335, -168, -88, 124, -93, 19, -46, 4, 63, 35, 164, -128, 167, 4, 163, -120, -305, -232, 35, -85, -129, -23, -148, -16, 129, 131, -252, -29, -201, 7, -55, 15, 61, -111, -185, -113, -128, 55, -17, -8, -82, -102, 11, -70, -15, -258, -104, -68, -95, -185, -21, -191, -119, 108, 13, 31, 166, 42, -300, 127, -69, -61, -79, 145, 79, 100, -89, 45, 177, 93, -74, -198, -326, -21, 273, -26, 33, -181, 164, -95, 175, 1, -21, -87, -171, 7, 102, -56, 113, -97, 122, -19, -82, 185, 165, -238, 58, -10, 125, -125, 105, -45, -81, 39, 81, -12, 99, 175, -10, 196, -183, -69, 74, -170, -197, -30, 73, -103, -18, 19, -153, -91, -159, -320, -167, 151, -7, 76, 15, -8, 199, 16, -52, 107, 46, 303, -122, -108, 105, 40, -27, 133, 93, -3, -123, -144, 83, 59, -43, -163, -121, 338, -46, -155, -73, -119, -237, 13, -169, -117, 226, 7, -75, 91, 126, 26, 84, -12, -171, -80, -28, 153, 227, 159, 5, -55, 56, 96, -132, -46, -4, 216, -40, 62, -31, -297, 121, -47]
6899d7J1k2K10j32K1L1j11J61j40M5r3J84j04j4n2j93J59KR4l56L7K62K09m1k48
6924a27K29j47K7Q8k98L95k31m8J97R6l41J95P3q5j21o9K13j06o3J39M4j65R6
6947iR0j72P2M9M9K42l50J22J47j83l44J0M07k37K37P3k45q9l3n3L37j87j24J40
6971e1Pj17QJ25l46M48N0k34k6J00j14K34L7j22J90j10J86k13O5N8k29J84k06
6994g6K41J46k92j65l0K00K1n0L19k75j28Lj69K09J32k21L81l10J24j83R3nl7
7017g2L09j50n5j11q4K19k76M7K99q6r8l6J28j10j8n7N5P2M6J1J6j57J79q0J24
7042A15m0j74J93k43J67k08R4q7N4J73O0j76m3J09p7J66p9K9J14k26N8p7J45O
7066E3M4Q4O9j50m38L68p5k1L5k17K31K0k75Q7RL31p9m4k9j95L65j83K3J82j78
$$ y = [-47, -36, -58, 152, 20, 41, 72, -39, 122, -18, 27, -66, 118, 14, 0, -52, -245, -86, -84, 10, -346, -309, -47, 162, 121, -127, 102, -45, -18, 70, -228, 167, -64, -112, 85, 181, -160, 35, 108, 23, -98, -167, 46, -60, -123, 16, 60, -105, -9, 81, -91, -19, 30, 79, 321, -29, 93, 240, 57, -287, -277, 130, -107, 130, 203, -42, -131, -164, -217, 120, -67, -191, -51, -44, -161, -153, -28, -374, 74, 124, -110, -136, -36, -150, 84, 121, -1, 189, 79, 265, 52, 117, 175, -54, 130, -76, 165, 311, 19, -146, -176, 24, 45, -5, 314, 39, -89, -86, -255, -46, 86, -135, 246, -64, 60, -123, -30, -35, -72, 237, 87, 32, -79, -163, 56, -220, -173, 126, 40, -58, -94, 34, -76, -94, -151, -96, -24, 22, 33, 49, -108, 71, -9, 115, 75, -99, 94, -149, 18, -190, -96, -183, -129, 44, 104, -72, -115, -6, -83, 83, 4, 33, 147, -79, -21, -98, 47, 53, 97, 181, 250, 100, -338, 30, -45, -66, -31, -248, -17, 3, -272, -185, -176, 155, 76, 32, 3, -192, 173, -10, 13, 195, 17]
7091A7o4K6L1Rn4l8k3j07L58l32K19j26J02k4o0K45j69j44L3J73K26k93o2K44
7115A87k19K9PJ82j61N2L5k84J00L6J6j28J17KR3r4n1J23k21J92r1J20j07J33
7139F8Mj38K52l18L44k06k52K75j00J13q5M9r6j71K58k28J57J26j62j57R2J00
7161g5K7j29J78L1LJ01p6Pj34J4q1M4k0j20J96o0QJ62j3j7l09J10k3l6Q8JK92
7188A69l54J29o6M67k32k11K54r0J54j03j6j44J94R4k83k42L99o5n1l3K2m21M86
7211E7p8J32k00K21J54l36J58j18K73j82m6P0j82K62l72J29J84k93P7K1q0O6L10
7234B27k29O4j14k04O1J85K75m59P2J01Q5l35K21j50J07Q4Lj4Ok3J58j59n8J77
7258H1J13j03j76J67l7M7k25pjK45l99N61Q6l28j33Q9j78K28j54J58j66J81P6
$$ y = [17, -47, -21, 10, 19, -35, -73, -96, -203, 155, -177, 42, -84, 18, -6, -66, 179, 10, -134, -101, 72, 298, 5, -57, 187, -32, -3, 4, 186, 25, 77, 112, -172, -72, -36, -20, -148, -31, -29, 64, -30, -81, 42, -179, 13, -78, 42, -65, 68, 72, -66, 186, -132, 212, 6, -246, 29, -71, 42, -43, 6, -90, -261, -3, -231, -74, 52, -110, -267, -175, -75, -48, -177, 1, 32, 35, 136, 60, 67, -67, -53, -134, -90, -110, -230, -34, -94, -86, 76, 63, 46, -263, -153, -176, -212, -124, -123, 169, -185, -56, -122, 345, 113, -98, 156, 66, 220, 117, 101, -43, 151, 245, -38, -280, 119, 54, 3, -30, -8, -429, 57, -21, 111, -89, 132, 286, -50, 108, -10, 263, 81, 35, 105, -77, 185, -187, -58, 126, -167, -90, -69, -149, -83, 227, -2, 62, -52, -256, -195, -10, 265, -194, -122, -21, 64, -271, -50, -200, -93, -9, -6, -20, -14, -37, 121, -38, -96, 81, 194, 91, -85, 82, 45, 92, -133, -140, -141, 104, -295, 266, 352, 24, -109, -20, -198, 30, -124, 34, -132, 49, 125]
7281A25J9k84J67o6K7P4j75Q7K8L5j8j38j62L92k11J41l1J78j91p2J99j32Q6r
7305F9j58l2O9j20J92K7R0P8l70P5N9o8p3K19q1m87P64l9k83K19J10k04q8R9j35
7330f8K93n9l03L8K1J33j53o3r1L23r3k9pP9K32l12M7k67K07K33J55k63M9m7j87
7355a32r8R6K34Q9j98J24k01P0M2oQ5j11R3p6j59K16j70L12k80N8J39k64M8n1
7379a40K3M0J78j50J41j84K15k98J92J69l38L37m16M87k03j90L2K03rP0J12k99
7401b8M1p6O9J88j86k8L55l27J36j09Rj54J4L35j96k74L25o1n3j5p7K36j34o0
7425g0P3k58L13N4k15k3l7J18j4r8J0Q1j09K28M4k34J70p0J68j46L33l61k13K79
7449B3J19k69P6j44RL05k54K27r0J49j7j09j6q4R8k14J62K67l09o9K29k54r6K82
$$ y = [125, 144, -140, 27, -39, -12, 62, -113, -26, 2, 37, 19, -119, -281, 111, -100, 41, 10, 188, -3, -75, 124, -8, 78, 69, -89, -121, -52, -172, 20, 47, 137, 215, -155, -80, -21, -89, -162, 57, -24, -511, 253, 214, -69, 150, 260, 56, -32, 67, -68, 225, 166, -137, -99, -78, 55, -98, -161, -252, 71, -22, -51, -58, 21, 253, -59, -12, -279, -72, 161, 316, 53, 102, 55, -132, -230, -134, 100, 189, -9, 115, -86, -16, 26, 20, 105, -6, 87, 11, -148, 68, -102, 210, -70, -12, 127, -137, -89, -140, -117, -77, 101, -49, 92, -92, 123, -175, 17, 186, -152, 185, -231, 256, 53, -137, -105, 98, 89, 159, 271, -28, 13, -63, 6, 194, 8, -20, 335, 8, 144, 35, 44, -110, -96, 239, 43, -231, 94, 33, -20, -35, -112, 124, -10, -70, 3, -255, 58, 112, -103, -126, -163, -45, -59, -157, -147, -66, -175, 53, 97, -137, 33, -37, 131, -15, 318, -43, -256, 23, 142, -127, -51, -195, -186, 119, -135, 92, 2, 151, 134, 25, 9, -75, 23, -191, -29, 238, -71, -140, 89, -165, -261, 21]
7473B1J01j89M67n18L39k58N2n1J98r4J14k21N3P6O5j71R0J01q2j19j93K25jK03
7497B08p9J27m15K04k77K54R4j07J02J07J1j33M2P9p0Oj48R0l57M20k40n9R8J6
7521b7J20k08O4K66j42o8k77K27O2k8K27j98K68m3l17j76L99j71J16k7j10j5j80
7544b38K20J83j71l03M56p0J1j07nl67N72j98j96M23k86L2J29J22j83r0J39j00
7566b7L6O8j0j53j50J61J69k38K07L3k72j65M19j46o3nJ66Pl87L00r1j41J95K22
7590A35k25L13j97O6k9n8j95K19Q2j17N0k17L00K5k1k28k6J87n3m0j04J02J71
7613A40k86QK48k10J16j07jj0L38j23j83l4J10J32l03J01j44M22k27J3M8O0k49
7636a41K60P4j89L01l31J28l3mn6j59P1k13K91p0N2oLN5j29J73j53m1K19K5j36
$$ y = [21, 122, -67, 400, -118, 221, -37, 15, -36, 162, 68, 182, -39, 14, 90, 155, -16, 74, 175, 93, -26, -219, 6, 5, 208, 129, 256, -159, 45, -232, 22, 116, 9, 111, 218, 229, 96, 138, 217, 147, 153, 5, 95, -262, 158, -82, -141, -43, -27, 93, -115, -51, 215, 73, 5, -272, -45, 17, -11, 216, 18, 286, 243, -74, -250, 149, -22, 94, 67, -43, -58, -238, -18, 165, -6, -309, 147, 77, 88, -19, -24, -391, 181, -17, -213, 210, -76, -44, 85, 207, 24, -66, 73, -27, 9, 77, 67, -86, -236, -75, 94, -144, 63, 96, -176, -341, 78, -68, -131, -136, 30, 37, -350, -50, -141, -282, -87, 135, -90, 223, 26, 92, 63, 5, -190, 29, 111, -6, 44, -173, 127, 152, 131, -97, -123, 64, 11, -29, -133, -31, 140, -146, -138, 110, -100, 16, -91, -92, -102, 236, 113, -70, -104, 6, 138, -165, -64, -208, 214, -13, 0, 48, 108, -141, 119, 193, 4, 305, -26, 102, 69, 65, 9, -150, -79, -292, -1, -71, -19, -25, -22, 33, -96, 77, -76, -117, 102, 127, -9]
7661ik52M47J41q6j94M7j16l2J24J01k3k76K73j56q1N8q0N5j66P8M10k34K04k16
7685A7P6j53j61J66n6L13l02J74l9K20q5k00j60Q4P0R0N2j37J74k82r5J49l45
7708d30L87J46j44R5J77l0l12M2J23q7m9J95m9l4J6J02k93J35J63j17q3J28J39
7731B20j11j18J64m83L50k17L48k02J42J4K1j05oK8L7P7k31j1J77K9k18M07k84
7754B8p0M1m2Jk55M46j61nRK67k36r2q7P5k3J72J17k21P9p7n2k7J51QJ3k15Q6
7781g0Q3j96J47J63k25k50K14R1J6q1K86m4j04o4K73l25J96j06q0L14N2j89j03
7804bJ6M2J43j66jj99j1K95l85J88Q6k78K94k52O9J53j57M8J86l8k64J57J46p6
7828fQ4p3J47l40K11j60J16k50J92j60K01R9O9l08L75k40k8P5P9J64q6l27J97
$$ y = [-9, -261, 186, 327, 241, 47, 94, -22, -54, 70, 171, 148, -128, 145, -11, -92, -34, -114, -59, -225, -147, 263, 29, 233, 17, 93, -60, -221, -55, -111, 202, -100, 74, 35, 255, 170, -30, -190, -106, -36, 54, 106, -31, 143, -139, -234, -85, -430, -43, 103, -41, 54, 231, 201, -111, -69, 54, -33, -82, 113, 64, 30, 46, 148, -145, -10, 153, 36, -47, 81, 220, 109, -9, 155, -328, 22, -195, 153, -49, 93, 107, 128, 23, 17, 45, 82, 159, -72, -83, 94, 123, -95, 312, 28, -42, -1, -43, -42, -297, 149, -12, -17, -8, 259, 23, -69, -156, -81, -104, 68, 185, -36, 43, -34, -86, -113, 38, 46, 59, -156, -70, 13, -183, -36, 127, -98, -348, -134, -43, -27, -108, 178, 134, 30, -34, 239, -86, 110, 4, -76, 238, 290, 101, -2, 14, 56, 199, 33, 32, -167, -178, 117, -268, -80, 6, -272, 22, -230, -161, -8, -165, -117, 69, 31, -233, -76, 70, -6, 78, 5, 152, -188, 23, -137, -21, -271, -79, -239, -38, 61, 130, -178, 197, -43, -71, 4, 83, 247, 161, -166, 31]
7851C1K15j86j25J16L06k75j03J49k21j09J5M30l80k7K83j11p3q0M10k54l1J55
7873A35q4Q9j64K24q0k8j43J3k3l68N6O12l37J67j88L39k69P8j59J36J18q7j57
7896a20K98m4j10K32l80K5R6l1j40K97j75L12m0m24M9K18k35M32n56N9R8L67j83
7919D5RK28k66k0K51k39MRk51M72m67O04l47k65J56J14j3j06J79j72k35J91J49
7942C0J52m80K95K5l20K21j0J98J27l35L11k34J97q2J51l36J45p0M7m9K10m4k6
7965A23j88N7M0l0j50K50n2j79Q3K75k19K32r7k23L39k45p5M66m65j22J51j90
7987b19K42j0j29j51L2o5M50j62j42j07L56j11J05l00L8jJ81oJ81l00l2J59J47
8010A56j47j62j29M53j40j31K09k80p5L58m5k55J23k27lL7K45J80J7j11J41j44
$$ y = [31, 246, 60, -65, 51, 357, 82, -21, 128, -93, -202, -187, 243, -137, -164, 119, 8, -65, -145, 265, 11, -20, 135, 51, 140, -24, 200, 120, 92, -51, -38, -61, -429, -373, 239, -98, 69, -119, 220, -49, 29, -130, 6, 124, 37, -120, 178, 134, 24, 256, -124, -99, -3, -34, -174, 123, -52, 260, 220, -204, -155, 63, -172, 260, -296, -237, -139, 228, 45, 54, 282, 16, -4, 247, 8, 12, 21, -230, 242, -225, 379, 32, -233, -77, 37, 24, -82, 97, -75, -310, -119, 30, 182, -298, -3, 22, -298, -77, -87, 111, 238, -97, 214, -20, 177, 95, 246, -90, 55, -15, 32, -17, 193, 149, 123, -65, -8, 32, 2, -148, 102, 50, -129, -46, 229, 10, 242, 145, -78, 261, 16, -59, 407, -58, -180, -29, -219, 23, 13, -116, -267, -235, -300, 150, -12, -154, -261, 95, -16, 89, -211, -173, -174, 7, 1, 182, -118, -150, 9, 156, 9, -153, -282, 171, 31, -100, 109, -171, -246, 112, 67, -188, -65, -292, -295, -258, -13, 167, 184, 73, 214, 70]
8032G0j56K36n3k10J12q7L5J67j62J7O5j28N8l6j75K80m7J03j95l5K59l1M4k10
8056g9J13k92K75K6k2L75l38J63j68J42l48J81q9k1J53o1j83L48k33J81j79k23
8078b79J84J58j3j67J3l3R6J76r8M3P8l74J41J59Np3O0n0j34q6M11m20K61j54
8102i6k00L39l2K09k37JM3Q4j21J63k74K64M9j43K41J7j61j00l3O7J11j29l4L9
8126F7OR0j45q0J73j79K45l43J48j18L21j43j36J6K21P7k32n5K15p5k0J06k90
8149a31K1K41j03p2J85QMr3n8J69j48J63l32K94l29j83K40M0J92K9o5k30J64J13
8173A19j48M8n5k09K21J57K4j89p5K0J19m7J84K37l21j5j49J21
$$ y = [70, -86, 150, 97, -113, -1, -88, -53, 114, -48, -31, 34, -94, -36, -72, -247, 33, -14, 89, -106, -141, 118, 87, 131, -79, 34, -258, 17, 43, 21, 396, 58, 221, 53, 195, -153, 28, -61, -82, 71, 10, -173, 175, -58, 123, -56, -279, -95, 63, 50, -117, -104, -137, -41, 135, 37, 80, 158, -216, -75, 84, 89, 16, 76, 26, -108, -194, 217, -203, 58, -96, -296, 43, 11, 220, -17, -16, 27, 111, -10, 153, -121, 143, 192, 49, 290, 307, 146, 46, 13, 80, 191, 62, 28, 67, 73, 163, 18, -62, 111, -68, 177, -166, -18, -136, 185, 42, -94, -78, 143, 220, -12, -67, 148, 73, 53, 159, -131, -110, 131, 28, -44, 141, 149, 153, 60, 2, 171, 23, 186, -146, 148, -181, -364, -124, -84, 108, 137, 72, -158, 6, 119, -29, 19, -36, -245, -24, 133, 157, -32, -107, -87, 32, -15, 169, 406, 85, 70, -79, 42]
8191D2
$$ Imaginary data points
##PAGE= N=2
##DATA TABLE= (X++(I..I)), XYDATA
0@%%%%%%%%%%Qj6J6j6K4l2M0m8N6o9Q1r5J10j31J54j78K05k34K70l10L53m02M54
33B40n12N76o48P28q11R04j008J119j238J371j517J676j849K037k245K471k720
50a426K998l303L642m024M451m936N493o138O897p801Q899j0270J2029j4368J7636
65I779k2502L0449m5432Q2313l15436l31441J135581m05086o37020O99007l2930
76A67282m62450L97281K3996k71876J05903P8135Q4380j20685k63544M07838J35054
87B81314n61811J91911L80479l86130l52K42603k24786K4888J62004j36998j2129
98c9007r605M1475J65251k66871r6411M29393j53953l15159L21470K5959k20250
109a17708J79418j8868j35555J38007R458n0334k1431o1549J88187j0329k98791
$$ y = [0, 0, 0, 0, 0, 0, 0, 0, 0, 0, 0, 8, -8, 8, -8, 16, -16, 24, -24, 32, -37, 44, -51, 59, -72, 82, -96, 109, -125, 145, -165, 188, -214, 240, -272, 304, -344, 384, -427, 477, -531, 588, -650, 721, -796, 880, -969, 1068, -1177, 1294, -1426, 1572, -1731, 1911, -2113, 2338, -2598, 2895, -3243, 3654, -4147, 4752, -5518, 6511, -7857, 9779, -12723, 17726, -27706, 54607, -260829, -592270, 543311, 138225, -498795, 200212, 167282, -295168, 102113, 126109, -145767, -39864, 38271, 122651, 1966, -261578, 146260, 281314, -280497, -88586, 291893, -94237, -94589, 148014, -76772, -51884, 110120, -26878, -39007, -48612, -7137, 158114, -108757, -205168, 224225, 70272, -244887, 76583, 102542, -117708, 61710, 42842, -92713, 45294, 54752, 4418, -17013, -78562, 109625, 99296, -199495]
120a99495K19296J48534l10400J41700R9403k75228K46122P6695l91058K69889
130B5458J63231l87492K25770J30456l84757K83549J80682m72951J83440L05262
140B52648l48405R373K08260j62989K9448P6580j19404N2506J3792k8542P8911
151F2178j39639j789K34866j84362j29066K70598q4523j36648J92491q9297q6072
162i1263J99126q9425j09755J48164l5762l7237O4783r9963L9535J04074j35835
173d3558p14R5092p8854K9241K8715j03045P8456M8298j03566M1347J4656l1816
185b5748Q1871p4746n1619J56685p8253p9932J58866j00379o7960K13714j31961
196E38j45891K59315m7947k02954J78308K1188j51062J08073K4799j11358N6802
$$ y = [-199495, 19801, 168335, -142065, -365, 99038, -176190, 69932, 146627, -244431, 25458, 188689, -198803, 26967, 157423, -227334, 56215, 236897, -236054, -52614, 252648, -95757, -86384, 121876, -41113, -11665, 64915, -54489, -1983, 11809, -16733, 62178, -77461, -79250, 155616, -28746, -157812, 112786, 28263, -108385, 84106, -5191, -91263, 107863, 18438, -91317, 56847, 21085, -16152, 48631, -51332, -11797, 92277, -43558, -44272, 50820, -28034, 1207, 29922, -73123, 5333, 53631, -49935, -8588, 6068, -25748, 56123, -18623, -70242, 86443, 8190, -71742, 87124, -13255, -81215, 132499, 538, -145353, 113962, 66015, -136939, 41369, 62557, -88505, 19568, 44367, -66991, -10189]
207a0189M4792l4584k6218j2720Q6658o619j27731R7320P5868j50402N4801R1418
219H2394j41449M3887J06146j31629j960R9462o1872p995J7545l9838O4712j0108
231A9295q7418Q2715K0982q9818O5381J7726q1709O5373L2052p5546J8110L5425
243B2568n777p935l6864L6315M3542q4238J3512P2027q3772O778Q4276r5831j3950
256d9349J10329o7775m6878P8128k3375j9418L5157l6312J0557M0390m5023O871
268f698K8100l3998K4206J3620m9441K6567K7970l9762O376M379r567K8875l0225
281i598k1557N5094k4636l2790N6330k9039l1788P3599k8534n5236P0268N583
293B7696n4867L2823J0543k3730K0466o077j2807J3739n282L874j275k6066K6954
$$ y = [-10189, 34603, 19, -26199, -38919, 47739, 41120, -86611, 10709, 86577, -63825, -9024, 82394, -59055, -15168, 90978, -40651, -42611, 56851, -5021, -13016, 4529, -35309, 29403, 19295, -68123, 14592, 35574, -54244, 11137, 28863, -52846, 12527, 44579, -30967, -12857, 22568, 16791, 8856, -28008, 8307, 51849, -32389, -18877, 53150, -30622, -23844, 60432, -35399, -49349, 60980, -6795, -53673, 24455, 1080, -18338, 16819, -19493, -8936, 31454, -13569, -6698, 21402, -12596, 11610, 25230, -24211, 2356, 30326, -9436, -3060, 1319, -8248, 20627, -9598, -31155, 23939, -697, -33487, 22843, -6196, -37984, 35615, 7081, -48155, 22113, 27696, -27171, 5652, 16195, -7535, 12931, 6854, -5953, 7786, 2504, 6378, 5103, -20963, 5991]
306E991J5484m8835J5834L0238l4817P952J8795l1261J8235K1027l4928J1112
318e173J9007j9587J4533m50k3017K9924M972l6843K0316J1760k2796J1532k79
331C899j6775J6473J656j7246P770o74K045Q030j9233M655K3527j8161n893K1072
345A1145j3718J003J9096k2543j062K5379j5444j0211J4710p753m98P209j5370
358h057K962J0506j0137q73K400n565J0243J00j4753J1839Q247j1036K815M505
372C196k916O094j170n961O357k268J7N265j3587R44J8646j5981j5439K3230r62
387E465j9984J0228R031j3567J0J4689n674j3230J3125J6331k1752r041L1681
400A7312l410k9233J8729J7537k8004J645K2829j8157j2223K1390n37k0622M515
$$ y = [5991, 21475, -27360, -11526, 18712, -16105, -8153, 10642, -20619, -2384, 18643, -16285, -5173, 13834, -5753, 8780, 8330, -14687, 15237, 20209, -16634, 3682, 15442, -7354, 4178, 3899, -12876, 3597, 5253, -11993, -4223, -4897, -2852, 5178, -14055, -9400, 14127, -4034, -9927, 11145, -2573, -1570, 17526, -5017, -6079, 19300, 3856, -6355, 8355, 602, 104, 7313, -8057, -5095, 5411, -4726, -5599, -3199, -8764, 1479, 1579, -13174, -1335, 6912, -4124, -1309, 3196, 280, 6374, 5204, -757, 5600, 3332, 3349, 8614, -4973, -4029, 14617, -1364, -16803, 6427, 5465, -14519, -4291, 4740, -8827, -8817, 5872, 198, -13032, 93, 16424, -5328, -14369, 17312, 13902, -15331, 3398, 20935, -7069, -5424, 17405, -752, -12975, 8415, 7878, -12744, -8229]
413h229J4297m473j5212N377J6735j0564j2069J7479M704j8104R541J4725j7848
426c641k238J9758n921j5456J0813P257r082m210J813M727j318r975K011J1799
440F337j1569p867J8686l815j8645J7415J3089k4882R20K5857r474j7501J3143
453A694J3524j1830j2290J3608J3680k4577q630L6659j3769m0625M0035K3184
465C0663o4291J1821O2412m9483l4899O8641l814o0495L9024L2973m8349k129
477a7926M1482j2208k8291J6047K3967j7241k7026K7469K3487m6719n441N4131
489C1731k7485m4076N4691R305o1924K8949M1507n0347q295M9078j8139k5668
501b0673K5390O533j4293K199L877L972j562j2210J2504Q985k6070O382K4973
$$ y = [-8229, 6068, 1595, -13617, -8240, 8495, -2069, -14138, 3341, 8045, -10059, -518, 14207, -3641, -5879, 13879, 7958, -7498, 3315, 10572, 1490, -2720, -907, 3820, 2502, -7473, -5462, 6337, -5232, -13099, 5587, 1772, -16873, 542, 13631, -11251, -10331, 15526, 6052, -11449, 1694, 15218, 3388, -8902, 4706, 18386, -6191, -14821, 21838, 8069, -32556, 7479, 30663, -33628, -21807, 40605, -8878, -43777, 24864, 21050, -39445, -421, 32552, -15797, -17926, 23556, 11348, -16943, -896, 23071, 5830, -21196, 6273, 29760, -16959, -22400, 31731, 4246, -39830, 14861, 24166, -37758, -8809, 32698, -17649, -25944, 23134, 4995, -20673, 4717, 11250, -3043, -844, 3033, 7005, 5443, -6767, 5737, 14722, -11348, -4966, 20007]
514B0007k6834j1147L3304j4468k0749K6787o069j5630K2729j0311j4315L3635
526A6939j6091k5495M6886q702m6540N0399J5121o7813L4304M5476o5377j567
538b2460N8699l6055k8467M1923l162k5722Q774R494J551j4824o321L3938j0163
551G205m1834M4592K3674o6234J9680N8582n5209k2007O7158k0516m8332M5188
563A1947J5247m5595P783L0149j8146j7447J4136J1538j2375j3692J7101J1712
575A2358k5201j706L2728j6518k5098L6371O218m1243K1484K9185m0246Q44L6481
588B5657k8684j0871L3566k0942j4364L2720j8857j8204L5475j5080k4324L6440
600A2532o296l1493L2178O148l1295J7418J3592j7473K896N864o28L634j2781
$$ y = [20007, -6827, -17974, 15330, 862, -19887, 6900, 831, -14799, 7930, -2381, -16696, 16939, 848, -24647, 22239, 13537, -33003, 17396, 32517, -35296, -992, 44484, -20893, -22460, 36239, 184, -28283, 13640, 10478, -15244, -6470, 3024, 4575, -10249, -16570, 17368, 7205, -34629, 9963, 33637, -32597, -12917, 45665, -9544, -31551, 35607, 15091, -33241, 11947, 27194, -18401, -10618, 19531, 1385, -16062, -1926, 9612, -2763, -16455, 646, 12358, -12843, -14549, 18179, 1661, -23437, 12934, 19152, -22091, -607, 28578, -11668, -10824, 25657, -3027, -13898, 19668, -1274, -15638, 17082, -1775, -19979, 15496, 416, -23908, 12532, 6236, -25257, 6921, 13069, -18226, -808, 12784, -4689, -1793, 4071, 3443, 7077, -5704]
613e704O147J7961k6731l608L5430k4367k4445M2167m667l9924K7617J9003l4220
626a5341O43K7635j1562j6182J4096J2408j4249r378K1239L880k4645P739K4146
639B0429j9736j5547K6947J736k8573R565K3473k2736j4610L0185k433l0720J9800
652b220J9102l1488J874K8399j7935j0986K2100m297j1065J1105n71l715L996
665D299m061K757L287j0273M425P360j3032P58R938q796k040O177m267R46J299
680a223l464N799p30o474J0087j04j0005J0135M119j2153N411O996r361J417M141
695D591m575N68J73k517K503k517k764N413l065l393N684l01m373L243K804j802
711c28o13J530L498k802k544P140k380o989Q565O92j1438P349M259j1651L297
$$ y = [-5704, 443, 18404, -8327, -11935, 23495, -872, -25317, 16850, 12183, -27741, -124, 18879, -15341, -14698, 12937, 1375, -14807, -711, 11697, -2552, -11930, 9309, 13189, -11456, -3717, 20429, 693, -14854, 12093, 13829, -14744, -5179, 18294, -4442, -19052, 11133, 8700, -22020, -2220, 16882, -14606, -12732, 15667, -2268, -13254, 8846, 4549, -6516, 4589, 4018, 303, 4299, 238, 2995, 6282, -3991, 434, 7794, -5238, -4480, 5458, -3338, -5378, 799, -3468, -2522, -1223, -4687, 1112, 382, -6092, 3995, 3891, -6114, 4021, 8140, -4013, 1398, 8394, -967, 450, 4591, 16, 584, 757, -1760, 743, -1774, -4538, 875, -2190, -5583, 101, -200, -4573, -1330, 1474, -328, -941, 589, 4087, 1285, -1259, 5881, 3501, -3488, 5077, 5769, -5669, 1680, 5939, -5712, -2415]
726b415O990q995o72P384n265j825M715k91k102J014K764R5k763K288M110n043
742a1L65N372n077j262N638l727l516M825k393l011L633l205o51L347l939j88
758c800N139l948r22N702k636j956M952J90l428K130K497j454k387J812K328m558
774c39q83M767l513m011N022n65n816L983J595m029J054K426p26l23P0K066J503
791B281l575J988M188m672l66N402k898m207N111n08m633J419J833k442k181J805
807a455J312l229j020N570k143m332O496J411o795M263N017o664Q06O475m404
822A308j810M102j181k975Q85J688j796k570J751J876m773K28M611m091j883N821
838A191j916l558N549J87l427K902J342j760J301n90R66J239l642J039K943m992
$$ y = [-2415, 4575, -4420, -5092, 2292, -2973, -4798, -83, -374, -2476, -1462, 1302, 1397, -1366, 922, 5032, -11, 354, 5726, 649, -613, 5025, 1298, -2218, 2607, 214, -2797, 836, -2369, -3020, 327, -3612, -3800, 1339, -2609, -3531, 2171, -465, -2421, 2531, 2721, -707, 1423, 3920, 2466, 79, 1891, 4219, -339, -1222, 3545, 32, -3979, 1043, 478, -5338, -1355, 240, -3789, -2735, -309, -1035, -1358, -1288, 778, 2281, -1294, 694, 4882, 210, -156, 5246, 2348, -1859, 3252, 2744, -1889, -470, 1363, -1079, -3260, -1455, -143, -3372, -4392, 1178, -965, -5297, 1199, 2610, -4185, 78, 5095, -1569, -763, 5712, 1308, -502, 3600, 2419, -556, 329, 2017, 221, -2349, -598, 1278, -3495, -3267, 1344, -2747, -4630, 1191, -725, -4283, 1266, 1453, -1974, 928, 2270, 510, 1811, 1221, 2187, 3426, -216, 823, 3766, -1226]
854a226J9L839l943j761L654k126j610J551m0M20l52l95L280j036k711M707N52
871B822m263L666J713l903R57J732j516K12k135R19K033n590Q06N570o205k453
887e635Q448m070n114P477j17m395L086K354j490j44n00L694o60n679O056K254
903E565r034L496O052q445j043P325m955k971L672k02j732m21J231J967k712p96
919c003N910l052k448N824j566k362M013j889n57K853n508K550M676r707K504
934a762Q005j0683o87J0911q968k880R088n049j525M725l745L318J769q076Q640
949C081L602j4434R957R240j7962M500J3928j5305k249J3912p743o373P578j066
963F66l152J26n25M756m096m260R648p84r813Q309N575j0576J935Q734m924n449
$$ y = [-1226, -1207, 2632, -1311, -3072, 582, -1544, -3154, -1603, -1643, -1223, -1575, -1970, 1310, 274, -2437, 2270, 2822, -1441, 2225, 3938, 35, 992, 2724, 1208, 1420, -715, 204, 2237, -3353, -2547, 3023, -3182, -5635, 2813, -1257, -6371, 1106, 989, -3406, -320, 2034, 544, 400, -100, 3594, 2934, -2745, 3311, 5565, -3469, 27, 6079, -2366, -3409, 3916, -1039, -4010, -338, -540, -2272, -2693, -1462, 505, -2207, -3003, 2907, -145, -2593, 3231, 1665, -697, 3316, 1427, 870, 3723, -1785, 765, 5441, -4266, -1762, 6243, -4440, -5127, 5784, -3184, -6064, 3024, -2025, -3550, 1175, -2570, 748, 2517, -5559, 3081, 6683, -7751, 2206, 11446, -6516, -2016, 11912, -3393, -5642, 8270, 527, -5846, 1732, 666, -2486, -2360, -2885, 1871, -2225, -6485, 3163, 2379, -7434, 875, 6450, -4126, -2191, 6543, 1619, -3830]
979c830O358L848q107j297R680m956q586J0612K16j2170Q630K627r647O370J608
994A356p367Q489j803q054J3382l604j1142J6180k148j4649J5730P66j5405J3664
1008E395L88j2781J1997k081j0945J4393n476j1669J8371o084j5663K0639j468
1021E016j8721J6862M516j7186J0106O407j0932M545K868l706L617l835O0P161
1035F778q726k369J1513p104p772J1096l75r573M374N889n785m338P784L018j1233
1050f823L859J1777j2041l030J5836q417p723J3971n084o838R551m802k505P546
1064E277q725J300R189j4173K979J3479j7202J401J6616j6369j463J7825j4571
1077d437j548J5591j2793m39J3238j2895P27J2418j3748J528J1843j3648J094
$$ y = [-3830, 2528, 6376, -1731, -3028, 6652, 1696, -6890, 3722, 3938, -8232, 398, 3025, -6622, -252, 1356, -6011, 2478, 675, -7379, 6003, 2399, -8743, 7437, 5289, -9360, 6370, 7136, -8269, 5395, 5783, -6998, 4999, 2918, -8027, 6366, 890, -10779, 7592, 1508, -14155, 6484, 5016, -13705, 3157, 7673, -9513, 593, 7000, -3932, 613, 3481, -225, 3392, -443, -383, 6778, -1948, -4317, 7196, 92, -7680, 3416, 3041, -6532, -2158, 3731, -2054, -6392, 1392, 4410, -6823, -2964, 8813, -3228, -6258, 9578, 1161, -6562, 7409, 2325, -4513, 5038, 236, -2269, 5277, -3448, -2148, 7041, -7132, -4153, 9326, -7876, -6475, 10141, -6228, -7691, 10134, -4437, -5985, 9606, -3187, -3626, 9612, -3283, -2556, 9862, -3886, -2358, 9485, -4163, -3069]
1090c069J1007j2278J048Q669j0482K904N760r659N151M289r298O209M008r598
1104e339N970M002p661M159K339m015K192o01m78K758n598K009N477r733K583
1119a936P805j0775Q31R491r871K67Q570q089J518N953p544M029L604q094P136
1134B895K069j0289R107J727j1773J0255J237j1912R472J853j1689R033Q55j0085
1148g245R349q41q063R403k198o679J0337l835n687J1036m927n222J0913n592
1162G49m674J0464n503m620R358n908l155P374n849j056O096o563J147M978p566
1177d728L545M427q497M693M745q887N221M160q299N111L073p603N487J238o908
1192c222N967k31o551O886j829n589P070k873m293P059l500l526P099m001j710
$$ y = [-3069, 7938, -4340, -3292, 5377, -5105, -2201, 3559, -6100, -949, 3340, -5958, 251, 4259, -5339, 631, 4633, -3028, 1131, 3470, -545, 1647, 1046, 568, 3326, -2272, -263, 5214, -4519, -1936, 5869, -4906, -4075, 5416, -4455, -4188, 4382, -3707, -2189, 3764, -3780, 249, 3853, -4241, 2895, 4964, -5325, 3782, 5509, -6264, 3991, 5228, -6684, 2788, 4641, -7048, 1985, 2840, -7245, 2104, 1263, -6800, 2603, 405, -6274, 4063, 228, -5459, 5577, 650, -4572, 6341, 749, -3925, 6539, 1036, -3584, 5774, -134, -3289, 4085, -1764, -2820, 3276, -3287, -2140, 2838, -4728, -1183, 3244, -5253, -560, 4185, -4702, 519, 4679, -3620, 1491, 4564, -3039, 2448, 3686, -3222, 2745, 2514, -4037, 2849, 1020, -4569, 2501, -372, -4665, 2394, -1106, -4632, 2467, -1534, -3244]
1207c244P112n542o86P185o338m3P440p597P12O956p777J010N669p298J333M983
1223C875p490K762L851p624M053K939p276M368L133p296N367K168o466N506O67
1238B537n199N402n96m519N704j405m812O677k736m605O587k837l778N912l408
1253a076k874O036l756j487N361m223j63N051m373L05N223n275R89M180m872J648
1269F94K792m791K197J763n398L607P80n646M494O01n495M727P93n261M627O22
1285A106m572M392J1l010M360j224k428M641k526j847M434k746j959M635l635
1300c68j481M523m060q71M219l936r0L791m138M41L799m114J241L497m282J846
1316A7L125m483J949K747m540K049K030m351K171J568m070K064O17l387K339L60
$$ y = [-3244, 3868, -1674, -2360, 4825, -1513, -1556, 5884, -1713, -1001, 5955, -1822, -812, 4857, -2441, -1108, 3875, -3615, -853, 2998, -4626, -573, 2366, -4910, -542, 2591, -4705, 662, 2830, -3636, 1870, 2537, -2662, 2740, 2144, -2375, 3329, 1924, -2888, 3789, 1053, -3552, 3035, 198, -3580, 2332, -1076, -3950, 2086, -1670, -3157, 2204, -2019, -2182, 2869, -1504, -1199, 4024, -1251, -262, 3918, -954, 694, 3486, -1305, 892, 2655, -2743, 864, 1644, -4002, 492, 1093, -4402, 325, 1118, -4143, 484, 1106, -3466, 926, 937, -2073, 2287, 1063, -1365, 3276, 750, -1097, 3337, 591, -1368, 3267, -368, -1849, 2674, -1386, -2257, 1962, -1974, -2064, 1727, -2411, -1970, 1829, -2285, -1044, 2453, -1829, 17, 3142, -1341, 608, 3355, -1185, 864, 2894, -1457, 714, 2282, -1788, 276, 893, -2494, -155, 205]
1332B05k751K867n21k233K988q47k106L809j059j597L253j286j034K582j676j032
1348d38K626k102k41J956k620J25J797k820Q03J377k576J453J224l091K301J162
1364I36l377L030J183l653K769J307l694K767J056l197K222R37l397J869O59k795
1380a378J748q8k534K513l81k083K348o66j465K186j02j488K056l0q84J072j81
1397F43j13Q43j047K72P37j448O39O10j813L36O13j534O22K67j047R10j35q88
1415a533J728k52j281K176k51j743K279L93k168K083M5j772J589p9j919J654n99
1432C50j633J885p63j897K307j88k606K231Q54k552J451J505j687K21J884j169
1448A93K91O59l82p8J92k14j70L51q10J7L32j027l22J311o69j447J652L13k376
$$ y = [205, -2546, 321, -200, -2433, 555, -292, -2398, 1411, 352, -1245, 2008, 722, -312, 2270, 594, -438, 2188, 86, -155, 1801, -819, -694, 1103, -1717, -914, 463, -2113, -660, 564, -2527, -226, 936, -2441, 589, 1772, -1881, 888, 2195, -1499, 1268, 2324, -873, 1349, 2286, -1111, 758, 1417, -1378, 370, 282, -2252, 261, -120, -2203, 145, -521, -1986, 200, 98, -1390, 666, 636, -248, 824, 643, 530, 1373, 326, 598, 1335, -113, 526, 1136, -677, -341, 272, -1262, -640, -373, -1420, -510, -645, -1533, 195, -57, -1338, 838, 587, -1156, 1123, 1516, -652, 1431, 1476, -296, 1293, 1214, -705, 949, 350, -1283, 602, -161, -2058, 249, 61, -2545, -314, 540, -2012, -561, 944, -743, -522, 1362, 193, 484, 1143, 761, 683, 875, 661, 491, 842, 32, 49, 381, -646, -968, 343, -326, -1773, -121, 192, -2184]
1467b184J652J031j670N47K089j821L28J586j288K10J277j497j5J375j792L6J433
1484A297k193r8K117k182o72K273j501j453K888o48j638K469l46j299K096k54
1500H56j743K304m61j938K685k26k314K184R9k899J795Q96k990J281J201k519
1516a789Q00J503j864O41J153j328L51J596j644N70J951k386N63J932j855p04
1532e10K455j439j485K348p76j780J812n78j773J563k18j366J587j04j191J314
1548a41O37j709J672O13j818J467P24j912J088J288k064L64J496k199O1J768k116
1565g81j13J395j682j46J620j295j64J682j119n89J802o05o30J893r82m00J365
1582A251m64j111J236k22j032J017l88q83Q83n08q46P63J10j216R23J68r87P64
$$ y = [-2184, -532, 499, -1171, -624, 1465, -356, -28, 1558, 270, 480, 1757, 260, 245, 1620, -172, -136, 1297, -896, -994, 1123, -1059, -1731, 542, -959, -2412, 476, -172, -1810, 659, 313, -986, 1110, 856, -887, 1417, 956, -982, 1703, 1477, -837, 1347, 1446, -1453, 342, 1238, -1752, -471, 730, -1789, -989, 514, -1350, -709, 444, -884, -533, 1063, -581, -11, 1940, -446, 117, 2049, 194, -510, 1945, 506, -979, 1369, 593, -1187, 625, 47, -1726, -163, -381, -1747, -160, -264, -1455, -141, 496, -1213, 459, 1072, -746, 721, 1445, -467, 621, 1909, -155, 209, 1705, -494, -433, 1335, -781, -894, 501, -1181, -1327, 293, -1002, -1166, 516, -603, -1192, 610, 5, -625, 1268, 286, -114, 1251, 787, -324, 912, 690, -342, 675, 287, -596, 287, -221, -1067, -304, -194, -1410, -487, -319, -1306, -542]
1600e42P63j129P02J001q00J39P73o52P7O78m63j32N95r26k32P76r16m58R08o02
1620d40n72R91o77l84Q68j16o42J095m2n07J119j75n53P94j01n27M33M15o98J56
1640D37K19p80k94O68r70j7M78n97J61N37m73j37O49n22K96P86j91l48J178n95
1660D85l69O15k59j63L31j63l69M4l7p12O60l84l72K96q2m06L33L82n70M84K02
1681e4M5N6O82l48M4L89j88k24K29o1k93L1p6n59K45P8o65L47j63l78M45L31r30
1704a017P36L50n40L75L85m20L83N85n05J73M69p12J06L78q75J42O35j220J76
1723c96N59q92K36M01n34k04P35l17J88N00j33j47M16l73J91K63J99l64K86j34
1743D80k58K54k32l34l1n9k38j07J71j35k48N34l87J56J59M58l74M06P0j14L60
$$ y = [-542, 221, -908, -206, 795, -5, 134, 907, 255, 332, 1010, 547, 415, 1010, 84, -148, 628, -288, -746, 162, -440, -1012, -21, -698, -1082, -214, -330, -972, 123, 81, -426, 693, 518, -35, 759, 658, 131, 564, 979, 281, 437, 656, -124, -418, 250, -720, -737, -259, -856, -695, -158, -631, -768, -119, -641, -345, 441, 250, -98, 1080, 485, 116, 731, 472, 309, 640, 477, 108, 152, 115, -597, 63, -321, -693, -397, -479, -885, -552, -170, -740, -256, -54, -9, 47, 729, 381, 425, 814, 626, 402, 631, 570, 277, 308, 232, -327, -82, -4, -669, -322, -485, -863, -418, -87, -1017, -281, 69, -471, -96, 289, -131, 252, 837, 332, 505, 974, 262, 368, 746, -129, 13, 648, -572, -396, 163, -729, -493, -92, -626, -830, -95, -412, -224, 276, 143, -4, 412, 39, 230, 493, 692, 328, 614, 480, 222, 476, 244, -90, -121, -180, -418, -525, -354, -489, -737, -203, -590, -434, -275, 183, -191, 215, 285, 171, 531]
1764E31j7k56J33L80m33J05K2l39K21k23p79N88j06m61Q1N35r65N06M70m03o0
1785d70N82l13K53N22l82pN68n38K24K65j60n22L54j43m36O6o1j46k56K79m12
1806g33L99n8M8n4J26K93j00K61JJ09r5O23n64N3N10o58M9K18n90J22L88n53k67
1829d72L66p49P6P12m77j36P31m84%R41p26L5R38m41j25O80l73k24P27p22j65
1850A12P84p25p01O62o11k94M77M2m78K84R4j43M18K96p14O21J25j59M74J13l37
1871C40K4N48n01m12M95k17l91J90k8o79O99k19r19Q38K84j028R38K03q82R89
1891B72J2l79K77O61p90L03O16r74L54N78j249K07Q66j221M4O81q81K58N45q03
1911f23J30M92p31M36P20o77OQ04m87J25N08n07P2K53r7l47J68Pk36L3m5k99n5
$$ y = [531, 514, 258, 391, 771, 338, 443, 465, 126, 347, 124, -655, -67, -173, -634, -553, -18, -983, -477, -7, -410, -470, 112, -201, 52, 574, 192, 185, 753, 215, 439, 704, 544, 22, 376, 233, -203, -137, -198, -344, -600, -321, -733, -334, -392, -344, -398, -272, 21, -79, 182, 183, 292, 197, 820, 256, 309, 819, 161, 210, 428, -162, -40, 348, -205, -472, -106, -855, -779, -67, -544, -680, 51, -433, -433, 508, -218, -183, 755, 314, 189, 869, 496, 272, 999, 277, 112, 896, 171, -530, 132, -479, -773, -296, -254, -732, -448, -354, -497, -79, 217, -497, 124, 249, 90, 564, 677, 340, 364, 912, 411, -1, 494, 277, -114, 76, 48, -631, 68, -151, -1070, -232, 52, -976, -38, 165, -717, 272, 284, -95, 182, 843, 53, 356, 972, -2, 352, 930, -319, -112, 754, -467, -423, 258, -623, -365, 180, -623, -493, -1, -732, -296, 424, -253, -247, 557, 70, 195, 703, 196, 268, 521, 424, 77, 245, 252, 16, 49, 4, -295, -350]
1934c50K75l59j50L87j24n73Q59k60m1M90L3k81L98O2n12R50j87q43O47K38q57
1955a98N97or57O18ql54l4N08j098P22M78j176Q94J43m91N51L53n33M68L91q02
1976F6K43M73o42P0K61m83p7L91n44NL03m51k36M39j43k63K2J37J36J91J27k20
1998a95K19N56m42K00L15k84j05K02k55mK73m80k70L78n51j80O83n78l59P30l10
2019d57k45Q86l72l93J152j34n94P67r1n76O84J1n20L91j45p47M37K32r40Q94
2039B40m24o75N85pj81M71p3m75M36J75j73K22L7o5J25K52l79K18L86m49Q2j03
2061B25m9p1k49K71k69j35Q0k11P3J10Q3l18Q60n51k12Q81m95q0O63j67l96O39
2083F82l41m09Q61j026o9O68p54J28N09r19J60O80n34j27M18k83k58Q34n49L40
$$ y = [-350, -75, -434, -584, -197, -321, -894, -35, -295, -336, 154, 187, -94, 304, 366, -146, 804, 617, -226, 421, 659, -198, 399, 393, -564, 54, 46, -308, -342, 166, -932, -210, 268, -908, -14, 129, -362, 189, 542, 9, 477, 868, 66, 309, 782, 140, 210, 471, -12, -89, 302, -242, -237, 66, -385, -621, -182, -325, -588, -566, -429, -293, -102, 25, -195, 24, 580, 138, 338, 653, 369, 264, 466, 211, 207, 480, 0, -270, 108, -443, -623, 60, -518, -877, -147, -457, -702, 184, -188, -581, 571, 437, -157, 610, 519, -57, 627, 638, 118, 509, 364, -383, 54, 286, -654, 240, -184, -859, -274, -281, -462, 9, -64, -539, -103, 72, -101, 121, 158, 93, 218, 470, 91, 309, 695, 246, 328, 225, 176, 105, -144, 127, -142, -277, -197, -408, -335, -225, -142, -460, 400, -151, -363, 518, 23, -57, 606, 439, 43, 682, 341, -68, 793, -233, -302, 366, -388, -260, 249, -670, -510, 170, -364, -491, -73, -356, -614, 220, -329, 11]
2103A1K53k28J31N22l38j14M87o68L23k73j24k8Q8k15l57M23n05L92K03l25M55
2124A13m31j83O11p4j64O79n36l67J010l60m00Q32n99k29O65r72L76M77p83J86
2144a49J99n64K55K15m91L36N03q56M78O86p89L08M91p23J65M91q43O52L19r46
2164b63M60K39p19O10k76o15M20l2n89M99j60J8M19k67j29L83j5o7P04q63L19
2185G6L88l03j60O54o77Q1L49p21M57J47r03P68k26q56Q74%o42N76J71n95M92
2206e0M59q75P15K19n63R66l30r85R57k3q29P59k89o62Q40m6o56O04n77k98O82
2227A8n06n9Q25n45j25O92l24n0M01l23J03L73m75K00K52k74MK22o93L91K47r18
2249e64K68J65m29M33R0r00R74P8n76P03m02j42P07j18n05O36j38l79O37l36l75
$$ y = [11, 264, 36, 167, 689, 351, 237, 724, 56, 379, 106, -18, -46, 42, -173, -530, -107, -612, -220, -17, -342, 113, -318, -501, 110, 36, -128, 551, 15, -352, 658, 298, -102, 730, 131, -98, 567, -405, -29, 448, -335, -149, 50, -514, -259, -44, -535, -199, 304, -552, -74, 612, -177, 131, 622, -101, 64, 555, -288, 364, 683, -263, 197, 436, -283, 327, 51, -564, -144, -176, -765, -266, -426, -408, 11, -256, -385, -2, -17, -84, 620, -243, 76, 464, 161, 1, 655, -22, 59, 408, -313, 144, 291, -612, 156, -70, -926, -52, -52, -694, -118, 53, -542, -50, 409, -466, 249, 468, -95, 871, 541, -444, 513, 490, -339, 420, 131, -531, 309, 263, -393, 211, -366, -664, 18, -488, -547, 278, -267, -392, 300, -24, -74, 327, 4, 107, 480, 5, 205, 457, 183, 187, 409, -284, 107, 354, -564, -296, -131, -560, -127, -37, -937, 37, 115, -461, 242, -160, -302, 405, 287, -218, 418, 280, -99, 538, 202, -173]
2270a73P18n51l40N25m02j58N79n88l16O53o04J89M52j88J89N00n90M07K93n73
2290B2J23M01k37k1j00k34J63M33r23K31N3o03P84m65qL95j82k75O59P9m61O85
2312E19n58j34P17m26j73O69o62n1N39l80j37M93n26k03P82q65PL67n08M08K78
2333A56q41M96L81p46M85K66k75K23J56l23M64k93j94K54l1k26m1M56k74N3m38
2354b92q7K53k63r3M10k69j10O12m23J21L40j64J3M78o42L96K44o14K87K46n26
2375h3k9M11l59J2J53n43J21K90m23L8L23l59K32M80n43J66N86n11K21L02m59
2396B6J74M38p86O13k08j66O4l56Q0L8J37k20J6p0J90k67R7J42j31J88K86j65
2418A20l4J32L18k46l08K40j4K19m33l79N52q3k27K54j63l58K31j21o9L30l26
$$ y = [-173, 545, -6, -346, 179, -223, -381, 198, -390, -706, -53, -657, -468, -16, -204, -15, 485, -105, 302, 595, 22, 145, 546, 309, 288, 188, -46, 117, 550, -373, -142, -89, -692, 92, -373, -381, 14, -168, -443, 216, 295, -166, 519, -39, -173, 544, 118, -55, 614, -48, -99, 440, 60, -77, 416, -110, -313, 469, -396, -389, -22, -530, -122, 156, -685, -189, 192, -554, -69, 197, -78, 145, 301, -22, 442, 149, -45, 209, 178, -48, -89, 367, 93, 146, -292, -379, -126, -389, -482, -72, -341, -451, 161, -262, -141, 199, 35, 48, 526, -116, 280, 524, -90, 197, 443, -83, -112, 299, -60, -48, 105, -438, -317, -27, -450, -412, -89, -448, -216, 264, -279, -113, 473, -38, 183, 485, 26, 200, 638, -148, 465, 257, 91, 155, -201, -121, -83, 54, -166, -150, -220, -30, -297, -200, -58, -189, -1, 285, 120, 86, 218, 536, 290, -18, 222, 208, 427, -6, -385, 167, 84, -143, 111, -52, -410, -179, -300, -369, -39, -365]
2439c65j45L86L4l96N52pl15N89j04k80L74J1m86P44l63k50M20l07k17n7P0p9
2461a91o2J36l86L65j37j4L66j56k0K38r0n9J23J52L01k70ml2l68P4K13k17K17
2484A79j82k37K2Q0m7j18J37j82J31L23j85J97Q9l70L63q0j99O79j95j75k06N14
2506E38n77J19J26k59Q7K2m48J00Q6l9r3J79q9L9L60j35r3R9jK37mM6o6L4k38
2531C0q4K37k89J91rk50P2p6J59k00L27k06k91J86M7K51m0J36j84K9K70l3j18
2554A55R1J56l85J5J92k89O6j25o7N8j62J23l8ol46L26o2J46J22k94L30m5j5J33
2578G9%RJ47P0q7k22L86l71l7M6j20j65J55K59n10M06k12R0P7j56K0K24L7r7o7
2603c9L1K25o0K35q9L5j80J57q2m06J00J92j40k86L01K0j69n5K24j81P2K13J1
$$ y = [-365, -510, -124, -90, -486, 66, 59, -256, 333, 229, -51, 323, 334, -152, 592, 229, -21, 399, 92, -125, -182, -112, -191, -253, -117, -503, -138, -275, -289, 77, -79, -99, 139, 49, -10, 113, 265, 566, 296, 292, 260, -108, -34, 179, -38, 179, -3, -240, -218, -138, -185, -303, -166, -348, -217, 106, -79, 118, 207, -163, 200, 120, -79, 600, 405, 230, 24, 538, -39, 80, 206, -53, 34, 56, -392, -292, -206, -245, -338, -159, -248, -209, 151, 16, -77, 22, 21, 258, 254, 300, 234, 268, 30, -54, 183, -106, 85, 76, -174, -102, -178, -19, -219, 108, -98, -389, -203, -156, 95, 55, 191, 7, 36, 306, 273, 155, 246, 402, 17, 32, 224, -65, 1, -124, -191, -133, -295, -172, -210, -216, -562, -236, -298, -152, -30, -324, 6, -39, -54, 79, 79, 88, 235, 305, 218, -4, 382, 11, -26, 20, -100, -265, -110, 149, -361, 45, -167, -77, 0, -156, -136, 88, 125, 28, -39, -8, 217, 157, 392, 303, 338, 158, 315, 233, -173, -73, 119, -21, -307, -6, 14, -155, -210, 14, -167, -95, 118, 129]
2626A29j1m6j76J57Q9k29Q9K89l39K18n8j19j36L29m38L1J44K7j03j98K43m0K72
2649A24m61J83q7K91r6J44P9k91L52k66K7J70J31m58L04J92l30N6L00k66l61J45
2671a18r2M7q7L49o60O58j77m0K67K5o4K90m09l28R23m30n0K33j38n36L91k76
2693b22J01K2Rj39K87j1l43K40j09J33N5R9KNj96J31j29K68j49L1J99k76r0J25
2717D3j59O5J48j04l4j37J78k88L32k55j60N36l97J14o4K18k95M06m5m7O8q5r4
2740e6L28P3m57J44L1k08n4L70l19k9k3j51K34J06k18P6K76k49L22O4k05l33M62
2763A84P8k61N83k07k48J08q2k50J63M1r7j3j23j16L26k32k14O32n16j0O3K33
2785D2j79M89l9l42M82j61m33L34r7k71J07K72j09r8rn4jl3k18j9J70J51k55L15
$$ y = [129, 118, 72, -104, 53, 142, -87, 2, 291, -48, 170, 112, -7, -143, 186, -252, -221, -77, -50, -153, -351, -108, -148, 124, -337, -154, -241, 50, -46, 98, 177, -114, 238, -28, -1, 169, 300, -158, 146, 338, 8, 64, 364, 98, -263, -118, -210, -163, -250, 99, -561, 97, -80, -120, 147, 172, 108, 398, -11, -339, 584, 154, 104, 337, 199, -337, 54, -222, -121, -99, -90, -229, 58, 47, -296, -56, -165, -32, 23, 122, 124, 129, -67, 64, -65, 203, 54, 85, 284, 8, -82, 43, -116, -51, 97, -7, -41, -178, 0, -288, 44, -211, -371, 165, -232, -118, -182, 36, -259, 147, 102, 55, 123, 38, -56, 272, 345, -112, 32, 63, -145, -199, 171, -148, -177, -200, -351, -117, -11, -229, -153, 123, -126, 196, 260, 55, -278, 184, 262, 1, 584, 377, 129, 237, 155, -95, 68, 109, 12, -1, -124, -240, 86, -146, -360, 272, -244, -254, -191, 42, -137, 352, 313, -29, 453, 292, -141, 193, 96, -175, -68, 204, 95, -3, -12, -66, -67, -100, -318, -337, -167, -16, -271, 44]
2809D4J28j46j71K44m2J10K55r0k46J11m91K99L27o68M09Rj30J9Nj02J75p4k34
2832b59q7L83j91nK68k65K33J61k42J43K42p6k91J84km78L47O0j62J33o0m35L87
2855a2j43n9K99l84K08j9K75l44J97L35l35j0J93j05r0J55r3M8O8r5j06o9O9j83
2879b00K08k47r1K27r9k86N49j39j70M27q3j42K90p3n9K20O3m75J40J19j79L05
2901C05n8Nj88r5l71J42K39m47K90j7L0M30m11K01m02M08J16k70K28N1l8K31k66
$$ y = [44, 172, 26, -145, 99, 57, 167, 422, 332, 86, 197, -294, 5, 332, -336, 73, 82, -48, -29, -24, -126, 49, -25, -259, -346, 37, -154, -159, 109, -156, 77, 238, -4, 139, 381, 305, 14, 198, 196, -282, 65, 125, -37, 96, 36, -399, -12, -155, -214, 85, -299, -91, -110, 165, -179, 18, 353, 18, 8, 201, 96, 6, 161, 68, 116, 184, 89, -17, -86, -17, -200, 8, -239, -330, -103, -202, -488, 61, -78, -248, 179, 96, -46, 244, 171, 112, 332, 395, -80, 60, 179, 0, 305, 247, 252, 64, -31, -402, -260, -21, -468, -178, -195, -165, 265, -146, 55, -347, 61, 177, -93, 135, 186, 148, 379, 113]
$$ [...]
8191a03
##END NTUPLES=NMR FID
##END=
