##TITLE=1H_Pr 4432-Pc
 CDCl3, 8 sc, 
 5.2.2020
##JCAMPDX= 6.0         $$ Bruker NMR JCAMP-DX V2.0
##DATA TYPE= NMR FID
##DATA CLASS= NTUPLES
##ORIGIN= UXNMR, Bruker Analytische Messtechnik GmbH
##OWNER= root
$$ XWIN-NMR		Version 3.5
$$ Wed Feb  5 15:40:48 2020 Russian Standard Time (UT+4h)  she@DPX200
##.OBSERVE FREQUENCY= 200.1315
##.OBSERVE NUCLEUS= ^1H
##.DELAY= (6, 6)
##.ACQUISITION MODE= SIMULTANEOUS
##.ACQUISITION SCHEME= undefined
##.AVERAGES= 8
##.DIGITISER RES= 18
##SPECTROMETER/DATA SYSTEM= spect
##.PULSE SEQUENCE= zg30
##.SOLVENT NAME= CDCl3
##.SHIFT REFERENCE= (INTERNAL, CDCl3, 0, 15.7039)
##AUDIT TRAIL= $$ (NUMBER, WHEN, WHO, WHERE, WHAT)
$$ ##TITLE= Audit trail, XWIN-NMR		Version 3.5
$$ ##JCAMPDX= 5.01
$$ ##ORIGIN= Bruker BioSpin GmbH
$$ ##OWNER= she
$$ F:/spectra/data/she/nmr/H-F/1/audita.txt
$$ ##AUDIT TRAIL=  $$ (NUMBER, WHEN, WHO, WHERE, WHAT)
(   1,<2020-02-05 15:39:20.06 +0400>,<she>,<DPX200>,
      <created by zg, POWCHK disabled, PULCHK disabled
       configuration hash MD5:
       00 E9 B6 7A A2 85 ED C7 34 08 36 98 17 FE 4E 26
       data hash MD5: 16K
       97 2C 2B DA CC 89 78 D1 AF 4A 3B A6 4F 02 B1 B7>)
$$ ##END=
$$ 
$$ hash MD5
$$ 0C 6F 79 7B DC 46 CA 74 3B 8B 90 DF ED B8 2E C9
##$RELAX= 
##$RELAX= 
##$RELAX= 
##$RELAX= 
##$RELAX= 
##$RELAX= 
$$ Bruker specific parameters
$$ --------------------------
##$DU= <F:/spectra>
##$EXPNO= 1
##$NAME= <H-F>
##$PROCNO= 1
##$TYPE= <nmr>
##$USER= <she>
##$AMP= (0..31)
100 100 100 100 100 100 100 100 100 100 100 100 100 100 100 100 100 100 
100 100 100 100 100 100 100 100 100 100 100 100 100 100 
##$AQSEQ= 0
##$AQ_mod= 1
##$AUNM= <au_zg>
##$AUTOPOS= <>
##$BF1= 200.13
##$BF2= 200.13
##$BF3= 200.13
##$BF4= 200.13
##$BF5= 200.13
##$BF6= 200.13
##$BF7= 200.13
##$BF8= 200.13
##$BYTORDA= 1
##$CFDGTYP= 0
##$CFRGTYP= 5
##$CHEMSTR= <none>
##$CNST= (0..31)
1 1 145 1 1 1 1 1 1 1 1 1 1 1 1 1 1 1 1 1 1 1 1 1 1 1 1 1 1 1 1 1 
##$CPDPRG= <>
##$CPDPRG1= <>
##$CPDPRG2= <>
##$CPDPRG3= <>
##$CPDPRG4= <mlev>
##$CPDPRG5= <mlev>
##$CPDPRG6= <mlev>
##$CPDPRG7= <mlev>
##$CPDPRG8= <mlev>
##$CPDPRGB= <>
##$CPDPRGT= <>
##$D= (0..31)
0 1.2 0 0 0 0 0 0 0 0.06 0 0.03 0 0 0 0 0.0002 0 0 0 0 0 0 0 0 0 0 0 0 
0 0 0 
##$DATE= 1580902759
##$DBL= (0..7)
120 120 120 120 120 120 120 120 
##$DBP= (0..7)
150 150 150 150 150 150 150 150 
##$DBP07= 0
##$DBPNAM0= <>
##$DBPNAM1= <>
##$DBPNAM2= <>
##$DBPNAM3= <>
##$DBPNAM4= <>
##$DBPNAM5= <>
##$DBPNAM6= <>
##$DBPNAM7= <>
##$DBPOAL= (0..7)
0.5 0.5 0.5 0.5 0.5 0.5 0.5 0.5 
##$DBPOFFS= (0..7)
0 0 0 0 0 0 0 0 
##$DE= 6
##$DECBNUC= <off>
##$DECIM= 24
##$DECNUC= <off>
##$DECSTAT= 4
##$DIGMOD= 1
##$DIGTYP= 9
##$DL= (0..7)
0 120 120 120 120 120 120 120 
##$DP= (0..7)
150 150 150 150 150 150 150 150 
##$DP07= 0
##$DPNAME0= <>
##$DPNAME1= <>
##$DPNAME2= <>
##$DPNAME3= <>
##$DPNAME4= <>
##$DPNAME5= <>
##$DPNAME6= <>
##$DPNAME7= <>
##$DPOAL= (0..7)
0.5 0.5 0.5 0.5 0.5 0.5 0.5 0.5 
##$DPOFFS= (0..7)
0 0 0 0 0 0 0 0 
##$DQDMODE= 0
##$DR= 18
##$DS= 0
##$DSLIST= <SSSSSSSSSSSSSSS>
$$ [...]
##$SUBNAM2= <"">
##$SUBNAM3= <"">
##$SUBNAM4= <"">
##$SUBNAM5= <"">
##$SUBNAM6= <"">
##$SUBNAM7= <"">
##$SUBNAM8= <"">
##$SUBNAM9= <"">
##$SW= 24.9337058887773
##$SWIBOX= (0..15)
0 0 2 0 0 0 0 0 0 0 0 0 0 0 0 0 
##$SW_h= 4990.01996007984
##$TD= 16384
##$TD0= 1
##$TE= 0
##$TE2= 300
##$TE3= 300
##$TEG= 300
##$TL= (0..7)
0 120 120 120 120 120 120 120 
##$TP= (0..7)
150 150 150 150 150 150 150 150 
##$TP07= 0
##$TPNAME0= <>
##$TPNAME1= <>
##$TPNAME2= <>
##$TPNAME3= <>
##$TPNAME4= <>
##$TPNAME5= <>
##$TPNAME6= <>
##$TPNAME7= <>
##$TPOAL= (0..7)
0.5 0.5 0.5 0.5 0.5 0.5 0.5 0.5 
##$TPOFFS= (0..7)
0 0 0 0 0 0 0 0 
##$TUNHIN= 0
##$TUNHOUT= 0
##$TUNXOUT= 0
##$USERA1= <user>
##$USERA2= <user>
##$USERA3= <user>
##$USERA4= <user>
##$USERA5= <user>
##$V9= 5
##$VALIST= <valist>
##$VCLIST= <CCCCCCCCCCCCCCC>
##$VD= 0
##$VDLIST= <DDDDDDDDDDDDDDD>
##$VPLIST= <PPPPPPPPPPPPPPP>
##$VTLIST= <TTTTTTTTTTTTTTT>
##$WBST= 1024
##$WBSW= 4
##$XGAIN= (0..3)
0 0 0 0 
##$XL= 0
##$YL= 0
##$YMAX_a= 743416
##$YMIN_a= -593983
##$ZGOPTNS= <>
##$ZL1= 120
##$ZL2= 120
##$ZL3= 120
##$ZL4= 120
##$ABSF1= 10
##$ABSF2= 0
##$ABSG= 5
##$ABSL= 3
##$ALPHA= 0
##$AQORDER= 0
##$ASSFAC= 0
##$ASSFACI= 0
##$ASSFACX= 0
##$ASSWID= 0
##$AUNMP= <proc_1d>
##$AZFE= 0.1
##$AZFW= 0.1
##$BCFW= 1
##$BC_mod= 2
##$BYTORDP= 1
##$COROFFS= 0
##$CY= 11.3945322036743
##$DATMOD= 1
##$DC= 2
##$DFILT= <>
##$DTYPP= 0
##$F1P= 16.9975609425685
##$F2P= -3.02152046262296
##$FCOR= 0.5
##$FTSIZE= 0
##$FT_mod= 4
##$GAMMA= 1
##$GB= 0.15
##$INTBC= 1
##$INTSCL= 1
##$ISEN= 128
##$LB= 0.24
##$LEV0= 0
##$LPBIN= 0
##$MAXI= 10000
##$MC2= 0
##$MEAN= 0
##$ME_mod= 0
##$MI= 1.114404
##$NCOEF= 0
##$NC_proc= 0
##$NLEV= 6
##$NOISF1= 3.799351
##$NOISF2= 2.8
##$NSP= 1
##$NTH_PI= 0
##$NZP= 0
##$OFFSET= 15.70392
##$PC= 1
##$PHC0= -9783.514
##$PHC1= 8.80081
##$PH_mod= 1
##$PKNL= yes
##$PPARMOD= 0
##$PSCAL= 0
##$PSIGN= 0
##$REVERSE= no
##$SF= 200.130013532006
##$SI= 16384
##$SIGF1= 3
##$SIGF2= 2
##$SINO= 400
##$SIOLD= 16384
##$SREGLST= <1H.CDCl3>
##$SSB= 0
##$STSI= 0
##$STSR= 0
##$SW_p= 3612.71676300578
##$SYMM= 0
##$S_DEV= 0
##$TDeff= 0
##$TDoff= 0
##$TI= <>
##$TILT= no
##$TM1= 0
##$TM2= 0
##$TOPLEV= 0
##$USERP1= <user>
##$USERP2= <user>
##$USERP3= <user>
##$USERP4= <user>
##$USERP5= <user>
##$WDW= 1
##$XDIM= 8192
##$YMAX_p= 0
##$YMIN_p= 0
$$ End of Bruker specific parameters
$$ ---------------------------------
##NTUPLES= NMR FID
##VAR_NAME=  TIME,          FID/REAL,        FID/IMAG
##SYMBOL=    X,             R,               I
##VAR_TYPE=  INDEPENDENT,   DEPENDENT,       DEPENDENT
##VAR_FORM=  AFFN,          ASDF,            ASDF
##VAR_DIM=   8192,          8192,            8192
##UNITS=     SECONDS,       ARBITRARY UNITS, ARBITRARY UNITS
##FACTOR=    0.0002004,     1,               1
##FIRST=     0,             0,               0
##LAST=      1.6414764,     0,               0
##MIN=       0,             -593983,         0
##MAX=       1.6414764,     743416,          0
$$ Real data points
##PAGE= N=1
##DATA TABLE= (X++(R..R)), XYDATA
$$ [...]
2238a023L72K444M0k793l23K579J420k462j362K482J932j460k219J492K265o67
2254B717l192k8K850M2l239r06K030J656k385j924J533K578o35k725Q28L187l9
2271B348k822l14K692J332k357j547J586K189k265k804J111K297p05k704K72K105
2287D14M83k455o41K571K019k160j252J615K257r42k619O08K532m49k559p21K078
2304G79O06k241j428J698J604j508j914J424K301n43k037Q94K512J65j915l31
2320F6J785O87j484j706J189J739j521k615N78K241r9k614O3K162J138j631j011
2337a033J924J813j164j627J299K039p35k113K1J624l30j725j080J847K80j559
2353e19j221J314J582j179j443J198J993j75j660J85K228L64j919r74J670R18
$$ plain form
2238 -1023 -651 1793 1833 -960 -1283 1296 2716 254 -1108 1374 3306 1846 -373 1119 3384 2717
2254 2717 -475 -503 2347 2389 -850 -1756 274 1930 -455 -2379 -846 1732 1097 -1628 -800 2387 2348
2271 2348 -474 -788 1904 3236 879 -668 918 3107 842 -1962 -851 1446 741 -1963 -1691 414
2287 414 897 -1558 -2199 372 2391 231 -1021 594 2851 1909 -710 -102 2430 1981 -578 -1299 779
2304 779 1385 -856 -2284 -586 1018 -490 -2404 -980 1321 778 -1259 -365 2147 2312 397 66
2320 66 1851 2538 1054 -652 537 2276 755 -1860 -1282 959 860 -1754 -1691 471 1609 -22 -1033
2337 -1033 891 2704 1540 -87 1212 3251 2516 403 424 2048 1718 -7 -1087 760 1040 -519
2353 -519 -1740 -426 1156 -23 -1466 -268 1725 1550 -110 75 2303 2667 748 -226 1444 2362
2369B362j592k059J102J344j001k144L97J377j37j145o23J678J092q83r59R70
2385b21J536m72j325P26J185n95j641m38J402l61j689m85J118N34j336j215J137
2402b140J655n43j618J017J802O6j412j17J487P21j777j046P58J304j525j606
2418b974J05J373n71j390m21J313Q86j250q02J597P60l68k71P07R47o91q72M38
2436a484Q68l57j403m05J128j21j747m92J282P51j112o35Q77J335J80j029M55
2453a909J642M49p52m41J161M19l34j273j16J066j037o01j76N08L80q82J46O63
2471a087M35j2L04Q00M28N0l90P40O52m46n53j92O83j61j237j73O10l02n30p98
2491a179R34M46k01l96K73R40M21k08p1O23M23k96l59J11K47n59p66ML13m38r83
$$ plain form
2369 2362 770 -1289 -187 1157 156 -1988 -1591 -214 -351 -1496 -2119 -441 651 -232 -1191 -221
2385 -221 1315 843 -482 244 1429 834 -807 -1245 157 -204 -1893 -2378 -1260 -726 -2062 -3277 -2140
2402 -2140 -485 -1028 -2646 -1629 173 239 -1173 -1290 197 918 -859 -1905 -1147 157 -1368 -2974
2418 -2974 -2869 -1496 -2067 -3457 -3878 -2565 -1679 -2929 -3731 -2134 -1374 -1742 -2013 -1306 -359 -1050 -1922 -1484
2436 -1484 -616 -973 -2376 -2781 -1653 -1774 -3521 -4013 -2731 -1980 -3092 -3727 -2850 -1515 -1335 -2364 -1909
2453 -1909 -267 182 -570 -1011 150 569 235 -1038 -1154 -88 -1125 -1726 -1902 -1394 -1014 -1896 -1750 -1087
2471 -1087 -652 -664 -360 440 868 918 528 1268 1920 1474 921 729 1412 1251 14 -159 451 149 -381 -1179
2491 -1179 -245 201 0 -396 -123 817 1238 1030 959 1582 2005 1709 1350 1461 1708 1149 383 387 700 262 -721
2512g21M95J02j6j41L78P33M00k2l6N62O40j61k26L78N03j52n40N7L71m09k13
2533A982n18J79L03J10p55R26jP98K23K1O36M71J06M21M75l78n3k74K72k69l49
2554D326M5k04m92q7n7j16J83M6l04L27K29J12J84K34J38l0Ro73Rm38j87p90m86
2577A978l26q44J2n49k09l36k34J83n34kk83K52J00q6l5k86J89q77R4k07m08m35
2599b843l16o54k15l36m40l23J66K53m88J97O79p0J90r1K38M77j25J65n4J1K3
2620c556j77j45K91l02n86K48K34N35k82n8K50P31K59j31L90O02O45RJ2M65L35
2641b31j86l4n14P25m00k88k53L62p9n48J65L87K68j76k07R45L55p4p53Q08N68
2662H40l26q16N8N40J3j378m94P59k93m07n90L1Q81m23p12M39O66J25o54N3O11
$$ plain form
2512 -721 -226 -124 -140 -281 97 830 1230 1208 1172 1734 2374 2213 1987 2365 2868 2716 2176 2233 2604 2195 1982
2533 1982 1464 1643 1946 2056 1301 2227 2226 3024 3247 3268 3904 4375 4481 4902 5377 4999 4946 4672 4944 4675 4326
2554 4326 4371 4167 3675 3588 3531 3415 3598 3644 3340 3667 3896 4008 4192 4426 4564 4534 4543 3870 3879 3441 3254 2464 1978
2577 1978 1652 808 820 271 62 -274 -508 -325 -859 -861 -1144 -892 -792 -878 -913 -1199 -1010 -1887 -1793 -2000 -2408 -2843
2599 -2843 -3159 -3813 -4028 -4364 -4804 -5127 -4961 -4708 -5196 -4999 -4320 -4390 -4200 -4291 -4053 -3576 -3701 -3536 -3590 -3579 -3556
2620 -3556 -3733 -3878 -3587 -3889 -4475 -4227 -3993 -3458 -3740 -3798 -3548 -2817 -2558 -2689 -2299 -1697 -1052 -1043 -1031 -566 -231
2641 -231 -417 -451 -965 -240 -640 -928 -1181 -819 -898 -1446 -1281 -894 -626 -802 -1009 -64 291 217 -536 272 840
2662 840 514 -302 -244 296 309 -1069 -1563 -804 -1097 -1504 -2094 -2063 -1182 -1605 -2317 -1878 -1212 -1087 -1741 -1688 -1077
2683a077Q30q85j56M48M78p29n79L98O20m36j061K23O93M0n86j65J079N92n63
2702h36q5J190J106l39r66J220M15Q3m77Q9P93k0o39l61R02J06j15m94J003M76
2722C051m0o81O05Q36M04p47K30Q33M62p82m96N77Q31q15j063N29N72l01j076
2741B929l48J067J84r06n12P12Q11j180n80L24M85Qj082J29L91o8j166m82N33
2760A249K6j098p70P43l6o01q01L05J056k09j393J21J215j92j142m19J081O99
2778a66j140q48L42O77q8j458l1J021K5j054k51R81N76q75k28P27P62k85r00O03
2798a610J182k81r17N6J251J48j254m30J067N02r11o22O58J081m38r87M69J522
2816D86j49r19m11J376M20p09o04N92R09p05n30j5J067o4j213k12J113J55j157
$$ plain form
2683 -1077 -247 -1132 -1288 -840 -362 -1091 -1670 -1272 -652 -1088 -2149 -1926 -1233 -1193 -1779 -1944 -865 -273 -836
2702 -836 -921 269 1375 1036 70 1290 1705 1788 1311 1400 2193 2173 1534 1173 2075 2181 2066 1572 2575 3051
2722 3051 3011 2330 2935 3771 4175 3428 3658 4491 4953 4171 3675 4252 5083 4268 3205 3734 4306 4005 2929
2741 2929 2581 3648 3832 2926 2414 3126 3937 2757 2177 2501 2986 2994 1912 2041 2432 2364 1198 716 1249
2760 1249 1275 177 -593 150 114 -487 -1288 -983 73 -136 -1529 -1408 -193 -385 -1527 -1946 -865 -166
2778 -166 -1306 -2154 -1812 -1135 -1223 -2681 -2712 -1691 -1666 -2720 -2971 -1990 -1414 -2289 -2517 -1790 -1028 -1313 -2213 -1610
2798 -1610 -428 -709 -1626 -1570 -319 -171 -1425 -1855 -788 -286 -1197 -1819 -1161 -80 -518 -1505 -1036 486
2816 486 337 -582 -993 383 803 94 -510 82 991 286 -244 -259 808 744 -469 -681 432 587 -570
2835e70J11L80Q83n83q76O45R04m07o97O14N75j28j350J3J313L36j317n65R56
2854B37O20o85j445P76J257l51j028J11J216J30r00p58J154R84j101j233R84Q13
2872G81n44p41K83J050n30p28l31J203J47q50n04R46N19o55q65N91J015n54r53
2891g20L48J186J20j367o59J140M85j060n39Q93N73k16j192L95N52N47q99m53
2909h66R59L30q88m09P05N77p94o80M93J051n29r20K07O99K62p49j0R14J19r65
2929d94n37P25R31m68q13O9J388o83q36r3R52Q46j216l28J146M92q83p74P21P24
2949H69k80p02l33J312j90j086J88P81J95o19p03P74N33m37p21J5J104k25n89
2968a14K2N17M1j171k58P93J010j199o45N26N56m2j273K32R70K50j205Q6O21J70
$$ plain form
2835 -570 -459 -79 804 221 -655 -10 894 487 -210 404 979 851 -499 -486 827 1163 -154 -719 237
2854 237 857 172 -1273 -497 760 409 -619 -508 708 838 -62 -820 334 1318 217 -1016 -32 781
2872 781 237 -504 -221 829 299 -429 -760 443 590 -260 -764 182 701 46 -819 -228 787 233 -720
2891 -720 -372 814 934 -433 -1092 48 533 -527 -1066 -173 400 184 -1008 -613 -61 486 -413 -866
2909 -866 93 423 -465 -874 -169 408 -386 -1066 -573 478 -51 -971 -764 -65 197 -552 -562 352 471 -494
2929 -494 -1031 -306 625 157 -656 -587 801 118 -718 -811 141 987 -229 -557 589 1081 198 -576 145 869
2949 869 589 -113 -446 866 676 -410 -222 559 754 135 -568 206 739 302 -419 -404 700 475 -114
2968 -114 -92 425 466 -705 -963 -170 840 -359 -1004 -478 78 36 -1237 -1005 -35 215 -990 -904 -283 -113
2988a13k90p47N02R05n86p70M42N99k64o49n3J033o7p59l76K72N27o67j55M39
3008g77Q80k35q61M8J208j45p54j23R09N71r22o50O20M79m40m83K78Q84k00j161
3028h74K52R45P6q52l3O57Q27o93o97N92N23m01o97N06P47j14j175K3N43N03o21
3049C7p14P71M26o54o80O37R13j16m14r4N82L2n80q0M03J111q14p36O74K60n43
3070D21n93PP58r4o25l04J223J12p59j85Q18O93l71n10L27N62r4n13%N39J20q00
3092G32p7M23M18n79n29L15R20m40m87j17P66J76k80k89P28J80m63n15L85M76
3112A743l41o73k6N27l88n16j67O89J18o90o2Q42Lm69k82M96M62j53m69L76J12
3133A132M8n88l24J77K83m22n46K43L80n99m9l2P72n72p6P8M28J17l84L84J13
$$ plain form
2988 -113 -403 -1150 -648 257 -329 -1099 -657 -58 -322 -971 -1024 9 -58 -817 -1193 -921 -394 -1061 -1216 -777
3008 -777 103 -132 -993 -945 263 118 -636 -759 150 721 -201 -851 -231 248 -192 -675 -397 487 287 -874
3028 -874 -622 323 399 -453 -486 171 998 305 -392 200 723 322 -375 131 878 764 -411 -388 155 658 37
3049 37 -677 94 520 -134 -814 -177 736 620 206 112 694 726 146 66 469 1580 766 30 704 964 421
3070 421 -172 -165 593 499 -126 -430 793 905 146 -39 779 1472 1101 591 918 1480 1386 873 873 1412 1532 732
3092 732 655 1078 1496 917 388 703 1623 1183 696 579 1345 1521 1241 952 1680 1860 1397 882 1267 1743
3112 1743 1402 729 703 1230 842 326 159 848 966 276 214 1056 1059 590 308 804 1266 1113 644 1020 1132
3133 1132 1180 592 268 445 728 306 -240 3 383 -216 -265 -297 475 -97 -173 -95 333 450 66 450 563
3154E63K96m22l41M26J94o08l95m5P23k85p14o8K69N76m19n23N35N60k76o19M26
3175a47K23R4j22m95J57M26o23m31QL1p25L36k16L6k42R6n02K87M52m28m5K82
3197a548K40o44k98O15Lp2p24j99J74l23k37m40M13L2m80K76K81J46P6l92K18
3218b883L97K70l24l3M79k48Ok0M09rj53l08J21J84m5j92M90J49L11n40N24O45
3240g70P3j2K18P03lJ09J08J32M7P0k31k04M35O4o3m03L05J29k0L22m4O06Jj4
3264A558L56J9R3K8M7r3r1r6K22J04m65k86k5lJ70l9l06L8Q1K8J97k27J78L79
3288A867p4k53J00rK02j65n81M69m39J52k42n22L50L60m13j41K69k9J08J12pJ78
3310A292j14M94lk54J79O7J44l48O5K03k91L89l81J69n52K43k37L79J09N1J03
$$ plain form
3154 563 859 437 96 522 716 108 -287 -332 391 106 -608 -676 -407 169 -250 -773 -238 322 46 -573 -147
3175 -147 76 170 48 -447 -290 136 -487 -918 -910 -879 -1604 -1268 -1484 -1448 -1690 -1594 -2096 -1809 -1357 -1785 -1830 -1548
3197 -1548 -1308 -1952 -2250 -1635 -1632 -1704 -2428 -2627 -2453 -2776 -3013 -3453 -3040 -3008 -3488 -3212 -2931 -2785 -2709 -3101 -2883
3218 -2883 -2486 -2216 -2540 -2573 -2094 -2342 -2336 -2356 -1947 -1956 -2109 -2417 -2296 -2112 -2157 -2349 -1859 -1710 -1399 -1939 -1415 -770
3240 -770 -697 -709 -491 212 209 318 426 558 605 675 444 240 675 739 676 273 578 707 687 1009 965 1571 1572 1558
3264 1558 1914 1933 2026 2054 2101 2008 1917 1821 2043 2147 1682 1396 1371 1368 1538 1499 1193 1231 1312 1340 1537 1310 1488 1867
3288 1867 1793 1540 1640 1631 1833 1668 1087 1556 1117 1269 1027 505 855 1215 802 661 930 901 1009 1121 1114 1292
3310 1292 1178 1672 1669 1415 1594 1661 1805 1457 1522 1725 1434 1823 1442 1611 1059 1302 1065 1444 1553 1604 1707
3331A707M94k39R3k5M29j88j07o8M6K86n06k50J03o8j8m81Q9k6J31m90Q9L41j45
3354A197M6k91L27o1j14m41K70k60k5l18n73L64l89Mr7k36k98n14j79N3J48K27
3376a160k00p3l55O31m10j97L17L8o81j30O1j37L05m71l87K15m1k1m69L16L48
3397b501j54J10R6J42l89L29L48L5j51J63J44k59K51n89L57J00r2r2q3J19N02
3418a614j30l83J13O01K72l58J23J84N27j86k35O50K56l11k84n5K04r9O1j99m9
3439i12N95o55j47O48l4M6J11K29K79j63lJL84O8k46l6K7l1J30n46J5M35n17n9
3463c81N16J88k40k59PQ91j7j02j82K95J08k50n1l2N54k94k76J46P1J52o79J86
3485C51N38J1j45n01Q10J78m04k10L49N62J9n28K32K40M01j033L26J93j3l49j74
$$ plain form
3331 1707 2201 1962 2055 2030 2459 2271 2164 2096 2142 2428 1922 1672 1775 1707 1689 1208 1297 1271 1402 912 1001 1342 1197
3354 1197 1243 952 1279 1218 1104 663 933 673 648 330 -243 121 -268 -264 -361 -597 -895 -1409 -1588 -1535 -1387 -1160
3376 -1160 -1360 -1433 -1788 -1157 -1567 -1764 -1447 -1409 -2090 -2220 -2159 -2296 -1991 -2462 -2849 -2634 -2675 -2696 -3165 -2849 -2501
3397 -2501 -2655 -2545 -2449 -2307 -2696 -2367 -2019 -1984 -2135 -1972 -1828 -2087 -1836 -2425 -2068 -1968 -2060 -2152 -2235 -2116 -1614
3418 -1614 -1744 -2127 -2014 -1413 -1141 -1499 -1376 -1192 -665 -851 -1086 -436 -180 -491 -775 -830 -626 -725 -664 -863 -912
3439 -912 -317 -972 -1119 -471 -505 -459 -348 -119 160 -3 -6 -5 379 447 201 165 192 161 291 -255 -240 195 -322 -381
3463 -381 135 323 83 -176 -169 722 705 603 421 716 824 574 523 491 1045 751 475 621 692 844 165 351
3485 351 889 900 755 254 1064 1242 838 628 977 1539 1558 1030 1262 1502 1903 870 1196 1389 1376 1027 853
3506H53P9N09n31l86M15N30j72k56K01J03q5l14k4L98J35o4o86L41J42j3o51q9
3528D35M98l15j57l07J44L92j4n94K61P92p15k20L5L25L66o85L18L30k36n36j85
3549f8K91J23m40j02j41M66m09k63pM51j28kj45M25K89o73j88N21L36l40l86j17
3571e07N11l78k84j95O42J34j053K31O36J32m91l54K33Q04l72l78K75K82j64J2
3591b84o0L59j73k98K1L78O0o20j35N18M84m12m65P6M74j51j9j70L66M09k92l59
3613b93j70Q37o2q12J20L71K95k88o25L95K83r6j69J06L87r6k99L4L95j38l00
3634a25j70O41k6m95k0L58O5n85J05J54L10k9n30K5P78l30l87pL84K21l18m36
3656d17K89M10q3n60J27K47J33l75j02J71K86j29p46N55K73k80j04J10Q9J76n62
$$ plain form
3506 853 932 1441 910 524 939 1469 1297 1041 1242 1345 1260 946 922 1320 1455 1391 705 1046 1188 1175 524 435
3528 435 933 618 461 154 298 690 676 82 343 1135 420 200 235 560 926 241 559 889 653 117 -68
3549 -68 223 346 -94 -196 -337 129 -280 -543 -550 -99 -227 -229 -374 51 340 -333 -521 0 336 -4 -390 -507
3571 -507 4 -374 -658 -853 -211 -77 -1130 -899 -263 -131 -622 -976 -743 61 -311 -689 -414 -132 -296 -284
3591 -284 -344 15 -158 -456 -435 -57 3 -617 -752 -234 250 -162 -627 -551 -77 -228 -247 -417 -51 358 66 -293
3613 -293 -463 374 312 -500 -380 -9 286 -2 -627 -232 51 -45 -214 -108 279 183 -116 -82 313 175 -125
3634 -125 -295 346 320 -175 -195 163 228 -357 -252 -98 212 183 -347 -322 456 126 -261 -268 116 337 19 -417
3656 -417 -128 282 199 -361 -234 13 146 -229 -331 -160 126 -3 -749 -194 79 -201 -305 -195 -106 70 -492
3677d92L34M4P6l82n8N87Q8n51l85K87N48o84l18O40L01j41o25L0P25Rl51l86
3699g04M68L50k10m48K4M40p8j71j00L05k72l52R7O04j72k37j44M11P9L0p07L97
3721c90N44m77j80K44K12J04k53L5K56j23k61j32K12L70l56n06L8M30L70n81K02
3742b42J9L56j93l31L97K7M18o68K08L25J28m57Q9J19K71l39j96L70L42o29PM80
3764E01P7N0m70M84J73lo28J43J93L39k34j13J75j09J65k76K78j04P3k37j35J35
3786D77K76j94N1k05L91k30j26J78M53k65n32N3J64K69m70Q8J1J61j40j06J42
3807D46k86R1k74J00K33k23j30N0K51K3o96L13r2L41m24J29j48K89j43J7k61K41
3829a53k02J52NK33J89p60K05J55R0K21m20KK33j19l8oL94j44n5m34R3L88m9k00
$$ plain form
3677 -492 -158 -114 -38 -420 -478 109 197 -354 -739 -452 96 -588 -906 -266 35 -106 -731 -701 24 33 -318 -704
3699 -704 -236 114 -96 -544 -520 -80 -158 -329 -429 -124 -396 -748 -651 -47 -219 -456 -600 -189 -110 -80 -787 -390
3721 -390 154 -323 -503 -259 -47 57 -196 -161 95 -28 -289 -421 -209 161 -195 -701 -663 -233 137 -444 -242
3742 -242 -223 133 -60 -391 6 33 451 -217 -9 316 444 -13 76 195 466 127 -69 301 643 14 21 501
3764 501 578 628 158 642 815 812 184 327 520 859 625 512 687 578 743 467 745 641 714 477 342 477
3786 477 753 559 610 405 796 566 440 618 1071 806 274 327 491 760 290 378 389 550 410 304 446
3807 446 160 251 -23 77 310 87 -43 7 258 281 -415 -102 -194 147 -277 -148 -296 -7 -150 -133 -394 -153
3829 -153 -355 -203 -198 35 224 -536 -331 -176 -86 135 -285 -283 -50 -169 -207 -213 181 37 -18 -452 -359 29 -20 -220
3853b20K87L14l56k70L45P9R3j59jj25K57J33l87L39L12l72R9l23K50j12n0K3
3875A56L8K33k86l12M31m18K64N7l27N54j37l61r9N35m52Q3J16k6K42j44p04M36
3897a21K87q8k95n3N19m90J66k80L86j20k47q7K17N5j18j46O3Q4j37q6L24L7J48
3920A8l56K15L6M5j76j33L31K3j00n1M4N4l20O7J04N7Q3N4j47M7q2o4L82MK78
3945D13k08j81l2K78k56l05M13L5j64K57p2j63L01l18j28L67k16K64r4o0l4k53
3967a56J75J52j52n0Q1N6l50J84j27j04R2n37L17L77k71k03K26o5j50J39K9j2
3989c49q4q7J48O0k1q3j08m1J00P4j62L75m52J74j29M09j49j64K19r3K00k6l04
4012d93K27N04k90k88K69j65J4j08J84J61k05J04j17N73n09L0J6M41j59l6o3J34
$$ plain form
3853 -220 67 381 25 -245 100 179 272 113 112 -13 244 377 -10 329 641 269 368 45 295 183 133 156
3875 156 194 427 141 -171 260 -158 106 163 -164 390 253 -108 -207 328 -124 -41 75 49 291 147 -557 -121
3897 -121 166 78 -217 -270 249 -241 -75 -355 31 -89 -336 -423 -206 -151 -269 -415 -352 -268 -405 -491 -167 -130 18
3920 18 -338 -123 -87 -42 -218 -351 -20 3 -97 -148 -104 -50 -370 -303 -199 -142 -59 -5 -152 -105 -187 -251 131 135 413
3945 413 205 24 -8 270 14 -291 122 157 -7 250 178 15 316 -2 -130 237 21 285 191 131 97 -156
3967 -156 19 171 19 -31 50 106 -244 -60 -187 -291 -199 -736 -419 -42 -313 -516 -290 -355 -505 -366 -337 -349
3989 -349 -433 -520 -372 -312 -333 -416 -524 -565 -465 -391 -553 -178 -630 -456 -585 -176 -325 -489 -270 -363 -163 -189 -493
4012 -493 -266 238 -52 -340 -71 -236 -222 -330 -146 15 -190 -86 -203 370 -139 -109 -93 348 189 153 90 224
4034B24k50L16J66m00K70j21q5L99n33J99J89J4l1J81j77j48J40K0J69r9k85K5
4056A83L39k04J05j70r9P5K69k77n0j60L26j04K05l46R0R7P3l46J17m3j30jJ37
4079H6q7K36J00n33K99j39m7K70L0k20Q4N1L91j12m14J43J29L9l2k63K58k99J19
4102H9j12J24K88j31J72l55RJ30P6j39J87J59k11j54K91l22M27m73K65j2k5J29
4124D12M0P5k44J57J5j82J79k79N7J1J03K64j36n77M75k34K39l60k4L78l06o6
4146cK14Q3K0j72k26K00N1J7j87j7J88k83j36J41k2J15r6j76O3r0K1k74K38J62
4170a69m42M52k99K37l77P4L85k90O7k69K06j86L05j79k57M93j49K46j75k76N28
4191g5o0k45K8M1K70l78n3K74M05n17k38K73L2K44n1l98K72K61j90j21N9J90J14
$$ plain form
4034 224 -26 290 456 56 326 205 120 519 -14 185 374 388 357 538 361 213 353 373 542 443 158 183
4056 183 522 318 423 253 154 229 498 221 171 11 337 233 438 92 182 279 352 6 123 80 -50 -51 86
4079 86 -1 235 335 -198 101 -38 -85 185 215 -5 79 130 521 409 -5 138 267 306 274 11 269 -30 89
4102 89 -23 101 389 258 430 75 84 214 290 151 338 497 286 132 423 101 528 55 320 308 283 412
4124 412 452 527 283 440 455 273 452 173 230 241 344 608 472 -105 370 136 375 15 -9 369 63 -3
4146 -3 211 294 314 142 -84 116 167 184 -3 -20 168 -115 -251 -110 -132 -17 -113 -289 -226 -316 -295 -569 -331 -169
4170 -169 -611 -159 -458 -221 -598 -524 -139 -429 -362 -631 -425 -611 -306 -485 -742 -249 -398 -152 -327 -603 -75
4191 -75 -135 -380 -352 -311 -41 -419 -472 -198 207 -310 -548 -275 -243 1 -50 -448 -176 85 -105 -226 -167 23 137
4214A37k89p0K36k76J03J61p0K26l86K25R5l03n0p3J81J32k5l2O4k92M3j38K10
4237a91J58K8l51M06l48K20k88K83J29j57k82j02kM01q2l80J44L86J53k02k94
4258c71J75K97k05l19L22R6k29J77j87QN1Q8R7O7p2l8n4jj79K64j85K68Jl3j24
4283h6k30N58k49K07l42L75j49K72j92J02K37k02k77J97L26l00J83m07K21J68
4303D12l23M3J07K18m04J63K25j8k59k87O36j3p5r6j83K52J18j90j94L03L6n58
4325h7L3K7K16j14j1O1K63l81J02p0L0K01L3l86J32J70J84n52k13M66l45J80m0
4348a01K56k31j97r7J15R6J64L7J08j51M08m68m9L3j3N6O1k84L13j39J93k2K0
4371A08j9r5N9J9M86k54j63j13L71n9m10K61K19m2l29p0M51J84m11Q5R4k78lJ1
$$ plain form
4214 137 -152 -222 14 -262 -159 2 -68 158 -228 -3 92 -211 -261 -334 -153 -21 -46 -78 -14 -306 -263 -401 -191
4237 -191 -33 -5 -356 50 -298 -78 -366 -83 46 -111 -393 -495 -497 -96 -178 -558 -414 -28 125 -77 -371
4258 -371 -196 101 -104 -423 -101 -5 -234 -57 -244 -236 -185 -97 0 67 -5 -43 -97 -98 -277 -13 -198 70 71 38 -86
4283 -86 -316 242 -7 200 -142 233 84 356 164 266 503 301 24 221 547 247 430 23 244 412
4303 412 89 132 239 457 53 216 441 423 164 -123 513 500 425 329 146 398 516 326 132 435 471 -87
4325 -87 -54 -27 189 75 64 125 388 7 109 39 69 270 303 -83 49 219 403 -149 -362 104 -241 -61 -101
4348 -101 155 -76 -273 -370 -255 -159 5 42 150 -1 407 -61 -110 -77 -90 -34 27 -257 56 -83 110 88 108
4371 108 89 -6 53 72 558 304 141 28 399 340 -70 191 410 368 39 -31 420 604 193 278 372 94 91 102
4395A02o4K12O9n60O95k45j56q6J42J59Rk71J20j01K28M4m35L71jk55j10j46L68
4418H9k52N9j40j7L84l30Rq6J86k24j25K41O9q2mr5J80j35j36p2J68K02l67R2
4442c86J14J4O2k03m1J42k0k56K70M75n05j60r2L92R7j20l00J37K53L6k74Q6J62
4465a17j28k32K20J41qj96J18Q4O8j08m5p6J75j42k14J50J33L5k65q9L06J8Jr1
4489b62J65L39k50l14K6J14J03j76J73%j55J5pj06K69o3J40l84M59o61K54N3K66
4512bJ33m68J7M24r1J69m80L46k19j26P1L55l8k58M3L13k88q5K15L5R9m58M42
4535A49j60j08M35j66p2J7J80R6r0j48J75k85M33j35k05P1L1K63k18L24l43K70
4557E14m26L28J7NJ39M5pj44m03O34j7j15j10L3j20k9l33Q7M33l09J35Rm4J76
$$ plain form
4395 102 38 250 319 -241 454 209 53 -33 109 268 277 6 126 25 253 297 -138 233 232 -23 -133 -279 89
4418 89 -163 -104 -244 -261 123 -207 -198 -284 -98 -322 -447 -206 -137 -219 -223 -318 -138 -273 -409 -481 -313 -111 -478 -386
4442 -386 -272 -258 -196 -399 -440 -298 -318 -574 -304 171 -334 -494 -586 -194 -97 -217 -517 -380 -127 -91 -365 -279 -117
4465 -117 -245 -477 -257 -116 -124 -320 -202 -118 -50 -158 -203 -279 -104 -246 -460 -310 -177 -142 -407 -496 -190 -172 -171 -262
4489 -262 -97 242 -8 -322 -296 -182 -79 -255 -82 -82 -237 -222 -229 -335 -66 -129 11 -373 86 -575 -321 -268 -2
4512 -2 131 -337 -320 104 13 182 -298 48 -171 -297 -226 129 91 -167 -124 189 -99 -184 31 66 165 -293 149
4535 149 -11 -119 316 150 78 95 275 371 281 133 308 23 456 321 116 187 218 481 263 587 244 514
4557 514 88 416 433 438 577 622 615 471 68 702 685 570 460 493 373 344 11 98 531 222 357 366 322 498
4581D98n31K39l8L28l49N1O3Q1j06j31N0j23J83j54K3K95l75m07K62k55K93k0
4603a23j50J77j02K50k39L37l05j65P5N5J19j85K16l79J24N7m7N41n26J06J06
4624e8k1M0j97K38O7k18K12k64J07j96J26J56n3j98J72J4J70k20j9J41l58M43
4646H4l08J70K01q7k93J96j21L85k30R4k91Q7M47k32o6J14r6j98K77k16K4j97
4668b56J57K5m2j04M4N9j05R9O1j20n1L03o0j15P7l56K17K25j53J70j59k5J42
4691C3j76K75j30j20k58R4K58oL6l70Q4K76q4k69K05l8m8K09K74j89k96j26M75
4714A09l57J88n4K71l91K41K96n03J13J46L20m62J79J18j98K40l08J42j70K14
4734A34K79n71R2J59k62J47R0O9p0o7m1J94j2j45J70L30j26J14l30K4l17N7J81
$$ plain form
4581 498 -33 206 168 496 147 198 261 342 236 105 155 32 215 61 84 379 4 -403 -141 -396 -103 -123
4603 -123 -273 -96 -198 52 -187 150 -155 -320 -245 -190 -71 -256 -40 -419 -295 -238 -285 256 -270 -164 -58
4624 -58 -79 -39 -236 2 69 -149 63 -201 -94 -290 -164 -8 -61 -259 -87 -73 97 -123 -142 -1 -359 84
4646 84 -224 -54 147 60 -233 -37 -158 227 -3 91 -200 -113 334 102 36 150 54 -144 133 -83 -59 -256
4668 -256 -99 -74 -116 -220 -176 -117 -222 -123 -62 -182 -233 70 10 -105 -28 -384 -167 58 -95 75 -84 -109 33
4691 33 -143 132 2 -118 -376 -282 -24 -30 6 -364 -280 -4 -88 -357 -152 -190 -238 -29 245 56 -240 -366 109
4714 109 -248 -60 -114 157 -234 7 303 -200 -87 59 379 -83 96 214 16 256 -52 90 -80 134
4734 134 413 -158 -66 93 -169 -22 68 137 67 0 -41 153 141 -4 166 496 370 484 154 178 -139 -82 99
4757I9J38l18j3M5J05j91j23K71J85j53J58o9j98O9l6n0M8L6j93J99j76J94p4
4780d7l1L60l55R9J12j92J88j54pM39o18N8K74J75k44l56J73J52j59L0j11j2L07
4803H1j40M51k90nR3j11rm7M13m63J39J34l24J57L0n0L30m89o3N52k49k04kK32
4827A66R5m77L22J80k04P6k36n7K10j70Q5l3j36K94j75N7J16l5R7p5j21j20L44
4850B03k87K35k06k1n9N1P6K1k57J55P8L5R8l29L47l04Q3j45L97k23L7r0j45L20
4874G0m5j57L03j50m6k14M91m20J58J69k89j60K60Oj33j60N06j31r1j10O9J43
4896F9j02R8l41N21m13M0J90J25k35K11k46J12N8j57K70j8j73j3oj28Q2N0j31
4919a37Q3L35j73k92M98o2j93j55l1K97j34j30J28o9O3K92n36N08k34j29J60k84
$$ plain form
4757 99 237 -81 -94 -49 56 -135 -258 13 198 45 203 134 -64 5 -31 -81 -33 3 -190 9 -167 27 -47
4780 -47 -78 282 -73 26 138 -54 134 -20 -27 412 -206 -148 126 301 57 -299 -126 26 -133 -103 -214 -226 81
4803 81 -59 392 102 97 190 79 70 23 436 -27 112 246 -78 79 109 59 389 -100 -163 389 140 -64 -66 166
4827 166 261 -216 106 286 82 158 -78 -135 75 -95 -10 -43 -179 115 -60 -3 113 78 175 100 -21 -141 203
4850 203 -84 151 -55 -76 -135 -84 -8 13 -244 -89 -11 24 122 -207 140 -164 -81 -226 171 -52 -15 -105 -250 70
4874 70 25 -132 171 21 -25 -239 252 -168 -10 159 -130 -290 -30 -24 -157 -317 189 58 -33 -143 -74 69
4896 69 -33 65 -276 245 -168 -128 62 187 -48 163 -83 29 87 -70 200 182 9 -4 -10 -138 -56 -6 -137
4919 -137 -54 281 108 -184 314 252 59 -96 -127 170 36 -94 34 -35 28 320 -216 292 58 -71 89 -195
4941a95L90J40j89j50n6j6K78j43l55M77j78Q2j68Q2J90j92o1J57r5j13K50k09
4963g4L95k46L7j71K22k78J81j94J29J91j08qQ8l0Q6o3r3oj91jj05ML50l79J91
4988g3L2l0J10l11K47K47k29j60J26j01K26l38K10L9q3l3N04n90M22l30j1k54
5010c80L35J34L8j96J81r9j94J4l47K60J00J87k3O0n0j26J47J39l75O1K02K9k14
5033a17n2K11n1r5j34L72j53Q3o6p0O8K75j19l61J74l04J61K87k97K61k59O9m5
5056a62N4o9P3ppL07L0m11p5J74L9J42k73K77j08J2K29j48j18J04j58r6L90K31
5080D30l33k02K50m26K28pJ10J57l53K61j05J92K10p4n7rl8l67M09m79K72K44
5102C13m77J23j39Q0K12M8k40K06J10r4j84j79J16o3j08L65J21j37j51N1j34L3
$$ plain form
4941 -195 195 335 146 -4 -60 -76 202 59 -296 181 3 85 -83 -1 189 -3 -64 93 -2 -115 135 -74
4963 -74 321 75 112 -59 163 -115 66 -128 1 192 84 76 164 134 220 157 64 58 -133 -134 -239 -235 115 -264 -73
4988 -73 -41 -71 39 -272 -25 222 -7 -167 -41 -142 84 -254 -44 -5 -88 -121 383 -207 215 -115 -126 -380
5010 -380 -45 89 127 -69 112 13 -181 -167 -514 -254 -154 33 10 70 20 -106 41 180 -195 -134 68 97 -117
5033 -117 -169 42 -9 -104 -238 134 -19 64 -2 -72 -4 271 152 -209 -35 -339 -178 109 -188 73 -186 -117 -162
5056 -162 -108 -177 -104 -111 -118 189 219 -192 -267 -93 -54 88 -185 92 -16 -4 225 77 -41 63 -95 -191 199 430
5080 430 97 -105 145 -281 -53 -60 50 207 -146 115 10 202 412 338 281 272 234 -133 276 -203 69 313
5102 313 -164 -41 -180 -100 112 160 -80 126 236 142 -42 -221 -105 -168 -276 89 210 73 -78 -27 -161 -128
5124a28L8L2K74o8k0k4j72J88k07J8K55J44j97J55k87J28p5J52j84j86j34K00
5146i8RqK90m07K12k9J01J18l31K09J17l32J60J12j11J65Q4j45j08m6L46k44j68
5169a04K82R0m8j04k0J0q1K58k41J09k6k4j69K63p4l4J92J20k75j95J67M4M7K8
5193B15m21M9q9J45P3J21q1K54l91K00L27r8p53J74J66L81k82K04j05k17P3r5
5215a50J15J39m38J94P7K43l76J63L8l85K67L5K6P9j65J5R0m1l1j18OM05m18k42
5239d72L63J93j8l19K61j14K38j82k57M25l00L98m19N7J16m7K49j67o7L1K59m25
5261a97K07M0P6L7k84Q0L09l83K55ml45K40j96J81m7N4n0K7m4j18J53O9m2J61
5285A79k63J89l04M60k80P5l2l97J02LK19K03l73PK11R1o3O3j2k24L1N26p72M97
$$ plain form
5124 -128 -90 -58 216 148 128 104 -68 120 -87 -69 186 330 133 288 1 129 54 206 22 -164 -298 -98
5146 -98 -89 -97 193 -214 -2 -31 70 188 -143 66 183 -149 11 123 12 177 261 116 8 -38 308 64 -104
5169 -104 178 268 220 116 96 106 25 283 42 151 125 101 -68 195 121 87 279 399 124 -71 96 140 187 215
5193 215 -206 -157 -246 -101 -28 93 12 266 -125 75 402 304 -449 -275 -109 272 -10 194 89 -128 -55 -150
5215 -150 -35 104 -334 -140 -63 180 -196 -33 5 -380 -113 -78 -52 27 -138 -123 -33 -74 -105 -223 -217 188 -230 -472
5239 -472 -109 84 66 -253 8 -106 132 -50 -307 118 -182 216 -203 -146 -30 -77 172 5 -62 -31 228 -197
5261 -197 10 50 126 163 -121 -41 268 -115 140 136 -209 31 -165 16 -31 23 -27 0 -44 -162 -9 60 18 179
5285 179 -84 105 -199 261 -19 56 24 -373 -271 -268 -49 154 -219 -212 -1 90 27 90 78 -146 -115 411 -361 136
5309A36q3J98j17l42L73n1k12n0K52k47J79K2k12N31n02Q8m1J59K70m63L59k51
5331dK2Q7j44O2n4N7j25J22k1K52m87J99J6p0K82L3k25L68Rm21M2ON2J72k55K58
5357B33nk98J81r7k83M02k53J53J54k58J23J05k93r3M11l61J55k48N7M02l3j41
5379A3j10J55k21J55J04k0k4j86M5N5J43l50J19p3J38N2J31m25J69J02J93k16
5401e1j6P9k49K07j12L28l19j33J05M39N5k32k73J14L48j50l58J32J68l28K45
5422an6r9N5j61K70j3pO7k83J86L46p76L28J98k29J51n9K06j85n9L25j47K4k16
5446a35J39j93O9JM24l13k48J55j6J84l12L1K83j15J72J57k51l2l8L38k09m11
5468c20M06O4j55l6J03l32r0M19J72j8k54J02r8Q0L1k06J62J57l32P7p9K74o4
$$ plain form
5309 136 53 251 134 -208 165 114 -98 -148 104 -143 36 58 -154 377 -125 -37 -78 81 351 -112 247 -4
5331 -4 18 105 -39 23 -31 26 -99 23 2 254 -233 -34 -18 -88 194 227 2 370 379 -42 0 6 58 230 -25 233
5357 233 228 -70 111 14 -269 133 -120 33 187 -71 52 157 -136 -229 182 -179 -24 -272 -215 187 154 13
5379 13 -97 58 -163 -8 96 76 52 -134 -89 -34 109 -241 -122 -195 -57 -5 126 -299 -130 -28 165 -51
5401 -51 -67 12 -237 -30 -142 186 -133 -266 -161 278 333 101 -172 -58 290 140 -218 -86 82 -246 -1
5422 -1 -57 -156 -101 -262 8 -5 -12 55 -228 -42 304 -472 -144 54 -175 -24 -83 123 -62 -121 204 57 81 -135
5446 -135 4 -189 -120 -119 305 -8 -256 -101 -117 67 -245 -214 69 -46 126 283 32 0 -38 300 91 -320
5468 -320 86 150 -5 -41 62 -270 -360 59 231 213 -41 61 -37 43 74 -132 30 187 -145 -68 -147 127 63
5491F3j68K2L20k00q9L21j44r0qj63N9n9kq3K76k23J19r5J52R6l35o3K35q3o9
5516b11J71j3j11M08k82kl7j8J07R7l14J32l7J45m51M69j86R2K50m83L02J00l31
5539b03J47K36k63R0m10L97n7o4k9J28j4j14O41n92p5L06O8j64n5P6j39K77K83
5562D70l40k70L42k04MK05q8n3m0k09M10k09J10j93k38M17k44K51j19K00j19j12
5584b9J42j06K37k13l09J55L40l36L04k06j37R6n7p5J60N5j24J25l09J20O9p5
5606a73L06l56L4L02n6j39K06l53K08M9q5j25k8J91K1J56l13P6K13j22j41kJ18
5629a3j58L2K77m3Q6L15o50M56l00rk92K89K2p9k50J96o1L11j79j61L16J54k32
5652B7j7J11j31J90j10l9M6Rm9K77j18l13j7L22m8l26M80n63N24l75K5K3qr6O0
$$ plain form
5491 63 -105 -83 237 37 -52 269 125 35 27 -136 -77 -136 -138 -221 55 -168 -49 -144 8 104 -231 -294 -59 -142 -211
5516 -211 -40 -53 -164 244 -38 -40 -77 -95 12 109 -205 -73 -110 35 -416 53 -133 -41 209 -274 28 128 -203
5539 -203 -56 180 -83 7 -403 -6 -63 -127 -156 -28 -42 -156 485 -107 -182 124 192 28 -27 49 -90 187 470
5562 470 130 -140 202 -2 2 207 119 66 26 -183 227 18 128 -65 -303 114 -130 121 2 202 83 -29
5584 -29 113 7 244 31 -278 -123 217 -119 185 -21 -158 -62 -119 -194 -34 21 -103 22 -287 -167 -98 -173
5606 -173 133 -223 -189 113 57 -82 124 -229 -21 28 -57 -182 -210 -19 2 158 -155 -79 134 12 -129 -131 -13
5629 -13 -171 -139 138 95 181 496 -154 302 2 -7 -299 -10 12 -67 -317 -121 -182 129 -50 -211 105 259 27
5652 27 10 121 -10 180 70 31 77 86 37 314 196 -117 -134 188 140 -186 294 -269 255 -120 -95 -72 -80 -176 -116
5677a16J80K87k38k06j46J98K90l05L48k23k25J13J46j74l7L5K77kk31O6Q4l75
5699b54L52J92j41m45L10P0m45K65lK79j03R3l45L13k31J53J62j76Q0L14o22j6
5721a98L21l17Q2J66l54M09o9k3j24K75j51P6l61Q7L14p1j51R1j51J87K15N2l50
5744d5R1J78j31Q1k79J31o2M17m43K20l99K17K3l4K80k76J56j74R7k17J28jN8
5767A6k60J69J05N6k71j25L66o2k90M27l10Q4R6J47j03P4K4j32k68M52k02M3R9
5790A35k94P7L3L39l39q8j10L37J27k61K32j94Q5m8k44L78r1k37K30k98K63K1
5812E3j50J6RpR1n2j61L92k77m5o6o5J11M31k50l76M85l72J77j31N5J53K63l16
5836c2l54K60J61l1Ok03K94r3nN9k54K99k7m9j7n5N6O1q9j87K22J92l31K83n7
$$ plain form
5677 -116 64 351 113 -93 -239 -41 249 -56 292 69 -156 -43 103 -71 -108 -73 204 202 -29 37 121 -254
5699 -254 98 290 149 -296 14 84 -361 -96 -99 180 77 170 -175 138 -93 60 222 46 126 440 -182 -198
5721 -198 123 -194 -112 54 -300 109 40 17 -107 168 17 93 -268 -181 133 62 -89 2 -149 38 253 305 -45
5744 -45 46 224 93 174 -105 26 -36 381 -62 158 -241 -24 -1 -35 245 -31 125 -49 48 -169 -41 -42 16
5767 16 -244 -75 30 86 -185 -310 56 -6 -296 131 -179 -95 1 148 45 119 143 11 -257 195 -7 36 135
5790 135 -159 -82 -49 290 -49 -137 -247 90 217 -44 188 -6 79 31 -213 165 74 -163 67 -231 32 53
5812 53 -97 -81 -72 -79 12 -40 -201 191 -86 -131 -197 -262 -151 280 30 -346 139 -233 -56 -187 -132 21 284 -32
5836 -32 -386 -126 35 4 10 -193 101 8 3 62 -192 107 80 31 14 -41 15 76 -13 -200 22 214 -117 166 109
5861A09O3j83j61L55k85P7j23K40k01m8K70j29K81k64K38r6j48o7J85J68n88J21
5883a86K94k22L7R9j42j71k9N74k09n8j93M39J0l6J76k42P6kk79K18J40j85k49
5906a40K3L43n22L78J92l71K15R2m59M44l08K39J02l74K59M6J2J2m71J55L70l50
5928a13R9J90j64k25K40j39j26J22R0k79L61j03K6p5J23P2m57L20J52q6K40k32
5950C6L3pL4J90m03K43K3r5R4m48R5L21j06J86j03j00K32j45k51L30j33q6K26
5973A66n9k84k5M02j45N8j46n9J45j6R4k40N22l93P8r5Rn3j19J14M30l51P3O3
5997A69m0j17J50k6l11L16k89R1K13j56N9M1j02k41J31k44M26L47m91O0K45l57
6019a26R5j84L62k91n0K41j09k47K41j06m38Q51j94On7J70j03k26l11K49J11m
$$ plain form
5861 109 172 -11 -172 183 -102 -25 -148 92 -109 -157 113 -16 265 1 239 143 -5 -72 113 281 -307 -186
5883 -186 108 -114 -77 22 -120 -291 -320 254 45 -13 -206 233 243 207 383 141 217 215 -64 154 294 109 -140
5906 -140 -117 226 -296 82 274 -97 118 210 -249 195 -113 126 228 -146 113 159 171 183 -288 -133 237 -113
5928 -113 -14 176 12 -213 27 -112 -238 -116 -26 -305 56 -47 -21 -96 27 99 -358 -38 114 28 268 36
5950 36 69 62 96 286 -117 126 149 54 148 -300 -205 116 10 196 93 -7 225 80 -171 159 26 -60 166
5973 166 107 -177 -202 200 55 113 -33 -92 53 37 131 -109 413 20 98 3 12 -41 -160 -46 384 33 106 169
5997 169 129 12 162 136 -175 141 -148 -57 156 0 59 100 -2 -243 -112 -356 70 417 -74 -14 231 -126
6019 -126 -31 -215 147 -144 -194 47 -62 -309 -68 -174 -612 239 45 51 -6 164 61 -165 -476 -227 -116 -120
6041a20J14J08m24J68K10J8Mj74K09j42r2L50j47j95j62K26r2J75K63o93J08J96
6063i2J25K93n3j71k69M07o69L71K33o5r6P1q6k7K61l32M6%o2K40j10Q4k06K00
6087I3m8l3N6k00k2k4K25J70k4k28K85k88J8K74k25j52P0L17k63M9r8o9K53l00
6111a64J28K05l75L15l10L23o3L8k44K00J1Q0j72kJ31pj83R2K78m55J43l2n5M57
6135C39m49K91n7j19j96J10k2k34L73k13M14n53L09l1l9m8N15l2k40j24R5L88
6157D77j76j54j35J88j75J22j76Q9m24K87J51l02M10j84J84m56N42j59k13K93
6177A89k17j09k70K86J98P1p48N36J32N4K04l57K64k16R8l52K77Qp1L75k83J19
6199A88l06J82j3j85N1L23l43O0K0r6P1MJ64l45K31p9R0J39j4m11L06o9K66j01
$$ plain form
6041 -120 -6 102 -322 -154 56 74 78 -96 113 -29 -121 229 82 -113 -275 -49 -141 34 297 -396 -288 -92
6063 -92 33 326 273 102 -167 240 -429 -58 175 110 14 85 -1 -28 233 -99 -53 -53 -115 125 15 99 -107 93
6087 93 45 12 68 -132 -154 -178 47 217 193 -35 250 -38 -20 254 29 -123 -53 264 1 50 -48 -117 136 -164
6111 -164 -36 169 -206 109 -201 122 59 97 -147 53 64 144 -28 -30 101 94 -89 3 281 -174 -31 -63 -118 339
6135 339 -110 181 124 5 -191 -81 -103 -337 36 -177 237 -316 -7 -38 -77 -125 390 358 118 -6 89 477
6157 477 301 147 12 200 25 147 -29 60 -364 -77 74 -228 182 -2 182 -274 268 109 -104 189
6177 189 -28 -137 -407 -121 77 148 -600 -64 68 122 326 -31 233 17 115 -237 40 48 -23 352 69 188
6199 188 -118 64 51 -134 -83 240 -103 -43 -23 -119 -48 -44 120 -225 6 -73 17 156 142 -269 37 -32 234 133
6223A33j84J6K28j53j79M28n72M78j57l21M14k12J79k32L35Rn14N27n09M18j93
6244f1pK48j59J2J6n0j59RL3K30o6p5o7L49j72j16L9j82J58nO1L32m04J48j32
6269b0K61o1k01L40k87j3K59m10j70O08l88N3J82k72J35J23j36R7j45M36l36K79
6291C34k79j4k81J36M7K4k6J43k91K63k1P1k8J01l89L03l09M48k35k93L48n9l2
6314c9K99l22j16M34l32K39k16Q6m11M82p3K3j02r1K44j52P0K21n06P7K60m06
6336c31L61l14K08J37L9j85j4R5j10K6K49k8j69k2J14j43L36k39k1J24l31J67
6358e1R0O9j21Q7N5j78j09M5r5j64L00j28L06J02n1k42K21j97NK67k01PJ14j03
6382B8q7j05L9j30N34k51O4K65q13O13j11J95q3l8k83K18M08l54l36J70k14O4
$$ plain form
6223 133 -51 -35 193 40 -139 289 -283 195 38 -283 131 -81 98 -134 201 210 -304 223 -286 132 -61
6244 -61 -68 180 21 33 49 -1 -160 -151 -118 112 46 -29 -96 253 81 -35 4 -178 -20 -25 36 368 -36 112 -20
6269 -20 241 180 -21 319 32 19 278 -132 -302 306 -82 -29 153 -119 16 139 3 100 -45 391 55 334
6291 334 55 41 -240 -104 -57 -33 -59 84 -207 56 35 106 78 179 -210 93 -216 232 -3 -296 52 -7 -39
6314 -39 260 -62 -178 256 -76 163 -53 33 -378 104 31 54 -48 -139 105 -47 23 244 -262 -185 75 -331
6336 -331 30 -284 -76 61 100 -85 -99 -4 -114 -88 161 133 -36 -58 56 -87 249 10 -11 113 -218 -51
6358 -51 39 108 -13 74 129 -49 -158 -113 -208 -372 -72 -200 106 208 157 -85 136 -61 -56 211 10 17 131 28
6382 28 -59 -164 -125 -255 279 28 92 357 -456 157 46 241 158 120 -163 55 463 109 -227 -57 -271 -207
6404b07L49k46Nl6j3p2L02l0P1R0m47K34K3J72L7k70J62k6j35J58j83r9o3k36
6428d60J98M79l01q1L6O0K0L7j96j78L30k09K29R0k34nP5k25M46J7k31J00M2j62
6452a23o3J98j52r8Jo2M59J54o35J97O8J04k60J61J69J18k09q0rP9L05j50p1k32
6476a31j11J89L1k28K41k03J11J69p5l50K28j92M23j15o3J44j68l6L52l39J37
6497A4L9l18J25P4K86k24k90K47J00l25N19k97j33L63k16O9l2P0j90r5P0K75j85
6520e4L6J03m6n1k04K62O0J8j89j12k8M30j71k8k8k38K09o8K60k01J16j7P1R3
6544B23k61k5j3oL59j33k39J22o2l1l7r9L71k46J85r1K8J34j41p6J64L9j04K30
6568B91l72J59O9j40J25j81p3k4q3J22R8K6J72l77n1O62k90j78K12oJ4l73L93
$$ plain form
6404 -207 142 -104 -99 -135 -148 -220 82 52 123 213 -234 0 23 195 232 -38 124 98 -37 121 -62 -161 -224 -460
6428 -460 -262 217 -84 -165 -129 -69 -49 -12 -208 -386 -56 -265 -36 54 -180 -185 -110 -335 111 128 -103 -3 39 -123
6452 -123 -186 12 -140 -238 -237 -299 160 314 -321 -124 -56 48 -212 -51 118 236 27 -53 -62 17 322 172 101 -131
6476 -131 -242 -53 -22 -250 -9 -212 -101 68 -7 -357 -129 -321 102 -13 -76 68 -100 -136 216 -123 14
6497 14 53 -265 -140 -66 220 -4 -294 -47 53 -272 247 -50 -183 180 -36 33 1 71 -119 -214 -144 131 -54
6520 -54 -18 85 39 -12 -216 46 106 124 -65 -177 -205 225 54 26 -2 -240 -31 -99 161 -40 76 59 130 223
6544 223 -38 -63 -76 -82 277 144 -95 27 -35 -66 -103 -202 169 -77 108 17 45 179 38 -38 126 165 61 291
6568 291 -81 78 147 7 132 -49 -122 -146 -229 -107 -9 17 189 -188 -239 423 133 -45 167 161 175 -198 195
6591A95k00r7J7P3J04k11m5J95j83R5o2P4J11k46M6J58l54J4j7K42kJ57m5N2O2
6616A33k72Q7j3P7j11J06j29l2J08J26k34K72m33M65k86L89n03qK44K01k63J4
6638f2o2K57J02l48p8N6j71L67k07J12j53K57k14J79J2p8K47k84K18j19j29K66
6660A68rj18J13k42K49l99K07K07l53O4M00j71j67k61K12j05J27Q1l0P5k61J96
6682a7J69j24J79p5l41J78j94P3K82n2k32L1M90k62l00p3L19L8j66K21r4K83p65
6705d32N53qj52J06j80L12l09J64J5N6j35j37J86j96L60r9n3m3K21j46J50o24
6727c91L85l0J53J7o3J54j99L41l91n7KK01k2j25m6Q1jJ1j25J31K01k7j26j9m36
6752c81L33L1j56L57K6j91L7Q6m8K20m7l68o4K61p7K17k30Q1p2K8p4j3R2k53L24
$$ plain form
6591 195 -5 -102 -85 -12 92 -119 -164 31 -152 -57 -119 -45 66 -180 -134 24 -330 -316 -333 -91 -93 64 19 71 133
6616 133 -139 -52 -65 12 -99 7 -122 -154 -46 80 -154 118 -315 150 -136 253 -250 -258 -14 187 -76 -62
6638 -62 -124 133 235 -113 -191 -135 -306 61 -146 -34 -187 70 -144 35 47 -31 216 -68 150 31 -98 168
6660 168 159 41 154 -88 161 -238 -31 176 -177 -113 287 116 -51 -312 -100 -205 -78 3 -27 48 -213 -17
6682 -17 152 28 207 132 -209 -31 -225 -152 130 78 -154 -123 367 105 -195 -268 51 89 -77 144 50 333 -432
6705 -432 121 113 -39 67 -113 199 -110 54 69 125 -10 -147 39 -157 203 104 51 8 229 83 233 -391
6727 -391 -6 -36 117 134 71 225 26 367 -24 -81 -79 122 100 -25 -71 10 9 20 -105 26 227 200 74 55 -381
6752 -381 -48 -17 -173 184 210 19 56 142 94 314 267 -101 -165 96 19 236 6 87 15 43 -31 -44 48 -205 119
6777A19q8J22l10L60k42J19M1J4j59K5Q2j62N0j11k25O0J02K31Ll0P5j76L3K9
6801c8K37j97l14J53L39k31J24j02J21j83K49r3j55L18l9j54M1J0j53k12NL49
6823G5m2O2J92j5j69j69k1J00KK49l93m4J88J04n4l45M60j39q3J70q7r7K57m24
6847b23K28k0K57j05j52k6q5L07J12j25k51K59k77l24L63j17K43l00j05L77l51
6868c15N48l0k24K40k62j29K38n7J03k64K96k6Q4j41j12K04j64Q9j75K70k99J24
6890bR9m26J87J60p5K20r2L5K09q8l2N2k48J7j31j5j53M35j69M6k33j3J51k45
6914c11L94J12m45N78n05L41j09M6r2M4J83l75L36o5J5k95j58K53j13J60p5o9
6936a50L3K56j56qj18K29j80K83m73K89R2k84K63j54K64q0m13O61j09J49n31K06
$$ plain form
6777 119 31 153 -157 203 -39 80 121 135 -24 1 83 -79 -29 -140 -365 -305 -203 28 31 1 76 -100 -67 -38
6801 -38 199 2 -312 -159 180 -51 73 -29 92 -91 158 65 -90 228 189 35 76 86 -67 -279 -274 75
6823 75 33 95 287 272 103 -66 -87 13 15 264 -129 -173 15 119 65 -280 180 41 -42 128 41 -56 201 -223
6847 -223 5 -15 242 137 -15 -41 -126 181 293 168 -83 176 -101 -425 -62 -179 64 -236 -341 36 -315
6868 -315 233 203 -21 219 -43 -172 66 9 112 -152 144 118 202 61 -51 153 -11 78 -97 173 -126 -2
6890 -2 97 -329 -142 18 -57 163 71 106 315 227 195 247 -1 16 -115 -130 -283 152 -17 29 -204 -217 -66 -311
6914 -311 83 195 -250 328 -177 164 55 101 9 53 236 -139 197 132 147 -148 -306 -53 -166 -6 -81 -150
6936 -150 -117 139 -17 -25 -143 86 -94 189 -284 5 97 -187 76 -78 186 106 -307 354 245 394 -137 69
6958F9k4Q1p8j76o9J75j6O7P3q8N8j0n6K12l54K69K22j81o1k27L00l68O39l14
6982A43j73j14M24l0l84j46K74J26l92M93j47n8K6L69l80K8l36J58j10O1K47O7
7004A46l2j66l0j10L66k12m8K40lj36j99K76M2k15N8j16K97j50n9L03n09N04Q
7027B55l55L54j99K3j24K97n63L15J5o2O7j48kJ99k2n63N53P4j26n32O31j80n4
7050a47L65o2J43l64n9L5Q5N4rK5k08L69k44P1j67J50j14N0J51j77N2OP9o3Lk3
7076Ap1l3K20%l7j45J74j75J71J26k56j3j2j04P5J23K40l68rJ20J39p0J26j68
7100E4p6j04p5J94K0j02k33M71l33L81j78J00l48L60Pl33R6L70n8j71K01j01J4
7123A56n7l13M65k52k42R8L48m28L33k77K49m01P5K1O0K32q6L30n58K57L03k96
$$ plain form
6958 69 45 126 48 -128 -197 -22 -38 29 102 14 72 62 6 218 -136 133 355 174 113 -114 186 -182 457 143
6982 143 -30 -144 280 250 -134 -280 -6 120 -272 221 74 16 42 411 31 59 -277 -119 -229 -168 79 146
7004 146 114 -52 -82 -192 174 -38 -86 154 151 15 -184 92 134 -81 -23 -139 158 8 -51 252 -257 247 255
7027 255 -100 254 55 78 -46 251 -312 3 18 -44 23 -125 -127 72 50 -513 40 114 -12 -544 87 -93 -147
7050 -147 218 156 299 -65 -124 -89 -4 50 41 66 -142 227 -17 54 -113 37 -77 -27 124 -53 -1 5 84 21 24 1
7076 1 -70 -103 117 117 80 -65 109 -66 105 231 -25 -38 -50 -154 -79 44 284 -84 -93 27 166 96 222 54
7100 54 -22 -126 -201 -7 13 -89 -322 149 -184 197 19 119 -229 131 138 -195 -99 271 213 42 243 142 156
7123 156 99 -214 251 -1 -243 -145 203 -225 108 -169 80 -321 -246 -225 -165 67 -19 311 -247 10 313 17
7145A7j0l0J11oj79o8J42j00n8M8K12j73J06j36J88P9k64O8R8K37k58M39o44K75
7169I4K70l48J01J30j89N2k38J16j0j07Q7m6J2PK07rk10p3r8J48O5P2j79Q0M3
7194b3J07J97l87J28K82o04O3K82j64J30j74l9K04R2k41n9L57l21K68qk32M2J01
7217AL16l82p9J02q8M12N4j08j75jk5J57j31l6p5q6J17l7j69N15l65O1J69j91
7241d4L31k47j70N8j32J32J18J56R7m38K09R4k89K48O0k64K32qj15j45K86J23
7263B92n69M09k74L80l19M8J97m92j1L16q4Q4m0N8n4M10l49Q6k54J12J66n5R9
7286A56j9l33K79R8o13M37j61M95k12m1j53k70L35n9J00K57l72M45m30Q3j90K14
7308D6J12o2R9l12K93l2j52j08J97j89Q7J35j43P7KK16o22K44L37k90K32n5j84
$$ plain form
7145 17 7 -23 88 82 -97 -165 -23 -123 -181 -133 79 -94 12 -124 64 143 -121 -53 45 282 24 463 -181 94
7169 94 364 16 117 247 58 110 -128 -12 -22 -129 -42 -88 -76 -69 138 129 -81 -154 -252 -104 -39 33 -146 -66 -23
7194 -23 84 281 -106 22 304 -300 -237 45 -119 11 -163 -202 2 94 -147 -206 151 -170 98 90 -142 -100 1
7217 1 317 -65 -144 -42 -130 282 336 228 53 52 27 184 53 17 -58 -144 -27 -64 -233 282 -83 -22 147 -44
7241 -44 287 40 -130 -72 -204 -72 46 202 299 -139 70 164 -125 123 183 -81 151 143 28 -117 169 292
7263 292 -277 132 -142 238 -81 -33 164 -328 -339 -23 -107 -23 -63 -5 -59 351 2 88 -166 -54 112 57 156
7286 156 137 -196 83 181 -432 5 -156 339 127 86 -67 -337 -2 -61 39 296 -76 369 -61 22 -168 46
7308 46 158 96 195 -117 176 144 -8 -116 81 -108 -21 114 -29 48 50 266 -356 -112 225 -65 167 112 -72
7331g2j85R8J61K02k16l9N1Lk24L00j4rK72k78j36L98%k69j92M15m38J4M13m94
7355b39M36k34q8K76j96mJ49P6r1L6N6j04J1R9k98J21k64J22L03j57k0J9K6k13
7379a78P0m4J43l64j39O00N1p2k29K91j93J04p4n9j48M04Q4k59J7K07k12p9J53
7402G4k91L22k29J15K54l53N6J56K09l70J65j13j09K21j1k73J24L7J92J09j78
7423A07K8k49K58n2j61L88m39K5J04M7J1J42m05j31J35J08P5P1j91K35k19J41
7445B8L7k18L72l60J53%k28K35k0rj68j00j7M21q7Q6j09k7j5N1j31L14m89K96
7469A5J71k75J35RK86j14j09q5rL58l20J50m24L90P7l65J43o9J73j98oK5K38j59
7493C7p3j78P0j48M71l66K09p7K37j44l08N13k42J78Lk78J39P7o9p8P4j47J53
$$ plain form
7331 -72 -257 -159 2 204 -12 -51 0 3 -221 79 65 56 328 50 -86 312 312 43 -149 266 -172 -158 255 -239
7355 -239 197 -37 -125 151 -45 -49 100 176 85 121 177 73 84 183 -115 6 -258 -136 167 10 -10 9 35 -178
7379 -178 -108 -152 -9 -373 -512 88 139 67 -162 129 -64 40 -34 -93 -241 163 247 -12 5 212 0 -79 74
7402 74 -217 105 -124 -9 245 -108 -52 104 313 -57 108 -5 -114 107 96 -177 -53 -16 176 285 107
7423 107 135 -114 144 92 -69 319 -120 -95 9 56 67 209 -196 -327 -192 -84 -9 62 -129 106 -113 28
7445 28 65 -153 219 -141 12 12 -216 19 -1 -10 -178 -278 -295 126 39 125 16 -11 -26 25 -106 208 -281 15
7469 15 186 -89 46 55 341 227 118 33 24 382 62 212 -212 178 255 -110 33 -36 137 -61 -67 -42 196 37
7493 37 -36 -214 -144 -292 179 -187 22 -55 182 38 -270 243 1 179 182 -96 43 120 51 -27 47 -100 53
7516E3j48j29K38j87j20J48l3J14J7J75k28J05O8j75J66j17J00r2R7l7J94m9k16
7539e6K95k57Q1k21L89m86J27M05n68K35J62k61J58o6J81N8rl9j86oM34k80k71
7562a81L18l89M25j57N5j38J05O9j74M4N5N5R7l54K38M7j37J88m53N45l13p1L44
7585B18n4j59q0Q3O1j28J08j11K85o3j59j10K04j26K59k84kK78o2j87k5P3Q5l2
7609G2O5j0K6k56J13n2j99K64j91J49o5p9J50N3P6k01l12K04l6M40j8k73l6K18
7633A02k62Q8M0m6j33pO69o76K49L9j2k94K27J86j39m79M61j40N1L10k65L29m03
7656a05K63l81p8J93R2l0J90n45O96k19j40K80k19N4J23l41j61L36K02j53m6p7
7678f6n3j4K10k1k05N7J59k50K21R4j01J07l25K48n8j9k72L99J04J25k47Q7j93
$$ plain form
7516 53 -95 -224 14 -173 -293 -145 -178 -64 -47 128 -100 5 73 -102 64 -53 47 -45 52 15 209 160 -56
7539 -56 239 -18 63 -158 231 -255 -128 277 -291 -56 106 -155 3 -63 118 176 167 128 -58 -64 370 90 -181
7562 -181 137 -252 173 16 71 -67 38 107 -67 -23 32 87 184 -170 68 115 -22 166 -287 258 -55 -126 218
7585 218 164 5 -75 8 69 -59 49 -62 223 160 1 -109 95 -31 228 -56 -58 220 158 -29 -54 19 104 72
7609 72 137 127 153 -103 10 -42 -241 23 -168 -19 -84 -163 -13 40 116 -85 -397 -193 -229 211 193 -80 -116 102
7633 102 -160 -72 -32 -78 -211 -218 451 -225 24 63 51 -243 -16 170 31 -448 13 -127 -76 234 -31 298 -105
7656 -105 158 -223 -301 -108 -16 -46 144 -401 295 76 -64 216 -3 51 174 -167 -328 8 210 57 11 -66
7678 -66 -119 -133 77 56 -149 -92 67 -183 38 132 31 138 -187 61 3 -16 -288 111 215 340 93 180 -13
7701a3k1q7K07M6K1j56j87L18k94q3L66l65K58L6N1l95L59j1J94l15J27n2k2m9
7725f7j02L39l32L22M8k04J02m0k33O17o89J45j07K95J3m00K92L7J75m13J79N
7747a8pN1K27k76k1J34K8J29j98J41k03N3J67j88O6O1j45M9K1J70l35J58J18j74
7771Ho2K76o4l14P1K84J0kl93O7Q0Q7j31o9K88J67k45jl15L53j89K47j14L24m75
7796a12p6J33j69N11k21j65P1q5K71J2l58J82L05j55m42L79M0l92L40j08J70r6
7818C5L4l63N19Q9l22J00j8N1M7k68K28Q9p0l6J4K2m37P99n10o5J36k50J22j2
7842f6J33o0K18n35K23lN56n52J69j88M18m28n5K61l1j04k02J53l39M95P3k94
7864a58L05r6n2J78R7k93N16p27N5J11Q8r0J70M5l45J26Q8r9j7K67j35N0k97L98
$$ plain form
7701 -13 -34 -121 86 132 153 -3 -190 128 -166 -249 117 -248 10 46 97 -298 61 50 244 -71 56 4 -18 -67
7725 -67 -169 170 -162 160 208 4 106 66 -167 450 -239 -94 -201 94 107 -293 -1 36 211 -202 -23 -18
7747 -18 -25 26 253 -23 -44 90 118 247 49 190 -13 40 207 19 85 146 1 50 71 241 -94 64 182 8
7771 8 -54 222 158 -156 -85 199 209 207 -186 -119 -39 48 -83 -152 136 303 58 57 -258 95 -94 153 39 363 -112
7796 -112 -188 -55 -224 287 66 -99 -28 -113 158 170 -188 -6 299 144 -298 81 121 -271 69 -39 131 35
7818 35 69 -294 225 314 -8 92 74 125 172 -96 132 221 151 115 129 151 -286 513 3 -62 74 -176 -54 -66
7842 -66 67 7 225 -310 -87 -90 466 -86 83 -105 313 -115 -170 91 60 -44 -246 -93 -432 63 136 -158
7864 -158 147 51 -1 177 274 -19 497 -230 -175 -64 24 -66 104 149 -196 -70 18 -81 -98 169 34 84 -213 185
7888A85j67Q8L1m11R9K86l81J45O6N6K71q6k93n0m8L01j29J04rj93O1J16P8k01
7912h1Q6j27r5L57n5J75k16m7J23rk29M09k74k12K44j47J73j08k69N27m7j91J74
7935A61m58K92J3L9j29K9J25l8M6j01Q3Q4p8M9o2O1NJ54j72k58M12l75K17o8K0
7960E1N2k24J07Pj14J78l65N66k40J7K64l83R8l60L97q9O6j07L22k81j18J1Nj2
7984a52N1K15n5o3K04r1o2j0j39Q2K16Lk34J50k74J44l6k25N75N0j77k00J67n7
8008H2k44K0K50j8N4j85o3R2J75k21L95m26j7J20j79K12Q2J5j19n10M37O3%J30
8032A45o1j83LJ47K7m1l9l60Q2J4J29L41l47N9K50l58Jj45N91j81j19M8k74rO36
8057C56k15j13j83M02k69j25L85m50J87j26K09j51J44j9j13j40K72l7jJ06k85
$$ plain form
7888 185 18 106 137 -274 -175 111 -270 -125 -59 -3 268 182 -111 -161 -209 92 -37 67 58 -135 -74 42 120 -81
7912 -81 5 -122 -217 140 85 260 44 -3 120 111 -118 291 17 -195 49 -98 75 -33 -302 225 178 -13 161
7935 161 -297 -5 8 47 -82 -53 72 34 80 -21 62 146 68 117 55 116 121 275 103 -155 257 -118 99 31 51
7960 51 103 -121 -14 -7 -121 57 -308 258 18 35 299 -84 14 -346 51 -38 28 -79 243 -38 -156 -145 -140 -152
7984 -152 -101 114 59 -4 200 109 47 37 -102 -20 196 199 -35 115 -159 -15 -51 -276 299 349 172 -28 139 82
8008 82 -162 -142 108 90 144 -41 -104 -12 163 -58 337 -89 -106 14 -165 47 129 144 25 -485 -48 15 15 145
8032 145 84 -99 -96 51 78 37 -2 -362 -280 -266 -137 204 -143 -84 166 -192 -191 -336 255 74 -45 3 -271 -280 356
8057 356 141 28 -155 247 -22 -147 238 -212 -25 -151 58 -93 51 32 -81 -221 51 14 13 119 -166
8078a66L96J56m30J31j26K51k15l57N19k96J0m2K27N9Mj49p9J23j76J00P3j35
8100a22J25K07M0k45k6k75pL41O7j64J79j40j69K02k25J45J6k55J66j85QK65J4
8123c8O0j11K02J44j99Q2J18j78P5M7m31K86j94K61Q8k12j40l1M47n23j20J84
8145a83L13l57P9J24L3j35K60k18K54o4l5J12m14K81m8P7l10K95L02n36K15k59
8167b14K84k04L7J76M0j22L3j21J39n9J56L3k33P6j36J38K8K02Ko01J93J95p8
8190c6J77
$$ plain form
8078 -166 230 386 -44 87 -39 212 -3 -360 159 -137 -127 -169 58 117 121 -28 -107 16 -160 -60 13 -122
8100 -122 3 210 250 5 -21 -296 -303 38 105 -59 120 -20 -189 13 -212 -67 -51 -306 -140 -325 -317 -52 -38
8123 -38 22 -89 113 257 58 140 258 80 155 202 -229 57 -137 124 212 0 -140 -171 276 -247 -367 -183
8145 -183 130 -227 -148 -24 9 -126 134 -84 170 106 71 183 -231 50 2 79 -231 64 366 -170 45 -214
8167 -214 70 -134 -97 79 119 -3 30 -91 48 -11 145 178 -55 21 -115 23 51 253 255 -346 -153 42 -36
8190 -36 141
8191A41
$$ Imaginary data points
##PAGE= N=2
##DATA TABLE= (X++(I..I)), XYDATA
0@%%%qJ6j6K4l2M0m8O0q4J04j22J48j82K20k64L14l71M35n05N88o81P82q96J026
27E48j169J325j499J691j903K136k391K673k981L316l689M097m543N032n570O167
43C240o827P562q386R311j0357J1559j2945J4566j6500J8851k1780K5549l0614
56a6771L7834m9044O9037j15800M20142L98018n17278j72110J63641J83595k67127
67A34137j80669j397K29516o5145j49110K4019J40111M1707j36811R2005K71935
78D00298N2388j83281j63979K18694J20259j36181j95254K5475J50556j36692
88A52283j90347n0189Q6348j6134j70935N3827J50822P9995j56018r3012K12619
99E9259J81397j6013j72067P8181K14880l1346j85210j05059J59541J7704j83987
$$ plain form
0 0 0 0 0 -8 8 -8 16 -16 24 -24 36 -48 56 -66 82 -100 120 -144 170 -201 234 -271 317 -364 418 -478 548
27 548 -621 704 -795 896 -1007 1129 -1262 1411 -1570 1746 -1943 2154 -2389 2643 -2927 3240
43 3240 -3587 3975 -4411 4900 -5457 6102 -6843 7723 -8777 10074 -11706 13843 -16771
56 -16771 21063 -27981 41056 -74744 345398 743416 226138 54028 217669 401264 134137
67 134137 -46532 -47929 181587 116442 -32668 -8649 131462 173169 36358 128363 400298
78 400298 452686 269405 105426 324120 444379 308198 112944 138419 288975 152283
88 152283 -38064 -88253 -1905 -18039 -188974 -135147 15675 95670 -60348 -153360 59259
99 59259 240656 224643 52576 130757 345637 314291 129081 24022 183563 201267 17280
110A7280r4599O2435O9269j97960j22294J06237J43723k7376j52670J10334J90959
121A05338M0697j33687k6520K46524J14800j06217j64615Q1427J66156j18284
131B05619k10121o8889J56230J2556j98091r7600M4596Q6725r4332n2732J04521
142a11518R5940J777q2668R2501J19030m088p5774q626J47456L530j24248j07864
154e4552K9566N3437j34080r5798J6015P1131p0865j47496M0336R7996L6746q8540
166b46104R037J52831O1630l9214p7012P3028P8708l9880n2938r758O0842p4340
178a03170j20140k6012M6936J9719j21320k7928Q1846O9010m7593q5517R3541
189b20628J09850L3139m1039L2223J19994j704o3020m3213P8360N2803r1156p9144
$$ plain form
110 17280 -77319 -14884 54385 -143575 -265869 -159632 -15909 -43285 -195955 -85621 105338
121 105338 146035 12348 -14172 232352 347152 240935 76320 157747 323903 205619
131 205619 -4502 -73391 82839 95395 -102696 -200296 -155700 -68975 -163307 -216039 -111518
142 -111518 -15578 -13801 -96469 -3968 115062 110974 35200 26574 174030 177560 53312 -54552
154 -54552 -24986 28451 -105629 -201427 -185412 -114281 -185146 -332642 -292306 -194310 -157564 -246104
166 -246104 -237067 -84236 -22606 -61820 -138832 -65804 12904 -26976 -79914 -89672 -28830 -103170
178 -103170 -223310 -249322 -202386 -182667 -303987 -331915 -250069 -181059 -228652 -314169 -220628
189 -220628 -110778 -77639 -118678 -86455 33539 31835 -31185 -74398 3962 56765 -34391 -113535
201a13535j2122O5652m0936j00587j9715L9372N9774k6232J4012M5070J6765J2249
213f0233K6130J11502L2226l7832j0693N9082P5337o8186q1618j8150N0878J2807
225I1250r3151m8246j1325K0923k7122k8393M5795K3197J1838j3337N4121P3008
237I8558m736j3538N763Q1017K0719m8421l2521p049J9350n2430l4940o538j1453
250A3781k6426n1458K5704K2357r280l0061R347Q9345K8168j7398k4857M3379
262G2601O7879j3363k4148j9762K5581m543m5214k1063k6398o639l4537o647R226
275b7027k1133q578n295M7892K4035l992J2026K7584N8245n685j4782N757K4107
288A13154J4450m6709j4965n253n627l5102m6218Q371m215r951k8466L948L5486
$$ plain form
201 -113535 -125657 -60005 -100941 -201528 -221243 -181871 -122097 -148329 -134317 -89247 -72482 -60233
213 -60233 -34103 77399 109625 71793 61100 120182 195519 127333 45715 27565 78443 91250
225 91250 -1901 -50147 -61472 -40549 -67671 -96064 -50269 -27072 -15234 -28571 25550 98558
237 98558 93822 80284 86047 167064 187783 139362 106841 99792 119142 66712 31772 25234 13781
250 13781 -12645 -64103 -38399 -16042 -25322 -55383 -46036 43309 71477 54079 29222 72601
262 72601 140480 127117 102969 83207 108788 104245 59031 37968 11570 4931 -29606 -36253 -27027
275 -27027 -48160 -56738 -62033 -14141 9894 5902 17928 45512 103757 98072 83290 89047 113154
288 113154 127604 80895 65930 60677 55050 19948 -26270 -17899 -22114 -32065 -60531 -56583 -21097
301b1097o34N202L346M1967K9751J273J5284O059K0933j4073r567N247j2971j8297
315E2423m0948J202l345k7865k8219j6807K9447j205r307l382J7523L5429j909
328C037J3411J2693K2024R269j0951J4447n075n374k4955j4888M916k0305j8240
341a9991k8804M551N087j5593j176K354K8173J231K294J9584J6727J9236j3017
354B0656J0756J4182L269j0655k5147P816p983j3604k1272j4418N956j6492k748
367d9684m710R467P738o654K0678J5236J8071l155M083K5751N879J935j7706K641
381B9570N215j2970j3163k2725K029j0788j1903o046p286Q528q555Q984R522R792
395a9796J1349k146K0313J0754Q792k530l072J4260p578n166j4101m148k329j7798
$$ plain form
301 -21097 -21731 -16529 -13183 28784 58535 59808 75092 81151 102084 88011 78444 83691 70720 52423
315 52423 11475 12677 9332 -18533 -46752 -63559 -34112 -35317 -44624 -48006 -30483 4946 3037
328 3037 16448 29141 51165 60434 49483 63930 58855 53481 28526 13638 18554 -1751 -19991
341 -19991 -48795 -44244 -39157 -54750 -55926 -53572 -25399 -24168 -21874 -2290 14437 33673 20656
354 20656 31412 45594 48863 38208 13061 20877 12894 -710 -21982 -36400 -30444 -46936 -49684
367 -49684 -54394 -44927 -37189 -43843 -23165 -7929 10142 6987 11070 36821 42700 44635 26929 29570
381 29570 34785 21815 8652 -14073 -12044 -22832 -34735 -40781 -48067 -39539 -48094 -39110 -29588 -19796
395 -19796 -8447 -10593 9720 20474 29266 26736 23664 37924 30346 25180 11079 6931 4602 -13196
409a3196n251j1544L413o781p333P014J883J1800k556R341J0457M515J1491j978
423A1275Q611l151l43K492q081j548j6872l86j965q077p285j1859R636j329N08
438b8374q54J750J4776J199Q973O38N474P576k133P166p494j389m958k597O08
453C61j5330k927n571L113k377j0633M877L880J1168n928n51J4824R336M626j0814
468a946R424J2944L08q507j2054J2526J560r013j2945l441R560r853l909j312
482a6658N858J441q475J0911P735M687q966J140K0179J978o009j0725J0591Q461
496B2148j2093p354k147J1405j0104j5404K834R707L117k3081k278J9021J1700
509G471j0886k1000J4387J8247N03j7641n986K1078P67j2898j1195J1677R597
$$ plain form
409 -13196 -18447 -29991 -26578 -33359 -40692 -33678 -31795 -19995 -22551 -13210 -2753 1762 13253 11275
423 11275 19886 16735 16392 18884 10803 9255 -7617 -8003 -9968 -18045 -25330 -37189 -27553 -28882 -28374
438 -28374 -29228 -27478 -12702 -11503 -2530 -1892 3582 11158 9025 16191 8697 7308 2350 -247 361
453 361 -14969 -17896 -23467 -20354 -22731 -33364 -28487 -24607 -13439 -19367 -19918 -5094 4242 8868 -1946
468 -1946 7478 20422 20730 12223 169 12695 14255 5242 -7703 -11144 -1584 -11437 -15346 -16658
482 -16658 -10800 -9359 -17834 -6923 812 5499 -3467 -2327 17852 19830 13821 3096 13687 22148
496 22148 10055 2701 554 11959 1855 -13549 -10715 -1008 2109 -20972 -23250 -4229 7471
509 7471 -3415 -24415 -10028 8219 8722 -8919 -14905 6173 6940 -5958 -17153 -5476 4121
522D121j8494q324P469J5813j1238j9834Q019J5716N122k0475j41J8952L039j2528
536a2783j0286K0292Q860j4850j0908J0364K0936j3449j9658M322K2586N267k4818
549a4125r13J8438R945j7946j3827K3768J6043j0488k3457R746K9152m019k3902
562a585q286K9055J4117k0427j2098R845J7988j3984j2885J4531J7330q400k8163
575b962R919K6662l393l0590j1880L4099J4834k2821k6826J1416K5851j1765j8992
588f448N159K5853l337k9245J853K3713P479k9516j4086K7653J8153j8423l4441
601b5633O863K4165m638k2922m224K3974j983k4015o089K0795J3488k2628r874
614c2721K3574K3115j6338l0222J4601K8313j259k9301j239L1761O70l1400j9183
$$ plain form
522 4121 -14373 -22697 -15228 585 -10653 -30487 -22468 -6752 -1630 -22105 -22246 -3294 -255 -12783
536 -12783 -23069 -2777 6083 -8767 -19675 -9311 11625 -1824 -21482 -17160 5426 10693 -14125
549 -14125 -15038 3400 13345 -4601 -18428 5340 21383 10895 -12562 -2816 26336 22317 -1585
562 -1585 -9871 19184 33301 12874 776 10621 28609 14625 1740 16271 33601 25201 -2962
575 -2962 6957 33619 30226 -364 -12244 21855 36689 13868 -12958 -1542 24309 12544 -6448
588 -6448 -1289 24564 21227 -8018 -6165 17548 25027 -4489 -18575 9078 27231 8808 -25633
601 -25633 -18770 5395 757 -22165 -26389 -2415 -4398 -28413 -34502 -13707 -219 -22847 -32721
614 -32721 -9147 13968 -2370 -32592 -17991 10322 9063 -20238 -21477 10284 10954 -20446 -39629
627c9629K9107K5481k2976k5878J4006L6635o778l1814K376L2735J6323k1748
639G840m753K4464J1134k1930j9522K8623K6707j7515l3339N086L5699l066l3093
652F335j2473K9427K3356j8059j4593J1998J7937j2255j3423K3550K5141j0870
664E6071l1946M884L1970p00l3946j9110K8233J9632k2641k8092K946J7358j2344
677A2315j4170J4140K1130j0051l0336Q045L2909L757l3772j2720L7815K2135
689E1197k9089l9940P395K9596j0113l0703m304K7547j24l6253j4864K4633K2772
702b250k0557j9103K2144K8266q821l2540L327K9912Q125k0025q858K1930L047
715D597k7777k1106J5631K0977j5953j9779P266K0066p485k4162N671K6509J0239
$$ plain form
627 -39629 -10522 14959 -8017 -33895 -19889 16746 9968 -21846 -19470 13265 29588 7840
639 7840 3087 27551 38685 16755 -2767 25856 52563 35048 1709 6795 42494 39428 6335
652 6335 -6138 23289 46645 28586 13993 25991 43928 31673 18250 41800 66941 56071
664 56071 24125 29009 60979 60279 26333 7223 35456 55088 32447 4355 7301 24659 12315
677 12315 -1855 12285 33415 23364 -6972 1073 33982 37739 3967 -8753 29062 51197
689 51197 22108 -17832 -10437 19159 9046 -21657 -25961 1586 1462 -34791 -49655 -25022 -2250
702 -2250 -22807 -41910 -19766 8500 -321 -32861 -29534 378 8503 -11522 -20380 1550 4597
715 4597 -23180 -44286 -28655 -7678 -23631 -43410 -36144 -16078 -23563 -47725 -42054 -15545 -5306
728e306j4947K208K5521L857k5506j3831K8733K3820j9325k7563M697K4227j0255
741c670l2711m442K5821J1686k2889r053K0126J0784k0207j5101K9238L2266r051
754A2797l1476J236L2059K185l1120j6017K4018J8157k2018k5993J404J3000j1277
767c3045j7797J0928K2248j484k4501l58K5084Q291j5958o131K5873J6439j6738
780g149k0457O455J6717j2105j9386N099J9184n674l0852p131K0000J1205j5145
793c9239p374K2340J7015r887j5013J4075K4850k752j4485P238K4920k117k9848
806a0277j0320K0314J5699j8533j7188J1690J4914j0600k1884J1073K6450K766
818A4104j6002M695L0133P137k3509j1619K6739K7844j1492k4565O14J8332m402
$$ plain form
728 -5306 -20253 -18045 7476 11333 -14173 -28004 729 24549 5224 -22339 -17642 6585 -3670
741 -3670 -36381 -40823 -15002 -3316 -26205 -35258 -15132 -4348 -24555 -39656 -10418 21848 12797
754 12797 -18679 -17443 14616 16801 -14319 -30336 -6318 11839 -10179 -36172 -34768 -21768 -33045
767 -33045 -50842 -39914 -17666 -19150 -43651 -44009 -18925 -10634 -26592 -32723 -6850 9589 -7149
780 -7149 -27606 -21151 -4434 -16539 -35925 -30826 -11642 -17316 -48168 -55299 -35299 -24094 -39239
793 -39239 -46613 -24273 -7258 -17145 -32158 -18083 6767 4015 -10470 -3232 21688 19571 -10277
806 -10277 -20597 -283 15416 -3117 -20305 -8615 6299 -4301 -26185 -15112 11338 14104
818 14104 -1898 2797 32930 40067 16558 4939 31678 59522 48030 23465 24079 42411 38009
831C8009k3460m029J3839M884j4201l346J2742J291j5383m915K5683K1476j0619
844D1971j7293R254K3041m573k1134q57J9861N995k2360j3517P866M371j8329
857A4296j6566J5427J8200j0168k3556K866K4294L803j6017l481K3507J4133j5015
870C1723j3779P430J2314j1800j4991P578J1491j0735k5314k347J5720k53j9292
883a2255n840K2111J2127j6281j5151J4570K3069m964j5211N983K0522J15k3075
896E720p959J3284P032j7378j3509R382P515j3772j8635P018J7275k823j2993
909a9843K629J9883L922j4816m177J7775J3066j2643j0841Q899J0239j1937j9680
922a7524L375J4072l725k0438n788J6129L628j6097r155J6800J6268p338j1089
$$ plain form
831 38009 14549 10520 24359 29243 15042 11696 24438 25729 10346 5431 31114 52590 41971
844 41971 24678 33932 56973 52400 31266 30409 50270 56265 33905 20388 28254 32625 14296
857 14296 -2270 13157 31357 21189 -2367 499 24793 28596 12579 9098 32605 46738 31723
870 31723 17944 25374 37688 25888 10897 18475 29966 19231 -6083 -8430 7290 7037 -12255
883 -12255 -18095 4016 16143 -138 -15289 -719 22350 17386 2175 8158 28680 28795 5720
896 5720 -2239 11045 18077 699 -12810 -3428 4087 -9685 -28320 -21302 -4027 -6850 -19843
909 -19843 -17214 2669 6591 -8225 -12402 5373 18439 5796 -5045 3854 14093 2156 -17524
922 -17524 -14149 -77 -3802 -24240 -30028 -13899 -10271 -26368 -35523 -18723 -2455 -9793 -20882
935b0882Q735J7200k466j4532L143J6732L233j9200r234J1101N582j5328j5218
948c1134Q169J2870o221j6019P84J5551K520j0430Q81J6914R059j0735m966J1474
962a283J0514q394j1579O600J0449n749j7314k595J1545q64j4015m585J4215P050
976f005j2012p215J2260J5581m231j0870O852J7339K053j5181l297J2338N736
989A3348j0810j0783N570N640p247j1791J918R183k508q550J901J2057K646q296
1003g722M82J1810Q340o250n939P610P956n317j1735P32R091l033j2705m715R065
1018b330J914j0249o561Q077J0081m510p123M675J1882J363p707J213R081K831
1032A2637p306l849N327J157p463o715K414M180o237q322J558P650j068p114Q22
$$ plain form
935 -20882 -12147 5053 2587 -11945 -8802 7930 11163 -8037 -17271 -6170 -588 -15916 -31134
948 -31134 -22965 -10095 -16316 -32335 -31551 -16000 -13480 -23910 -23029 -6115 2944 -7791 -12757 -1283
962 -1283 9231 837 -10742 -4142 6307 558 -16756 -19351 -7806 -8670 -22685 -27270 -13055 -6005
976 -6005 -18017 -25232 -12972 2609 -1622 -12492 -5640 11699 13752 -1429 -4726 7612 13348
989 13348 2538 -8245 -2675 2965 -4282 -16073 -14155 -4972 -7480 -16030 -14129 -2072 574 -7722
1003 -7722 -7240 4570 12910 6660 721 8331 16287 10970 -765 -33 9058 6025 -6680 -11395 -2330
1018 -2330 -416 -10665 -17226 -9149 932 -3578 -10701 -6026 5856 7219 -488 725 9806 12637
1032 12637 5331 1482 6809 7966 503 -6212 -3798 382 -5855 -14177 -12619 -4969 -6037 -13151 -12329
1047a2329Q850N457m911k215O669O518k118n858K755N369k023p547k563M650j164
1062d60o469m295L178L116m409k641L242N368k12k811M569N959Q56l614J565N472
1078H414J188n035l710L753K086m671o030K90L870j349m313q47L698K916j513
1093a253k64L216M453O89q79L078K559J52k301K96J724j522k119k449L25m43k353
1110B909j523J42Q50q83N56K345J991O07l70K749L350J176j538k96J893J148j364
1127A3742l250q72N98j567j728j767r81j6K58K24o99J796J056Q74J332J014J899
1144A1913P63K22j215J007J304j522k841j321N46j32k719k101l87Q07q12j066
1160B446P0J598J060p73J429J953M54n17L86J352K75j385j400R8j57k851k368
$$ plain form
1047 -12329 -3479 1978 -2933 -5148 1521 8039 5921 63 2818 8187 6164 -1383 -3946 704 -460
1062 -460 -6929 -11224 -8046 -4930 -9339 -11980 -8738 -3370 -3582 -6393 -1824 4135 4991 1377 2942 8414
1078 8414 9602 4567 857 4610 6696 2025 -4005 -3715 155 -1194 -5507 -6354 -2656 260 -1253
1093 -1253 -1517 1699 6152 6841 5962 9040 11599 11751 9450 9746 11470 9948 7829 5380 5705 5262 2909
1110 2909 1386 1528 2378 1495 2051 4396 6387 6994 6624 9373 12723 13899 12361 12065 13958 15106 13742
1127 13742 10492 9620 10218 8651 6923 5156 4175 4159 4417 4641 3942 5738 6794 7668 9000 10014 11913
1144 11913 12676 12898 11683 12690 13994 12472 9631 8310 8856 8724 6005 3904 3517 4324 3512 2446
1160 2446 2516 4114 5174 4401 5830 7783 8237 7720 8106 9458 9733 8348 6948 7046 6889 4038 1670
1177A670L9Q16k435l907J300K937J65l798j104M343L261j793l900K399M285r43
1193C335l719p17K445j72m238k461J488J072m319l565J639K509j669l929J449
1208a0852L422P1k408M34L689K72k844o08L578J830n041l423K767L335l535n525
1224a4838M47M329l67n150j734M679L323l999k667M568N138k163m533K045O174
1239d748K5m609j291L977J517m482k355L189K139m188k966M152M112l367m983
1254a3878K903P667N20n946j016P311L789n325l245M936M824l689n141K743N515
1269A968k482p565M75P757K340p540m038O497N356l523m788L218O403p02m636
1284a260J315N150k53n892K84O164J514p303l867N422M549m754n969L445O359
$$ plain form
1177 1670 1709 2525 90 -3817 -2517 420 585 -3213 -4317 26 3287 1494 -2406 -7 4278 3335
1193 3335 -384 -1101 1344 1172 -3066 -5527 -4039 -2967 -7286 -10851 -9212 -6703 -8372 -12301 -10852
1208 -10852 -7430 -7359 -9767 -9333 -5644 -5372 -8216 -8824 -5246 -3416 -8457 -11880 -9113 -5778 -9313 -14838
1224 -14838 -14391 -10062 -10429 -15579 -17313 -12634 -9311 -13310 -15977 -11409 -6271 -8434 -12967 -10922 -4748
1239 -4748 -4723 -9332 -10623 -6646 -5129 -9611 -11966 -8777 -6638 -10826 -13792 -9640 -5528 -8895 -13878
1254 -13878 -10975 -3308 -2788 -8734 -9750 -2439 1350 -3975 -7220 -2284 2540 -1149 -6290 -3547 1968
1269 1968 -514 -8079 -7604 153 2493 -5047 -9085 -2588 2768 -755 -5543 -2325 4078 3376 -1260
1284 -1260 55 5205 4952 -940 -656 5508 7022 -281 -4148 1274 5823 1069 -4900 -1455 4904
1299D904j446o829O28P648J035o370p62P428M195o762n070M913O178l040p414
1314g64J931O960j017p733j511P308J715o565l028O723N329n128o289M072Q054
1329A0057j067p320Q02P569N96q196j738P374L295p104n879O151O482n133r372
1344c483K607R622R47q062k561P336L540n900l652N576N044m836n024L818N889
1359A0861m000q103J477Q608j50q216l035O067L294o473l692N884N207m598o297
1374c166M100P264k889q864J902R802J584r858n590P724N607o651q012M630R047
1389F630l025j0267L58Q392J470q039k120Q102M746o703o528N321P272l807o903
1404e101L272P276k487q606o57P850J518p689k587O821M965o891o624N101P741
$$ plain form
1299 4904 3458 -3371 -2743 4905 5940 -430 -1192 6236 10431 3669 -1401 3512 9690 6650 -764
1314 -764 1167 8127 7110 -623 -2134 5174 6889 324 -2704 4019 9348 4220 -2069 2003 10057
1329 10057 8990 1670 2472 10041 10637 2441 703 8077 11372 4268 -1611 4540 11022 5889 -3483
1344 -3483 -876 8746 9693 1631 -930 6406 9946 4046 394 5970 11014 6178 1154 4972 10861
1359 10861 6861 -1242 235 8843 8693 477 -2558 3509 6803 330 -3362 2522 7729 3131 -3166
1374 -3166 934 8198 5309 -3555 -1653 8149 9733 -125 -5715 2009 7616 965 -7047 -2417 6630
1389 6630 3605 -6662 -6304 2088 3558 -4481 -6601 1501 6247 -456 -6984 -1663 5609 1802 -5101
1404 -5101 -1829 5447 2960 -5646 -6303 1547 3065 -4624 -7211 -390 4575 -2316 -8940 -3839 3902
1419C902k614p170K888Q081j160q836j193R902K962q375n092P357O606o495r312
1434h549L839R221j511p683m70P721J385p750k819Q484N446o569o061N763P065
1449G512m812q862K610R728L85r464k959P366L355p453m755O549O727n106o846
1464f025L005P510j951q162J265R257K293r035l918O706M528o249n478N377O542
1479E665m164q158J117Q025o74p998J88Q307K973q509m367P101N545n388o186
1494f523M823P947l311r348K7Q977J484q727k102P021M439p226n859M724O834
1509C180k947o777L111P746j197q989q60R101K657p512l746O543N109o515p131
1524h227L877Q036j875q013R20P511M23q318k154P839M907o083n352M590O525
$$ plain form
1419 3902 1288 -5882 -2994 5087 3927 -4909 -6102 3800 6762 -1613 -6705 652 7258 763 -8549
1434 -8549 -4710 4511 3000 -4683 -5153 2568 3953 -3797 -6616 1868 7314 745 -5316 447 7512
1449 7512 2700 -6162 -3552 6176 6561 -2903 -5862 1504 4859 -2594 -7349 -800 5927 821 -6025
1464 -6025 -3020 4490 2539 -5623 -4358 4899 7192 -1843 -5761 945 5473 -776 -6254 -877 5665
1479 5665 1501 -6657 -5540 2485 1811 -6187 -5999 2308 5281 -3228 -7595 -494 5051 -337 -6523
1494 -6523 -1700 6247 2936 -6412 -6385 2592 4076 -4651 -6753 268 4707 -2519 -8378 -3654 3180
1509 3180 233 -6544 -3433 4313 3116 -5873 -6733 2368 5025 -2487 -6233 310 5419 -1096 -8227
1524 -8227 -4350 3686 1811 -6202 -5282 2229 2652 -5666 -7820 19 4926 -1157 -6509 -1919 4606
1539D606l894p734K372Q066J84p731j890O725J684o454l671O213N183m578n984
1554f903L188O483k628o783K040Q071L5p375j836O399K804o206m735O275N844
1569D673m601p563L054P544j371p516j4Q208J943o697m143O105N241m378n783
1584e298L733O901k098p354N02O485J022n845k007O156K646n256m423M839N215
1599E218l531n114L554O022j924o389O08O403J704o132k802N865L947n635n299
1614c505L909O198k101o480J003O217N26n891j786N553L337m277m021L811M395
1629F888l225n101J969N307r44n582m56M902R95n532k116N750K695m434l711L704
1645A109M419l112n062J934N815n44n747j233N348K010n040l570M121M036l353
$$ plain form
1539 4606 712 -7022 -4650 3416 3600 -4131 -6021 704 2388 -4066 -7737 -1524 3659 -919 -6903
1554 -6903 -3715 2768 140 -6643 -4603 3468 3503 -3872 -5708 691 3495 -2711 -7446 -1171 4673
1569 4673 72 -7491 -4437 3107 1736 -5780 -5794 2414 4357 -2340 -6483 -378 4863 485 -5298
1584 -5298 -1565 5336 3238 -4116 -3614 2871 3893 -1952 -3959 2197 4843 -413 -4836 3 5218
1599 5218 1687 -3427 127 6149 4225 -2164 -1556 4847 6551 419 -2383 3482 7429 1794 -3505
1614 -3505 404 6602 4501 -1979 -976 5241 5767 -124 -1910 3643 6980 2703 -1318 2493 6888
1629 6888 3663 -1438 531 5838 4894 -688 -1144 3758 4753 -779 -2895 2855 5550 1116 -2595 1109
1645 1109 5528 2416 -2646 -712 5103 4559 -1188 -2421 2927 4937 -103 -3673 448 4484 1131
1660A131m841J733M557q43m535o1M813J480m247k393M182K742l745k771K676L503
1676C381k212m025J134L699n51m227m89M564J186m347k202M262L133l129l092
1691b915K435M113j074m467J04M704O05m327j551L817K001l681k936K726L271
1706B825j413m004R60L844K03l318p01L749J386l017j604K809J802k599k589K241
1722E74K709j547l621O83L230L36m049r34L739J829k835k148K276L156j318l031
1738i51O63L590m21l033q27L195N26k912j582K059J273j355k254J335K118j054
1754C70j943L96K928l06j974r6K330J121k247j855K285J549j788k360R83K237
1770A630q81k842l46K641P12k261j217J852J941j222j601Q43K155J36k298j36
$$ plain form
1660 1131 -3710 -1977 2580 1737 -2798 -2859 1954 3434 -813 -3206 976 3718 -27 -2798 -122 3381
1676 3381 1169 -2856 -1722 1977 1426 -2801 -3290 1274 2460 -1887 -4089 173 3306 177 -2915
1691 -2915 -480 3633 2559 -1908 -1804 2900 3505 -822 -2373 1444 3445 -236 -3172 -446 2825
1706 2825 1412 -2592 -1632 2212 2415 -903 -1604 2145 3531 514 -1090 1719 3521 922 -1667 574
1722 574 3283 1736 -1885 -1202 2028 2364 -1685 -2619 1120 2949 114 -2034 242 3398 2080 -951
1738 -951 -288 3302 2881 -152 -979 2216 2742 -170 -1752 307 1580 225 -2029 -694 1424 370
1754 370 -1573 -1177 1751 1445 -529 -625 1705 2826 579 -1276 1009 2558 770 -1590 -607 1630
1770 1630 749 -2093 -2439 202 914 -1347 -2564 -712 1229 7 -1594 -751 1404 1540 -758 -894
1786h94J808j0j853m22O34R31j352j614J178L92o13j309Q25J221m11j523O11J513
1804h88K76j420m06J451P73j447j579J240P16r75j962M18J020k24j150o90J130
1821c717N40k67p07M14J240n11o57P18N48Mo79k35Q77m28l60q60R52L3n87p30
1841d412M80K75o9j81O45M85K01J44P7M92Q07j49J09L07K98ql24N07m89K04l5
1862f36K2j90O3Q28k38N11p8P38O34l8N16K18P74q3k79M87L42r5l29l34l8J37
1884B932P0l20q9K77J65k76J64P32k12k01O16N63N41j017k70P02P54q11j429L84
1904C275O64r80r26k34R22m5j002m74R24Q02j080q03J236P03n83j070P34Q80l56
1923B587j343n14J426N6j651q52P39J095j656j327R16J341m37j373N28J510M87
$$ plain form
1786 -894 914 904 -949 -1371 -737 194 -1158 -2772 -1594 -1202 -1815 -3124 -2299 -1078 -1489 -3012 -2401 -888
1804 -888 -612 -2032 -2438 -987 -214 -1661 -3240 -2000 -1284 -2259 -4221 -3803 -2783 -3007 -4157 -4847 -3717
1821 -3717 -3177 -3444 -4151 -3737 -2497 -3008 -3665 -2947 -2399 -2395 -3074 -3309 -2432 -2860 -3220 -4080 -3128 -3095 -3682 -4412
1841 -4412 -3932 -3657 -3726 -3907 -3262 -2777 -2576 -2432 -2355 -1863 -1056 -1205 -1096 -789 -491 -499 -823 -316 -805 -601 -636
1862 -636 -614 -804 -741 87 -151 360 282 1020 1654 1616 2132 2350 3124 3041 2762 3249 3591 3496 3167 2833 2795 2932
1884 2932 3002 2682 2593 2870 3035 2759 2923 3655 3443 3242 3858 4421 4962 3945 3675 4377 5131 4320 2891 3275
1904 3275 3939 2959 2033 1799 2721 2676 1674 1200 2124 2926 1846 1043 2279 2982 2399 1329 2063 2943 2587
1923 2587 1244 730 2156 2212 561 -291 448 1543 -113 -1440 -524 817 380 -993 -465 1045 1532
1940A532j381k74J539Q93j388j003J087J186j101j512K60J374j98j771j61J182
1956B64R31j042n77J109J278j288r64J695J388o37j980Q74J640j12k212o19J987
1973A735M64k445j418J724J201j253j947R09K088j46k275J44J998J125k313j329
1989a738J294J528j332j871N48J655r51k133Q7J541J57k349k91K082M06j719j058
2006d144K009J385j433j612J153K071q86k301m9L310k23l226o43K170J630k199
2022b988k156J863K627o66k190K31K916Q58k609p24L055J234k039j343J899K180
2038B148j321k126P73K026J04k675N06K315O35k515n52K664J443j989j465K051
2054B022K385j144k996J013K873k62k974o62K663Q07k696j945K158K194j774k760
$$ plain form
1940 1532 151 -123 1416 2309 921 -82 1005 2191 1090 -422 -162 1212 1014 -757 -918 264
1956 264 1195 153 -424 685 1963 675 -289 1406 2794 2157 177 1051 2691 2579 367 -252 1735
1973 1735 2199 -246 -1664 60 1261 8 -1939 -1030 1058 912 -1363 -1219 779 1904 -409 -1738
1989 -1738 -444 1084 -248 -2119 -1571 84 -867 -3000 -2913 -1372 -1215 -3564 -3855 -1773 -1367 -3086 -4144
2006 -4144 -2135 -750 -2183 -3795 -2642 -571 -1457 -3758 -3807 -497 -720 -3946 -4589 -2419 -789 -2988
2022 -2988 -5144 -3281 -654 -1320 -3510 -3279 -363 495 -2114 -2838 217 1451 -588 -1931 -32 2148
2038 2148 827 -1299 -526 1500 1604 -1071 -565 1750 2385 -130 -682 1982 3425 1436 -29 2022
2054 2022 4407 3263 267 1280 4153 3891 917 255 2918 3725 1029 -916 1242 3436 1662 -1098
2070a098J092L200p69k912l55L160L58k752j007J953J280k375k420J483K196j797
2086g63k669Q57K380o62l046k07K606J271k966j443K594K316k263k552J264L031
2102b52r37l276J32L071L26l096j478K587K140k159k478J959K642q64k713J192
2118c204L237Kk676l08L003J162k677j545K567K034k128k496J647L084r96l125
2134b419O25L739L35l500n68L417J996k381k151K091L172j640k985O05L394j38
2150C592l113j127K713J531l062j622K486K124k033k051J327K693p96k697N97
2165E62K969J49l128n98K723J075k845k108K171K182k322l009J396K982l40l403
2181a544k11L284J641l125j678K926K210k179k273J473K831r24l179k83K859K43
$$ plain form
2070 -1098 -6 3194 2425 -487 -842 2318 2676 -76 -1083 870 2150 -225 -2645 -1162 1034 -763
2086 -763 -3432 -2575 -195 -857 -3903 -4110 -1504 -233 -3199 -4642 -2048 268 -1995 -4547 -3283 -252
2102 -252 -1189 -4465 -4333 -1262 -936 -4032 -5510 -2923 -783 -2942 -5420 -3461 -819 -1683 -4396 -3204
2118 -3204 33 35 -2641 -2949 54 1216 -1461 -3006 -439 1595 -533 -3029 -1382 1702 706 -2419
2134 -2419 -1794 1945 2280 -1220 -1788 1629 3625 1244 -907 1184 4356 2716 -269 336 3730 3592
2150 3592 479 -648 2065 3596 534 -1088 1398 3522 1489 -562 765 3458 2662 -35 562
2165 562 3531 3680 552 -46 2677 3752 907 -1201 970 3152 830 -2179 -783 2199 1859 -1544
2181 -1544 -1755 1529 3170 45 -1633 1293 3503 1324 -949 524 3355 2431 -748 -1031 1828 2071
2197B071k890j114K464J913k836j638K142K455j745k401J568L234l36k772l88
2212b73L013J098l158j665K809J612k334k355J218K566j081l025L32L427N9k719
2228d76r83L115J832k365j491J580K322j310k673O31K483l91k902p62K807L76
2244A793k806j213K157J978k020j980J519K944j233k657R08L137O9l251o24K866
2260A587P75k541k146J658K193j823k568Q46K464k08k744k38K956P19k235n98
2276a903K517J309j265k163J740K160j276k494K47K457n44k651o79K335P60k106
2292a556j710K029K232j340k107J201K871l08k539L05K559N65k164j283J674J326
2308A755k017j917P96J802j258k064Q21K238l35k203j69K788J148k003o47J820
$$ plain form
2197 2071 -819 -1933 531 2444 -392 -2030 112 2567 822 -1579 -11 3223 2887 115 -273
2212 -273 2740 3838 680 -985 1824 3436 1102 -1253 -35 2531 1450 -1575 -1243 2184 2243 -476
2228 -476 -1459 1656 3488 1123 -368 1212 3534 2224 -449 182 2665 2274 -628 -1390 1417 1793
2244 1793 -1013 -2226 -69 1909 -111 -2091 -572 2372 1139 -1518 -610 2527 2596 -655 -1279 1587
2260 1587 2362 -179 -2325 -667 1526 -297 -2865 -2019 445 237 -2507 -2745 211 930 -1305 -1903
2276 -1903 614 1923 658 -1505 235 2395 1119 -1375 -1128 1329 785 -1866 -2545 -210 550 -1556
2292 -1556 -3266 -1237 995 -345 -2452 -1251 1620 1312 -1227 -922 1637 2202 38 -1245 429 1755
2308 1755 -262 -2179 -1383 419 -839 -2903 -2082 156 -179 -2382 -2551 237 1385 -618 -1265 555
2324E55J719j770j799J026K094p62k624n73K429K08k279j324J953J476j529j502
2340b702J404J886n26j625P41K242j64j619l76J881P18j997j405J266J182j748
2356h42j658O57J425q10j589M00K130K73j791j96J939J440j328j335J618J182
2372A515o11k126N8J533k51j944p29J361M75j788j042J267J443j024j013J329
2388a547J536O8j748O29J585L52j614k18J276M98k048j035M97J605j484j629P58
2405b519J462j58j406l68K561N92j183o50J965Q57q06j042M42J499p11j427JR45
2423E4m1j567p27J144N28r72n06R39J163o64o57J018J124J30o51n3J017P14j446
2442E47p55J244K76j192j128Q53R90r88j127j09J953p7p89J9J378O75m00r2R07
$$ plain form
2324 555 2274 504 -1295 -269 1825 1063 -1561 -2134 295 503 -1776 -3100 -1147 329 -1200 -2702
2340 -2702 -1298 588 62 -1563 -822 1420 1256 -363 -739 1142 1860 -137 -1542 -276 906 -842
2356 -842 -2500 -1843 -418 -1228 -2817 -2417 -287 -14 -1805 -2001 -62 1378 50 -1285 333 1515
2372 1515 904 -1222 -1164 369 118 -1826 -2555 -1194 -719 -2507 -3549 -2282 -839 -1863 -2876 -1547
2388 -1547 -11 57 -1691 -1062 523 875 -739 -957 319 817 -1231 -2266 -1769 -164 -1648 -3277 -2519
2405 -2519 -1057 -1215 -2621 -2989 -428 164 -1019 -1669 296 1153 347 -695 -253 1246 535 -892 -891 54
2423 54 13 -1554 -2281 -1137 -609 -1581 -2087 -1148 15 -649 -1306 -288 836 966 315 262 1279 1993 547
2442 547 -208 1036 1312 120 -1008 -155 835 -153 -1280 -1389 564 487 -302 -283 1095 1770 1370 1278 2185
2461B185N81o0r32L0Q88j04j238J85M48j12o23m37M42L92N5n56J074N73K30n96
2481B425Q69J107r8p67N82N13K5q49o42N99J12o01r88K63Q08m09o50l9N36M12
2501C208k75o1O17M35K20m62K08M88o08n66k47L2m89p91k06l81m9o53o72O11o3
2522B96k6l95K61O41j13n14K62L63j90l48m40l78L07o55o29k99j17j63p29qj80
2543c054K56j97p0L42M32L4J55L19P8j07j31P13j42n54K28Ll8q97q0r2j19J10
2565b811j63K41L56L31j21K47L65O19M11l49M66K42l42M80n89k80k54M8k81m2
2585a426o03k39K79Q0m67K55L09j6L7J03K12M36nl24J64Jm68l37l74K5k98m98
2607c154n09k52M6O4m56K38K72l10j12J59O75j34P4L33N04N9l15n38O60J54o55
$$ plain form
2461 2185 2766 2706 1774 1804 2692 2588 1350 1535 1983 1871 1248 811 1253 1645 1700 1144 2218 2791 3021 2425
2481 2425 3294 4401 4303 3536 4118 4631 4656 3807 3165 3764 3876 3275 2287 2550 3358 2949 2299 2260 2796 3208
2501 3208 2933 2872 3489 3924 4144 3682 3890 4378 3770 3204 2957 2989 2500 1709 1503 1122 1073 420 -252 359 296
2522 296 270 -125 136 777 664 150 412 775 585 237 -203 -581 -274 -929 -1558 -1857 -1974 -2137 -2866 -2874 -3054
2543 -3054 -2798 -2995 -3065 -2723 -2291 -2257 -2102 -1783 -1705 -1812 -1943 -1230 -1372 -1926 -1698 -1695 -1733 -2630 -2710 -2802 -2921 -2811
2565 -2811 -2974 -2733 -2377 -2046 -2167 -1920 -1555 -936 -525 -874 -408 -166 -508 -28 -617 -897 -1151 -1103 -1384 -1426
2585 -1426 -2029 -2268 -1989 -1909 -2376 -2121 -1812 -1828 -1791 -1688 -1476 -1040 -1045 -1369 -1205 -1204 -1672 -2009 -2383 -2358 -2656 -3154
2607 -3154 -3663 -3915 -3869 -3805 -4261 -4023 -3751 -4061 -4173 -4014 -3339 -3473 -3399 -3066 -2562 -2503 -2818 -3356 -2696 -2542 -3197
2628c197m76J89O51m54m77K25P24L70k37M75P32N00L29k42J363K86J63KJ68N75
2648A669m4k80LP15K08o25j11J031P2J24l91J030N33J44k63Q45O06L46l57k40
2668E015J134l7m11p15K22M52j53j102J04M99l92q99m7P11J69p30l11J017K57
2687D783n40l38J31O00o27r66n8J70l76q89n36M90l21p06j068M62J87l45o38K77
2707c08M52j47o56J07P30k8q40k40N41L00o69p88K02K45o03m52J30N57j01q61
2727b429k0J028N68o83k82R79J089n57o36M41Q73k88q88l41J389q4q19n72R17
2746c15N74j018m62N85R91j95p67K84J128L5r20j47J217K81j077k31O27N02j099
2765gp66K06P47n33r04o3J134Lj353k31J222L66p30r49R07P92n98p88O5J048l02
$$ plain form
2628 -3197 -3673 -3484 -2833 -3287 -3764 -3539 -2815 -2445 -2682 -2207 -1475 -975 -646 -888 475 761 924 926 1094 1669
2648 1669 1625 1345 1348 2063 2271 1646 1535 2566 2638 2762 2371 3401 3934 4078 3815 4660 5266 5612 5255 5015
2668 5015 6149 6112 5701 4986 5208 5660 5507 4405 4509 5008 4616 3717 3670 4381 4550 3820 3509 4526 4783
2687 4783 4243 3905 4036 4636 4009 3043 2985 3155 2779 1890 1354 1844 1523 817 -251 211 398 53 -585 -308
2707 -308 144 -3 -659 -552 178 150 -690 -930 -389 -89 -758 -1546 -1344 -1099 -1702 -2154 -2024 -1467 -1568 -2429
2727 -2429 -2449 -1421 -853 -1536 -1818 -839 250 -307 -943 -502 371 83 -805 -1146 243 159 -660 -1232 -315
2746 -315 259 -759 -1221 -636 355 160 -607 -323 805 840 -80 -227 990 1271 194 -37 590 1092 -7
2765 -7 -773 -567 180 -353 -1257 -1320 -186 -183 -1536 -1767 -545 -179 -909 -1858 -951 -159 -757 -1545 -1480 -432 -734
2786g34r73n22J017J0p40o73R90L75p16p13K47J174j17q56L02J211Lj110j53R63
2806a015O25r85o30J116P11j031j043P78J082j68j194K75J655L1j125m02R88J280
2824I48n74j242J025Q47j03j310N58J084j95o28m55Q99M65j079m14J246K51m89
2842H34o31N91Q39j84j096n4J290N78j471m78J301K0p14p04M28J343q10j026J62
2861B18J005k29j104r7Q12Q28o87j149P06R22o38o84J62R87l69q57j19R12J31
2880G50j211p3P61N38p65j063Q79Q18r93p63M44J115K38j533o9J262K41r68p97
2899a189Q47Q88o15j285M09J072J80j203nR85K64r15r64J200O44m99j307Q95Q18
2918B20q27p39M35P38P4q46o2J102K48j127l04M58J159n95j080L72P47J43j427
$$ plain form
2786 -734 -1707 -2229 -1212 -1202 -1942 -2615 -1625 -1250 -1966 -2679 -2432 -1258 -1375 -2231 -1929 -718 -715 -1825 -1978 -1015
2806 -1015 -390 -1375 -2005 -889 -178 -1209 -2252 -1474 -392 -560 -1754 -1479 176 207 -918 -1320 -332 948
2824 948 374 -868 157 1004 901 -409 149 1233 1038 410 -45 854 1319 240 -174 1072 1323 834
2842 834 203 794 1633 1449 353 299 1589 2167 696 218 1519 1539 825 121 549 1892 1082 56 218
2861 218 1223 994 -110 -207 605 1433 746 -403 303 1225 587 -97 65 1052 683 -174 -293 619 750
2880 750 -461 -534 227 765 0 -1063 -184 634 -359 -1122 -678 437 675 -858 -927 335 576 -392 -1189
2899 -1189 -342 546 -69 -1354 -945 127 307 -896 -901 84 348 -567 -1531 -331 313 -186 -1493 -598 220
2918 220 -607 -1346 -911 -173 -99 -945 -1007 95 343 -784 -1088 -630 529 -66 -1146 -774 -27 116 -1311
2937a311L30J147K96q14p96J274M55p42n68L58Q33l11q34M70N64L72q11l74Q10
2956C48O95j190j42R41K38l47j162Q87O80r6r99j16J187K26j008j00Q81P50r99
2975F74q01N99O15l01r03J98J266k16j400J69O34L60r81l51R17K98l76n74K0J065
2995I12l01r68L57O67J91j115j94L86O04n08p47O83O81r73j026M57R42j52p73
3014h77J37J071r5r83o9J095K49m11n85O60K67j84q15K73O92J76j087J20O91N41
3034H66j244m26P09R89n06l58K00R61k52r69M08R23R5p74k95M44P34o18r06M67
3054D48P23l53o12L2Q30K91j179J74N19O75n75l30R3O88J24j108M49L04J12p76
3074E29mL34k0o58m78O73P4k79l72M09N56j04l62L34O10l10n78L8K86N58n35n75
$$ plain form
2937 -1311 -981 166 462 -352 -1148 126 581 -161 -729 -371 462 151 -683 -213 351 723 -88 -462 348
2956 348 1043 -147 -289 652 890 543 -619 268 948 852 -147 -263 924 1150 142 42 923 1673 674
2975 674 -127 472 1087 786 -117 81 1347 1131 -269 -100 534 894 -87 -438 479 777 401 -173 -153 912
2995 912 611 -357 0 667 858 -257 -451 -65 539 31 -716 -33 648 -325 -1351 -894 48 -104 -877
3014 -877 -740 331 236 -747 -816 279 528 117 -468 192 459 275 -540 -267 425 601 -486 -366 325 866
3034 866 -378 -804 -95 894 388 30 230 1191 939 -30 378 1301 1396 622 327 771 1505 887 -19 448
3054 448 1171 818 206 238 1068 1359 180 354 873 1548 973 643 736 1424 1548 440 889 1193 1305 529
3074 529 525 859 839 181 -297 376 450 171 -201 208 764 660 298 632 1242 932 354 392 678 1236 701 126
3096A26J61N92n28j136N00M62l15j98k24Q69J24n09l36O78J68m12j2j6M99k51
3116B42o02k52N69k57p59j48N27L86q51o63Q35L27k15o64J76L39L02o37j3K89
3136a069J83m79j83K76k3l17p37L99L51k70p60J55L20J20n13j81Q86m10J59l71
3156b464N58M02p3n31j87J028k86n45Q3O18m84j56k61K84M50n26j44K32Q84j33
3176a251k24N09Q3L77k96K04L71M19o1m6k81R7J27n92M90p1o4j51L16J68K13m23
3198h6L7M98J28K44l4M6O25j20m71J3L75m39K14m63L31o3m34j97J55k31N05j51
3220D82k7L25RK5M8MK28j46Q5p8K51k35k08O1k55k77mj41N21j3n64J54M88J67
3244I00kl35O01k1M66J67l43O69j75j6j77J48j08J09q3l01K75J29j99k8L91J67
$$ plain form
3096 126 287 879 351 -785 -285 177 -138 -336 -560 309 433 -76 -412 266 434 22 10 -6 493 242
3116 242 -360 -612 -43 -300 -1059 -1207 -680 -294 -1145 -1808 -973 -646 -861 -1525 -1349 -1010 -708 -1345 -1358 -1069
3136 -1069 -886 -1365 -1548 -1272 -1295 -1612 -2349 -1950 -1599 -1869 -2629 -2474 -2154 -2034 -2547 -2728 -1842 -2252 -2093 -2464
3156 -2464 -1906 -1504 -1577 -2108 -2295 -1267 -1553 -2098 -2015 -1397 -1881 -2037 -2298 -2014 -1564 -2090 -2234 -2002 -1118 -1251
3176 -1251 -1475 -966 -883 -506 -802 -598 -227 192 131 85 -196 -99 28 -564 -74 -145 -209 -360 -44 124 337 -86
3198 -86 -49 449 577 821 787 833 1458 1338 867 880 1255 816 1030 567 898 835 401 204 359 128 633 482
3220 482 455 780 789 814 862 866 1094 948 1033 955 1206 971 763 824 569 292 288 147 668 655 91 245 733 900
3244 900 898 563 1164 1143 1609 1776 1433 2102 1927 1911 1734 1882 1774 1883 1800 1499 1774 1903 1704 1676 2067 2234
3266B234R8k18K75L47P0K45L00m36N4J51L2n49J60j74J24m9k35j70l10L56j75
3287B130m6o72K92K75J5m2j51M12k13k99J47j95l68l35L33q66k64K04l19l65l34
3308f61J05k35o3j72q3L5P2o4j98J4J66k21k44K72k51k08j10j22r0k75l18J19
3330b532k09k30K10M1K43p8O4J50K92J45j50l95O16q1J51j04l57M08k02l19K5
3351b312L12n63M05j55k5O27p6O2j43J85L70L9k6K27M02n10K38J45J56n71j03
3372a316K68o8O1r9K0n6k72K48k29M79n0K01k80K84L21j26j95K89R2l6k97o0P0
3395g51p6p4n11K76M19l95k43L25K13J64K0j17O32J72j51k28L14L52m89k98M27
3416a9J44j89jO8M9O2m18K09M72K40j32Q6K38K87k50J34J21L71K51m34l04P06
$$ plain form
3266 2234 2332 2114 2389 2736 2806 3051 3351 2915 2969 3120 3152 2603 2763 2589 2713 2664 2429 2259 1949 2305 2130
3287 2130 2084 1412 1704 1979 1994 1952 1801 2213 2000 1701 1848 1653 1285 950 1283 417 153 357 38 -327 -661
3308 -661 -556 -791 -854 -1026 -1109 -1074 -1002 -1066 -1264 -1250 -1084 -1305 -1549 -1277 -1528 -1736 -1846 -1968 -2058 -2333 -2651 -2532
3330 -2532 -2741 -2971 -2761 -2720 -2477 -2555 -2491 -2341 -2049 -1904 -2054 -2449 -1833 -1914 -1763 -1867 -2224 -1816 -2018 -2337 -2312
3351 -2312 -2000 -2563 -2158 -2313 -2338 -1711 -1787 -1725 -1868 -1683 -1313 -1274 -1300 -1073 -671 -1181 -943 -798 -642 -1213 -1316
3372 -1316 -1048 -1116 -1055 -1154 -1134 -1190 -1462 -1214 -1443 -964 -1014 -813 -1093 -809 -488 -614 -809 -520 -428 -464 -761 -821 -751
3395 -751 -827 -901 -1412 -1136 -717 -1112 -1355 -1030 -817 -653 -633 -750 -118 54 -97 -325 -11 341 -148 -446 -19
3416 -19 125 -64 -65 3 52 114 -304 -95 377 617 485 571 809 1096 846 980 1101 1472 1723 1289 985 1691
3438A691J63m26l10M72J00l01k81N17J65k36j20K33L90l53j22L59O62J70o52k23
3458A898N44k24r8o04N69m1m82k27J43M28k03m55j80L46J02r9l08Q99k27j73m36
3479A172L98L88p41n68J74L57j53k11m01L07K33n99k06q0L65R0o05L6L15P8l08
3500D1j75M93K8k28k16p6N40m04k70k55L10l39p4k64N85j25k52nK42R7k79k38
3522h64K73L49k10l29m0P74k07m64j85O7M81p28k17N14K23l72n07K16O35Kn33
3543a122L1O30J61m75N2J68M79k36p19L38O13p42J27p4M69L2o52j26P27j1l90
3564g20j8K44O45m88o62O62N25k59n00P1N18J40p49q8M55J2j0l69l5R08n60l23
3586f01L8O23K24l14j20M13J78m79P4J96L90o26N5j14L27k75l83K55M43mm42l35
$$ plain form
3438 1691 1854 1428 1118 1590 1690 1389 1108 1625 1790 1554 1434 1667 2057 1704 1582 1941 2603 2773 2121 1898
3458 1898 2442 2218 2120 1516 2085 2044 1562 1335 1478 1906 1703 1248 1068 1414 1516 1417 1109 2008 1781 1608 1172
3479 1172 1570 1958 1217 649 823 1180 1027 816 415 722 955 356 150 70 435 525 -80 -44 271 349 41
3500 41 -134 359 387 159 -57 -133 407 3 -267 -522 -212 -551 -625 -889 -304 -429 -681 -686 -444 -347 -626 -864
3522 -864 -591 -242 -452 -781 -821 -47 -254 -718 -903 -836 -355 -1083 -1300 -786 -563 -935 -1442 -1226 -591 -589 -1122
3543 -1122 -1091 -461 -300 -775 -723 -555 -76 -312 -1031 -693 -80 -822 -695 -769 -300 -268 -920 -1046 -319 -330 -720
3564 -720 -738 -494 151 -337 -999 -337 188 -71 -571 -500 18 158 -591 -679 -224 -212 -222 -591 -626 282 -278 -601
3586 -601 -563 60 284 -30 -150 263 441 -38 36 232 622 -4 51 -63 264 -11 -394 -139 304 300 -142 -477
3608d77Q17p2k05m49Q5N86l19N7J29J57p3k04l99L48L07l63k33O5O08n18l83K88
3630b48J4K32l90R4M20k13k81R1O20j2j36m16J84L61m71l99M30L97j00o41j54
3651f18P47m7m82l40J87P93m26k94R4L54j8m49R6M97m4n88J47M48Q7p00N5J85
3673c16J28M54p14K36J0k4j91L86K99p7p01K36L87l5k76k18K47N36k50j96l46
3694d25N18j40j79pJ45K79p3j39m7M58l34QJ80K12j40j25K40j77M36k78n87N92
3716D17M7k65k1J66K48m24k52M92K27pm09m3K96K08k96k80J39R67m95o57K97J40
3738D95J61m95J77K06j80l88J84J24L69l18q1j45L70j7n0k54N28l43l33l4L41
3759C17J77m37j78p2N87O3m69K34K78m25j00j72L84J25k41n5L3K25q8l61L07P9
$$ plain form
3608 -477 340 268 63 -386 -301 285 -34 23 152 309 236 32 -367 -19 288 -75 -308 -243 365 -153 -536 -248
3630 -248 -234 -2 -392 -298 122 -91 -372 -281 339 327 191 -225 -41 320 -151 -550 -120 277 177 -464 -618
3651 -618 129 82 -400 -740 -553 240 -186 -480 -386 -32 -50 -499 -403 94 50 -538 -391 57 144 -556 -501 -316
3673 -316 -188 266 -448 -212 -202 -226 -417 -31 268 191 -510 -274 113 78 -198 -416 -169 367 117 -79 -425
3694 -425 93 -47 -226 -233 -88 191 118 -21 -68 390 56 64 244 456 316 191 431 254 690 412 -175 417
3716 417 464 199 178 344 592 168 -84 408 635 628 219 176 472 680 384 104 243 1210 715 58 355 495
3738 495 656 161 338 544 364 -24 160 284 653 335 254 109 479 462 412 158 686 343 10 -24 317
3759 317 494 57 -121 -193 394 457 -12 222 500 75 -25 -197 187 312 71 16 49 274 186 -175 132 211
3781B11l19J53l22N07R7n39M3M51k85No2J05K41j93l56M07K36j54k74KJ78m9k92
3804b09M71j21K81m49k18L68j23M4J16k53M04j52m26J12j43M0K49k68K53M9n36
3825e11J23K36P1p8j57k08J68o7j01K58j93M87l26j69L24m82K4O9K9L54j34l8
3847c21l10K39r5pk44J90L19r0j13K03P3L2k40Q0J93r2r7l1Q5L05j55k66L38L73
3871C69n17j56L17K80J16n60r5M32L27o44R5L95J28k24l43K21K05J22o00M34L5
3892C37l03K38j20j37J60j71J40J8jJ42l95M32j71k09L12Q8n1l76k41M40q4Kj78
3915a28j70K51k12J12j09K9j41R6k54j2K86L8j09Po7J43j32j18K23J22l53J04
3937c94j34lJ56k61M22l05L43J91k50k32J94R9m65M37kM7j16n5L72k78K19j06
$$ plain form
3781 211 -108 45 -277 230 327 -212 -169 282 -3 2 -60 45 286 93 -263 144 380 226 -48 -46 132 83 -209
3804 -209 262 141 422 -27 -245 123 0 44 160 -93 311 159 -267 -155 -298 -258 -9 -277 -24 25 -511
3825 -511 -388 -152 -81 -159 -316 -524 -356 -423 -524 -266 -459 28 -298 -467 -143 -625 -601 -532 -503 -149 -283 -321
3847 -321 -631 -392 -487 -494 -738 -548 -229 -319 -432 -229 -156 -124 -364 -284 -91 -183 -280 -311 -226 79 -76 -342 -4 369
3871 369 -148 -304 13 293 409 -151 -246 186 513 -131 -36 359 487 263 -80 141 346 468 -132 302 337
3892 337 34 272 152 15 175 4 144 162 161 303 -92 340 169 -40 272 360 309 -67 -308 132 48 50 -128
3915 -128 -298 -47 -259 -147 -256 -227 -368 -272 -526 -538 -252 -214 -323 -316 -383 -240 -372 -490 -267 -145 -498 -394
3937 -394 -528 -531 -375 -636 -214 -519 -176 15 -235 -467 -273 -174 -639 -202 -204 -157 -273 -328 44 -234 -15 -121
3959a21P8L2J59j75k9j13K70j07p2N4K52J55j0j09j90K88J12j47k59Q6J5rj65
3982eJ61k04M69k54J69m4O3j86M23m47N0J26q1L14m11k23K80Q7K01k04l26Q0N7
4005I5j1k11J05J62K9J4l07K6J90J1j12N1j00M10l99j90P7L45J4j94L06o20O29
4028C20k39L00j59k74N2j78K53N5P2K64l34J26J51q5O4k64J52k02M14J05k69r9
4050B25k3j13M36J21O2l52O2K7k1m3L15q7j77O2m0M6l7m18M11N5j38k16K0L10
4074D87j20j65J99k17J3K95o43N34l2j16l58r3N04j95l72L02j81m8L19j56L0O1
4096D8k10k58K03J98k42j5J07r9k02P9j05L07m3l6j24K39k31k28J80NJ73L5l33
4119e52J77j11K50K1k9K80k34Q0m91M12ml38K25j74L23l1J4J16qk09L35m58J24
$$ plain form
3959 -121 -43 -11 148 -27 -56 -169 101 -6 -78 -24 228 383 373 264 74 362 474 327 68 154 169 160 -5
3982 -5 156 -48 421 167 336 292 355 169 592 145 195 321 240 554 143 -80 200 287 488 284 -42 38 95
4005 95 84 -127 -22 140 169 183 -124 -98 92 103 -9 42 -58 352 -47 -237 -160 185 199 5 311 -309 320
4028 320 81 381 222 -52 0 -178 75 130 202 466 132 258 409 324 388 124 276 74 488 593 324 225
4050 225 202 89 525 646 708 356 418 445 424 381 696 609 432 494 454 500 463 45 456 511 373 157 177 487
4074 487 367 202 401 184 197 492 -151 383 351 235 -123 -216 288 93 -279 23 -158 -206 113 -43 -13 48
4096 48 -162 -420 -217 -19 -261 -276 -169 -268 -470 -391 -496 -189 -232 -268 -392 -153 -384 -612 -432 -427 -254 -219 -552
4119 -552 -375 -486 -236 -215 -244 36 -198 -118 -609 -197 -201 -539 -314 -488 -165 -196 -182 -66 -74 -283 52 -406 -282
4142b82N6K49l5j60K74k26J07j39L67k40O6k02oP3k25K13j24K44j96r5O3K65k04
4165a57j82K65L2m01K12k10K35k2J4k4J0K63j62k20k0j8L50k26n0n4L50j92m88
4188f95M73J83j07j9l10L33j27j23%K88j7j61n1M10m07N4q2L55J34k64j74k2M86
4211A57L5k18q0j5K74k70K02JJ24n6l7k47M73j39k33L32j58q2J23l03N24K11n01
4234A17J55L62k14J48m92R9L28q0j8j9J6J41Lk00K31l01J23p0oJQ9j37k8j33J40
4259B55o8K45n26L65N9k86J10M62o22P4j58L05K82k35l05J56k23J27l0J15j56
4280e4j78K22j6L49l88j08L55P8k86R8j10r9K80k16j13R7L04r7k2J21j25k10L65
4303B47j80j83o4K90o9k07L50K3j76J10L9L6m8MK79k75K30l88L06Q7m7j97k01
$$ plain form
4142 -282 -226 23 -12 -172 102 -124 -17 -156 211 -29 37 -165 -171 -98 -323 -110 -234 10 -186 -281 -218 47 -157
4165 -157 -339 -74 -42 -443 -231 -441 -206 -228 -214 -238 -228 35 -127 -347 -367 -385 -35 -261 -311 -365 -15 -207 -695
4188 -695 -222 -39 -146 -165 -475 -142 -269 -392 -392 -104 -121 -282 -333 77 -330 -276 -358 -3 131 -133 -307 -329 157
4211 157 192 -26 -106 -121 153 -117 85 86 210 154 117 -130 343 204 -29 303 145 63 186 -117 407 618 117
4234 117 272 634 420 568 76 175 503 423 405 386 402 543 546 346 577 276 399 329 323 324 413 276 248 115 255
4259 255 187 432 -94 271 330 44 154 616 -6 68 -90 215 497 262 -43 113 -110 17 -13 102 -54
4280 -54 -232 -10 -26 323 -65 -173 182 260 -26 72 -38 -137 143 -73 -186 -89 215 118 96 217 92 -118 247
4303 247 67 -116 -180 110 41 -166 184 207 31 141 180 216 168 172 451 176 406 18 324 411 364 167 -34
4326c4K88J63j91k32R9o0M9r5K06j68k73L90np8J28j17oL7K11l20r6K78K68l05
4350A37j14J21k11k57J05k4K85m47J31K86j08Q3m33K9O6J49j92j08N50p6j55J0
4372a73j1J23k0l42q5L70L22m62Pj48L40j91j05J22K55l24l27K96L04j68M1k4
4394b00r6L8K17j7k44R7N2K27o3l4k35J78k50M49j73O2l36K0L25k33N3M0J86m06
4418c43L00l8L29j37l68q1L7mK8M53n51K67O3m64N38J08j16k20j65M41m13m8K44
4441a40r3k49J3l7K28K57j94k20Q7J09j01k26J96K06l8K02m42J82J17p7o5J05
4463a80L48j73k00K90K16l99k18Q8K73q5l08K68Q3Q0L5m3o0K6L94k77K65l50L09
4486C82j77j7M17k65k37o7K07K04j69L4L1L94l80p6J3K7J83p8J49j55j28J88k26
$$ plain form
4326 -34 254 417 226 -6 93 33 82 -13 193 25 -248 142 137 59 187 70 64 101 312 -8 -104 174 442 137
4350 137 23 144 -67 -324 -219 -243 42 -405 -274 12 -96 -13 -446 -417 -351 -202 -394 -502 48 -28 -183 -173
4372 -173 -184 -61 -81 -423 -508 -138 184 -278 -271 -419 -79 -270 -375 -253 2 -322 -649 -353 -49 -217 -176 -200
4394 -200 -296 -258 -41 -58 -302 -205 -153 74 11 -23 -258 -80 -330 119 -54 8 -328 -308 17 -216 -163 -123 63 -343
4418 -343 -43 -81 248 111 -257 -338 -301 -305 -277 176 -375 -108 -45 -509 29 137 21 -199 -364 77 -336 -384 -140
4441 -140 -233 -482 -469 -506 -278 -21 -215 -435 -348 -239 -340 -566 -370 -164 -202 0 -442 -260 -143 -220 -285 -180
4463 -180 168 -5 -205 85 301 -98 -316 -228 45 -40 -348 -80 3 83 118 75 15 41 435 158 423 73 382
4486 382 205 188 605 340 103 36 243 447 278 312 343 737 357 281 294 321 504 426 575 420 292 480 254
4509B54L01j51J63K10k65K0j61p9L8K51L7k24kj49K62k12j07L5r5R1K45m40J12
4532A34M06l78j87P5J16k83K7K26K24m45J73k93J7L63j50j15j4o9K00K81m28P1
4554d9n9J19k13M41j65m64O01m81R3K84m14K26J17j34k17K76l02J28K%Q0L56k87
4577f2R6k29j9j1J72j55J52K97j85r8J57N5k92K17j87J91j61k65K91j94L28k45
4599a47m9K12J4j51p3L28q4k73M5j76K46j31J22m7l2L3l13K28j5L8k24K16k0N6
4623a97k18K14L8J46p2l42N7J49j71J46j50K21j93o4K62l29L82k62J40J04j27
4644b66K61j04J87k11J64j42k06L77q2K03q3j52K12k31JN2J77j48J28o6J27p8
4666A20M1l16J82J55j1J99l29J47q2P2K13j36Q9j18J27k87r9L90j19m8J46q0n3
$$ plain form
4509 254 555 404 567 777 512 532 371 292 330 581 618 394 392 243 505 293 186 221 126 217 462 22 134
4532 134 540 162 -25 50 166 -117 -90 136 360 -85 88 -205 -188 175 25 -90 -104 -173 27 308 -120 -49
4554 -49 -108 11 -202 239 74 -390 211 -270 -177 107 -307 -81 36 -98 -315 -39 -341 -213 -211 -211 -131 225 -62
4577 -62 34 -195 -214 -225 -53 -208 -56 241 56 -42 115 170 -122 95 -92 99 -62 -327 -36 -230 98 -147
4599 -147 -196 16 30 -121 -194 134 50 -223 -178 -354 -108 -239 -117 -164 -196 -163 -476 -248 -263 -225 -449 -233 -253 -197
4623 -197 -415 -201 -163 -17 -89 -431 -374 -225 -396 -250 -400 -179 -372 -436 -174 -503 -121 -383 -243 -139 -266
4644 -266 -5 -109 78 -133 31 -111 -317 60 -22 181 98 -54 158 -73 -72 -20 157 9 137 71 198 120
4666 120 161 -155 27 182 171 370 41 188 106 178 391 255 344 226 353 66 -33 357 238 190 336 256 203
4689B03N4n34M89j75O9j86J84l0j26j56J77K51j07l54p0K56K1L3j2j79k2q2L17
4712B1Q6j32Q1k72K43p0j0J55k88J42Q2K28n10J16j46L62k17p2K57k2JJ5K82n36
4736b04M22l21J62l53M37k04P9R5j66L46l38J32J59j47k49M06k88L51j74j59L88
4757C74k49J48N9p5k69L08l48j05K55M8j54L27J08n48J96J60J8k75K38P5l28L88
4779C51l12L21m50l67L46r7p7N13L00m98J03l25L41j13J33p2k12J95m51J41K19
4800a1k84L10j51q7Q6K94k60j21R0j08PK15l8l5J30j89J77m39M61l04M47Q4n32
4823b58K21J76M0j58q3L28m21Q3k43K96K77k02j72J96j17o1L30m08L01O6k89k4
4845a22J58K13m42L08q8Q2k04J78k68O1J43k70K57p5k50K83k30R8N8M21k85R4
$$ plain form
4689 203 257 -277 212 37 106 -80 104 74 -52 -208 -31 220 113 -241 -311 -55 -34 -1 -13 -192 -214 -296 21
4712 21 107 -25 56 -216 27 -43 -53 102 -186 -44 38 266 -244 -128 -274 88 -129 -201 56 34 35 50 332 -204
4736 -204 218 -103 59 -294 143 -61 18 113 -53 293 -45 87 246 99 -150 256 -32 319 145 -14 374
4757 374 125 273 332 257 -12 296 -52 -157 98 146 -8 319 427 -121 75 235 253 -22 216 291 -37 351
4779 351 39 360 -90 -457 -111 -208 -285 228 528 30 133 -192 149 36 169 97 -115 80 -371 -230 -11
4800 -11 -295 15 -136 -223 -137 157 -103 -224 -134 -242 -235 -20 -58 -93 37 -152 25 -414 47 -257 190 274 -258
4823 -258 -37 139 179 21 -62 266 -155 -72 -315 -19 258 56 -116 80 -37 -98 232 -176 125 191 -98 -122
4845 -122 36 249 -193 115 27 109 -95 83 -185 -124 19 -251 6 -69 -319 -36 -266 -168 -110 311 26 120
4867A20j15P1J31J35m49K06l88L58j35K39j97l41M54k09J77k66J86l31K52K17
4887A15Pj60L55l64k16L80l43K83l16J37l4J8J13q7J14o7R5o5L47k28j31Q7n0
4910a0K6J35l35L5r8J26P6J44j60M3k5J14j20l9lJ82k97K29k7K76l86J70J75n25
4934b94M53l92L68Q1m36K97r8R1m15j08K83Q7J64m25k1L08q2M22l53J64k03j35
4956b44J13p0L23j88j20J4K43J58l79J86j67k26K90k8o6l5J92Oqn3K76m22K5K07
4980B7n0j59J15r0J04J78j6J14K1n01M77j18rm11K80N4J27j91J42q5K11k6j60
$$ plain form
4867 120 5 76 207 342 -107 99 -289 69 -66 173 -24 -365 89 -120 57 -209 -23 -354 -102 115
4887 115 122 -38 317 -47 -263 117 -226 57 -259 -122 -156 -138 -25 -112 2 -65 30 -35 312 84 -47 40 -10
4910 -10 16 151 -184 -149 -247 -121 -45 99 -61 -18 -43 71 -49 -88 -91 91 -206 23 -4 272 -114 56 231 -294
4934 -294 159 -233 135 216 -220 77 -21 70 -345 -453 -170 -83 81 -344 -365 -57 -139 283 -70 94 -109 -244
4956 -244 -131 -201 122 -66 -186 -172 71 229 -150 36 -131 -357 -67 -95 -161 -196 -4 2 -6 -59 217 -205 -180 27
4980 27 -23 -182 -67 -157 -53 125 109 223 244 -257 220 102 93 -318 -38 16 143 -48 94 9 220 194 34
$$ [...]
8191B61
##END NTUPLES=NMR FID
##END=
