##TITLE=1H_Pr 4432-F
 CDCl3
 8 sc, 
 23.09.2022
##JCAMPDX= 6.0         $$ Bruker NMR JCAMP-DX V2.0
##DATA TYPE= NMR FID
##DATA CLASS= NTUPLES
##ORIGIN= UXNMR, Bruker Analytische Messtechnik GmbH
##OWNER= root
$$ XWIN-NMR		Version 3.5
$$ Fri Sep 23 16:44:55 2022 Russian Standard Time (UT+4h)  she@DPX200
##.OBSERVE FREQUENCY= 200.1313499994
##.OBSERVE NUCLEUS= ^1H
##.DELAY= (6, 6)
##.ACQUISITION MODE= SIMULTANEOUS
##.ACQUISITION SCHEME= undefined
##.AVERAGES= 8
##.DIGITISER RES= 18
##SPECTROMETER/DATA SYSTEM= spect
##.PULSE SEQUENCE= zg30
##.SOLVENT NAME= CDCl3
##.SHIFT REFERENCE= (INTERNAL, CDCl3, 0, 15.7039)
##AUDIT TRAIL= $$ (NUMBER, WHEN, WHO, WHERE, WHAT)
$$ ##TITLE= Audit trail, XWIN-NMR		Version 3.5
$$ ##JCAMPDX= 5.01
$$ ##ORIGIN= Bruker BioSpin GmbH
$$ ##OWNER= she
$$ F:/spectra/data/she/nmr/H-F/1/audita.txt
$$ ##AUDIT TRAIL=  $$ (NUMBER, WHEN, WHO, WHERE, WHAT)
(   1,<2022-09-23 16:42:34.21 +0400>,<she>,<DPX200>,
      <created by zg, POWCHK disabled, PULCHK disabled
       configuration hash MD5:
       00 E9 B6 7A A2 85 ED C7 34 08 36 98 17 FE 4E 26
       data hash MD5: 16K
       D7 D2 1D A9 A7 E4 5F DE 19 88 45 66 9A 1B 96 BA>)
$$ ##END=
$$ 
$$ hash MD5
$$ B4 40 D3 12 FA A1 ED F8 0C 71 0E 47 86 80 CB 5C
##$RELAX= 
##$RELAX= 
##$RELAX= 
##$RELAX= 
##$RELAX= 
##$RELAX= 
$$ Bruker specific parameters
$$ --------------------------
##$DU= <F:/spectra>
##$EXPNO= 1
##$NAME= <H-F>
##$PROCNO= 1
##$TYPE= <nmr>
##$USER= <she>
##$AMP= (0..31)
100 100 100 100 100 100 100 100 100 100 100 100 100 100 100 100 100 100 
100 100 100 100 100 100 100 100 100 100 100 100 100 100 
##$AQSEQ= 0
##$AQ_mod= 1
##$AUNM= <au_zg>
##$AUTOPOS= <>
##$BF1= 200.13
##$BF2= 200.13
##$BF3= 200.13
##$BF4= 200.13
##$BF5= 200.13
##$BF6= 200.13
##$BF7= 200.13
##$BF8= 200.13
##$BYTORDA= 1
##$CFDGTYP= 0
##$CFRGTYP= 5
##$CHEMSTR= <none>
##$CNST= (0..31)
1 1 145 1 1 1 1 1 1 1 1 1 1 1 1 1 1 1 1 1 1 1 1 1 1 1 1 1 1 1 1 1 
##$CPDPRG= <>
##$CPDPRG1= <>
##$CPDPRG2= <>
##$CPDPRG3= <>
##$CPDPRG4= <mlev>
##$CPDPRG5= <mlev>
##$CPDPRG6= <mlev>
##$CPDPRG7= <mlev>
##$CPDPRG8= <mlev>
##$CPDPRGB= <>
##$CPDPRGT= <>
##$D= (0..31)
0 1.2 0 0 0 0 0 0 0 0.06 0 0.03 0 0 0 0 0.0002 0 0 0 0 0 0 0 0 0 0 0 0 
0 0 0 
##$DATE= 1663936953
##$DBL= (0..7)
120 120 120 120 120 120 120 120 
##$DBP= (0..7)
150 150 150 150 150 150 150 150 
##$DBP07= 0
##$DBPNAM0= <>
##$DBPNAM1= <>
##$DBPNAM2= <>
##$DBPNAM3= <>
##$DBPNAM4= <>
##$DBPNAM5= <>
##$DBPNAM6= <>
##$DBPNAM7= <>
##$DBPOAL= (0..7)
0.5 0.5 0.5 0.5 0.5 0.5 0.5 0.5 
##$DBPOFFS= (0..7)
0 0 0 0 0 0 0 0 
##$DE= 6
##$DECBNUC= <off>
##$DECIM= 32
##$DECNUC= <off>
##$DECSTAT= 4
##$DIGMOD= 1
##$DIGTYP= 9
##$DL= (0..7)
0 120 120 120 120 120 120 120 
##$DP= (0..7)
150 150 150 150 150 150 150 150 
##$DP07= 0
##$DPNAME0= <>
##$DPNAME1= <>
##$DPNAME2= <>
##$DPNAME3= <>
##$DPNAME4= <>
##$DPNAME5= <>
##$DPNAME6= <>
##$DPNAME7= <>
##$DPOAL= (0..7)
0.5 0.5 0.5 0.5 0.5 0.5 0.5 0.5 
##$DPOFFS= (0..7)
0 0 0 0 0 0 0 0 
##$DQDMODE= 0
##$DR= 18
##$DS= 0
##$DSLIST= <SSSSSSSSSSSSSSS>
$$ [...]
##$SUBNAM2= <"">
##$SUBNAM3= <"">
##$SUBNAM4= <"">
##$SUBNAM5= <"">
##$SUBNAM6= <"">
##$SUBNAM7= <"">
##$SUBNAM8= <"">
##$SUBNAM9= <"">
##$SW= 18.0517283424941
##$SWIBOX= (0..15)
0 0 2 0 0 0 0 0 0 0 0 0 0 0 0 0 
##$SW_h= 3612.71676300578
##$TD= 16384
##$TD0= 1
##$TE= 0
##$TE2= 300
##$TE3= 300
##$TEG= 300
##$TL= (0..7)
0 120 120 120 120 120 120 120 
##$TP= (0..7)
150 150 150 150 150 150 150 150 
##$TP07= 0
##$TPNAME0= <>
##$TPNAME1= <>
##$TPNAME2= <>
##$TPNAME3= <>
##$TPNAME4= <>
##$TPNAME5= <>
##$TPNAME6= <>
##$TPNAME7= <>
##$TPOAL= (0..7)
0.5 0.5 0.5 0.5 0.5 0.5 0.5 0.5 
##$TPOFFS= (0..7)
0 0 0 0 0 0 0 0 
##$TUNHIN= 0
##$TUNHOUT= 0
##$TUNXOUT= 0
##$USERA1= <user>
##$USERA2= <user>
##$USERA3= <user>
##$USERA4= <user>
##$USERA5= <user>
##$V9= 5
##$VALIST= <valist>
##$VCLIST= <CCCCCCCCCCCCCCC>
##$VD= 0
##$VDLIST= <DDDDDDDDDDDDDDD>
##$VPLIST= <PPPPPPPPPPPPPPP>
##$VTLIST= <TTTTTTTTTTTTTTT>
##$WBST= 1024
##$WBSW= 4
##$XGAIN= (0..3)
0 0 0 0 
##$XL= 0
##$YL= 0
##$YMAX_a= 25699
##$YMIN_a= -22833
##$ZGOPTNS= <>
##$ZL1= 120
##$ZL2= 120
##$ZL3= 120
##$ZL4= 120
##$ABSF1= 10
##$ABSF2= 0
##$ABSG= 5
##$ABSL= 3
##$ALPHA= 0
##$AQORDER= 0
##$ASSFAC= 0
##$ASSFACI= 0
##$ASSFACX= 0
##$ASSWID= 0
##$AUNMP= <proc_1d>
##$AZFE= 0.1
##$AZFW= 0.1
##$BCFW= 1
##$BC_mod= 2
##$BYTORDP= 1
##$COROFFS= 0
##$CY= 11.3945322036743
##$DATMOD= 1
##$DC= 2
##$DFILT= <>
##$DTYPP= 0
##$F1P= 2.36226072786647
##$F2P= -0.459571619588291
##$FCOR= 0.5
##$FTSIZE= 0
##$FT_mod= 4
##$GAMMA= 1
##$GB= 0.15
##$INTBC= 1
##$INTSCL= 1
##$ISEN= 128
##$LB= 0.24
##$LEV0= 0
##$LPBIN= 0
##$MAXI= 10000
##$MC2= 0
##$MEAN= 0
##$ME_mod= 0
##$MI= 1.114404
##$NCOEF= 0
##$NC_proc= 0
##$NLEV= 6
##$NOISF1= 3.799351
##$NOISF2= 2.8
##$NSP= 1
##$NTH_PI= 0
##$NZP= 0
##$OFFSET= 15.70392
##$PC= 1
##$PHC0= -17951.38
##$PHC1= 19.60069
##$PH_mod= 1
##$PKNL= yes
##$PPARMOD= 0
##$PSCAL= 0
##$PSIGN= 0
##$REVERSE= no
##$SF= 200.130013532006
##$SI= 16384
##$SIGF1= 3
##$SIGF2= 2
##$SINO= 400
##$SIOLD= 16384
##$SREGLST= <1H.CDCl3>
##$SSB= 0
##$STSI= 0
##$STSR= 0
##$SW_p= 3612.71676300578
##$SYMM= 0
##$S_DEV= 0
##$TDeff= 0
##$TDoff= 0
##$TI= <>
##$TILT= no
##$TM1= 0
##$TM2= 0
##$TOPLEV= 0
##$USERP1= <user>
##$USERP2= <user>
##$USERP3= <user>
##$USERP4= <user>
##$USERP5= <user>
##$WDW= 1
##$XDIM= 8192
##$YMAX_p= 0
##$YMIN_p= 0
$$ End of Bruker specific parameters
$$ ---------------------------------
##NTUPLES= NMR FID
##VAR_NAME=  TIME,          FID/REAL,        FID/IMAG
##SYMBOL=    X,             R,               I
##VAR_TYPE=  INDEPENDENT,   DEPENDENT,       DEPENDENT
##VAR_FORM=  AFFN,          ASDF,            ASDF
##VAR_DIM=   8192,          8192,            8192
##UNITS=     SECONDS,       ARBITRARY UNITS, ARBITRARY UNITS
##FACTOR=    0.0002768,     1,               1
##FIRST=     0,             0,               0
##LAST=      2.2672688,     0,               0
##MIN=       0,             -22833,          0
##MAX=       2.2672688,     25699,           0
$$ Real data points
##PAGE= N=1
##DATA TABLE= (X++(R..R)), XYDATA
0@%%%%%%%%%%%%%%%%%%%%%%%%%%%Oj4J6j6J6j6J6j6J6k2L0l2L2l5M3m8M8n4O2
$$ 0 0 0 0 0 0 0 0 0 0 0 0 0 0 0 0 0 0 0 0 0 0 0 0 0 0 0 0 6 -8 8 -8 8 -8 8 -8 8 -14 16 -16 16 -19 24 -24 24 -30 32
46C2o7P5q3R1j02J13j21J32j48J64j82K05k30K58k93L37l93M66n66P11r47J395
$$ 32 -35 40 -43 48 -54 59 -62 70 -78 86 -96 109 -121 137 -156 181 -212 254 -312 399 -548 847
68H47k510J0084J7278k7180j5292J7606J1504j6468q502J2542P795p591l303L773
$$ 847 -1663 8421 25699 -1481 -16773 833 12337 -4131 -12633 -91 7704 113 -3190 583
82E83N38p04L071l358q995J628J2406L249p930l070M264J6l868p21J933K202K742
$$ 583 1121 417 3488 130 -8865 -7237 5169 8418 488 -2582 1682 1698 -2170 -2891 -958 1244 3986
99C986j378o178K36Q900Q56j1164l965R096M067n507k28N485k009o275J066L237
$$ 3986 2608 -3570 -3334 5566 6422 -4742 -8707 389 4456 -1051 -1279 4206 2197 -4078 -3012 225
115B25k198L69N695j163p483J930Q629k478r061K180P159l532m742P148N375q039
$$ 225 -1973 -1604 4091 2928 -4555 -2625 6004 3526 -5535 -3355 3804 272 -4470 2678 8053 14
131A4n906O298L006o778o40Q223P90p830j225O139R96m361j500J009O27J865J450
$$ 14 -5892 406 3412 -3366 -4006 4217 5007 -2823 -4048 2091 3087 -1274 -2774 -1765 -1138 727 2177
148B177k231j068L296l93o427k30Q366K000p578j599O986O25o723K88N941j884
$$ 2177 -54 -1122 2174 1781 -4646 -4876 3490 5490 -2088 -3687 3299 3924 -2799 -2511 3430 1546
164A546n733K665N601k038l938K201J694m129j764M303K344k832j387J790K32
$$ 1546 -4187 -1522 4079 2041 -1897 304 1998 -2131 -3895 408 2752 -80 -1467 323 555
179E55j427J54Q02l92k00K56l13J014K162j112l778M42L721q91l559K463M571
$$ 555 -872 -718 84 -308 -508 -252 -565 449 2611 1499 -2279 -1837 1884 993 -2566 -103 4468
196D468k910n480K400N085k286m514J917L346j746j750K160O29k440j00J686j490
$$ 4468 1558 -3922 -1522 3563 1277 -3237 -1320 2026 280 -1470 690 1319 -1121 -1221 465 -1025
212a025j308L482K502m059l253L800L240l568l011L359K746k622k134K200J911
$$ -1025 -2333 1149 3651 -408 -3661 139 3379 -189 -3200 159 2905 283 -1851 349 2260
227B260j443j781q9N42P94O53m02p62J13J11o57O7P43m17o08J073O39j644m81
$$ 2260 817 -964 -1053 -511 283 936 534 -228 -115 -4 -661 -594 149 -268 -876 197 836 -808 -1289
246a289K653N02l774j170M335J965l910j607L910J214m192j316M000J281l353
$$ -1289 1364 1866 -1908 -3078 1257 3222 -688 -2295 1615 2829 -1363 -2679 1321 2602 -751
261g51j016K777N94k215k00J642n18j826M35J812n2j181L5P23k96q79M9J025O57
$$ -751 -1767 1010 1604 -611 -811 831 313 -1513 -1078 734 682 -499 -464 259 -37 -916 -867 158 815
280H15p08r92N45J506k45j732J8J736j73j723N79K111m99k184K22J557p03j222
$$ 815 107 -885 -340 1166 921 -811 -793 943 770 -953 -374 1737 1238 -946 -724 833 130 -1092
298a092J205J054j477r59J678P42j938p47J863M75j994j68K449M77k285o87J814
$$ -1092 113 1167 -310 -1269 409 1151 -787 -1534 329 804 -1190 -1358 1091 1568 -717 -1404 410
315D10N35j462k80J492M30j147n15Q81N62p49p87M01P57l20n95N25P46q34j280
$$ 410 945 -517 -797 695 1125 -22 -537 344 906 157 -630 -229 528 208 -387 138 884 50 -1230
334a230N86J307n25j251P61J461r06j615R69J719j037j837J061J955q65j546J041
$$ -1230 -644 663 138 -1113 -352 1109 203 -1412 -443 1276 239 -1598 -537 1418 553 -993 48
351D8J433j221j595J099J555q58j260Q33J047q62j126P04R70q19r61P11R55m75
$$ 48 1481 260 -1335 -236 1319 461 -799 34 1081 219 -907 -203 767 -52 -1013 -302 653 178
369A78r14M69P62o72r32O45J295l53j187K84J309k04j404J33J414nj418P3J414
$$ 178 -736 -267 495 -177 -1109 -464 831 478 -709 -425 884 680 -724 -591 823 818 -600 -527 887
388H87J00j293j13Q53k51q31M50Q92n69r51O86R24j008j157J040J387j023j500
$$ 887 987 -306 -419 434 183 -648 -198 694 125 -826 -140 784 -224 -1381 -341 1046 23 -1477
406a477R71J888o58j887K61J721Jj467n5J488K65j164m04Q65K45p22q7O06j75
$$ -1477 -506 1382 724 -1163 -902 819 820 -647 -702 786 1051 -113 -517 348 593 -129 -216 390 215
425B15o19L85P08n45j046L95J071l52j165L27J334j09j378j48J246K84j014k00
$$ 215 -404 -19 689 144 -902 -507 564 212 -953 -626 708 599 -779 -927 319 603 -411 -611
443f11Q89K42o71JO44r5p80J38Q63j07r17M9J137Q9j336m96J171P73j027j149
$$ -611 278 520 -151 -150 494 399 -381 -243 620 513 -404 -355 782 871 -465 -961 210 983 -44 -1193
463a193P68J226k82j207j50J010L86p73n25M98N68Qk55k95j64M63P57l38j244
$$ -1193 -425 801 519 -688 -838 172 558 -215 -740 -242 326 334 79 -216 -380 83 840 502 -742
482g42Q3J626L64j740r81J738J348j586j841J208K053p68k063K46J816J2j516
$$ -742 -659 967 1331 -409 -1390 348 1696 110 -1731 -523 1530 762 -1301 -1055 761 773 -743
499g43j37J052K01o75N8M27k96k78P04L23j047m54J385Q43j434j152J458J343
$$ -743 -880 172 373 -302 -244 183 -113 -391 313 636 -411 -865 520 1363 -71 -1223 235 1578
517A578j394j564J295J549j176j612J118J525j222j488J186J424j442j424J630
$$ 1578 184 -1380 -85 1464 288 -1324 -206 1319 97 -1391 -205 1219 -223 -1647 -17
532a7J567j691j660J630J798j481j803J296J833r94j516P50J286n49r41N09M77
$$ -17 1550 -141 -1801 -171 1627 146 -1657 -361 1472 478 -1038 -288 998 449 -492 17 494
549D94n99l5Q58k36j224J95J487j86j818j28J978N07j995r25J769J240j430j524
$$ 494 -105 -140 718 482 -742 -547 940 754 -1064 -1192 786 1293 -702 -1627 142 1382 -48 -1572
567a572J003J643m83j418K45J134pp51l5L40k5P3L32k83o23L33R83m19j281K04
$$ -1572 -569 1074 591 -827 -582 552 545 -206 -241 99 74 147 479 196 -427 -94 889 470 -811 -607
587f07J385k0j416j71J298K45j164l58Q91L51o90k20N35J91m27r7L84J40l55j95
$$ -607 778 758 -658 -829 469 714 -450 -808 83 434 -256 -476 59 250 -177 -274 110 250 -105 -300
607c00M04L90k37n33J50O49j2q34k08Q93M26r00o24P52O74o52o81M00M78k43k85
$$ -300 104 494 257 -276 -126 523 511 -323 -531 362 788 -112 -736 16 690 38 -643 -243 235 -8 -293
628b93K55j7k32K61L63m07n75N62Q88m64j085L22J304r7j270k78J247N97j072
$$ -293 -38 -55 -287 -26 337 -70 -645 -83 805 341 -744 -422 882 785 -485 -763 484 1081 9
647Iq39Q17R76o14j083K92R17j06p88m1O03l4m23J71K03l11o5N50O9p47j5R65
$$ 9 -830 -13 963 349 -734 -442 475 369 -419 -460 143 109 -314 -143 60 -251 -316 234 303 -444 -459 506
669E06J27j054k12J164K99j077l18J027L24r32l38P96K71p54k51O83Q7o33j21
$$ 506 633 -421 -633 531 830 -247 -565 462 786 -146 -484 312 583 -171 -422 261 348 -285 -406
688d06O48j7o49m6O64N0o62o5O55K12o81k27P07L25o47l69P07M29o40m34O62M70
$$ -406 242 225 -424 -470 194 244 -418 -483 172 384 -297 -524 183 508 -139 -508 199 628 -12 -446 216 686
710F86o82m81O72M55p13m68O74M23p35m64P29M10p46m55P69M23p02m49O90M37
$$ 686 4 -477 195 650 -63 -531 143 566 -169 -633 96 506 -240 -695 74 497 -205 -654 36 473
730D73o09m50O13N37n44m74M78N41m24m96L49M77l01m50K59M19k45m21J94L90
$$ 473 -136 -586 27 564 20 -454 24 565 141 -355 -6 471 170 -280 -21 398 153 -268 -74 316
750C16k85m14L12L48l33m19L84M33m12m54M26M99l88n00M20N81m20n05L73N36
$$ 316 31 -383 -71 277 -56 -475 -91 342 -70 -524 -98 401 13 -487 -67 514 94 -411 -38 498
770D98l39m95L90M54l58m31L24L99l82m05L19L86l49m51L37M32l41m73K52N00
$$ 498 159 -336 54 508 150 -281 43 442 60 -345 -26 360 11 -440 -103 329 -12 -485 -233 267
790B67k08n45K48N34j89m94J65N78j43n33K29N50k15n04J86N02j92n56K48N67
$$ 267 59 -486 -238 296 107 -387 -222 356 213 -320 -91 459 244 -260 -74 428 236 -320 -72 495
810D95k51o44K42O34k92o89J83O79j98o86J71O62j20o41Q8O24q3n18L9N52qm52
$$ 495 244 -400 -158 476 184 -505 -322 357 159 -527 -356 306 186 -455 -367 257 174 -344 -305 247 239 -213
832b13M2M51j8l97L5L91j7l75M6L71o5m83Q0M26n9n45J8N77K1o24r4O26R4o49
$$ -213 -171 280 262 -135 -100 291 274 -101 -55 316 251 -232 -152 274 215 -330 -312 265 286 -338 -432 194 288 -361
856c61r0O19J33n52r5N68N0m79l4M87M7m70N5M91p5n15P5M78n6m91j2M94K1m87
$$ -361 -451 168 301 -251 -346 222 272 -207 -241 246 293 -177 -122 369 294 -221 -146 332 276 -215 -227 267 288 -199
880a99j01L91J29l90j69L19K15l03j79K89J86l48j20L89J55l81j23M98J46n34
$$ -199 -300 91 220 -170 -339 -20 195 -108 -287 2 188 -160 -280 109 264 -117 -240 258 404 -130
900a30k17O60K27o59k94O29L18o41l42N29K84m56k66L72J77l33j34L14K7k87J6
$$ -130 -347 313 540 -119 -413 216 534 -107 -449 80 364 -92 -358 14 191 -142 -276 38 65 -222 -206
921b06L09l6k70M9K90O1l21q5L09K31k30k66J69L70j39m29Q2M02n9m58J02M58
$$ -206 103 67 -203 -154 136 197 -124 -209 100 331 101 -165 4 374 235 -194 -112 290 231 -227 -125 333
943C33k42m34K17M44l55m85M37N00m71n47N35N43m55n50L77N88k91n02K62M31
$$ 333 91 -343 -126 318 -37 -522 -85 415 -56 -603 -68 475 20 -530 -153 435 144 -358 -96 335
963C35j46l36J83K09j69j14J57Q1k44r6K51J29l16k78L36M22l67n53K67P05k25
$$ 335 189 -147 36 245 76 -38 119 200 -44 -140 111 240 -76 -354 -18 404 37 -516 -249 456 231
984B31q13J02R01l4q87L5Q38K6p74O2P15j48n86K76N57l98n17N18N00o79m75O81
$$ 231 -582 -480 421 387 -500 -465 373 399 -375 -313 402 254 -332 -56 501 103 -414 104 604 -75 -550 131
1006A31M79p17n06O89M52o38m35N49L39m80k40M13J94l13k18L30J75k50j73L02
$$ 131 610 -107 -613 76 528 -110 -545 4 343 -137 -377 36 230 -83 -301 29 204 -46 -219 83
1026H3J95k15k51J95L55j75m15J08M69j09m61J0M91j02m78R4M11j58l74K51L14
$$ 83 278 63 -188 7 362 187 -228 -120 349 240 -221 -211 280 178 -300 -206 205 47 -327 -76 238
1047B38l89k73M73K99n81k49O45L05o00k86N88K38m52k00L50K05k47j06P3M5m
$$ 238 -151 -424 49 348 -233 -482 163 468 -132 -418 170 408 -44 -244 106 311 64 -42 31 76 72
1068G2M5j14j18J52J34k40j62K22R8k17q4K47r0j53J52K47k91k08L80K21m02k34
$$ 72 117 3 -115 37 171 -69 -231 -9 89 -128 -212 35 -55 -208 -56 191 -100 -308 72 293 -109 -343
1090c43N38K11n22j78N19J27m89p6M55K4m06J1L27m6l08N1K31q5j74J3J52mj27
$$ -343 195 406 -116 -294 225 352 -137 -213 242 266 -140 -129 198 152 -156 -105 126 41 -133 -120 32 28 -99
1113i9o2K4J93j1j67rK44J5k88L7L18n7l16J59L58k39l84L26L81m12l94M80M04
$$ -99 -161 -137 56 45 -122 -131 113 128 -160 -123 195 138 -178 -19 339 100 -284 42 423 11 -383 97 501
1136E01n64l92N64K99o03k66N59K02n37j31N12R3m57l9M17J0l70Q8L04n3k66J28
$$ 501 -63 -455 109 408 -195 -461 98 300 -237 -368 144 237 -220 -259 158 168 -202 -114 190 137 -129 -1
1158aJ99j08j46N0J09Mk7j48L5J61k1k70N2K57r4l41J37L94j49m41J93M34k10
$$ -1 198 90 -56 -6 103 107 80 -68 -33 128 107 -163 -111 146 52 -289 -152 242 93 -348 -155 279 69
1181F9m55L06M61l29l66L70L38l89k92M15K00l66j65L82J10l78o1L10J7k99j1
$$ 69 -386 -80 381 52 -314 56 394 5 -287 128 328 -38 -203 179 289 -89 -150 160 177 -122 -133
1202a33K10kj84lJ01L0p2m3l1J44J8j05p2K10Q6k14j09K93P1l20JL69J0m05N6
$$ -133 77 75 -109 -112 -11 19 -53 -96 -127 17 35 -70 -142 68 154 -60 -169 124 195 -125 -124 245 255 -150 -94
1227i4L93r2m56J67M38k65l75K02L74k74l56K53L02k73k34K69J88k72j32K38J31
$$ -94 299 207 -249 -82 356 91 -284 -82 292 18 -338 -85 217 -56 -290 -21 167 -105 -237 1 132
1248A32k11n0J57J00j31o2O2J24l1r7o1J77M9j76r6J81J31k75j29L08Q7l47p3
$$ 132 -79 -129 28 128 -3 -65 -3 121 90 -7 -68 109 158 -18 -114 67 198 -77 -206 102 189 -158 -231
1271b31L51L2l58l1M02l5l83O1L69k9m00J24L73j20l24J50L01j63k24J20K20j44
$$ -231 120 152 -206 -237 165 130 -253 -192 177 148 -252 -128 245 125 -199 -49 252 89 -135 -15 205 61
1293F1j89J15J45j27j09O4R3k9q9JN6M6j16l6J09J00j62r0J80J40j94j50K13K08
$$ 61 -128 -13 132 5 -104 -40 53 24 -65 -64 -8 38 -78 -114 -5 95 -67 -157 23 163 -31 -181 32 240
1317B40k69j39L07J42l29r9K70Q7l03p3L16L1l03k7K79j1k89oK99p4k57N4K38
$$ 240 -29 -168 139 281 -48 -147 123 210 -93 -166 150 181 -122 -149 130 119 -170 -176 123 49 -208 -154 84
1340H4j8j99j2J76J7j04j8J30L2o3r6R5J56j38j28J40J18j07j79J06J96j79j77
$$ 84 66 -133 -145 31 48 -56 -74 56 88 25 -71 24 180 42 -86 54 172 65 -114 -8 188 9 -168
1363a68J87J40j84j99K24J59k51j59K21K02k55j47K31J56k23j04K16J21j91j17
$$ -168 19 159 -25 -224 0 159 -92 -251 -30 172 -83 -230 1 157 -66 -170 46 167 -24 -141
1383a41K32R9j65j01J88Q4j98p6J50R9j58j16J22R0j34j57J28J62j13j76J20J76
$$ -141 91 190 25 -76 112 196 -2 -78 72 171 13 -103 19 109 -25 -182 -54 108 -5 -181 -61 115
1405A15j28j74J44J39q0j66J12J90q2j97J24J85j28j95J79J57j56j88J65J89j73
$$ 115 -13 -187 -43 96 16 -150 -38 152 70 -127 -3 182 54 -141 38 195 39 -149 16 205 32
1426C2j98J60J52j49j79J50J86j57j86J36J75j35j57J47J63q9k09J46J72j49j53
$$ 32 -166 -6 146 -3 -182 -32 154 -3 -189 -53 122 -13 -170 -23 140 51 -158 -12 160 11 -142
1447a42J09K24j06j98J03K22j53j83R4J57o6k02J20J49j21j63Q0J92j06k03J09
$$ -142 -33 191 85 -113 -10 212 59 -124 -30 127 61 -141 -21 128 7 -156 -76 116 10 -193 -84
1468h4K11j31j89J35J98j24j89J31K40j33j98J15K42j46k01J23K04j16j74Q7J53
$$ -84 127 -4 -193 -58 140 16 -173 -42 198 65 -133 -18 224 78 -123 0 204 88 -86 1 154
1489A54j04j61J06J32j23j43J08J09j22j33J33J25j24j22J17J52r9r8O4J12o2
$$ 154 50 -111 -5 127 4 -139 -31 78 -44 -177 -44 81 -43 -165 -48 104 5 -93 -29 83 21
1510B1j08Q4Q9l7p2%J37k4j22J4J00k1j03m8J52Mj32J5N9M4j35j4J08L4j21j6
$$ 21 -87 -3 86 49 -23 -23 114 90 -32 -18 82 61 -42 -90 62 66 -66 -51 8 52 -83 -97 11 45 -76 -92
1536i2J07Op1j5J07J9j12RR0Po8j7J12j0p5m0J13%o2o9P6R8j32j15J29R3r7r7
$$ -92 15 21 -50 -65 42 61 -51 -42 48 55 -13 -30 82 72 -3 -43 70 70 8 -61 15 113 -19 -134 -5 88 -9 -106
1564a06Q6J24j14j44J35J05r5j07J55J10j63j06J76Q2j42r2J56Q5j63q5J65Q0
$$ -106 -20 104 -10 -154 -19 86 -9 -116 39 149 -14 -120 56 138 -4 -96 60 145 -18 -103 62 142
1586A42j85p9J46J09j81q4J65N5j33j28J55Q2j13j02J38J28j64m2R4J36j44o7
$$ 142 -43 -122 24 133 -48 -132 33 88 -45 -173 -18 64 -49 -151 -13 115 -49 -91 3 139 -5 -72
1608g2J31J20j30j02P9J37j30j06J04J26j35j33J34J15j96j01J54P4j01j23J50
$$ -72 59 179 49 -53 26 163 33 -73 31 157 22 -111 23 138 -58 -159 -5 69 -32 -155 -5
1629eJ18j78r0J37Q8j19q3J76L6j13p7J43Q7j18o8P7J07q5j04J09O5q7o4N1O1
$$ -5 113 -65 -155 -18 70 -49 -132 44 80 -33 -110 33 120 2 -66 11 118 33 -71 38 103 16 -48 3 64
1654F4m3j21P4J03q9j00O9J15o4j10Q5J12j00j21Q8J27o6j47J36Q8n2j23P3J39
$$ 64 21 -100 -26 77 -12 -112 -43 72 8 -102 -17 95 -5 -126 -38 89 23 -124 12 100 48 -75 -2 137
1678A37q6j21O2J30j23n8M1J12p0j22M8J37r7j05Q7R3r0q2Q0O1k8n9L5Q5j0r1
$$ 137 51 -70 -8 122 -1 -59 -18 94 24 -98 -50 87 -10 -115 -28 65 -25 -107 -27 34 6 -53 -18 67 57 -34
1704c4RJ04op6m7J06M3j31JJ22m6j32J4J18rj24J0J19j5j15OJ10J0j37K8J19j1
$$ -34 -25 79 73 -3 -50 56 99 -32 -31 91 45 -87 -73 45 36 -88 -78 41 26 -89 -83 27 37 -100 -72 47 36
1731C6j17M6J21l3j17M0J14k4p5j2J08l0n2j7R1j6r5k6J20j5r1k7J06j1r4l5J10
$$ 36 -81 -35 86 53 -64 -24 90 66 -9 -21 87 57 5 -12 79 63 -32 -58 62 47 -44 -71 35 24 -70 -105 5
1758EM1j18m3J23M4j22MJ04K7j23J3R4K5r5n0J17P7j71L1J06Pj25k7J02M6j09
$$ 5 46 -72 -115 8 52 -70 -66 38 65 -58 -45 49 74 -21 -71 46 123 -48 -17 89 96 -29 -56 46 92 -17
1784a7m2J13mj04k5O3N0q4l0Q9J2o5k3Q1J5o9l7R6M4n2k8R0K4j00p3J38M2j05
$$ -17 -59 54 50 -54 -79 -16 34 -50 -80 9 21 -44 -67 14 29 -40 -77 19 63 11 -17 73 97 -3 -76 62 104 -1
1812an1R5K3p0q2Q0R1j04n8Q5O4q0p3R6K6m2o7O7R1j25m7Q6O2m4p4J01Q2j46m0
$$ -1 -52 43 66 -4 -86 -6 85 -19 -77 8 72 -8 -81 15 41 -1 -68 -1 90 -35 -82 4 66 22 -52 49 131 -15 -55
1841e5P5O7r1o4P6O6n9j00O6Q6m2r0N6N9o0j13J01R3p6q6R8J08q9r7J06P0p9o7
$$ -55 20 87 -4 -68 8 74 15 -85 -19 67 25 -65 -9 50 -10 -123 -22 71 -5 -91 7 115 26 -71 35 105 26 -41
1869d1M1J11r0q6P3Q9o8p4N0R1r5j23J16N7j02k7M3O6p4o5P6R0p5o2O5O0l0o2
$$ -41 0 111 21 -65 8 97 29 -45 5 96 1 -122 -6 51 -51 -78 -35 31 -43 -108 -32 58 -17 -79 -14 46 16 -46
1897d6P5Q3q7p7Q6N3k6r0M9R7p0r6M3R6n5j03L9R9o8j02O8P6p6n2M1R5r5l7P5
$$ -46 29 112 25 -52 34 87 61 -29 20 117 47 -49 -6 90 35 -68 -29 70 2 -100 -32 44 -32 -84 -43 52 -43 -80 -5
1926eM9l3o9M5O3m2p4Q0Q7o5q2N7O0k3p4K9O8m0p6O4L8l6p1J4N6k2o0M1R0k5q7
$$ -5 44 11 -58 -13 50 8 -66 14 101 36 -46 11 71 48 -26 3 71 31 -45 19 57 21 -50 -36 20 -2 -62 -21 69 44 -43
1957d3L0O9o4n1M7O2k8m3M7N4m1n7JP5jj09K6L8Lo9K4N3Kr8K6Q2l4n1PQ6j5l8
$$ -43 -13 56 -8 -59 -12 50 22 -21 26 80 39 -18 -17 58 57 -52 -26 12 15 -54 -30 23 25 -73 -47 35 1 -50 -43 43 28 -10
1989a0j1O1J6q8L6L8K7n1k5N4Ln0k3N7Rl8o8O3L4n8l4L9M5p2j9M7L0m2l6Q3K7
$$ -10 -21 40 56 -32 4 42 69 18 -7 47 50 0 -23 34 43 5 -63 0 34 -24 -58 -19 26 -46 -65 -18 12 -30 -66 17 44
2020D4m4o6Q2K6o3nN9L5n2m3R1Mm2p7P7Jj6m1M8L1o6j3L0K4m4l1P0J1p1m2O3P4
$$ 44 0 -66 16 42 -21 -26 33 68 16 -27 64 68 26 -51 26 27 11 -30 18 49 -17 -30 0 24 -20 -51 19 30 -41 -83 -20 54
2052E4o0q9J01M5o1o9O6P9n9o7O6M4k5q1R2N6q0o7R0M8j01l2O4P7r2o2P2O2q4
$$ 54 -6 -95 6 51 -10 -79 -13 66 7 -60 6 50 25 -56 36 92 12 -55 35 83 -18 -50 14 91 -1 -63 9 71 -13
2081a3o2R3N7j18pO2M4r5J8J3N4k9p6O7O8p5n3P8J2pp4M9L3m3n6K8O8k3n0K2Q9
$$ -13 -75 18 75 -43 -50 12 56 -39 -21 -8 46 17 -59 8 76 1 -52 26 38 31 -43 6 39 -4 -60 -32 36 13 -37 -15 74
2112G4o4p9L8O3n1n0M0J17o7o4P9O6q0o6Q9K9q3nK2Okl1J2M9o1m0K8M2l7l5N0
$$ 74 10 -69 -31 32 -19 -69 -29 88 21 -43 36 102 22 -44 45 74 -9 -14 8 14 12 -19 -7 42 -19 -59 -31 11 -26 -61 -11
2143a1Rj2l3K4PK0m7J7L9J4p0M4M4j3o9K8Q5l4o9K1J03m4n3LJ05p4r1N1P7n8o5
$$ -11 -2 -14 -47 -23 -16 4 -43 -26 13 27 -43 1 45 32 -37 -9 76 42 -27 -6 97 53 0 3 108 34 -57 -6 71 13 -52
2174e2L6O2q6l0M8L2j9m3L5K5j6k4L0J4K8n8oL9K2m0j9K9M4o3NM2L1j13K8O1N
$$ -52 -16 46 -40 -70 -22 10 -9 -52 -17 8 -8 -32 -2 12 40 -18 -24 15 37 -3 -22 7 51 -12 -7 35 66 -47 -19 42 47
2205D7l6m6O5pp6OQ3j4o2%P3no3J8P7n1k8j1P3k2m7LN6nm6OJ8J8m9kML7l1l0K6
$$ 47 11 -35 30 23 -53 -47 36 22 -40 -40 33 28 -35 -17 60 9 -19 -30 43 21 -26 -23 33 28 -18 -12 6 24 -25 -27 -23 14 -17 -47 -21
2240b1L0rn5N7L8l8n0M8N3n6m7P0M4p3k6R1J7p4m3P6J5r9L2L6J4p9J3N0K3r6r
$$ -21 9 0 -55 2 40 2 -48 0 53 -3 -50 20 64 -9 -35 56 73 -1 -44 32 47 -52 -20 16 30 -49 -36 14 37 -59 -68
2271f8M1J3j0j3M4qoj3K6J6rl1K0J3Qj1nO5n9m0L3O0l1q3N7O6o8n0O3J7l5m1N3
$$ -68 -27 -14 -24 -37 7 -1 -7 -20 6 22 13 -18 2 15 23 12 7 72 13 -27 6 66 35 -48 9 75 7 -43 20 37 2 -39 14
2304A4L1p8o9Q4L0m2m1O4M0l9m6L6M0l2J1kM7l0j5RK0j1k9J0M0k3k2J0L2oo0R
$$ 14 45 -33 -102 -18 12 -30 -71 -7 33 -6 -52 -16 24 -8 3 1 48 18 3 12 32 21 -8 2 42 19 -3 7 39 33 -27 -18
2336a8N0l7p5L1J02k5r9N1P0n2o3K6P4m2m3J8P0j6q2P3O0n9o0M7O8m6o9O0J0m2
$$ -18 32 -5 -80 -49 53 28 -71 -20 50 -2 -65 -39 35 -7 -50 -32 38 22 -60 13 73 14 -46 1 69 23 -46 14 24 -18
2366a8KK0J4k7OLJ0nm9M1M1k8k5J1J5Qm6L1L6k6m3J3N2j2o5K3N5m0l8K9N0o2j6
$$ -18 -16 4 18 -9 -3 0 10 5 -44 -3 38 10 -15 -4 11 19 -27 4 40 14 -29 -16 36 24 -41 -18 37 -3 -41 -12 38 -24 -40
2399d0PL4j1q4R0K1l4k3K4M2m6j8JO5j4m1L6M5l0n4K3M7K0o3J4J2J1j7n1M3J4
$$ -40 -33 1 -10 -94 -4 17 -17 -40 -16 26 -20 -38 -37 28 14 -27 9 54 24 -30 -7 40 60 -3 11 23 34 17 -34 9 23
2430B3o1JL9Op2qQ2j9l1J9L0l1kJ0O9l7k7JM6On5NM6j8k6NM8j4j5j0J8J4n9JL2
$$ 23 -38 -37 2 8 -64 -72 10 -9 -40 -21 9 -22 -24 -14 55 18 -9 -8 38 44 -11 -6 40 22 -4 1 49 35 20 10 28 42 -17 -16 16
2465A6Mk1k1L1Kn0K7QRj9l0N0Ok9k7N2ll3k6N7L8o9K1M2J8m2m8N1K2m8j8J6M2
$$ 16 20 -1 -22 9 11 -39 -12 -4 5 -14 -44 6 12 -17 -44 8 5 -28 -54 3 41 -28 -7 35 53 11 -37 14 36 -12 -30 -14 28
2498B8k7n9N6K8l1k6N4mm2j9Q8po7J3K5K1m4%K0J0k6j8J0L8l5m5J8N4j4k4K0K5
$$ 28 1 -58 -2 26 -5 -31 23 19 -23 -42 46 39 -28 -15 10 31 -13 -13 7 17 -9 -27 -17 21 -14 -59 -41 13 -1 -25 -5 20
2530B0m1rK3K1m1j2N5jj5j4K2J0j1l5L6L5l9l6N9Pk6j8J1L0m2k3J6O5n2rj2N0
$$ 20 -21 -30 -7 14 -27 -39 16 15 0 -14 8 18 7 -28 8 43 4 -32 27 34 8 -10 1 31 -11 -34 -18 47 -5 -14 -26 24
2562B4m5k5L0K7l3j4K1N6n1JPK4j2j9kL3mqk7M6j7j2OK4K2p1M8j0j5j9JM1k1l8
$$ 24 -21 -46 -16 11 -22 -36 -15 41 -10 -9 -2 22 10 -9 -11 22 18 10 -17 29 12 0 6 30 52 -19 29 19 4 -15 -14 27 6 -32
2596c2L7K4k0n0LO0k4k8NK9Nm7J3N2n1j7PN2kj9OL5l2m5J7L9lk5J3L0k2k8k2P6
$$ -32 5 29 9 -41 -38 22 -2 -30 -25 4 9 -38 -25 27 -24 -41 -34 18 16 -3 3 38 6 -39 -22 17 14 -11 2 32 10 -18 -40 36
2630C6l5j0J2L8m0j4j6K2L5o7rN7J1n6lM6J3m9L7Pln0OM1km0%N0l7OPQk2j7N8
$$ 36 1 -9 3 41 1 -13 -29 -7 28 -39 -48 9 20 -36 -39 7 20 -29 8 15 12 -38 -32 9 7 -33 -33 17 -20 -14 -7 1 -21 -38 20
2665B0Mnl3L4lJ8l1oK5kmoK6j2l3J3LJ6m6OnM5l9k8N0k1Pk7M2j4m4J2L4Ok5j0
$$ 20 24 19 -14 20 17 35 4 -2 23 21 17 11 37 25 -8 5 8 24 -22 -16 -21 24 -15 -43 7 -14 -7 -34 8 -6 -50 -38 -4 2 -23 -33
2701c3N1nlj9K6oKo%J4k5pN0k4j1j1JL0k1J5J0mj5m0RL8k7ok2M7rm3L5K6m7qK3
$$ -33 18 13 10 -9 17 11 13 7 7 21 -4 -11 39 15 4 -7 -6 24 3 18 28 24 9 -31 -22 16 -11 -17 -39 8 -1 -44 -9 17 -30 -38 -15
2738a5L6j9j6J2M8n9j2L7J1l8l9Q7J1l3j6j3N0m5k5P4j6m2nL7Qj5k1J2J3jl1M
$$ -15 21 2 -14 -2 46 -13 -25 12 23 -15 -54 33 44 11 -5 -18 32 -13 -38 36 20 -22 -27 10 18 3 -18 -6 7 6 -25 -21
2770b1L8pm2K5L1k6kkK0Kl9mN1l1j2OL0l3rJ5K9k0j5J3N9m5k4JM2m5k0N8mj1n
$$ -21 17 10 -32 -7 24 -2 -4 -6 14 16 -23 -27 24 -7 -19 -13 17 -16 -25 -10 19 -1 -16 -3 56 11 -13 -12 30 -15 -35 23 19 8 3
2805CJ1K7k9l3M4K7o3lOqL3o4N0J4qk7oRJ8n6L6RJ0l2K3K5Pl4J8J6k5NJ1J5K8
$$ 3 14 41 12 -21 23 50 -13 -16 -10 -18 15 -49 1 15 7 -20 -26 -17 1 -55 -19 -10 0 -32 -9 16 23 -11 7 23 -2 3 14 29 57
2840E7r0K5L6jm2L9kk0k0L5J7mn6L3j6JJ8k9K5nj0j3K7j9j7J9M2k6k7KM1k1NK3
$$ 57 -33 -8 28 27 -15 24 22 2 -18 17 34 30 -26 7 -9 -8 10 -19 6 1 -9 -22 5 -14 -31 -12 30 4 -23 -21 20 -1 4 27
2874B7n%n0J5K7l6M7j0Kj7J2j1Mj3NK1%Ol8JK5j4j5j5M4j5k9L3jorOK7j9k0PK1
$$ 27 22 22 -28 -13 14 -22 25 15 17 0 12 1 5 -8 -3 18 18 24 -14 -13 12 -2 -17 -32 12 -3 -32 1 0 -6 -15 -9 18 -1 -21 -14 7
2911GL4m9lnK9k3j2PJ9j4NJ8K8m6k3N8jm9QL5j9%l7O4pm9J9OL0l1j6L5k8j7J7
$$ 7 41 -8 -11 -16 13 -10 -22 -15 4 -10 -5 13 41 -5 -28 30 29 -20 -12 23 4 4 -33 31 24 -25 -6 0 30 -1 -17 18 -10 -27 -10
2946a0M9m9k9J2J1Rl3PL6J2pmmL6n1JM0j0J1m4O0j2j9k6K3K7m6pM9j0j7nJ4k3
$$ -10 39 -10 -39 -27 -16 -7 -40 -33 3 15 8 4 0 36 -15 -14 26 16 27 -17 43 31 12 -14 9 36 -10 -17 32 22 5 0 14 -9
2980iJ8m7M1%kmJ7k8j7K3k5K6RoL1j3m9OL4Mj6pMM7ol5K0K5Jn3J6J2j9j1K4J1
$$ -9 9 -38 3 3 1 -3 14 -14 -31 -8 -33 -7 2 -4 27 14 -35 -29 5 9 -7 -14 -10 37 31 -4 16 41 42 -11 5 17 -2 -13 11 22
3016B2k9PlN5n1oNjMk0OL1j8Jj0J9mpK2k8J5k6OJ5qRK1k9pk0L9lL1m0j8K6jL8
$$ 22 -7 0 -3 52 1 -5 0 -1 3 -17 -11 20 2 3 -7 12 8 1 23 -5 10 -16 -10 5 -3 6 27 -2 -9 -29 10 7 38 -2 -20 6 5 43
3054D3l7J2Pm0K3L2lm1pL6k0j7J7K5m1K%K6l0J3Oj1K4k8nPJ6l6J6K0Rj6J0klk0
$$ 43 6 18 25 -15 8 40 37 -4 -11 25 5 -12 5 30 -11 -9 -9 17 -13 0 6 -5 19 -9 -14 -7 9 -27 -11 9 18 2 12 10 7 -13
3090a3K4LJ6l4M3L0m4j8J7qj0nQK6l4j3KKM8n7J3J9k3j6K0J9%o4L3Qj3J4jkj4
$$ -13 11 14 30 -4 39 69 25 7 24 16 6 1 9 35 1 -12 -10 -8 40 -17 -4 15 -8 -24 -4 15 15 -49 -16 -8 -21 -7 -8 -10 -24
3125b4KQK1Ll8M0K8k6j4j8N1j0j8J1J7k7J0l3L1j0k9J9K1rk1RL0k1j9J4m7M2j7
$$ -24 -22 -14 7 10 -28 12 40 14 0 -18 33 23 5 16 33 6 16 -17 14 4 -25 -6 15 6 -15 -6 24 3 -16 -2 -49 -7 -24
3158b4J9KLqJ3MK2k5j9PJ6j1K5k6J3j7kL6l0lrK3L6n8J5nL7j2l9M1j2l0%J0K3
$$ -24 -5 -3 0 -8 5 9 31 6 -13 -6 10 -1 24 -2 11 -6 -8 28 -2 -5 -14 9 45 -13 2 -3 34 22 -17 24 12 -18 -18 -8 15
3193A5rk3QJ1j6K7J3j6k4j8L2j6K0j9pK3PpJ5nk3Mj8L5Ml5L9L0n2j2L9Kj0k2R
$$ 15 6 -17 -9 2 -14 13 26 10 -14 -32 0 -16 4 -15 -22 1 8 1 16 11 -12 -8 -26 9 13 -22 17 47 -5 -17 22 24 14 -8 1
3228AL3kj4J7j8Nn6K9J7j4k6K7J1l9j2L7jk8J1K0mJ9k4K0qRk3J9L9l8l5N7kj6
$$ 1 34 32 18 35 17 22 -34 -5 12 -2 -28 -1 10 -29 -41 -4 -5 -33 -22 -2 -6 13 -11 9 1 10 -13 6 45 7 -28 29 27 11
3262A1J5m7M2j0k2K4K5l2oJ2j6K4l6K1J5k0j6RJ6Rk5qJ9l8K4J3lqj8L3j2j7NK9
$$ 11 26 -21 21 11 -11 13 38 6 0 12 -4 20 -16 5 20 0 -16 -7 9 18 -7 -15 4 -34 -10 3 0 -8 -26 7 -5 -22 -17 12
3296A2JJj1j3K7l5NMJ8Kl7J7K9j0K2k8j7J8%J3j4Ml5J3J5Jj2j5L9k0prL8mj1q
$$ 12 13 14 3 -10 17 -18 -13 -9 9 11 -26 -9 20 10 32 4 -13 5 5 18 4 8 -27 -14 1 2 -10 -25 14 -6 -13 -22 16 12 1 -7
3332gJ4K1ol2J2Ll9L8PK7j9j5J0lJ0k8L2jj1KPJ3Km1JrJ7j3K8K5m9oL0qk2rJ1
$$ -7 7 28 22 -10 2 5 -34 4 11 38 19 4 14 11 21 -7 25 24 13 15 22 35 37 -4 -3 -12 5 -8 20 45 -4 -10 20 12 -10 -19 -8
3369hJ6Qj9rj4Rj8L0lj0KJK9n7M7J6%j3mK1j1j1J6NmJ7j7QRm1QJ6L1o1j2L3%l7
$$ -8 8 16 -3 -12 -26 -17 -35 -5 -8 -18 -16 -15 14 -43 4 20 20 7 3 24 13 2 18 23 19 36 19 27 36 -5 3 19 50 -11 -23 10 10 -27
3407b7J2L8J0k6k0NqJ1j2oJ9oj4K8O%k2J3K2j2j2J8Qj6j8J2K3k9pML3k5lK4Rj
$$ -27 -15 23 33 7 -13 -8 -16 -5 -17 -23 -4 -10 -24 4 10 10 -12 1 23 11 -1 17 25 9 -9 3 26 -3 -10 -6 27 2 -1 23 32 31
3443C1k4qNL3k7mlQj6qJ8j2l4M0QJ7k8pJ1k7K1KJ5jk4NJ9k1oK8j4JLOj7L5Ll4
$$ 31 7 -1 4 37 10 6 3 11 -5 -13 5 -7 -41 -1 7 24 -4 -11 0 -27 -6 -4 11 10 -14 -9 10 -11 -17 11 -3 -2 1 7 -10 25 28 -6
3481fM4m1qKK5j9l8N7mj7k1L1m%l8L5j7PQk4K5j8J4mKJ6J1j0qqoJ4J0KOkK3l8
$$ -6 38 -3 -11 -9 16 -3 -41 16 12 -5 -26 5 1 1 -37 -2 -19 -12 -4 -28 -3 -21 -7 -11 -9 7 18 8 0 -8 -14 0 10 12 18 16 39 1
3519AJ1M3m3j9kK2j8Rj4J9qlk6lM3j3k4J9mM3l8jlMJJ0J3m4kK3J5j1rK0mJ2l2
$$ 1 12 55 12 -7 -9 13 -5 4 -10 9 1 -2 -28 -31 12 -1 -25 -6 -10 33 -5 -6 -9 -5 -4 6 19 -25 -27 -4 11 0 -9 11 7 19 -13
3556a3K4L2k6pkK4ol2k6M9k6oPJ9Rmk1QJ4m5nK8j5L6k5J8Jm1L4nrj0j8M8Pj0j8
$$ -13 11 43 17 10 8 32 26 -6 -32 17 -9 -15 -8 11 20 16 -5 3 17 -28 -33 -5 -20 16 -9 9 10 -31 3 -2 -11 -21 -39 9 16 6 -12
3593a2PLk0QJ8k0lK7j5J0loL3k2m5K5L9k8KQK8m0NrJ9qj2L4j8k0Pj0K4jll8J1
$$ -12 -5 -2 -22 -14 4 -16 -19 8 -7 3 0 -6 27 5 -40 -15 24 -4 -2 6 34 -6 -1 -10 9 1 -11 23 5 -15 -8 -18 6 5 2 -36 -25
3630b5K7qj6J2J3NoJ2k5PnJj0QKJLOj0QOJ1j8%qPj6kK4k1MJ3Lj5kk8L2J6l2qJ9
$$ -25 2 -6 -22 -10 3 8 2 14 -11 -4 -9 -8 -18 -10 -8 -7 -4 2 -8 0 6 17 -1 -1 -9 -2 -18 -20 4 -17 -13 0 3 -12 -14 -42 -10 6 -26 -34 -15
3671a5O%jKnpJ6L5k4j1J8J2k6J0Lj2K8j8oRj5J8oqJ3m3J0M3j3k6K4rj6mRJmj6
$$ -15 -9 -9 -10 -8 -13 -20 -4 31 7 -4 14 26 0 10 13 1 29 11 5 14 -1 17 11 3 16 -27 -17 26 13 -13 11 2 -14 -18 -9 -8 -12 -28
3709b8j8J3L9l0%J4K0k3PPmk2K1pK3k0J4MrpkNM7j6l3JpK5k1%Nk0J9j9pnM1k2
$$ -28 -46 -33 6 -24 -24 -10 10 -13 -6 1 -3 -25 -4 -11 12 -8 6 10 1 -6 -8 -3 44 28 -5 -4 -11 14 -7 -7 -2 -22 -3 -22 -29 -34 7 -15
3747a5j4L3j0j8K9k9L6j7OrrQJ6k4K8m5M0lj4kL4j9KlJMj6J3pJ2PnPj2j0K1k7
$$ -15 -29 4 -6 -24 5 -24 12 -5 1 -8 -17 -9 7 -17 11 -34 6 3 -11 -13 21 2 4 1 2 6 -10 3 -4 8 15 10 17 5 -5 16 -11
3784a1L0k0L0l2Nj8rMkK2k1PPk5J3J4qJ2l0K1K7k8J7nl5kM8j6J1j1NK5l5J9kl5
$$ -11 19 -1 29 -3 2 -16 -25 -21 -23 -1 -22 -15 -8 -33 -20 -6 -14 -2 -32 -11 16 -12 5 0 -35 -37 11 -5 6 -5 0 25 -10 9 7 -28
3820b8N2m5J6K9k1J3j3Nlj6j3K1qj8NJ5Jj7J5j7K3k2kP2m3%j9J4oj2K8LJj2J2
$$ -28 24 -21 -5 24 3 16 3 8 5 -11 -24 -3 -11 -29 -24 -9 -8 -25 -10 -27 -4 -26 -28 44 1 1 -18 -4 -10 -22 6 9 10 -2 10
3855A0pQl1K1NRl8OL3j7j5J3jj0pJ9Oj4JrL2k8JK3m5jPK2Om3K5K4j6Ok1MK4j4
$$ 10 3 11 -20 1 6 15 -23 -17 16 -1 -16 -3 -4 -14 -21 -2 4 -10 -9 -18 14 -14 -13 10 -35 -36 -29 -7 -1 -44 -19 5 -11 -5 -26 -22 2 -12
3893a2Rj1J9jJj0J0oJ6Qk9K6Llj2OKp%J0k7J3lk2J1MLjl1K0KLqrJ7j4l1O5k8K1
$$ -12 -3 -14 5 4 5 -5 5 -1 15 23 -6 20 23 20 8 14 16 9 9 19 -8 5 2 -20 -9 -5 -2 -3 -34 -14 -12 -9 -17 -26 -9 -23 -54 11 -17 4
3933Dj6JpJ6J6j2MlK9m4M6k5nK7%l7K1j7K8k2rk2M2jl8J0j3JK6Nk4MrJ3jk4K3
$$ 4 -12 -11 -18 -2 14 2 6 3 32 -12 34 9 4 31 31 -6 15 -2 26 4 -5 -27 15 14 -24 -14 -27 -26 0 5 -19 -15 -24 -11 -12 -36 -13
3970a3j3M2k8MJ3j3J6%k3k2M2l7K2ROK4k2%J6j9Pnk8J1J9lj0o%kK7k2kRJ2Nl7
$$ -13 -26 16 -12 -8 5 -8 8 8 -15 -37 5 -32 -10 -1 5 29 7 7 23 4 11 6 -22 -11 8 5 -5 -11 -11 -13 14 -8 -10 -1 11 16 -21
4007b1rK8k5NJ4j8omK8j3J9LJ4mmoK5l7M3j7J9l2LJ4k9K3k%%%roMoOOjlkLj9J
$$ -21 -30 -2 -27 -22 -8 -26 -32 -36 -8 -21 -2 1 15 11 7 1 26 -11 32 15 34 2 5 19 -10 13 11 11 11 11 2 -4 0 -6 0 6 5 2 0 3 -16 -15
4049a5%nLMJ6k5K7k2OJ8j3j4J7J3k8L7j3nJlMnJ7j2NmmJ6j6rK6k1j1jL2j4%Nr
$$ -15 -15 -20 -17 -13 3 -22 5 -17 -11 7 -6 -20 -3 10 -18 19 6 1 2 -1 3 -2 15 3 8 4 0 16 0 -9 17 -4 -15 -16 16 2 2 7 -2
4088bj6mJ2j1K3j6J3ml6L5NOl9J9L9k8LLj4j7M1Ql0L0j4Mk1K3nOoOj8KK2j6j3
$$ -2 -18 -22 -10 -21 2 -14 -1 -5 -41 -6 -1 5 -34 -15 24 -4 -1 2 -12 -29 12 20 -10 20 6 10 -11 12 7 13 7 13 -5 -3 19 3 -10
4125a0KomJ5j8J9k7J0J0j9JJ4K0j1j5M5m3Jj1kQRkK9Mn2N2j7j9J9J8j8K5k1rN
$$ -10 -8 -14 -18 -3 -21 -2 -29 -19 -9 -28 -27 -13 7 -4 -19 26 -17 -16 -27 -29 -21 -12 -14 15 19 -33 19 2 -17 2 20 2 27 6 -3 2
4161BK3k9Qj4N%j5K4qj0NJJ9k4mJ3J9l4rk1K4QpJ0j6K4PNKj0lrJ3M4k6j0pnj0
$$ 2 25 -4 4 -10 -5 -5 -20 4 -4 -14 -9 -8 11 -13 -17 -4 15 -19 -28 -49 -25 -17 -24 -14 -30 -6 1 6 8 -2 -5 -14 -1 43 17 7 0 -5 -15
4200a5L0j7K4k4K8k7JpKj4N%J0l0K8Rqj0Ok2L3J5l1RMJl1K3O%rk0N7Nm0K7l3K0
$$ -15 15 -2 22 -2 26 -1 0 -7 -5 -19 -14 -14 -4 -34 -6 3 -5 -15 -9 -31 2 17 -14 -5 -1 0 -31 -8 -2 -2 -11 -31 26 31 -9 18 -15 5
4238EJ3pk9M8j0mpoj7jJ7l1lK2J3Lj9K7l5L8l3oL6j5J%rj1J3J3j5RJ5j8l8P4m0
$$ 5 18 11 -18 30 20 16 9 3 -14 -15 2 -29 -32 -10 3 6 -13 14 -21 17 -16 -22 14 -1 0 0 -9 -20 -7 6 -9 0 15 -3 -41 33 -7
4275gK2Kl9K8j1J8ml1J9K4Nk9OJ3l7M9j4j2K7k3j4JJ5npqJ2KPk9k6L3jJ4j2L1
$$ -7 15 17 -22 6 -5 13 9 -22 -3 21 26 -3 3 16 -21 28 14 2 29 6 -8 -7 8 3 -4 -12 0 2 9 -20 -46 -13 -14 0 -12 19
4311A9n7J9j5L8j1KkRmL2om2L7j3k3jJ2J6Nk8L9j9K9k8J1k8J5k7OPMnmk3K4j0
$$ 19 -38 -19 -34 4 -7 -5 -7 2 -2 30 24 -18 19 6 -17 -18 -6 10 15 -13 26 7 36 8 19 -9 6 -21 -15 -8 -4 -9 -13 -36 -12 -22
4347b2RK2k4k9L2j7J5pJ2J7rk9K9pMJ4Rk%j7L0k0%oPj2J8j6nQj6jL0j6K7l1j3
$$ -22 -13 9 -15 -44 -12 -29 -14 -21 -9 8 -1 -30 -1 -8 -4 10 19 17 17 0 30 10 10 4 11 -1 17 1 -4 4 -12 -13 17 1 28 -3 -16
4384a6J1mlpL5m4J2k2K0K3k7K0j2j0QJ4K1j7J5m1K0QK5l9L5rJ0k9K0Nmj3J1k7
$$ -16 -5 -9 -12 -19 16 -28 -16 -38 -18 5 -22 -2 -14 -24 -16 -2 19 2 17 -24 -4 4 29 -10 25 16 26 -3 17 22 18 5 16 -11
4418a1K7l1pL0k4K1J4mplJ6pm7J8Jk1L7jmj8K4mnQK1k7k6L2%J3m5M3K5m8L7k5
$$ -11 16 -15 -22 8 -16 5 19 15 8 5 21 14 -33 -15 -14 -35 2 1 -3 -21 3 -1 -6 2 23 -4 -30 2 2 15 -30 13 38 -10 27 2
4454BPPqK7k3oJ3nRj6j0j9J0QNRl3rK8j0oJ1jJ2k3L1j2j5J5qJ5jRj2%qJ7qmmK4
$$ 2 9 16 8 35 12 6 19 14 23 7 -3 -22 -12 -4 1 10 -23 -32 -4 -14 -20 -9 -10 2 -21 10 -2 -17 -2 -10 5 4 13 1 1 -7 10 2 -2 -6 18
4495A8n2N0j0OMlkkk8J4qL0mJ3l1J3l0k0M9j9k3J0J2qL5j6j0j1NNMj0NL6Qn6M1
$$ 18 -34 16 6 12 16 13 11 9 -19 -5 -13 17 13 26 -5 8 -22 -42 7 -12 -35 -25 -13 -21 14 -2 -12 -23 -18 -13 -9 -19 -14 22 30 -26 15
4532A5jk3K5j4jj7K4p%J4kpoPk4QK5k7lMlJ8j6lK0k3J6j4mqMQj7J7K0Nl0K2rJ7
$$ 15 14 -9 16 2 1 -16 8 1 1 15 13 6 0 7 -17 -9 16 -11 -14 -10 -13 5 -11 -14 6 -17 -1 -15 -19 -27 -23 -15 -32 -15 5 10 -20 2 -7 10
4572A0Knoj8J9rJ1qL3j1J7l7K4j5Qk1PJ6l2L8j4l0J7lqNJ6Km0K5l3K4PK3n8J2
$$ 10 12 7 1 -17 2 -7 4 -4 29 18 35 -2 22 7 15 -6 1 17 -15 23 9 -21 -4 -7 -15 -10 6 8 -32 -7 -40 -16 -9 14 -44 -32
4608c2L0k9L4k4K5kl0L0mKj0RQJ7k8qL5Jl1K9l8J5K1k8Kk4L8qqJj6L4k1RLj2p
$$ -32 -2 -31 3 -21 4 2 -28 2 -2 0 -10 -1 7 24 -4 -12 23 24 -7 22 -16 -1 20 -8 -6 -30 8 0 -8 -7 -23 11 -10 -1 2 -10 -17
4645a7k0J0J7RkLOj8J3MmJ9J0l0JK5Krol4L1%J7k4J7k6J7KJ1k0q%PJj6L2J0l5
$$ -17 -37 -27 -10 -1 -3 0 6 -12 1 5 1 20 30 0 1 26 28 19 13 -21 10 10 27 3 20 -6 11 13 24 4 -4 -4 3 4 -12 20 30 -5
4683eJ0Mk4mJ2j0K6j8j9L0j3k5L5j1jMPrMnL2j1j7j7M0j8lK4k4J5lK1m7L3j3Q
$$ -5 5 9 -15 -19 -7 -17 9 -9 -28 2 -11 -36 -1 -12 -13 -9 -2 -11 -7 -12 20 9 -8 -25 15 -3 -6 18 -6 9 6 27 -20 13 0 8
4719HoJ5k6L5l9nN2%m5nMmJ7l9PL4j3j2qQQJ6qPrJ3j4J6K2j8K8oj0j8M2m3Pj7
$$ 8 2 17 -9 26 -13 -18 34 34 -11 -16 -12 -16 1 -38 -31 3 -10 -22 -30 -22 -14 2 -6 1 -8 5 -9 7 29 11 39 33 23 5 47 4 11 -6
4757fJ7k1LK0nj0K2m0QJ7%k7J7j7K6Pj6K2k1j6kK5k2K6Pk6K5m3L5j0J6Rj8k7M3
$$ -6 11 -10 -7 13 8 -2 20 -20 -12 5 5 -22 -5 -22 4 11 -5 17 -4 -20 -22 3 -19 7 14 -12 13 -30 5 -5 11 20 2 -25 18
4792A8k5M6m0l2O4m0L6j0j7nJ7j2j5m%J5J3m9L9j2kK9l5L9j6p%k7JK1j1L8j5J2
$$ 18 -7 39 -1 -33 31 -9 27 17 0 -5 12 0 -15 -19 -19 -4 9 -40 -1 -13 -15 14 -21 18 2 -5 -5 -32 -31 -10 -21 17 2 14
4826A4k0j2K7j9J5J2jNk2k3J7J6j8J7PrOj8J7Qk5LlROj8rqk1M2nj6J8QpkmpKK4
$$ 14 -6 -18 9 -10 5 17 16 21 -1 -24 -7 9 -9 8 15 6 12 -6 11 19 -6 -3 -6 3 9 -9 -18 -26 -47 -5 -10 -26 -8 0 -7 -9 -13 -20 -18 6
4866Fk0QjL0j9j2j5M2k9NJ3Qk0j3M3m2K2lK5k4oMj3J2j2j5J4PQl2JlK3Pm4L2K2
$$ 6 -14 -6 -7 23 4 -8 -23 19 -10 -5 8 16 -4 -17 26 -16 6 3 28 4 -2 2 -11 1 -11 -26 -12 -5 3 -29 -28 -31 -8 -1 -45 -13 9
4903IMrnJ2l3lJK3j4L0k4J4k1mM7k2moJ9k3OQ%nj2J5lJj4QRJ4k1KkJLkj7oK6j0
$$ 9 13 4 -1 11 -22 -25 -24 -1 -15 15 -9 5 -16 -20 27 5 1 -5 14 -9 -3 5 5 0 -12 3 0 1 -13 -5 4 18 -3 -1 -3 -2 1 -1 -18 -24 2 -8
4945hjj2J4Rlk7Qj4K3MJ6LrJ8j3j0LK2k6J3rOj5%J7j3NJ4Ok9J2J4prk0L6k2lj2
$$ -8 -9 -21 -7 2 -1 -28 -20 -34 -11 -7 9 12 3 21 8 -2 1 23 -3 10 1 7 -8 -8 9 -4 1 15 21 -8 4 18 11 2 -18 18 -4 -7 -19
4984a9K7j6j4J4k3MNQK1j6mK4Lj4L7j5pokpK6k8J5j3K8l3pL7k9J5k0OL3l7J4p
$$ -19 8 -8 -22 -8 -31 -27 -22 -14 7 -9 -13 11 14 0 37 22 15 9 7 0 26 -2 13 0 28 -5 -12 25 -4 11 -9 -3 30 -7 7 0
5020@K9l7nj1QOK0j5j7OLJ0j3J2J3k2kj3K9k2MQJ8nk5L5Jj8nK4j1J7j3l2L1j3
$$ 0 29 -8 -13 -24 -16 -10 10 -5 -22 -16 -13 -3 -16 -4 9 -13 -15 -28 1 -21 -17 -9 9 4 -21 14 15 -3 -8 16 5 22 9 -23 8 -5
5056eK3kjjk0J3j7lOjkPj3JoOkJ3NqpK6Lk3NJ3m1K9LJk7RJ2J1oPqk0K6J3okPj1
$$ -5 18 16 15 14 -6 7 -10 -13 -7 -8 -10 -3 -16 -15 -21 -15 -17 -4 1 -7 -14 12 15 -8 -3 10 -31 -2 1 2 -25 -16 -4 7 1 8 0 -20 6 19 13 11 18 7
5100GNk0K5j0J7m8J7Ok4M0k0knmQjoJ4oK6k2k3M0k9RKPnQPKj2lj7L6k8lk9L9J5
$$ 7 12 -8 17 7 24 -24 -7 -1 -25 15 -5 -7 -12 -16 -8 -9 -15 -1 -7 19 -3 -26 14 -15 -6 -4 3 -2 6 13 15 3 0 -17 19 -9 -12 -41 -2 13
5140A3Nn4L4j2MRk0J5kNJqpJ7mk8N6l6jMJ6mj7J0j2K2Mj3KJ6lj7rK5J9k2j6NN
$$ 13 18 -36 -2 -14 -10 -1 -21 -6 -8 -3 -2 -10 -17 0 -4 -32 24 -12 -13 -9 7 3 -14 -4 -16 6 10 -3 -1 15 12 -5 -14 11 30 8 -8 -3 2
5179BJ9qoNm1K9pK1k3mJ4j5RNj5NRj9pJ9j9mL9l7K4J0jJ4Jk0J7j6j9M4k7Nj8L7
$$ 2 21 13 7 12 -29 0 -7 14 -9 -13 1 -14 -5 0 -15 -10 -1 -20 -27 -8 -27 -31 8 -29 -5 5 4 18 19 -1 16 0 -19 25 -2 3 -15 22
5217B2Jj3kpRppK4j3nJ1k5M2m0J6llj1j8kJ3LJ0j8rL3k4L0Jj3J2pl6K3Qk1O0m7
$$ 22 23 10 8 1 10 3 -4 20 7 2 13 -12 30 -10 6 3 0 -11 -29 -31 -18 -15 -5 -23 -32 1 -23 7 8 -5 7 0 -36 -13 -5 -26 34 -13
5255a3J2lK0k5L3l4PJJ1jJJ9l9K9j5lk5J7N4k8l4onKL7j1k6NMjk1K3L5k1K8k6
$$ -13 -1 -4 16 -9 24 -10 -3 -2 9 8 9 28 -11 18 3 0 -25 -8 46 18 -16 -22 -27 -25 12 1 -25 -20 -16 -17 -38 -15 20 -1 27 1
5291AplLmJ3llNmRj0J7qJ7k0nJ0j4J9l0L2qnj2j1J1M3n1L0J0k4j3J9pj2K8k4m
$$ 1 -6 -9 -6 -10 3 0 -3 2 -2 7 -3 14 6 23 3 -2 8 -6 13 -17 15 7 2 -10 -21 -10 33 -18 12 22 -2 -15 4 -3 -15 13 -11 -15
5329a5J2lpNJ0k5QJ7PJ0nrllJ3l0K3nJ7Mk7J8Kj7j5N6n0J9k5OlmM0k6Mk7J4nj6
$$ -15 -3 -6 -13 -8 2 -23 -15 2 9 19 14 5 2 -1 12 -18 5 0 17 21 -6 12 14 -3 -18 38 -12 7 -18 -12 -15 -19 21 -5 -1 -28 -14 -19 -35
5368c5K8k4K4j5OJ5k0PL3Ol7K6l1J0OJ3jj6MJ8%j0PrrK7k6MJ1qj5pJ8K1j6j3J
$$ -35 -7 -31 -7 -22 -16 -1 -21 -14 19 25 -12 14 -17 -7 -1 12 11 -5 -1 17 17 7 14 5 -4 23 -3 1 12 4 -11 -18 0 21 5 -8 -7
5405gNl1K5J4j0j8J1lMk1KJ6pK2rj3J6jj1M1n2L4l0J8J7Kk1K2prJ8qJj2Pj8Mp
$$ -7 -2 -33 -8 6 -4 -22 -11 -14 -10 -31 -29 -13 -20 2 -7 -20 -4 -5 -16 25 -27 7 -23 -5 12 14 -7 15 8 -1 17 9 10 -2 5 -13 -9 -16
5443a6K0k1K6oj3jK4k3J0m2K9%J1k8J1NJ9l3J4J2J0k7L1j5Mpj4M0lj7K3kJ2k0
$$ -16 4 -17 9 3 -10 -11 13 -10 0 -42 -13 -13 -2 -30 -19 -14 5 -28 -14 -2 8 -19 12 -3 1 -6 -20 20 17 0 23 21 33 13
5477A3%j6J8%k4J1RoLj9Oj3J8J3l2J9k8PK6j7J8j4k6M6l4rj8N5lj9L3qj0k1KJ6
$$ 13 13 -3 15 15 -9 2 11 5 8 -11 -5 -18 0 13 -19 0 -28 -21 5 -12 6 -8 -34 12 -22 -31 -49 6 3 -16 17 9 -1 -22 -20 -4
5513dK6k6J6k9J7qL0ml6L3k7LMPj5pJ1j1J4j6K5qMJ5qnk3K2k9L1j8J7j1k0QJ0
$$ -4 22 -4 12 -17 0 -8 22 18 -18 15 -12 -9 -5 2 -13 -20 -9 -20 -6 -22 3 -5 -1 14 6 1 -22 0 -29 2 -16 1 -10 -30 -22 -12
5549a2J5j1oK2JKMj9QJ3k6M1j3k2Qj0K8j6lk5L3l2KL5m0K9l7J1J1kk1K5J7l4L5
$$ -12 3 -8 -14 8 9 11 15 -4 4 17 -9 32 19 -3 5 -5 23 7 4 -21 12 -20 -18 17 -23 6 -31 -20 -9 -11 -32 -7 10 -24 11
5584A1pj5%k8L5rJ5j3j0K4J4jj9j0Nj1jL4Rj7lK1m2KJ3J3L3n6L2mqj0J4pk4K1
$$ 11 4 -11 -11 -39 -4 -13 2 -11 -21 3 17 16 -3 -13 -8 -19 -20 14 23 6 3 24 -18 -16 -3 10 43 -13 19 15 7 -3 11 4 -20 1
5620Aj8Rk5K1NJ0k5MK2j9J7mJ5l5M5k7j3J7L7m3J2k4K1J9l2K6mj8oPJ4K1m6J0
$$ 1 -17 -8 -33 -12 -7 3 -22 -18 4 -15 2 -2 13 -22 23 -4 -17 0 37 -6 6 -18 3 22 -10 16 12 -6 -12 -5 9 30 -16 -6
5654fJ9k6K1j9PQl0qMJ7KK8l3L1m1J6Jk5RRL2j3j1PJ2j0j8K8J4Oj8Ql8J0JK4j4
$$ -6 13 -13 8 -11 -4 4 -26 -34 -30 -13 -11 17 -16 15 -26 -10 -9 -34 -25 -16 16 3 -8 -1 11 1 -17 11 25 31 13 21 -17 -7 -6 18 4
5691DRj9J2K0n3K5nk1QJ6j7LOj2pK5j5Kj0MJ4j2RjJ2J3j6J5k7L7k0J2J7j6J0r
$$ 4 13 -6 6 26 -27 -2 -7 -28 -20 -4 -21 -18 -12 -24 -31 -6 -21 -19 -29 -25 -11 -23 -14 -15 -3 10 -6 9 -18 19 -1 11 28 12 22 13
5727A3j6J8k4J8K4m0J6rJ4j2QJ0j4l4K9%Qj0pNnjL2j9l5OM2l1oPJ4k8J2K6j7%
$$ 13 -3 15 -9 9 33 -7 9 0 14 2 10 20 6 -28 1 1 9 -1 -8 -3 -8 -9 23 4 -31 -25 17 -14 -20 -13 1 -27 -15 11 -6 -6
5763fQokK1j7Nk3L9l4NplK7pk3QL0Ml7j0NNJ9kj3rMJJ7mj3J2k0J9qK0k6NJK6j0
$$ -6 2 -4 -6 15 -2 3 -20 19 -15 -10 -17 -20 7 0 -23 -15 15 19 -18 -28 -23 -18 1 -1 -14 -23 -19 -18 -1 -5 -18 -6 -26 -7 -15 5 -21 -16 -15 11 1
5804Aj2jRl2J4L5K%k1J9k7jL3j2l1K6J5J4j9k8J7nQqJ2ll2PMj9K2j1RRJ0k7K6
$$ 1 -11 -12 -3 -35 -21 14 16 16 -5 14 -13 -14 19 7 -24 2 17 31 12 -16 1 -4 4 -4 8 5 -27 -20 -16 -35 -13 -24 -15 -6 4 -23 3
5841COl6K0L%RK0j6j7L1j4J0J4m0J8j1j9L3j2kJ7j0k7MJ8kk4QL1l9J4J2rQMPk6
$$ 3 9 -27 -7 -4 -4 5 25 9 -8 23 9 19 33 -7 11 0 -19 14 2 0 17 7 -20 -16 2 0 -24 -16 15 -24 -10 2 -7 1 5 12 -14
5878a4J4k0K1l6K9l1M1k2K1kJ2j7K5k6J8jk6J6J7k2L3l5K4jKj3j1j5N8l7j6K7
$$ -14 0 -20 1 -35 -6 -37 4 -18 3 1 13 -4 21 -5 13 12 -14 2 19 -3 30 -5 19 18 20 7 -4 -19 39 2 -14 13
5910A3l1K2J3Lk4Ok5L3k4K4m5K0J8kNj0j1M4l3k6K1pjjOJ4j0QmK5j4Jpj6J2J8
$$ 13 -18 4 17 20 -4 2 -23 10 -14 10 -35 -15 3 1 6 -4 -15 29 -4 -30 -9 -16 -17 -18 -12 2 -8 0 -4 21 7 8 1 -15 -3 15
5946A5Loj0nk5L3lP%prJ0m1nL6L5m5LJ9k1L0k4J9rpJ4qL1l1k5L3NJ4k2J5j3Oj4
$$ 15 18 12 2 -3 -28 5 2 9 9 2 -7 3 -38 -43 -7 28 -17 -14 5 -16 14 -10 9 0 -7 7 -1 30 -1 -26 7 12 26 4 19 6 12 -2
5984bJL2k1n2N4J5l0%MJ3j3J1lj7j4J4PJ4%k8RjK9j7k0J1j7mK9pl5J7J8j8K0J9
$$ -2 -1 31 10 -42 12 27 -3 -3 1 14 1 12 9 -8 -22 -8 -1 13 13 -15 -6 -7 22 5 -15 -4 -21 -25 4 -3 -38 -21 -3 -21 -1 18
6020A8ol2K2J5k8NJ8j7J4lnjqnoM0k7jJ2j5oLlJ8j0j3K7k6J0J3k2QJ%%J0Nk0K0
$$ 18 12 -20 2 17 -11 -6 12 -5 9 6 1 0 -8 -13 -19 21 -6 -7 5 -10 -16 -13 -16 2 -8 -21 6 -20 -10 3 -19 -11 -10 -10 -10 0 5 -15 5
6059Ej3J4nRlj3K4k3J5nJ6k2K1qj2J4pJ3rk%j8K0J1j3k8K7onrK5j6m%Pl2L2J2
$$ 5 -8 6 1 10 7 -6 18 -5 10 5 21 -1 20 12 0 14 7 20 11 9 9 -9 11 22 9 -19 8 2 -3 -12 13 -3 -7 -7 0 -32 0 12
6097A2j0KpQk2K0J4j2NK2j3j6k5N1j6J1j2J5j4l0PPj2K0k8J5J2Mk5j4M2j5k1K1
$$ 12 2 4 -3 5 -17 3 17 5 10 32 19 3 -22 29 13 24 12 27 13 -17 -10 -3 -15 5 -23 -8 4 8 -17 -31 11 -4 -25 -4
6131dpJ1j9J2j9J4mLRJ1l3M9j3J2j5k7L2j1J3OMqlnk0%J9Pk5J2nLJOj9K1k6PJ7
$$ -4 -11 0 -19 -7 -26 -12 -16 -13 -4 7 -26 23 10 22 7 -20 12 1 14 20 24 16 13 8 -12 -12 7 14 -11 1 -4 -1 0 6 -13 8 -18 -11 6
6170FJl4K9kj6K1rmNj2J5%j3J1J0qj3J6j4L8k4k1OL2j5Oj3Mqj5J3J6jNKqJ1l3
$$ 6 7 -27 2 0 -16 5 -4 -8 -3 -15 0 0 -13 -2 8 0 -13 3 -11 27 3 -18 -12 20 5 11 -2 2 -6 -21 -8 8 7 12 14 6 17 -16
6208a6K5J4k0%K3n3K9k3K0rj2J7Om4L7kJ5kPk2JM6k7jPk2J7k8L3J0k9OJ3Kk3L5
$$ -16 9 23 3 3 26 -27 2 -21 -1 -10 -22 -5 1 -43 -6 -8 7 5 12 -10 -9 37 10 9 16 -6 11 -17 16 26 -3 3 16 18 -5 30
6244C0pk4K1k4m2K9J6RJnj3J7j9k5K6Lj6j0L9j3l0J6J6KJ9l1RrQJ0J4j3j1j1L4
$$ 30 23 -1 20 -4 -46 -17 -1 8 9 4 -9 8 -11 -36 -10 -7 -23 -33 6 -7 -37 -21 -5 -3 16 -15 -6 -15 -7 3 17 4 -7 -18 16
6279A6k4J7mkNJ8j4k7M5k9oKRk9J9J4mk0oKJ9NLj8j1L5k3k6OL3j4N%JJ3J2n0L2
$$ 16 -8 9 5 3 8 26 12 -15 30 1 -5 -3 6 -23 -4 10 6 -14 -20 -18 1 6 9 -9 -20 15 -8 -34 -28 5 -9 -4 -4 -3 10 22 -28 4
6317DJJ5J2k5OpRJk4lL6l2LJ8JmRj5l0j1N5kk6Pk4L4j6Rmlqm%kJ4j3%K0l1J5J7
$$ 4 5 20 32 7 13 6 15 16 -8 -11 25 -7 -4 14 15 11 20 5 -25 -36 19 17 -9 -2 -26 8 -8 1 -3 -6 -14 -18 -18 -20 -6 -19 -19 1 -30 -15 2
6358Bj7K9mRMm7M6qpj1J2j5J0pJ2j1lL7k3j3k9NK8Pj4Mmjk9L3k6L4J2k4Kj5J4
$$ 2 -15 14 10 19 23 -24 22 14 7 -4 8 -7 3 -4 8 -3 -6 31 8 -5 -34 -29 -1 6 -8 -4 -8 -9 -38 -5 -31 3 15 -9 -7 -22 -8
6395hJ4Lk5LJ6mJ4%J1k0K2j1j3M1m1j1J3J2J3rrk3lJ6J6nj0J6n1J5J3oJ5k8Rj0
$$ -8 6 9 -16 -13 3 -1 13 13 24 4 26 15 2 43 2 -9 4 16 29 20 11 -12 -15 1 17 12 2 18 -33 -18 -5 -11 4 -24 -15 -25
6431b5klROJ2k3J7Jk2L3j4QL3k9k3J3jL0j7K0oNk7j1J1PoOJ6j0k6N9k6m4J5J7
$$ -25 -27 -30 -21 -15 -3 -26 -9 -8 -30 3 -11 -3 30 1 -22 -9 -10 20 3 23 17 22 -5 -16 -5 2 -4 2 18 8 -18 41 15 -29 -14 3
6467CLoNrj3J1j6JqL8J6m7L7k3M3k4j7J7j3j6L7jk3lj4PJL3l0k4N1j5qO0n5J1
$$ 3 6 0 5 -4 -17 -6 -22 -21 -29 9 25 -22 15 -8 35 11 -6 11 -2 -18 19 18 -5 -8 -22 -15 -14 19 -11 -35 16 1 -7 53 -2 9
6503IOrn9L5j0N1l4J1k6ORNk0J8J4MJ1l6J8j8K5m1J2K9j4QLnK3Kk6J8Rj6j1J3
$$ 9 15 6 -53 -18 -28 23 -11 0 -26 -20 -11 -6 -26 -8 6 10 21 -15 3 -15 10 -31 -19 10 -4 4 7 2 25 27 1 19 28 12 1 14
6539A4k6Mj1L3Rj6j2K8l2oJ8nJ6k7k9K1Rpj2J9J7nj5%OJ2NJ6J7n2%Oj1K9%j2N
$$ 14 -12 -8 -19 14 23 7 -5 23 -9 -15 3 -2 14 -13 -42 -21 -12 -19 -31 -12 5 0 -15 -15 -9 3 8 24 41 -11 -11 -5 -16 13 13 1 6
6576FrL6kl3mJ7mnLQj1J0k5MRoJ7%l4L2j4k8K7j7K9j0jk7K4J1J8l6KknL9qJ6j8
$$ 6 -3 33 31 -2 -6 11 7 2 5 13 2 12 -13 -9 0 -6 11 11 -23 9 -5 -33 -6 -23 6 -4 -5 -32 -8 3 21 -15 -13 -15 -20 19 11 27 9
6615IOononNK0k2J6j7oOOj6J8lJ0JpQk4K1kk7k2L5j4QPRl5L4Pj5Kj3MJ1K0j7k7
$$ 9 15 9 4 -2 -7 -2 18 -4 12 -5 -11 -5 1 -15 3 0 10 11 4 12 -12 9 7 -20 -42 -7 -21 -13 -6 3 -32 2 9 -6 -4 -17 -13 -2 18 1 -26
6656b6K3nKK6j0k5K3j9RJ6l0K4l0J7j4PJ7J3l4NKMoPJ1k8QNk4K9k4rO2j6j9j0
$$ -26 -3 -8 -6 20 10 -15 8 -11 -2 14 -16 8 -22 -5 -19 -12 5 18 -16 -11 -9 -5 -11 -4 7 -21 -13 -8 -32 -3 -27 -36 26 10 -9 -19
6692a9L4j8JJ9K3m3nLNK6l6kLMJ1pjJ3rjllJ0%k0L1j9J0k2K0l4J6L1j7%qj0Oj6
$$ -19 15 -3 -2 17 40 -3 -8 -5 0 26 -10 -12 -9 -5 6 -1 -2 11 2 1 -2 -5 5 5 -15 16 -3 7 -15 5 -29 -13 18 1 1 -7 -17 -11 -27
6731b7J2Rk6M8l0K6qj5k3L9j9RJJjroL5k8J2PK1j6opk4K5j7J9JnK2l8j5K8LJ9
$$ -27 -15 -6 -32 16 -14 12 4 -11 -34 5 -14 -5 -4 -3 -4 -13 -19 16 -12 0 7 28 12 6 -1 -25 0 -17 2 3 -2 20 -18 -33 -5 -2 17
6768A7k8kK6k4J4Pl5K7j4rrL1oNk8L9nlMJ4k7N1k8l4jK8K5l5J7l4K8pJ5k4J9l7
$$ 17 -11 -13 13 -11 3 10 -25 2 -12 -21 -30 1 -5 0 -28 11 6 3 7 21 -6 45 17 -17 -18 10 35 0 17 -17 11 4 19 -5 14 -23
6804b3K4j5M0m9M5m2J8Jj2K%K3qjLnLjj0J6J6j1jJ8k3qJ0k2NqL0k3jJ0K1j9j8
$$ -23 1 -14 26 -23 22 -20 -2 -1 -13 -11 -11 12 4 3 6 1 4 3 -7 9 25 14 13 31 8 0 10 -12 -7 -15 15 -8 -9 1 22 3 -15
6841a5RL0l0k2M3j8k7J2KJ4M%j2JjoJj3K2P%jNrk6N4m4J8J1J7pl2K1j0LJ1KpK5
$$ -15 -6 24 -6 -28 15 -3 -30 -18 -16 -2 2 2 -10 -9 -10 -16 -15 -28 -6 1 1 0 5 -4 -30 24 -20 -2 9 26 19 -13 8 -2 1 12 14 7 32
6880C2n3N1k1k5J6PrK3J9n2L7k6l0O6k0l2OLml6M5QJ4m0L8kk4QRPj2K1Nj9j2P
$$ 32 -21 30 9 -16 0 7 -2 21 40 -12 25 -1 -31 35 15 -17 -11 -8 -12 -48 -3 5 19 -21 17 15 -9 -1 8 15 3 24 29 10 -2 5
6916EJ6oloLJ2lJ1j9LJ%%ml1L4k5K4pj7J2NOr%LrmROOk7L8j1%Joj7%j0K5J5j5
$$ 5 21 15 12 6 9 21 18 29 10 13 14 14 14 10 -21 13 -12 12 5 -12 0 5 11 2 2 5 -4 -8 1 7 13 -14 24 13 13 14 8 -9 -9 -19 6 21 6
6959FJ9j7Pj2Oj7QrJ2mmj4KJ3J5qJ6k9%J7Mk2lL2l6K7k3j0O0l9qOK1pLK4k9pK5
$$ 6 25 8 15 3 9 -8 0 -9 3 -1 -5 -19 -17 -4 11 3 19 -10 -10 7 11 -11 -14 18 -18 9 -14 -24 36 -3 -11 -5 16 9 12 36 7 0 25
6998B5j4Jj1J5oLk4M7k0qK8l3lj7M1k8K8j8Kl5QJ2POl8jNN7m5pL4pk6JL7j3j6
$$ 25 11 12 1 16 10 13 -11 36 16 8 36 3 0 -17 24 -4 24 6 8 -27 -19 -7 0 6 -32 -33 -28 29 -16 -23 11 4 -22 -21 16 3 -13
7035a3K2qm4N2NJ7k2j7M7m8M4l2J9j2JQj4J8Jj3RKl4lL7j9J7m0J0K4j5j3K0Nk5
$$ -13 9 1 -43 9 14 31 9 -8 39 -9 35 3 22 10 11 19 5 23 24 11 20 22 -12 -15 22 3 20 -20 -10 14 -1 -14 6 11 -14
7070a4JkJ7j4K0k2J2J1l1L7%%jk0J0kRLJ9m0K0J8m0KJ5lj7J3J7j7mj9lJ5l%JJ0
$$ -14 -13 -15 2 -12 8 -14 -2 9 -22 15 15 15 14 -6 4 2 11 14 33 -7 13 31 -9 -7 8 5 -12 1 18 1 -3 -22 -25 -10 -13 -13 -12 -2
7108bmk4K6pJ7k2J2nj0L0k5NK6m8K8JJ1J0k0J7j1jpL1k4K5jl6J2j0L9l0J6ll7
$$ -2 -6 -30 -4 -11 6 -16 -4 -9 -19 11 -14 -9 17 -31 -3 -2 9 19 -1 16 5 4 -3 28 4 29 28 -8 4 -6 33 3 19 16 -21
7143b1L4m8J7K3j2j3J6J0j6J2k0J3k1LM0m1%J1K0j7J7j7mJ3KJ9jj8Pk2NK3N%k9
$$ -21 13 -35 -18 5 -7 -20 -4 6 -10 2 -18 -5 -26 -23 17 -24 -24 -13 7 -10 7 -10 -14 -1 1 20 19 1 8 -14 -9 14 19 19 -10
7178a0K9j6J9kj2M1l4j0%j3pNK5Jj1j9K9J1m5M1k8j4K1Lk0Lj5M2j2M%Rj3L7k5
$$ -10 19 3 22 20 8 49 15 5 5 -8 -15 -10 15 16 5 -14 15 26 -19 22 -6 -20 1 4 -16 -13 -28 14 2 6 6 15 2 39 14
7213A4J0j4j6K4oj1j1J2%Pj8MLK1l6j9L0kMNj9j1K5ln%QoMl1K1J7j0QrL4k4Pj5
$$ 14 24 10 -6 18 12 1 -10 2 2 9 -9 -5 -2 19 -17 -36 -6 -8 -4 1 -18 -29 -4 -7 -12 -12 -4 -10 -6 -37 -16 1 -9 -1 -10 24 0 7 -8
7252hkJMPOqJJ1j6j6J8J8Kmnl5M4k9L1k5OjMrJ2lK6k0l5M2Jk8J1j0LOpKKLm5O0
$$ -8 -10 -9 -5 2 8 0 1 12 -4 -20 -2 16 18 14 9 -26 18 -11 20 -5 1 0 4 -5 7 4 30 10 -25 17 18 -10 1 -9 -6 0 -7 -5 -3 0 -45 15
7294A5j0j4JM2k2k0K0pk8J8k4N3l8K0k9J5QKOJ7j7j5j2K7j7J6j0nMj7L3jkj4k7
$$ 15 5 -9 -8 34 12 -8 12 5 -23 -5 -29 24 -14 6 -23 -8 0 2 8 25 8 -7 -19 8 -9 7 -3 -8 -4 -21 12 11 9 -5 -32
7329c2J6PK0j8LK0q%RL1n3K7rPkj3Mj6jK3J2j6Mmk4QJ1JJk4%L3j4k3Pk5M5oJ6
$$ -32 -16 -9 11 -7 -4 16 8 8 17 48 -5 22 13 20 18 5 9 -7 -8 15 27 11 15 11 -13 -5 6 7 8 -16 -16 17 3 -20 -13 -38 7 1 17
7368A7jk9L9k6lj7K6Oo%lJ5k0K4nnJ8qk4j3J6J7%j2k5K4J4k9LK2Nj8j6RMl6J1
$$ 17 16 -13 26 0 -3 -20 6 12 6 6 3 18 -2 22 17 12 30 22 -2 -15 1 18 18 6 -19 5 19 -10 -7 15 20 2 -14 -5 -1 -37 -26
7405b6L4j7%jJ5j4klL7l0pK0L0l9K3l8K7Pj6J2jj9qM3k0k8RK1j5PnJ8p%Ljk0J4
$$ -26 8 -9 -9 -10 5 -9 -11 -14 23 -7 -14 6 36 -3 20 -18 9 16 0 12 11 -8 -16 27 7 -21 -12 9 -6 1 -4 14 7 7 10 9 -11 3
7443CLPk8J4j1j6QK1Jorj6L3j4L2k9Mk7O1l4J8jRk3K5k9L4qj9K6k6QOj1K8m1J3
$$ 3 6 13 -15 -1 -12 -28 -20 1 2 -4 -13 -29 4 -10 22 -7 -3 -30 31 -3 15 14 23 0 25 -4 30 22 3 29 3 11 17 6 34 -7 6
7480FNJ%rPl6M2k0RpmJ4k0j2KQJ4j4qj2K9j7M7k0rk5L2rPj2L0oJ5nk6J2Rk0L4
$$ 6 11 12 12 3 10 -26 16 -4 5 -2 -6 8 -12 -24 -22 -14 0 -14 -22 -34 -5 -22 25 5 -4 -29 3 -6 1 -11 19 13 28 23 -3 9 18 -2 32
7519C2l1r%J0njm%K2qLk6Jj4OJ0L8k2J4l2pJ3j3J6LJ0Oj7K7n3O3k7NJ0k2kJ9m
$$ 32 1 -8 -8 2 -3 -4 -8 -8 14 6 9 -17 -16 -30 -24 -14 24 2 16 -16 -23 -10 -23 -7 -4 6 12 -5 22 -31 32 5 10 20 -2 -4 15 11
7557A1j1j0L8m2%J5rJ9l6J2PJ9KpOk7j1L5k9J5J2j7lJ6j9pK0kqK1k1J2k6L6k2
$$ 11 0 -10 28 -14 -14 1 -8 11 -25 -13 -6 13 15 8 14 -13 -24 11 -18 -3 9 -8 -11 5 -14 -21 -1 -3 -11 10 -11 1 -25 11 -11
7592a1RlK1j4QRk0rK6j2J4k2K9l5pLK1olK6m4pJ7MLpRk4J6mJ0K2j7Jj2ROJ1j0
$$ -11 -2 -5 16 2 10 19 -1 -10 16 4 18 -4 25 -10 -17 -14 7 1 -2 24 -20 -27 -10 -6 -3 -10 -1 -25 -9 -13 -3 19 2 3 -9 0 6 17 7
7631Gk0%LJ7J9k0J9j7nK1j0lLMnj1Nrj2J7J6oj4Mk7lL0JK5k9J3ol4L3j2RkNjl4
$$ 7 -13 -13 -10 7 26 6 25 8 3 24 14 11 14 18 13 2 7 -2 -14 3 19 13 -1 3 -24 -27 3 4 29 0 13 7 -27 6 -6 3 1 6 5 -29
7671b9J2J4K6l4K0j8lK0J0j0Oj0k6L5Jk3qJ4J0nmk2J7k6K6K3lJ2m3JJ8j1J1J6
$$ -29 -17 -3 23 -11 9 -9 -12 8 18 8 14 4 -22 13 14 -9 -17 -3 7 2 -2 -24 -7 -33 -7 16 13 25 -18 -17 1 -10 1 17
7705A7nJ1k8j1j0J9rj2J9M3j2m3RRK7rj9L6j6j5K1j6j1PJ0j1j6J4K8j6J1Kk6j2
$$ 17 12 23 -5 -16 -26 -7 -16 -28 -9 34 22 -21 -12 -3 24 15 -4 32 16 1 22 6 -5 2 12 1 -15 -1 27 11 22 24 -2 -14
7739a4K4j0j8J9j8Oj6K7%K%J7l3L9n1K4J5j2QqJ3Pk6L0Ln%j9KJ1JnpOK7j1pj2
$$ -14 10 0 -18 1 -17 -11 -27 0 0 2 2 19 -14 25 -26 -2 13 1 9 1 14 21 -5 25 28 23 23 4 6 17 18 13 6 12 39 28 21 9
7777IoJqJp%J8k9nJ1J5m9L7oJK2MK2l4j3P%J3nK4ll3K4J9l7L4k1J6Jmml4N4lk5
$$ 9 3 4 -4 -3 -10 -10 8 -21 -26 -15 0 -49 -12 -18 -17 5 9 31 -3 -16 -9 -9 4 -1 23 20 -13 11 30 -7 27 6 22 23 19 15 -19 35 32 7
7817GoJ8Pk3OjpplMJ2J0l3NnK6j8J9j3QKkm4L5KQk0K2K3rJ4j6nlJ6k2LRk5RRQ
$$ 7 1 19 26 3 9 8 1 -6 -9 -5 7 17 -16 -11 -16 10 -8 11 -2 6 8 6 -38 -3 -1 7 -13 9 32 23 37 21 16 13 29 7 10 19 -6 3 12 20
7859B0k8K4pj1kK7l5OjMRj8J1J0rk1pM2k4NQqMJ6L5n5K5k9j1M3j3J4j2oj0j4L7
$$ 20 -8 16 9 -2 -4 23 -12 -6 -7 -3 6 -12 -1 9 0 -21 -28 14 -10 -5 3 -5 -1 15 50 -5 20 -9 -20 23 10 24 12 6 -4 -18 19
7896A9lJ2l9NK7k2jrL6k1j2kJ7k3j8K5qlJ2oj0J7J1J1k4L0rJ3j8J0k0OqOLJJN
$$ 19 16 28 -11 -6 21 -1 -2 -11 25 4 -8 -10 7 -16 -34 -9 -17 -20 -8 -14 -24 -7 4 15 -9 21 12 25 7 17 -3 3 -5 1 4 5 6 11
7934A1Jj9j2K5ONk6J0k5J7LMJ2%j3J7k3MJlj6J5J2pk%Pk2ONJ6k5L0pk9L8j7qJ2
$$ 11 12 -7 -19 6 12 17 -9 1 -24 -7 -4 0 12 12 -1 16 -7 -3 -2 -5 -21 -6 6 -1 -3 -3 4 -18 -12 -7 9 -16 14 7 -22 16 -1 -9 3
7973CjJm2M0K7K5n2K1l2K7kk8J0J3j4K1rk1J9k6L6l4J1J2k0J5J7l8J9Mj8K0Pk1
$$ 3 2 3 -39 1 28 53 1 22 -10 17 15 -13 -3 10 -4 17 8 -13 6 -20 16 -18 -7 5 -15 0 17 -21 -2 2 -16 4 11 -10
8007a0J4k8K6J8j5Qk3L8j4j4rL0K6l5Oll5L7k5qL7Ml4K7nMk3j8K9Omm2L7l1L6
$$ -10 4 -24 2 20 5 13 -10 28 14 0 -9 21 47 12 18 15 -20 17 -8 -16 21 25 -9 18 13 17 -6 -24 5 11 7 -35 2 -29 7
8042Gj7J7l3K7Lj0M2m8J0NK0l6QmJ4Qk1J7J1Kr%jj3Pk3J2KNj3N2k2j1Kk3M2k8
$$ 7 -10 7 -26 1 4 -6 36 -12 -2 3 23 -13 -5 -9 5 13 -8 9 20 22 13 13 12 -1 6 -17 -5 -3 2 -11 41 19 8 10 -13 29 1
8079Ak2K6j1jMj2K2JLk2K4j2K6ml9K7k4MRK8k3J1l3K2rOLKLmOKJ7k4jqJk9K6P
$$ 1 -21 5 -6 -7 -3 -15 7 8 11 -11 13 1 27 23 -16 11 -13 -9 0 28 5 16 -17 5 -4 2 5 7 10 6 12 14 31 7 6 -2 -1 -30 -4 3
8119CnK2l3L8m4L0%l5K7l3QK7j7J6pj1L3qMj8K2j1mJJ7ommk3K0L6k0j9qK0pJJ8
$$ 3 -2 20 -13 25 -19 11 11 -24 3 -30 -22 5 -12 4 -3 -14 19 11 15 -3 19 8 4 5 22 16 12 8 -15 5 41 21 2 -6 14 7 8 26
8157B6k8mJ9Jk2J1J7j0Mk5MJ1Rj9k3J2JK7k7Lj1K8KL2j7j4qqL5k3NJ1j6L7
$$ 26 -2 -6 13 14 -8 3 20 10 14 -11 -7 4 13 -6 -29 -17 -16 11 -16 -13 -24 4 6 38 21 7 -1 -9 26 3 8 19 3 40
8191D0
$$ Imaginary data points
##PAGE= N=2
##DATA TABLE= (X++(I..I)), XYDATA
0@%%%%%%%%%%%%%%%%%%%%%%%Qj6J6j6J6j6J6k4L2l2L2m0M8m8N6o4P2q0Q8r6J04
$$ 0 0 0 0 0 0 0 0 0 0 0 0 0 0 0 0 0 0 0 0 0 0 0 0 8 -8 8 -8 8 -8 8 -16 16 -16 16 -24 24 -24 32 -32 40 -40 48 -48 56
44E6j20J36j52J67j83K00k16K39k63K88l20L52l91M38m87N44o15P01q06R39j118
$$ 56 -64 72 -80 87 -96 104 -112 127 -136 152 -168 184 -207 231 -256 288 -327 374 -432 507 -611
65f11J372j755K411l845J2988j2315k1078K4239J1762j5270j0622J5847P597r444
$$ -611 761 -994 1417 -2428 10560 -1755 -22833 1406 13168 -2102 -12724 3123 10720 1276
79A276o436N838J042k175M69j343o154L636J1370J248j0984l700N367J572l939
$$ 1276 -5160 678 1720 -455 14 -1329 -7483 -3847 7523 8771 -2213 -5913 -546 1026 -2913
94b913L29L422J891L61j818m716Q14P444J68j0370k343J0647M697p104k492M960
$$ -2913 -2584 838 2729 3090 1272 -3444 -2630 4814 4982 -5388 -7731 2916 7613 509 -1983 2977
110B977j532o333J575N086j217j202L898j061o851J423Q014k313r018K405Q452
$$ 2977 1445 -4888 -3313 1773 556 -646 3252 2191 -4660 -3237 4777 2464 -6554 -4149 4303
125D303k394n537N397M797q065n926P238M789o123j439P650N16q346j157O900
$$ 4303 1909 -3628 1769 6566 -1499 -7425 -187 4602 -1521 -2960 4690 5206 -3140 -4297 2603
140B603J003n392j341K780J301O67M06k306j690K371J77m707L86P776J295q081
$$ 2603 3606 -1786 -3127 -347 954 1621 2027 -279 -1969 402 579 -4128 -3742 4034 5329 -2752
156b752j999P223J121o874j10O429r66n648K535N814k403m995J860K645l159j501
$$ -2752 -4751 2472 3593 -3281 -3391 3038 2072 -3576 -1041 4773 2370 -2625 -765 1880 -1279 -2780
172b780M510K108l672k094K074O53j671n8J101l31m35M35P2L68J117j252l110
$$ -2780 1730 3838 166 -1928 146 799 -872 -930 171 -160 -595 -160 -88 280 1397 145 -2965
189b965P99L965l25l466J767M042k874n116K724N387k278m807K161L969j764k602
$$ -2965 -2166 1799 1474 -1992 -225 3817 943 -4173 -1449 3938 1660 -3147 -986 2983 1219 -1383
205a383J841J009k502m81K071n21j357K497J794m079k989L930L327l658l060L572
$$ -1383 458 1467 -1035 -1516 555 34 -1323 1174 2968 -1111 -4100 -170 3157 -501 -3561 11
221A1K950k903k431K466J972j900j825P55J300O43J57o30q45J30L58l97K2P09
$$ 11 2961 58 -2373 93 2065 165 -1660 -905 395 1038 1195 565 -280 -150 208 -189 -167 542
239E42k14p50O68O05j412o64K046L95l283p30M235J639m136j859L819J406l989
$$ 542 328 -422 246 851 -561 -1225 821 1216 -2067 -2797 1438 3077 -1059 -2918 901 2307 -1682
256a682j175M195J454l646j149L077Q76k489m62J926k44j705N63J864k84j586
$$ -1682 -2857 1338 2792 -854 -2003 1074 1950 -539 -1001 925 681 -1024 -461 1403 1119 -467
272d67o1Q36k78p79J95R56K95q99q48N92J231l78j632J16J818Nj575M41J938o09
$$ -467 -528 308 30 -749 -554 402 697 -202 -1050 -458 773 395 -1237 -1121 697 702 -873 -432 1506 897
292H97k184L56J924l66j329R92J117j362j054J520Q12j875q28J865O17j907k96
$$ 897 -1287 -931 993 627 -702 290 1407 45 -1009 511 1323 -552 -1380 485 1102 -805 -1101
309a101K209J94k470o87K066O80j559l32J501L93j333m60J082N45p70o56O17Q47
$$ -1101 1108 1302 -1168 -1855 211 891 -668 -1000 501 894 -439 -899 183 728 -42 -698 -81 766
327G66k60o68M11O02p69j047P38J298n16j308N97J282r64j552Q75J648j029j768
$$ 766 506 -162 249 851 82 -965 -227 1071 555 -753 -156 1126 162 -1390 -515 1133 104 -1664
345a664J066J929r15j738Q83J525j156j487J281J653q68j404Q33J161q61j047
$$ -1664 -598 1331 416 -1322 -439 1086 -70 -1557 -276 1377 509 -895 -62 1099 238 -809
361h09Q46R51p23r16O98J001o45j048M13P68o21q43O80J130n35j264K33J249k38
$$ -809 37 988 265 -651 47 1048 403 -645 -232 536 -85 -928 -248 882 347 -917 -684 565 327
380C27j368K10J497m5j364N9J497M7j346j63J139l7p61L61Q41n07r63N91Q90r01
$$ 327 -1041 -831 666 621 -743 -684 813 860 -486 -649 490 453 -308 53 894 387 -576 15 905 4
400Dj017R75J253j056j493R86J698r15j920M13J820m7j610J8J516J81j326l12
$$ 4 -1013 -38 1215 159 -1334 -348 1350 435 -1485 -1072 748 701 -909 -891 625 806 -520 -832
418h32J001L95p30j34O98m3m99K78O17m70r86M75J076l85j134L29J206k65j424
$$ -832 169 564 -166 -300 398 355 -144 134 751 281 -705 -230 846 461 -673 -344 862 597 -827
437h27q1J318K27j159k73R66K39p49j57O59k3o80J61Q86r2q45J16J032L3j231
$$ -827 -908 410 637 -522 -795 171 410 -339 -496 163 140 -540 -379 507 415 -430 -314 718 751 -480
457d80k50J256O31j101r60Q51J174n46j312M4J104K61r60m78O04N34k49m39j93
$$ -480 -730 526 1157 56 -904 -53 1121 575 -737 -693 411 672 -288 -766 -162 372 123 -316 -509
476e09P5M43M78l96r52K59J444K18j723o39J807J135j605j593J442J952r90k120
$$ -509 -434 9 487 91 -861 -602 842 1060 -663 -1302 505 1640 35 -1558 -116 1836 846 -1274
494a274M36J966j26j692j37J265J67q79j06N06j75l69M75K31q30l57J261O61j411
$$ -1274 -838 1128 1002 -690 -827 438 605 -274 -380 126 -49 -418 57 288 -542 -899 362 1023 -388
513c88r66J513J256j388j434J377J591j227j567J134J557j153j492J155J414j326
$$ -388 -1354 159 1415 27 -1407 -30 1561 334 -1233 -99 1458 305 -1187 -32 1382 56
529E6j400J507J457j721j662J663J699j602j800J402J838j153j678Q79J417o07
$$ 56 -1344 163 1620 -101 -1763 -100 1599 -3 -1803 -401 1437 284 -1394 -515 902 295
545B95j110N78P24n21j74P19j00j042K67J387k29j679M2J951K53k040p32J861
$$ 295 -815 -237 487 -34 -208 511 411 -631 -364 1023 794 -885 -843 1108 1361 -679 -1411 450
563D50J053j614j463J206J614p56j558L20J277j07r45l2N54R5q6J83j75m48L50
$$ 450 1503 -111 -1574 -368 1246 490 -1068 -748 529 422 -523 -555 -1 94 8 191 16 -432 -82
582h2Q00l39j128K96J404q3j419j07J363J54j264l36J034L62q32l09N64J96n34
$$ -82 718 379 -749 -453 951 868 -551 -658 705 859 -405 -741 293 655 -177 -486 78 274 -260
601b60j46L95J08l42j36L55L18l09m57K45O08n3o98p5Q75L75q79n56Q33O64p03
$$ -260 -406 -11 97 -245 -381 -26 292 -17 -474 -229 379 326 -372 -447 428 803 -76 -632 201 865 162
622A62p07M85O11l52m21K38J00k59Q8K98l67n26N51P14n33r78M20J177j69j301
$$ 162 -545 -60 551 199 -222 16 116 -143 -55 243 -124 -650 -99 615 82 -896 -476 701 532 -769
642g69r0J345M42j118p16J004Q95p09r84M33R98j66q79L8O72n7m79K0K85k61j43
$$ -769 -859 486 928 -190 -906 98 993 284 -700 -267 731 565 -314 -276 396 339 -140 -120 165 -96 -239
663b39M10L5o75j3Q51M3j019j30J095K69j069l00J063L76r62l23Q78L29p74k13
$$ -239 171 206 -469 -482 369 412 -607 -737 358 627 -442 -742 321 697 -265 -588 290 619 -155 -368
683c68P15J61o35j21O30J3o61n3O40M9o81j03O83Q9p07k22O98K51o80l04O68M30
$$ -368 347 508 -127 -248 382 395 -266 -319 321 370 -311 -414 269 358 -349 -571 127 378 -302 -606 62 492
705D92o88l70O63M56o59l96O73M75o55m73P01M77p43m66P41M31p15m97P27M00
$$ 492 -196 -566 97 553 -106 -502 171 646 -9 -482 219 696 -47 -513 228 659 -56 -553 174 574
725E74p24m41O14M44o55m64O28M67n41n05N20M86m08n08L69N49k90m49K93M92
$$ 574 -150 -591 23 467 -188 -652 -24 443 -98 -603 -83 403 -5 -513 -144 405 115 -334 -41 451
745D51k47m22K05M14k19m20K92L85l25m36L44L92m01m54L76M56l92n27L73N31
$$ 451 204 -218 -13 401 182 -238 54 439 114 -322 22 414 13 -441 -65 391 -1 -528 -155 376
765C76m13n17L53N67l56m60L56M86l05m65L87M19l24m18L90M18l39m58L71M13
$$ 376 -37 -554 -201 366 10 -450 -94 392 87 -378 9 428 104 -314 76 494 155 -303 68 481
785D81l52m68K68N07k69n84K16N32k20n49J56N39j87m94J50N65k03m85K20N37
$$ 481 129 -339 -71 436 167 -417 -201 331 111 -438 -282 257 70 -424 -274 291 88 -397 -177 360
805C60k19n16K78N58k17o03K55O15k26o80K19P19k38o99J83O49j77o60N6O31o7
$$ 360 141 -375 -97 461 244 -359 -104 511 285 -395 -176 543 305 -394 -211 438 261 -399 -343 288 221
826B21n95M8N30j9n19K0M36K4m05M0M16ql81O4L59K1m18L5M66m2m65K1N51j0o32
$$ 221 -374 -326 204 185 -334 -314 122 146 -259 -219 197 189 -192 -128 231 252 -166 -131 335 293 -172 -151 400 390 -242
851b42p4O22P7o80r2O20O8o22j26N75R5n18o6M99M1m53J5M97l4m92J14M98k4m77
$$ -242 -316 306 383 -297 -389 231 299 -323 -449 126 221 -297 -363 136 177 -276 -261 236 202 -290 -176 322 298 -179
875a79N2M58K2m76o9M37P5l69j61L42J72l61k15K96J70l35j70L54J65m11j29M30
$$ -179 -127 331 353 -123 -192 245 320 -49 -210 132 304 -57 -272 24 194 -141 -311 43 208 -203 -332 98
897I8J56n24j35O11K11n92k52O23L56o64k99O01L07m87k99M71J95m10j59L37K5
$$ 98 254 -270 -405 206 417 -175 -427 196 552 -112 -411 190 497 10 -289 182 377 -33 -192 145 170
918A70k78m5K83k8k84pK88Qk78j02K63J93k50k45K10L87j98l55J62L91n0m01J03
$$ 170 -108 -153 130 102 -182 -189 99 107 -171 -273 -10 183 -67 -312 -102 285 87 -268 -106 285 235 -166 -63
941f3M11j45m53K38M16k94m82L94M59m64n47M68N63n01n94M35N90l80n64L08N11
$$ -63 348 203 -250 -12 404 110 -372 22 481 17 -530 -62 501 0 -594 -159 431 51 -513 -205 306
962C06k23l90J68L21j25j73J65J29j91j06K66J43l23j87L51L39l41n30K88O40
$$ 306 83 -307 -139 182 57 -116 49 178 -13 -119 147 290 -33 -220 131 470 129 -401 -113 527
982E27k88p87J51Q69o8r26RQ52O6q62J9P44r1o14J79O24l11n32M57N23n63n02
$$ 527 239 -548 -397 472 404 -522 -513 339 405 -457 -438 306 215 -399 -220 404 93 -439 18 541 -22 -524
1004e24P00N11p18n11P03M95o79m40N85L61n12l37M30K11l56k47L43J33k72j55
$$ -524 176 687 -31 -542 161 656 -23 -463 122 483 -29 -366 64 275 -81 -328 15 148 -124 -279
1024b79K67J95k27k45K36L02j89l30J23M64q6m59P3M84o4m61Q3M42j24m14K01
$$ -279 -12 183 -44 -289 -53 249 60 -270 -147 317 231 -228 -155 329 265 -196 -113 329 205 -209 -8
1045hL10l28k88L85L08n60k79O29K10o37k39N91K55n23k64M72K19l19r9J40J04
$$ -8 302 -26 -314 71 379 -181 -460 169 379 -258 -497 94 349 -174 -438 34 253 -66 -165 -25 79
1066G9j9npj19J53J75k07j80K15J49k44j01K41k0k42R0K24k50k41L45K21m12k10
$$ 79 60 55 48 -71 82 257 50 -130 85 234 -10 -111 130 110 -132 -42 182 -68 -309 36 257 -155 -365
1089c65M68J62m64j67N31J37m85j13N16N4m46L3L81l9l33M8L00m0k24J6J39j2
$$ -365 103 265 -199 -366 165 302 -183 -296 220 274 -172 -139 242 203 -130 -82 218 178 -46 -30 109 97
1111I7j04n8K7J21l3k10J2J99Jk52L1K84k0l39J13L81k16l42K93L90l55l76M65
$$ 97 -7 -65 -38 83 50 -160 -148 51 52 -200 -169 115 95 -244 -131 250 34 -308 -15 375 20 -356 109
1134A09L96n42l53N77L10n80l05N73K53n90j77N15P8n13rM31m5l64K4L56q1k66
$$ 109 505 -37 -390 187 497 -83 -388 185 438 -152 -329 186 264 -249 -258 173 128 -236 -212 144 63 -203
1156b03P7K45r4j45O9J26J2q7k2N2J18l8j95N3K54p6l27J28L55j80m30J94M35
$$ -203 -126 119 25 -120 -51 75 87 0 -22 30 148 110 -85 -32 222 146 -181 -53 302 122 -308 -114 321
1179C21k54m18K48M18l20m02L35L86l90l02L80K52l64j51L90J24l66m0L17L5k52
$$ 321 67 -351 -103 315 -5 -407 -72 314 -76 -378 2 254 -110 -261 129 253 -113 -153 164 199 -53
1200e3m0K45J2j88j1J16J3q8m6J2N9L1j40n3J60O8k26j03K96Q1l23J0L27m4l54
$$ -53 -93 152 164 -24 -35 81 94 6 -40 -28 31 62 -78 -131 29 97 -129 -232 64 145 -178 -168 159 115 -239
1225b39R2M22r0m26J55M39j79m17J93L76k03l84K59L16k65k86K42K31k74j82K49
$$ -239 -147 275 185 -241 -86 353 174 -243 -50 326 123 -261 -2 314 49 -237 5 236 -38 -220 29
1246B9R3j94j06J70P6j51n5R1J01l5p9QJ29N5j45r3K35J05k61j05K66J10l14p2
$$ 29 122 -72 -178 -8 68 -83 -138 -47 54 19 -60 -52 77 132 -13 -106 129 234 -27 -132 134 244 -70 -142
1270a42L15Q9l98p0L82Km36KM41o2m11J02L89j26l48J39L05j19k61J53K56j30
$$ -142 173 262 -136 -206 176 178 -258 -256 185 123 -288 -186 203 77 -271 -132 173 54 -207 -54 202 72
1292G2k05J67J31j36j10J19J22p6r7J0R1pj11n3Q3J23j68j05J58J25j93j66K07
$$ 72 -133 34 165 29 -81 38 160 84 -13 -3 88 81 -30 -83 0 123 -45 -150 8 133 -60 -226 -19
1315a9J53k28j43K50J69l02r2L16Q6k94o1L25M5l02nK74J6k95LK81j8k77K4K22
$$ -19 134 -94 -237 13 182 -120 -212 104 190 -104 -165 160 205 -97 -102 172 188 -107 -104 177 159 -118 -94 128
1339A28o3k11K9J88oj78m3J76N9j60m5J27M5m5j44J38J41q7j59J29J53j15j92
$$ 128 65 -146 -117 71 65 -113 -156 20 79 -81 -126 1 46 1 -143 -5 136 49 -110 19 172 57 -135
1362a35J59J86j86j71J67K16k53j86K30J38k05j69K05J48k14j65K29J48k06j15
$$ -135 24 210 24 -147 20 236 -17 -203 27 165 -40 -209 -4 144 -70 -235 -6 142 -64 -179
1382a79K27J19k31r0J82R8j54o5J52J27j69j03J49J22j61j24J15J79j60j73J25
$$ -179 48 167 -64 -154 28 126 -28 -93 59 186 17 -86 63 185 24 -100 15 194 34 -139 -14
1403a4J61j56j37N7J98j13j97J33J89j05k11J43K01j79j61J76J76j42j74J70J93
$$ -14 147 -9 -146 -89 109 -4 -201 -68 121 16 -195 -52 149 -30 -191 -15 161 19 -155 15 208
1424B08j41k15J73J93j45j90J37J78j32k17J24J93j38j75J00J73j12k12J33J68
$$ 208 67 -148 25 218 73 -117 20 198 66 -151 -27 166 28 -147 -47 126 14 -198 -65 103
1444A03j11j79J06K41j36j78Q9K39j18k06R7K23q7j83Q4J80p8j75P8J93j09k03
$$ 103 -8 -187 -81 160 24 -154 -65 174 56 -150 -53 170 83 -100 -16 164 86 -89 -11 182 73 -130
1466a30J07J81j25k03J58J44j53j73J18K22j47j83J14J85j00j95J35J62p1j76
$$ -130 -23 158 33 -170 -12 132 -21 -194 -76 146 -1 -184 -70 115 15 -180 -45 117 46 -130
1486a30J06J88q9j79J27J36j25j25J35J09j42j02Q7J08r2j57J27J34j20j20P2
$$ -130 -24 164 75 -104 23 159 34 -91 44 153 11 -91 -4 104 12 -145 -18 116 -4 -124 -52
1507e2J34q9j18O8J17l3j06K4J01Qr7K3R0Nr1jJ18mj42J2P9L6j38PJ25l9q5l1
$$ -52 82 -7 -125 -57 60 27 -79 -55 46 54 -43 -20 70 75 -16 -17 101 97 -45 -33 46 82 -56 -49 76 37 -48 -79
1535g9Q1K5j24nJ15or0J0N5L3q2pR8Mn0j3Q6O3p4o5O9R3j13r2R7R1j06r9P0J23
$$ -79 2 27 -97 -102 13 7 -83 -73 -18 15 -67 -74 24 28 -22 -35 51 114 40 -25 44 137 24 -68 29 120 14 -85 -15 108
1565A08j12j27J48N5j12q9R9J21j62r3J60J13j43j19J47J42j68o7J57J03j66p1
$$ 108 -4 -131 17 72 -40 -129 -30 91 -71 -164 -4 109 -34 -153 -6 136 -32 -99 58 161 -5 -76
1587g6J68O2j69q6J65Q8j51j02J30J02j57j02J64N1j33r6J59O8j12j04J07J12
$$ -76 92 154 -15 -101 64 152 1 -101 29 131 -26 -128 36 87 -46 -142 17 85 -27 -131 -24 88
1609H8j24j07J59N4q9j15J25J35j00j26J19J34j64q8J43Q9j18j59J62J03j38j06
$$ 88 -36 -143 16 70 -19 -134 -9 126 26 -100 19 153 -11 -99 44 133 15 -144 18 121 -17 -123
1631a23J25J17j74j13J77J06j78o4J26J02j43o0J25N1q6o9R4Q8o0p9M2J08o3r2
$$ -123 2 119 -55 -168 9 115 -63 -127 -1 101 -42 -102 23 74 -12 -81 13 101 41 -38 4 112 49 -43
1655d3N5Q1n1j24N8J14o6j12L9J18o1j46P8J53q4j50Q9J04m2j02O8J29p5j11P2
$$ -43 12 93 42 -82 -24 90 24 -88 -49 69 8 -138 -60 93 9 -141 -52 52 10 -92 -24 105 30 -81 -9
1680iJ13p6q5P2Q5n9j02R4R3j03q4O7O4q3p4N3J05p0r0L9N0J0r1OJ02kj09L3J00
$$ -9 104 28 -57 15 100 41 -61 33 126 23 -61 6 70 -13 -87 -34 71 1 -89 -50 0 10 -81 -75 27 25 -84 -51 49
1709D9J0j13K6Q6K9j32NJ46l0r3NJ21l6r5j4J08j5j19PJ36l6j47N0Q7jj35M5Q5
$$ 49 59 -54 -28 58 87 -45 -40 106 76 -17 -12 109 73 -22 -36 72 57 -62 -55 81 45 -102 -52 35 34 -101 -56 29
1737B9J6r4jO6J7q9J5J09Qq5m5J05Op1l8J14K0r0n6J16Lr7n5J15M3r6n3J03L9
$$ 29 45 -49 -50 16 33 -56 -41 68 76 -9 -54 51 57 -14 -52 62 82 -8 -64 52 55 -42 -97 18 61 -35 -88 15 54
1766E4j17n2J30K8r0l5J10N3j32pJ05L7j11j3R8K9q7m0P1O9j32mN2L1q7rP4K4
$$ 54 -63 -115 15 43 -47 -82 28 81 -51 -58 47 84 -27 -40 58 87 0 -40 31 100 -32 -36 16 47 -40 -49 25 49
1794D9o6p2Q0L4q9l0R6N0p1p3J35K6j08oP2R0q2q8Q2P9q4o9J19L8j20l9O2P9r1
$$ 49 -17 -89 -9 25 -64 -94 2 52 -19 -92 43 69 -39 -45 27 117 35 -53 29 108 24 -45 74 112 -8 -47 15 94 3
1823Cr8J04N2r5m8R9J9o6o5R1J00j45l8Q2N4n0r3J13M7o6n6J03K0k1q9O0R8r0
$$ 3 -95 9 61 -34 -82 17 36 -30 -95 -4 96 -49 -87 -5 49 -1 -94 19 66 0 -56 47 67 46 -43 17 115 25
1851B5r6Q7O8o7q4O3J07j24n1Q6N1p6j19J31N9m3r9Q2J03j14o7P6J02p1q4M9J38
$$ 25 -71 16 84 17 -67 -4 103 -21 -72 14 65 -11 -130 1 60 17 -82 0 103 -11 -78 -2 100 29 -55 -6 132
1878A32j29o7P8P7p0r2O6J08r7o2O3N4o3r2R1P5j02k9J2R3q1m8N5J07p1p5O7P5
$$ 132 3 -64 14 91 21 -71 -5 103 6 -56 7 61 -2 -94 -3 72 -30 -59 -47 46 -35 -83 -28 79 8 -67 0 75
1906G5m1p3O8J03q8r4O5R9r4r7P1P7n2r4P5O1o0j02O1N3j8j04R1P5n9p4O3Q6n0
$$ 75 34 -39 29 132 44 -50 15 114 20 -77 -6 71 19 -75 0 61 1 -101 -40 13 -5 -109 -18 57 -2 -76 -13 73 23
1935B3m6nR8m0p1M4P9m5n0K9P4m6p1K0M5j8o1J2O6j5p4K2M7k0n9M6L4k3k2j3J02
$$ 23 -23 -28 70 30 -41 3 82 37 -13 16 90 44 -27 -7 38 20 -41 -29 37 22 -52 -30 17 -3 -62 -16 18 -5 -27 -40 62
1966F2m8m9J6O3l6o8O3M6K4r0oO3no4jQ8j3n6k2O0po1j9N7J1m8l1O1Pl8j8Q0J0
$$ 62 14 -35 -19 44 8 -60 3 49 73 -17 -23 40 35 -29 -30 58 45 -11 -33 27 20 -41 -60 -3 8 -40 -71 -10 -3 -41 -59 21 31
1999C1l8qL7M4p9pP8lm3l5N3M7o9n7P9L7o5o9R7J1m0m1K2N2p6j8Q1K7q9m0Q3M4
$$ 31 -7 -15 22 66 -13 -20 58 55 12 -23 30 77 8 -49 30 67 2 -67 30 41 1 -40 -18 34 -42 -60 21 48 -41 -81 2 46
2031D6p3l2P0P7r7k2N8K4m0n3N7M1q8l7O5M8l6l2L5M1o7n1N0O9o1p3Q9O1r2n3
$$ 46 -27 -59 11 88 -9 -31 27 51 11 -42 15 56 -32 -69 -4 44 8 -24 11 52 -15 -66 -16 53 -8 -81 8 69 -23 -76
2061g6P1M9l8n4O2O4p3o6R8N6p0n1M7R4r3o7Q3N0q7n5P7M5j25j1N3O4j02mP6j0
$$ -76 -5 44 6 -48 14 78 5 -61 37 93 23 -28 19 113 20 -47 36 86 -1 -56 21 66 -59 -70 -17 47 -55 -59 17 7
2091Gl9k0N3J2pm2L6N6n8k9M8N1l0p6O5M7k6q4M9N6l6q7M5P4j9j12M4O1m1p1L3
$$ 7 -32 -52 1 13 6 -36 0 56 -2 -31 17 68 38 -38 27 74 48 -36 13 69 33 -54 -9 65 46 -66 -22 39 -2 -73 -40
2122d0Q6o0l0L8M1k3r1R9K9r0lN8L2p3lL6M5n7J0K2K2on2mL1K2q6L0L9Kq7K3Q0
$$ -40 46 -14 -44 -6 35 12 -79 20 49 -41 -44 14 46 -27 -30 6 51 -6 4 26 48 42 -10 -14 17 39 -47 -17 22 24 -63 -40 40
2155D0l2n9J7Q4k8p4J8Q2k9q4M9Q4m3p1M4J04q4n0K6Q3n7k3k2N2j3o7N7mKn1J4
$$ 40 8 -51 -34 50 22 -52 -34 48 19 -65 -16 68 25 -46 -2 102 18 -32 -6 77 20 -3 -25 27 14 -53 4 0 2 -49 -35
2186c5M2Ml4J5L0ol5PM9rl7k2L6O5q0k1L2Q9j24k7J08pp7KQ9qj08K2P2rp9j4R7
$$ -35 7 11 -23 -8 22 16 -19 -12 37 28 -9 -31 5 70 -10 -31 1 90 -34 -61 47 40 -37 -35 54 46 -62 -40 32 23 -56 -70 27
2219B7k2o1K0L9J3n2J4O1j9m1QN2j1k5OJ1M5o6j3K2J0j8k8N3K7n8l8L6N3o4l8
$$ 27 5 -56 -36 3 16 -36 -22 39 20 -21 -13 39 28 3 9 20 65 -1 -14 8 18 0 -28 25 52 -6 -44 -8 45 -19 -57
2250e7M3N9p9n5R8L7q8j0O9J9q7mQ4L4r4QN6rm3J2N9Pq4J3K6kl4nM0J7m2l6K2
$$ -57 -14 45 -34 -89 9 46 -42 -52 17 36 -51 -55 29 63 -31 -23 33 24 -19 -7 52 59 -25 -12 14 12 -22 -27 13 30 -12 -48 -26
2283b6L5k2l2J0M4Jo5P5L9m3n3K8P6l3o9M3O5o6k7M0N5r1k4M3L6m2m3O3J7o6k2
$$ -26 9 -13 -45 -35 9 10 -55 20 59 16 -37 -9 67 34 -35 8 73 7 -20 20 75 -16 -40 3 39 -3 -46 17 34 -32 -54
2314e4P0J2m1k4N1Mj7l7N5kj7J1k3L3Nl5J7P0o7l0j1O1k9n8L1N5k2n9M2N0n4m7
$$ -54 16 28 -13 -37 14 18 1 -36 19 17 0 11 -12 21 26 -9 8 78 11 -19 -30 31 2 -56 -25 30 8 -51 -9 41 -13 -60
2346f0L4N2j7p0N3M9o3l9R4K0o3k7N6N5o4OL2J6l3k6JP7m2o6L1K8k3j7k0L2j1
$$ -60 -26 26 9 -61 -8 41 -22 -61 33 53 -10 -37 19 74 10 16 48 64 31 5 6 83 41 -25 6 34 11 -6 -26 6 -5
2377ej8j2N3m3pJ2M1kp0K0P0k3n5L6M7kn4J4M0m4nj0Q9k3q1L2L5l4l1M4Ll1j5
$$ -5 -23 -35 18 -25 -32 -20 21 19 -51 -31 39 16 -39 -3 44 42 -12 2 42 -2 -7 -17 72 49 -32 0 35 1 -30 14 17 -14 -29
2410b9M2K9m7J2m1M1j0Qk5K0J7l3Kk1O0l2rM6lm5NJ6M6l6l7N3ln6j4O8nm5J3O5
$$ -29 13 42 -5 7 -34 7 -3 5 -20 0 17 -16 -14 -35 25 -7 -16 30 27 -18 -13 3 49 13 -24 29 26 -30 -44 24 19 -26 -13 52
2444E2n6k8jQ9m1l8nM1K2o8L2M9j3m6JL7J4n5J0M6%l7rKK1k0m7N9Nk1m7L4L5l1
$$ 52 -4 -32 -33 56 15 -23 -28 13 35 -33 -1 48 35 -11 -10 27 41 -14 -4 42 42 5 -4 -2 19 -1 -48 11 16 -5 -52 -18 17 -14
2478a4m3O7K9m9j2L4J7l4K3QL3o2l1P6k2jj4J2K4m2QK1J1m4m3M7L6m7l9M0M8p2
$$ -14 -57 10 39 -10 -22 12 29 -5 18 26 59 -3 -34 42 20 19 5 17 41 -1 7 28 39 -5 -48 -1 35 -12 -51 -11 37 -35
2510c5j4N4L7j6n3M2rn1PL1N3k7m3K9RMj1NJ9m8j0M0lj4m0O1j3j4j9K4MKm6L0
$$ -35 -49 5 42 26 -27 15 6 -45 -38 -7 46 19 -24 5 14 18 7 12 31 -17 -27 13 10 -4 -44 17 4 -10 -29 -5 -1 1 -45 -15
2544a5L5m5nL8J0k5j9L1K2k8l9M7K5j6k9L7K5j8l2K2J7n0k9K0L0j9qJ1K1n5j1
$$ -15 20 -25 -30 8 18 -7 -26 5 27 -1 -40 7 32 16 -13 24 49 31 -1 21 38 -12 -41 -21 9 -10 -18 -7 14 -41 -52
2575e2L4L0j4m4K6N2k0k5J7L4Ko3L4J6k8j7K2K3j4n2K5L8k5j9LM9m1k3J1O0l9
$$ -52 -18 12 -2 -46 -20 32 12 -13 4 38 40 -23 11 27 -1 -18 4 27 13 -39 -14 24 -1 -20 -17 32 -9 -32 -21 39 0
2606@m2L0M3k3o2M8MK1k5pL6j5k5PL2j9k8OM7jn7M6J5k5pJ3J3k8m5K9K6j3l1%
$$ 0 -42 -12 31 8 -54 -6 -2 19 -6 -13 23 8 -17 -10 22 3 -25 -19 28 27 -30 16 31 6 -1 12 25 -3 -48 -19 7 -6 -37 -37
2640c7M7ol0J0N9n7j7M3j1K8n1J0O4j0n3K4K3pl3L2opl2ML5pk9MJ2jk8M7j3J0
$$ -37 10 4 -26 -16 43 -14 -31 12 1 29 -22 -12 52 42 -11 13 36 29 -4 28 22 15 -17 -13 22 15 -14 -10 2 1 -27 20 7 17
2674A7l0j8L7%l4J6J7J8l7j9O7k1j8n3O2M1n6JnK7k4mL0Jk3j0K0l1K0l6K2L5k3
$$ 17 -13 -31 6 6 -28 -12 5 23 -14 -33 34 13 -5 -58 4 45 -11 -10 -15 12 -12 -16 14 15 -8 -18 2 -29 -9 -45 -23 12 -11
2707a1j8M7l5mK6lJ5k6j7L8jj4J1qj2pQRK5kl6%N1m6j6j7O4l2l0L1K1j3m3M3L8
$$ -11 -29 18 -17 -21 5 2 17 -9 -26 12 11 -3 8 0 -12 -19 -11 -2 23 21 -15 -15 36 -10 -26 -43 21 -11 -41 -10 11 -2 -45 -2 36
2742C6p7lN1K5m3k1K1K5ol1L5J1k5jL6k5J7n5K8nl0PJ7J2o3K0N3j4k6j7O3Mm8
$$ 36 -41 -44 7 32 -11 -32 -11 14 8 -23 12 23 -2 -3 33 8 25 -30 -2 -7 -37 -30 -13 -1 -64 -44 9 -5 -31 -48 15 19 -29
2775b9kK2K5km5M6mlo1M0L2k0l1O6j1m7j4M3L3m4l6L8J7l2l9P1K3n2m9N1J0j0
$$ -29 -31 -9 16 14 -31 15 11 8 -53 -13 19 -1 -32 34 23 -24 -38 5 38 -6 -42 -4 13 -19 -58 13 36 -16 -65 -14 -4 -14
2807a4k0K2K0j4kNJ0l1J3QL5m4k8M7J8j5k0J1K9k6oj3J4k0KJRmKk1K4J5l6NL1
$$ -14 -34 -12 8 -6 -8 -3 7 -24 -11 -3 32 -12 -40 7 25 10 -10 1 30 4 -2 -15 -1 -21 -19 -18 -9 -13 -11 -32 -8 7 -29 -24 7
2842Gj0Jk5O6k7j6Nmmj6J3Pj2k0MM4j3k6K0J4J0l9qM7k9QoMJ5k4mK6L1n6j4L9
$$ 7 -3 -2 -27 39 12 -4 1 -3 -7 -23 -10 -3 -15 -35 -31 13 0 -26 -6 8 18 -21 -29 18 -11 -3 -9 -5 10 -14 -18 8 39 -17 -31 8
2878HJ3j4k5K2J6k9k7L8K9l8MK2k0j7J3N4m8l6L3M2n3rOLpONJ4J2m1J5J8nPj8
$$ 8 21 7 -18 4 20 -9 -36 2 31 -7 -3 19 -1 -18 -5 49 1 -35 -2 40 -13 -22 -16 -13 -20 -14 -9 5 17 -24 -9 9 4 11 -7
2913gK7ml2K3nM7p7K7Kj3jj1L0J2l0QKJ0m8K9L2kk9l6J7M6m1pK8L2l3k3K5J5j9
$$ -7 20 16 -16 7 2 49 -28 -1 1 -12 -13 -24 6 18 -12 -4 -2 8 -40 -11 21 19 -10 -46 -29 17 -24 -31 -3 29 -4 -27 -2 13 -6
2948fk4M9Ljl3LK8j9j1K5kk8mPL1m5mK6M4n7MJ8rK0l6K8L5l7k5NM5k6j5K4pKj0
$$ -6 -30 19 22 21 -12 -9 19 0 -11 14 12 -16 -20 -13 18 -27 -31 -5 39 -18 -14 4 -5 15 -21 7 42 5 -20 -15 30 4 -11 13 6 8 -2
2985bK2kj0j1L1j3kk9J0M2m3j9N3Kk8oJ3lpJ8l2J1M1o5K1J9lk0L5k9J8j6oqMK5
$$ -2 20 18 8 -3 28 15 13 -16 -6 36 -7 -26 27 29 1 -5 8 5 -2 16 -16 -5 36 -29 -8 11 8 -12 23 -6 12 -4 -10 -18 -14 11
3021A1J9k5k1j8M9l3%LJ1RJ5m4K3Jkj2K6J0j7Lj7RJ0k7KO8m7j8K1Ml4J0k2M0j1
$$ 11 30 5 -16 -34 15 -18 -18 -15 -4 5 20 -24 -1 0 -2 -14 12 22 5 8 -9 0 10 -17 -15 53 6 -12 9 13 -21 -11 -33 7 -4
3056doJ3L8l6j4oM2k4j2j6M5m2K7k6L4Ll0qP1o1j7J5M6k9lKK4j1m3N1J3j8k0%
$$ -4 -10 3 41 5 -9 -15 27 3 -9 -25 20 -22 5 -21 13 16 -14 -22 49 -12 -29 -14 32 3 0 2 26 15 -28 23 36 18 -2 -2
3090bL3m3l2K7nJ4j1j9N7Mn8M3nKk4L1jnk1K0J6j7qK5Lk9J4oMQrj5K6lkk5j4M7
$$ -2 31 -12 -44 -17 -22 -8 -19 -38 19 23 -35 8 3 5 -19 12 11 6 -15 5 21 4 -4 21 24 -5 9 3 7 15 6 -9 17 14 12 -13 -27 20
3128B0ol5N2k2j6K3rJ4k2j5K4Pnj8K6jk5j3M6pn2J6%L0k2mL0%pk7NJ7J5l5K0M3
$$ 20 14 -21 31 9 -7 16 7 21 -1 -16 8 15 10 -8 18 17 -8 -21 25 18 -34 -18 -18 12 -10 -14 16 16 9 -18 -13 4 19 -16 4 47
3164D7m2P%Rj0j1j6N1n5%M0lj7moM5k6oj2lkROj2rJ4mK0j2j5J0j1kM4j6j1rOl
$$ 47 5 12 12 21 11 0 -16 35 -20 -20 20 17 0 -4 -10 35 9 3 -9 -12 -14 -5 1 -11 -20 -6 -10 10 -2 -17 -7 -18 -20 24 8 -3 -12 -6 -9
3203ik1L4PqJ4j8rJ1J0k0J2jk0K4%Pknj6mJ3%okj3K2l7J4L1ok7L0j9J2rL2j0l0
$$ -9 -30 4 11 3 17 -1 -10 1 11 -9 3 2 -18 6 6 13 11 6 -10 -14 -1 -1 -7 -9 -22 0 -37 -23 8 2 -25 5 -14 -2 -11 21 11 -19
3241a9RN8k3l6j1J2%j3L6J2j2j9j8M0l6L6oj5j4kL2kJ1k3kj1K3J6o6M0Lk1K0L7
$$ -19 -10 48 25 -11 -22 -10 -10 -23 13 25 13 -6 -24 16 -20 16 10 -5 -19 -21 11 9 20 -3 -5 -16 7 23 -43 -3 0 -21 -1 36
3275C6k1k4J5j3Nj5K1j%J4l6K8k0K2j1j1OK3m4K3Nj7L3qMJ3k4j4M8n1J2%l3Q3
$$ 36 15 -9 6 -7 -2 -17 4 3 3 17 -19 9 -11 11 0 -11 -5 18 -26 -3 2 -15 18 10 14 27 3 -11 37 -14 -2 -2 -35 48
3309D8o5KJ1OOk4K5l9K0JNK4j9k9N1j5j9J9j0Kj5J9K1k6J3L1j9k4qK3J2Jk7mm
$$ 48 -17 -15 -4 2 8 -16 9 -30 -10 -9 -4 20 1 -28 23 8 -11 8 -2 0 -15 4 25 -1 12 43 24 0 -8 15 27 28 1 -3 -7
3344gLj2K8l5K3%QMj3k3J8Qj2j4J9MJ5j1j8K3nj5L8k0j8kj2L9Lj1j7K8oj9qJ2
$$ -7 -4 -16 12 -23 0 0 8 12 -1 -24 -6 2 -10 -24 -5 -1 14 3 -15 8 3 -12 26 6 -12 -14 -26 13 16 5 -12 16 10 -9 -17 -5
3380eRRk3MKj2k3L5J4j6K9k8NOm2K5L1k5j8J2oK2NK3m3j8NM9k2rnK2j7lMM9n1
$$ -5 4 13 -10 -6 -4 -16 -39 -4 10 -6 23 -5 0 6 -36 -11 20 -5 -23 -11 -17 5 10 33 -10 -28 -23 26 4 -5 -10 12 -5 -8 -4 45 -6
3417fj2lK3Ll9K6PJm0L6M0j9j9K4j1Qk0K0n7L2K8l8L1k7J9klk8J7PkKMj1K1K1
$$ -6 -18 -21 2 5 -34 -8 -1 0 -40 -4 36 17 -2 22 11 19 -1 19 -38 -6 22 -16 15 -12 7 5 2 -26 -9 -2 -4 -2 2 -9 12 33
3453C3m0lPK3k1k2K6J5Ol4M6m8K8j6lJ5pl2J9J8j3Qqj8rL6nkk2POL1j6k4K0k1
$$ 33 -7 -10 -3 20 -1 -23 3 18 24 -10 36 -12 16 0 -3 12 5 -27 -8 10 -3 5 -3 -21 -30 6 1 -1 -23 -16 -10 21 5 -19 1 -20
3489b0kL1Qolj1OqRkoJ1Mj5QJ8%m0K9k1NNJ8j6J9l2KK0l4K7j9J3j2K2k2JK1j5
$$ -20 -22 9 17 11 8 -3 3 -5 4 2 -4 7 11 -4 4 22 22 -18 11 -10 -5 0 18 2 21 -11 -9 11 -23 4 -15 -2 -14 8 -14 -13 8 -7
3527glK9mj0KLok0K2J0j7K2l5K2%oj0K5k3NJ2Qj9J1ORk2k9K6J7Nn1L4j8R%MJ3
$$ -7 -10 19 15 5 7 10 4 -16 6 16 -1 21 -14 8 8 2 -8 17 -6 -1 11 19 0 11 17 26 4 -25 1 18 23 -28 6 -12 -3 -3 1 14
3565A4j1Jj9J7j3P%LpRj3NL1l5pJ3K0j6J6pk4K5LPJ2k2ooJ9j0lK7k7rJ8j6lj3
$$ 14 3 4 -15 2 -11 -4 -4 -1 -8 1 -12 -7 24 -11 -18 -5 15 -1 15 8 -16 9 12 19 31 9 3 -3 16 6 3 30 3 -6 12 -4 -7 -20
3603b0JK7qOl0K4k3J0J9J7k8ljM1j5j6OlRj6J5jK0l2j5J3K5mLKk2oj3MJ2J5k3
$$ -20 -19 8 0 6 -24 0 -23 -13 6 23 -5 -8 -9 32 17 1 7 4 13 -3 12 11 31 -1 -16 -3 22 18 21 23 1 -5 -18 -14 -2 13 -10
3640a0K7j7j0NJ3KK0j8J2l8J0k0L1Qj9J5k3rK1J6l2JJ1k6L6k2rK2J0l5L6J2m4
$$ -10 17 0 -10 -5 8 10 30 12 24 -14 -4 -24 7 15 -4 11 -12 -21 0 16 -16 -15 -4 -30 6 -16 -25 -3 7 -28 8 20 -24
3673b4K3NOJ0KJl3oQJ1k3L3Kj6J2Nj1Pkj4J1j1Lj2J8Pj4j2L3j2l9L6j9PPl0L1
$$ -24 -1 4 10 20 22 23 -10 -16 -8 3 -20 13 15 -1 11 16 5 12 10 -4 7 -4 -1 -13 5 12 -2 -14 19 7 -32 4 -15 -8 -1 -31 0
3710@MJ1m3K3kL0j4lLk%K8l0j8J1J8j3Kk1N2m5lKK2j1J3k6K1k2oRLJ1l1M2qkN
$$ 0 4 15 -28 -5 -7 23 9 6 9 7 7 35 5 -13 -2 16 3 5 -16 36 -9 -12 -10 12 1 14 -12 9 -13 -19 -10 -7 4 -27 15 7 5 10
3748A0m6N4j5j2pL6Mj7j1M3j1k4L0o0M9l6K8%k9J9lj1PJjJ8n8N3j2L4k5lj6j6
$$ 10 -36 18 3 -9 -16 20 24 7 -4 39 28 4 34 -26 23 -13 15 15 -14 5 2 -9 -2 -1 -2 16 -42 11 -1 33 8 5 -11 -27
3782b7M7k2OjJ3l9J8QRj9K3l0K4qK6l4J6kj9JlkJ2qJ6oj3J4pjj0K6jm0M3Jj8J6
$$ -27 20 -2 4 3 16 -23 -5 3 12 -7 16 -14 10 2 28 -6 10 8 -11 -10 -13 -15 -3 -11 5 -1 -14 0 -7 -8 -18 8 7 -33 10 11 -7 9
3820Ik2K9l0K5k1kK2l9K9Nrj2K9k8J3k5L5j5k0J0L5j1MQl0%Mk4K2J2LK5l3k6N4
$$ 9 -13 16 -14 11 -10 -12 10 -29 0 5 -4 -16 13 -15 -2 -27 8 -7 -27 -17 18 7 11 19 -11 -11 -7 -31 -9 3 6 31 -2 -28 26
3855B6m2LJ0J2k1rJ5JJ0l3L4oKjPj9j4K4OPj2j4L2nNj4j4J8j2J7qKK7oOj8jj1
$$ 26 -16 -13 -3 9 -12 -21 -6 -5 5 -28 6 0 2 1 8 -11 -25 -1 5 12 0 -14 18 13 18 4 -10 8 -4 13 5 7 34 28 34 16 15 4
3893DJ9j0k2J6rmk5K4LJ3k2Pj0K5j9PPL1m5RK1rj9KPlKKj0L7m9RK2j0L8j6k1j6
$$ 4 23 13 -9 7 -2 -6 -31 -7 -4 9 -13 -6 -16 9 -10 -3 4 35 -10 -1 20 11 -8 -6 1 -2 0 2 -8 29 -20 -11 11 1 39 23 2 -14
3931a4K0mk4P%L3l2K2OJ0l0oLK1Ml0L1j2k0Qj0kL5j6rJ9K4j3l2J8l0K4K0l1MJ7
$$ -14 6 2 -22 -15 -15 18 -14 8 14 24 -6 -12 -9 12 16 -14 17 5 -15 -7 -17 -19 16 0 -9 10 34 21 -11 7 -23 1 21 -10 -6 11
3967A1j7LK6qk1J4MK8n1K6j6J2j2k9K1nJ3MqJ5l0K3J2k2oRJ0k5PJ2nj6K7Qlk1
$$ 11 -6 -3 23 15 -6 8 12 40 -11 15 -1 11 -1 -30 -9 -14 -1 3 -5 10 -20 3 15 -7 -13 -4 6 -19 -12 0 -5 -21 6 14 11 -10
4003a0K8n2PM2l5MJM4k6j4nM7l6k2K2PJ3J1l6NL2l3MLRKj1nj4L4k4L1k7KlKJ2
$$ -10 18 -34 -27 15 -20 -16 -15 29 3 -11 -16 31 -5 -27 -5 2 15 26 -10 -5 27 -6 -2 1 10 12 1 -4 -18 16 -8 23 -4 -2 -5 -3 9
4040Ik8J3mj5J6mJ3olK9pK2j0k3Pj7L7k4J8Mm8K6j7K0Kj0j5J8nqJ0rL9j4n9K5
$$ 9 -19 -6 -10 -25 -9 -13 0 -6 -9 20 13 35 25 2 9 -8 29 5 23 27 -21 5 -12 8 10 0 -15 3 -2 -10 0 -9 30 16 -43 -18
4076a8K4rJ3l5OQL4rk9K2j2mM3n4J0L9m4RK5j5J1j4L8m8J2jjKnJ6oOk6J2J2j2
$$ -18 6 -3 10 -25 -19 -11 23 14 -15 7 -5 -9 34 -20 -10 29 -15 -6 19 4 15 1 39 -9 3 2 1 3 -2 14 8 14 -12 0 12 0
4112@j3J1Mj0mJ3%J8l8k1K1K6k0Nj0lL8l4J8j6rJ7J3J0J4l0j0K6k%k2qK3PoJ9
$$ 0 -13 -2 2 -8 -12 1 1 19 -19 -40 -19 7 -13 -8 -18 -21 17 -17 1 -15 -24 -7 6 16 30 0 -10 16 14 14 -8 -16 7 14 8 27
4148B7l6Qj0L3j6qJnrOK0k8J5Qj9Jj3J3L2l1NJ4k2kN5n7J5j2L7k3lJRjKkk9N0
$$ 27 -9 -1 -11 22 6 -2 -1 -6 -15 -9 11 -17 -2 6 -13 -12 -25 -12 20 -11 -6 8 -14 -16 39 -18 -3 -15 22 -1 -4 -3 6 5 7 5 -24 26
4186B6k3J2l1K3l2M4k4j5J6qJ3j0J0kJ3j7QJ3k3k2L7j2lJ8j9KkMqj8L8k1%K0J
$$ 26 3 15 -16 7 -25 19 -5 -20 -4 -12 1 -9 1 -1 12 -5 3 16 -7 -29 8 -4 -7 11 -8 -6 -8 -4 -12 -30 8 -13 -13 7 8
4221HmJ1j0lJ1lrJ1m1ORK4j3Oj7K9qk9L9Kk1L3qk9lL5J4k1k9k2J6J4Mk6QK5qm8
$$ 8 4 15 5 2 13 10 1 12 -29 -23 -14 10 -3 3 -14 15 7 -22 17 19 -2 31 23 -6 -9 26 40 19 -10 -32 -16 -2 2 -24 -16 9 1 -47
4259d7K2PK5j0JoK6m5L2J7j6Qj0L6l5K8j1Rk4j8K4ml3J3J5pk6J6LqoK6%Qk3lN
$$ -47 -25 -18 7 -3 -2 -8 18 -27 5 22 6 14 4 40 5 33 22 31 7 -11 13 9 -24 -11 4 -3 -29 -13 -10 -18 -24 2 2 10 -13 -16 -11
4296a1j8K4l2M0Pj3pJ0Jk1J6%l0oM0j1L9m1K2ojJ4jk8RqmK0Jk4K2KNj9Kk6K7P
$$ -11 -29 -5 -37 3 10 -3 -10 0 1 -20 -4 -4 -34 -40 0 -11 28 -13 9 3 2 16 15 -13 -4 -12 -16 4 5 -19 3 5 10 -9 -7 -33 -6 1
4334Aj7L1qj4J7j0J6k5J9Pj1MKKKk0l4L1kLJ2lPl3J6%mnK1Jk6MQk1K3oK6j5Lj0
$$ 1 -16 15 7 -7 10 0 16 -9 10 17 6 10 12 14 16 -4 -38 -7 -9 -6 6 3 10 -23 -7 -7 -11 -16 5 6 -20 -16 -8 -29 -6 -12 14 -1 2 -8
4374hmLL%Rj0nnQL6k3J2j1j8R%k0L9K2l5oJoMoK0k3K4J4J0m4L6l5KK8j7k7L9j6
$$ -8 -12 -9 -6 -6 3 -7 -12 -17 -9 27 4 16 5 -13 -4 -4 -24 15 37 2 -4 -3 -9 -5 -11 9 -14 10 24 34 -10 26 -9 -7 21 4 -23 16 0
4413@LPJk7J3nmJ9j7Lkkk3RJ3J9p%k2N0j6%k0j4J4j7PPL7jk3J4k2ol0L8J3k7L1
$$ 0 3 10 11 -16 -3 -8 -12 7 -10 -7 -9 -11 -34 -25 -12 7 0 0 -22 28 12 12 -8 -22 -8 -25 -18 -11 26 25 2 16 -6 -12 -42 -4 9 -18 13
4452A3%k4pJ2LKl4L8LJ1l3j0K1Lpk1J2L0Rj6qJmJ6j5Qj5pJ8JoJ7J3Jj6pkMKk9
$$ 13 13 -11 -18 -6 -3 -1 -35 3 6 17 -16 -26 -5 -2 -9 -30 -18 12 21 5 -3 -2 -6 10 -5 3 -12 -19 -1 0 -6 11 24 25 9 2 0 4 6 -23
4492b3RJ8MPjQrl4L0j0Qk3jK3j8J2%RqRnRRk4Rj1JJ5J2LqPk1J3k0KK0Ll3RJ7j2
$$ -23 -14 4 8 15 14 22 13 -21 9 -1 7 -16 -17 6 -12 0 0 9 1 10 5 14 23 -1 8 -3 -2 13 25 28 20 27 6 19 -1 1 21 24 -9 0 17 5
4534EpOLkj0K2k2OMpk7L8kj5LqJ9j5nRJ7j1%K6m1K6J4l4J4J3l8L2j4J5j9MJ2q
$$ 5 -2 4 7 5 -5 17 -5 1 5 -2 -29 9 7 -8 -5 -13 6 -9 -14 -5 12 1 1 27 -14 12 26 -8 6 19 -19 13 -1 14 -5 -1 11 3
4572CK4k5k4J8RkLJJ5j7kj6J7j5K1j3J5m%j8J4Pk0K2KJ1k9j7MRROl0MN0l9J8k0
$$ 3 27 2 -22 -4 5 3 6 7 22 5 3 -13 4 -11 10 -3 12 8 8 -10 4 11 -9 13 15 26 -3 -20 -16 -7 2 8 -22 -18 32 -7 11 -9
4610iM0k4j4J3j9M1j8j3k2O9m5pMOj2L0k6K0k8NK4L%k4j2QJ9j7k6K2jN4m2j7J1
$$ -9 31 7 -7 6 -13 28 10 -3 -25 44 -1 -8 -4 2 -10 20 -6 14 -14 -9 15 18 18 -6 -18 -10 9 -8 -34 -12 -13 41 -1 -18 -7
4645goK7j9J2j6K3k6QNlj4K3Rl6LK2Pk1jOpkj2K4kJK7k9mK2k3k4J6NJ3Kj2K1j3
$$ -7 -13 14 -5 7 -9 14 -12 -4 1 -2 -16 7 16 -20 -17 5 12 -9 -10 -4 -11 -13 -25 -1 -3 -2 25 -4 -8 14 -9 -33 -17 -12 1 3 -9 12 -1
4684ak9M0rKnl6O9l8J5lK2qk6N0m9QnJ1k7K5kK8l5JMk0KqJ8n%qQj6K3MPJ8m0Q
$$ -1 -30 10 1 3 -2 -38 31 -7 8 5 27 19 -7 43 -6 2 -3 8 -19 6 4 32 -3 -2 2 -18 -16 -24 -6 -11 -11 -19 -11 -27 -4 0 7 25 -15 -7
4724gJ5k0L5nl2MpJ1M4m2J0j8pK4j7J6jk4K7k8J0QpJ4j4NnMNpK0j6nJ0j4K0k6
$$ -7 8 -12 23 18 -14 -10 -17 -6 38 -4 6 -12 -19 5 -12 4 3 -21 6 -22 -12 -4 -11 3 -11 -6 -11 -7 -2 -9 11 -5 -10 0 -14 6 -20
4761b0K6k7J8l0L9%qPJ7k5NqJRj3J0K1k5LmK8k0MK4k8oJ9k9J6K4n1L1Onk1JK9
$$ -20 6 -21 -3 -33 6 6 -2 5 22 -3 2 -6 -5 4 -9 1 22 -3 0 -4 24 4 8 32 4 -2 17 -12 4 28 -23 8 14 9 -12 -11 18
4798A8k1J2l4J4J6nj2J0Qj5J4kLolMMK9n0J2L1k3LMlkL1k0k8LQJ8k6lK6k0K6r
$$ 18 -3 9 -25 -11 5 0 -12 -2 6 -9 5 3 6 0 -3 1 5 34 -16 -4 27 4 7 11 8 6 37 17 -11 -8 0 18 -8 -11 15 -5 21 12
4836A2j8lkRQMnj9JKk1L0k4M4l1P%NK0n6K9NmJ9j3oK2j3Oj9J1j4L3Qm2J9J6j7
$$ 12 -6 -9 -11 -2 6 10 5 -14 -13 -11 -32 -2 -26 18 -13 -6 -6 -1 19 -37 -8 -3 -7 12 -1 -7 15 2 8 -11 0 -14 19 27 -15 4 20 3
4874Cj0J1j7j0L3k3J6mPrj6RK9l6j9K2P%K1l0J5kPnj4K1m6L0K6j8j0Qk8L1PJ0
$$ 3 -7 4 -13 -23 10 -13 3 -1 6 -3 -19 -10 19 -17 -36 -14 -7 -7 14 -16 -1 -3 4 -1 -15 6 -40 -10 16 -2 -12 -4 -32 -1 6 16
4910A6Lk6%j8K7J0j4K9j8Jj9L9k8Rk4J6j0j8kL0j2J8J1m3K4oj6K5%j1kK9k7MM
$$ 16 19 -7 -7 -25 2 12 -2 27 9 10 -9 30 2 11 -13 3 -7 -25 -27 3 -9 9 20 -23 1 -5 -21 4 4 -7 -9 20 -7 -3 1
4945Aj4L1l6KK8k3J7mL3l3olRj7J2J9lnK9p0J6J4qJ3rJ5Lj5MPj8K1%j2mPj6K0
$$ 1 -13 18 -18 -16 12 -11 6 2 35 2 -4 -7 2 -15 -3 16 13 8 37 -33 -17 -3 -11 2 -7 8 11 -4 0 7 -11 10 10 -2 -6 1 -15 5
4983Ek2J4J1%mJ8k3J5j7mL6k4rpRnj1J7Rj2lpM1j9j5RRk9L6j4k0k8O1k6L3j9J4
$$ 5 -17 -3 8 8 4 22 -1 14 -3 -7 29 5 -4 -11 -2 -7 -18 -1 8 -4 -7 -14 27 8 -7 2 11 -18 18 4 -16 -44 17 -9 24 5 19
5020A9l1PNj5OJ9l1J5OOj4nj7O5k8lJ5k9J6oj3%M3m2oK3orJ2Oj0%Pj8M7m3Qk4
$$ 19 -12 -5 0 -15 -9 10 -21 -6 0 6 -8 -13 -30 35 7 4 19 -10 6 0 -13 -13 30 -12 -18 5 -1 -10 2 8 -2 -2 5 -13 34 -9 -1 -25
5058b5MJ0J7j8K2nJ0Oj1k9OL2j6mK5k6j1M6m1JnlMQJ6Nk1lK6j5J7l3J1k5K2K7
$$ -25 -21 -11 6 -12 10 5 15 21 10 -19 -13 19 3 -1 24 -2 -13 33 -8 -7 -12 -15 -11 -3 13 18 -3 -6 20 5 22 -11 0 -25 -3 24
5094B4n8K4j1K5Kj2%j9M3om7K4K6kj5L3Jm9lK2K9J2m4Koj1OOK1k5mLQjRJ8j9j
$$ 24 -34 -10 -21 4 6 -6 -6 -25 18 12 -35 -11 15 13 -2 31 32 -17 -20 2 31 43 -1 1 -5 -16 -10 -4 17 -8 -12 -9 -1 -2 7 25 6 5
5132EpRj2J7nrLj2Jj3M0%l0qPK4m8M6j1JL7l8K3LpJ9j0j9Oj2J4k5J7k4K2k1NL0
$$ 5 -2 7 -5 12 7 -2 1 -11 -10 -23 17 17 -13 -21 -14 10 -38 8 -3 -2 35 -3 20 23 16 35 25 6 12 0 14 -11 6 -18 4 -17 -12 18
5170A8l5j2L1k2%K8nk7RK1rk2K4%j5Rj0K1l4L9j4jK5j7J5l4J6J1j2J7j1jj1K3
$$ 18 -17 -29 2 -20 -20 8 3 -24 -15 6 -3 -25 -1 -1 -16 -7 -17 4 -30 9 -5 -6 19 2 17 -17 -1 10 -2 15 4 3 -8 15
5204A5lpk4N0l6k8N6Oj5j7K9k5nJ5k1pPRKj4J1lK0j6Rmj2PJOpmj0K3j6J7j7Po
$$ 15 12 5 -19 31 -5 -33 23 29 14 -3 26 1 -4 11 -10 -17 -10 -1 1 -13 -2 -5 15 -1 8 4 -8 -1 0 6 -1 -5 -15 8 -8 9 -8 -1 -7
5243gnK3k6%L1Kj0MNJ7k6l2J1OJ7k3NoRLj4OOJ2k1J2k5K8j2K0oj0J3j0J7kj1j
$$ -7 -12 11 -15 -15 16 18 8 12 17 34 8 -24 -13 -7 10 -13 -8 -14 -5 -2 -16 -10 -4 8 -13 -1 -26 2 -10 10 4 -6 7 -3 14 12 1 0
5281@J1j8J2J1j8M5l1j1J0qjOj0nMj3JMK9qj9J8j2k2L0l1L4l8K9K0k3j%Nk1jJ1
$$ 0 11 -7 5 16 -2 43 12 1 11 3 2 8 -2 -7 -3 -16 -15 -11 18 10 -9 9 -3 -25 5 -26 8 -30 -1 19 -4 -5 -5 0 -21 -22 -11
5318a1K0l6J1PLrJ6JJ6nk0K3j5Rj7Rj9K0J3J5pk6Oj4J1Oj1K2l1k7NK7K4k6J3L
$$ -11 9 -27 -16 -9 -6 -15 1 2 18 13 -7 16 1 10 -7 2 -17 3 16 31 24 -2 4 -10 1 7 -4 18 -13 -40 -35 -8 16 -10 3 6
5354Fk0jqK1k8L2jJ1jl7J7K4jJl8J9j0K2j8J8Pj6J9k4qK1m2KJ8K2Pk7kK5k5LK7
$$ 6 -14 -15 -23 -2 -30 2 1 12 11 -26 -9 15 14 15 -23 -4 -14 8 -10 8 15 -1 18 -6 -14 7 -35 -33 -15 7 14 -13 -15 10 -15 -12 15
5391A5Pk6llk3L9Pj9j6NJ3j6J5lQk1K0Jk3K6kLl1K5l1L5kqmj9L9l9J3J4j5K0o
$$ 15 22 -4 -7 -10 -33 6 13 -6 -22 -17 -4 -20 -5 -8 0 -21 -1 0 -23 3 1 4 -27 -2 -33 2 0 -8 -12 -31 8 -31 -18 -4 -19 1 -5
5428eJ3j5J5rRk4J9mjJ6%k6J0K1k8KmJ5k5LNL2k0lj8L4l0K1MJ4l6MRJNk4L7k9
$$ -5 8 -7 8 -1 8 -16 3 -1 -2 14 14 -12 -2 19 -9 -7 -11 4 -21 -18 -13 19 -1 -4 -22 12 -18 3 7 21 -15 -11 -2 -1 4 -20 17 -12
5466a2J0Nk3K4lj4oJ5j9K8j3j0LK4okjrPk0PL0o0M4MJRrj1K3oQrk4L1Plj8pj2
$$ -12 -2 3 -20 4 1 -13 -19 -4 -23 5 -8 -18 -15 9 3 1 0 -9 -2 -22 -15 15 -45 -1 3 4 13 4 -7 16 10 18 9 -15 16 23 20 2 -5 -17
5506a7RK1Jk0J1J0k6K2k3J7Ok0K0k1rM6l2j4L1j4j3M2l2nL6l4K1j7J1jKj2NJ1
$$ -17 -8 13 14 -6 5 15 -11 11 -12 5 11 -9 11 -10 -19 27 -5 -19 12 -2 -15 27 -5 -10 26 -8 13 -4 7 6 8 -4 1 12
5540A2J5k0NMj0k0NQrpJ1QK3j2k6L8j8k0J1lpK6Rm4J1j7L9k6Lj0J7rPJ9rk1J9
$$ 12 27 7 12 16 6 -14 -9 -1 -10 -17 -6 2 25 13 -13 25 7 -13 -2 -5 -12 14 23 -21 -10 -27 12 -14 -11 -21 -4 -13 -6 13 4 -17 2
5577BlJ1j6QoJ7l4J0L3m2K4j1M0k8j6K5k8J7OpOj5kJ4Nl2L2l4J6omNjnL3jj7%
$$ 2 -1 10 -6 2 -4 13 -21 -11 22 -20 4 -7 33 5 -11 14 -14 3 9 2 8 -7 -9 5 10 -22 10 -24 -8 -14 -18 -13 -14 -19 14 13 -4 -4
5615dklJ9ol7L2NNJ2k3pJ7k1K0qK0l0L9l3ojJ4rJ6%j1k5L7l2RK3l2J2J4j2rJ3
$$ -4 -6 -9 10 4 -33 -1 4 9 21 -2 -9 8 -13 7 -1 19 -11 28 -5 -11 -12 2 -7 9 9 -2 -27 10 -22 -13 10 -22 -10 4 -8 -17 -4
5652dk5K8j6K1lk9K9j0pJ3pK7k0J6Lj7K1Kl0j8J9kMLJpK1k4QK2l3J6j6jOJ9j9
$$ -4 -29 -1 -17 4 1 -28 1 -9 -16 -3 -10 17 -3 13 16 -1 20 22 -8 -26 -7 -9 -5 -2 -1 -8 13 -11 -3 19 -14 2 -14 -15 -9 10 -9
5689ij1K3m1L1NrK2l7J0Mj0J8j3pJ1JL5l6J3LkJ1%j2j3L0%rk5K8j7K3jm3L5jj4
$$ -9 -20 3 -38 -7 -2 -11 11 -26 -16 -12 -22 -4 -17 -24 -13 -12 23 -13 0 3 1 12 12 0 -13 17 17 8 -17 11 -6 17 16 -27 8 7 -7
5726gjj0J4K8j6k6KJ6mJ2j6kjqK5J3k5JJ8j0MJ2j0Lk7K0J4j6Kj3PK1lj8K4k4j5
$$ -7 -8 -18 -4 24 8 -18 -16 0 -4 8 -8 -10 -11 -19 6 19 -6 -5 13 3 7 19 9 12 -15 5 19 3 5 -8 -1 20 17 -1 23 -1 -16
5763a6J7j2OJ3K9l9k3K5m1L7j2K5j2j9PQj1K6k8J7k4j0N3k6J4k0K5j3j8L0j8J2
$$ -16 1 -11 -5 8 37 -2 -25 0 -41 -4 -16 9 -3 -22 -15 -7 -18 8 -20 -3 -27 -37 16 -10 4 -16 9 -4 -22 8 -10 2
5795BL1l7kJ9J4pl3J7PK5k3J1ql3K8J1k5Lk0kk2M7L0n1J5lJ1nj4J3Nk3K1Pj5J0
$$ 2 33 -4 -6 13 27 20 -13 4 11 36 13 24 16 -17 11 22 -3 0 -20 -22 -44 3 33 -18 -3 -6 5 0 -14 -1 4 -19 2 9 -6 4
5831DPj6o%L0j6K0j0Lo%Lk0K1j8J3l2ORKRj3J7lj9QOnJ9lk6J8K4l6j1J4jKJ9J3
$$ 4 11 -5 -11 -11 19 3 23 13 16 10 10 13 -7 14 -4 9 -23 -17 -8 -6 3 -10 7 4 -15 -7 -1 -6 13 10 -16 2 26 -10 -21 -7 -8 -6 13 26
5871B6l3KL1m9J8lkK4pQNlJj2LkRk4jpK3j3j4qJ6L7m1LK9m3L0Lk5J5j8K6Jj5J6
$$ 26 -7 -5 26 -23 -5 -8 -10 14 7 15 20 17 18 6 9 7 16 -8 -9 -16 7 -6 -20 -28 -12 25 -16 -13 16 -27 3 6 -19 -4 -22 4 5 -10 6
5910Fj1j9L5pk6L9K0j9j1proK3J0j1rPK4k0j2pOK5kk0LK5j9ojpnj7J9LNRjJ1J
$$ 6 -5 -24 11 4 -22 17 37 18 7 0 -9 -15 8 18 7 -2 5 29 9 -3 -10 -4 21 19 -1 2 27 8 2 1 -6 -11 -28 -9 -6 -1 8 7 18 19
5950A9k4M2k3j8j4J9Rj2kJ3rJ3j8k0K8k4K7j0J8LJ9j4j1k0J1J1Jol6K3J3j0ok
$$ 19 -5 37 14 -4 -18 1 10 -2 -4 9 0 13 -5 -25 3 -21 6 -4 14 17 36 22 11 -9 2 13 14 8 -28 -5 8 -2 -8 -10
5984a0oK7oj8OMJRqoJ6j6OLMj7Pj3NJ7K4k8LqPK3n2M4k7K2j5J6nk3L4m2N4j4l1
$$ -10 -16 11 5 -13 -7 -3 -2 7 -1 -7 9 -7 -1 2 6 -11 -4 -17 -12 5 29 1 4 -4 3 26 -26 18 -9 13 -2 14 9 -14 20 -22 32 18 -13
6023a3J9lk3KJ5j9K1j9J5J3j8K1l1J3mJ7qmJ1Oj9RNJ0qpRJ4J1m4nL7K3n3kK0k4
$$ -13 6 3 -20 -18 -3 -22 -1 -20 -5 8 -10 11 -20 -7 -11 6 -2 -6 5 11 -8 1 6 16 8 1 10 24 35 -9 -14 23 46 -7 -9 11 -13
6060a3K0L6l9J9l3kL1n0K4oJ6k0J1%kJ1Jj2J4Rk5J5k2QJ7j2JPnj2RK1kj5L3k8
$$ -13 7 43 4 23 -10 -12 19 -31 -7 -13 3 -17 -6 -6 -8 3 4 -8 6 15 -10 5 -17 -9 8 -4 -3 4 -1 -13 -4 17 15 0 33 5
6096EJ2oj1j2kJ0k0M8l3J1j1OjJ2Kll9J4J0J7Lj1j0J3jk5L8qJ9k6J1jk1j3K5J4
$$ 5 17 11 0 -12 -14 -4 -24 24 -9 2 -9 -3 -4 8 10 7 -32 -18 -8 9 12 1 -9 4 3 -22 16 8 27 1 12 11 -10 -23 2 16
6132A6J4k8oRJmlK3j5J7k6K6qqmj3MOJ1l8M0k2k3K7Oj3K8l1L2j4J2l5J0Rj0L1
$$ 16 30 2 -4 5 6 2 -1 22 7 24 -2 24 16 8 4 -9 -5 1 12 -26 14 -8 -31 -4 2 -11 17 -14 18 4 16 -19 -9 0 -10 21
6168B1j1j6J2JqPmJ6J3j2J4k1%K3o6MjL4oj7N4m7J0mJ2j6j2L9j6Lj5J1k4K3j4
$$ 21 10 -6 6 7 -1 6 2 18 31 19 33 12 12 35 -31 -27 -28 6 0 -17 37 -10 0 -4 8 -8 -20 19 3 6 -9 2 -22 1 -13
6203a3lK7k6O3o1K6kj7j2QPK5j7L1k4j8mL8k9MJLLk6J7lPljlJ7l7J6j7K2jkqJ5
$$ -13 -16 11 -15 48 -13 13 11 -6 -18 -10 -3 22 5 36 12 -6 -10 28 -1 3 4 7 10 -16 1 -2 5 2 1 -2 15 -22 -6 -23 -1 -2 -4 -12 3
6242CMnk0KPJ8k2Rl4M8l1NK1j5jmJ9J8m5K5Rj7j4L9j9J5j4K2l2J0J2n8M6JJ1N
$$ 3 7 2 -18 -16 -9 9 -13 -4 -38 10 -21 -16 5 -10 -11 -15 4 22 -23 2 11 -6 -20 19 0 15 1 23 -9 1 13 -45 1 2 13 18
6278A8l6oMJJ1J2ll2K4npK2rQLkK2k6J1oJj4RRl9K4K0k4PL1jqK7m9J2j4K0k1p
$$ 18 -18 -24 -20 -19 -8 4 1 -31 -7 -12 -19 3 -6 2 5 3 25 -1 10 4 5 -9 0 9 -30 -6 14 -10 -3 28 27 19 46 -3 9 -5 15 -6 -13
6317a3J1NNkQk0%J5pk4J0lK3j0KQj8Nk3M6k2K2k3J7Jj9K7m1O2m8LQnnpK0J6k8
$$ -13 -2 3 8 6 14 -6 -6 9 2 -22 -12 -15 8 -2 0 8 -10 -5 -28 18 -4 18 -5 12 13 -6 21 -20 42 -6 -3 5 0 -5 -12 8 24 -4
6355dKjK0Mk8PJj2J0j0J2Ol0L9k9J0KNj0K2k9RqJ1%J1rnJ1PKkoK7l0llJ2j8%O
$$ -4 -2 -3 17 21 -7 0 1 -11 -1 -11 1 7 -23 16 -13 -3 -1 4 -6 16 -13 -4 -12 -1 -1 10 1 -4 7 14 16 14 8 35 5 2 -1 11 -7 -7 -1
6396aL2n1K4%Rj4J9j1j1jJ6j8K2j1k0J4k6J5MpK6j4k0J7QRk1Ok7M9k0K2l7M2j3
$$ -1 31 -20 4 4 13 -1 18 7 -4 -5 11 -7 15 4 -16 -2 -28 -13 -9 -16 10 -4 -24 -7 1 10 -11 -5 -32 17 -3 19 -18 24 11
6431A1nmLj5K5opqK0pJ0K7l0j4jOj4J6rJ0j0Ok3K6k6M9l2mJ0J1j8J6j6J1j0PR
$$ 11 6 2 5 -10 15 9 2 -6 14 7 17 44 14 0 -1 5 -9 7 -2 8 -2 4 -19 7 -19 30 -2 -6 4 15 -3 13 -3 8 -2 5 14
6468A4j4%MRJ7j3j7J5j2j8J5J3J9j6jPl2J2j1K5l4K2oMj6J6jOk4K2qjK2qj1j4
$$ 14 0 0 4 13 30 17 0 15 3 -15 0 13 32 16 15 22 -10 2 -9 16 -18 4 -2 2 -14 2 1 7 -17 5 -3 -4 18 10 -1 -15
6504a5J1lj7L0Kk1J6P%jL%k6J8pK0l0J8qJ7l3O4l6j4oM3%l1j1lJ7j1J7k0j5K9
$$ -15 -4 -7 -24 6 8 -13 3 10 10 9 12 12 -14 4 -3 17 -13 5 -3 14 -19 45 9 -5 -11 32 32 1 -10 -13 4 -7 10 -10 -25 4
6540Dl7K2j3NjPJ2KKk6K4j4K5Mj2j9kM7l0kK0k2Rj7K3oJ6j5K9k4j6J3j4J5Lj5
$$ 4 -33 -11 -24 -19 -20 -13 -1 1 3 -23 1 -13 12 16 4 -15 -17 30 0 -2 18 -4 5 -12 11 5 21 6 35 11 -5 8 -6 9 12 -3
6576cJ8nj3nrJ4K5k7r%J6jJ0Kj9Jj1jJ4L2j3j2j2J1J2kl2K8k7L7j9J1K2j0k8M
$$ -3 15 10 -3 -8 -17 -3 22 -5 -14 -14 2 1 11 13 -6 -5 -16 -17 -3 29 16 4 -8 3 15 13 -19 9 -18 19 0 11 33 23 -5 -1
6612aK3j5J3l7J5K2j8j7j8qL4Rk7L1j3J8j8nJ8Lj4k6NRL6l2PjJ6k5L3m3M5Ok6
$$ -1 22 7 20 -17 -2 20 2 -15 -33 -41 -7 2 -25 6 -7 11 -7 -12 6 9 -5 -31 -26 -17 19 -13 -6 -7 9 -16 17 -26 19 25 -1
6647aL2k1j0J6j4qNK2j3j0J8j7J8n1QL6k4J6J8k7K3m1%N1l8K1j8K8j7qJ3k2J2
$$ -1 31 10 0 16 2 -6 -1 21 8 -2 16 -1 17 -34 -26 10 -14 2 20 -7 16 -25 -25 26 -12 9 -9 19 2 -6 7 -15 -3
6680cJQj8J0KJ2Koj8L1pj4J3k7L1j4mko%jL7k6Ol6RK4Jk4rK8kQkj2j8qL0kK5j5
$$ -3 -2 6 -12 -2 0 12 14 8 -10 21 14 0 13 -14 17 3 -1 -3 -9 -9 -10 27 1 7 -29 -20 4 5 -19 -28 0 -2 6 4 -8 -26 -34 -4 -6 19 4
6721DqK2rJ1j2llJ9j3QJj7J6j9Oj2M4k8J0rOl5M0j9pJ6qojrK7Pj9Nj5OmONK4j2
$$ 4 -4 18 9 20 8 5 2 21 8 16 17 0 16 -3 3 -9 35 7 17 8 14 -21 19 0 -7 9 1 -5 -6 -15 12 19 0 5 -10 -4 -8 -2 3 27 15
6762A5mQJ6l7J9l0L1l8L2j9K3k8J3K0k4J2roML5n9L6Jk7jJ4J5jrNk9nK1J1Nk7
$$ 15 11 19 35 -2 17 -13 18 -20 12 -7 16 -12 1 21 -3 9 0 -6 -2 33 -26 10 11 -16 -17 -3 12 11 2 7 -22 -27 -6 5 10 -17
6798a7K4k2j8NO%K1jjj0K7j2jlj5K0RK6n3J5M0l5oM%K1k5k2K7nJ9rj3L3l5nKj1
$$ -17 7 -15 -33 -28 -22 -22 -1 -2 -3 -13 14 2 1 -2 -17 3 12 38 -15 0 40 5 -1 3 3 24 -1 -23 4 -1 18 9 -4 29 -6 -11 -9 -20
6836b0L0l9K2nJ0K5rj8R%j3J1K4l0j5L4k2L4k3pL3m4QJ4J1%lk0J3j7K9k2Mj1P
$$ -20 10 -29 -7 -12 -2 23 14 -4 5 5 -8 3 27 -3 -18 16 -6 28 5 -2 31 -13 -5 9 20 20 17 -3 10 -7 22 0 4 -7 0
6871@QqlMj3J2j2oJ5RLm0L9pK3o0M8orL3l5kJ9k2K0L5n4JJ5K2k6MK5m2oJ2K3Q
$$ 0 8 0 -3 1 -12 0 -12 -18 -3 6 9 -31 8 1 24 -36 12 6 -3 30 -5 -7 12 -10 10 45 -9 -8 7 29 3 7 32 -10 -16 -4 19 27
6909B7l2J2l2K6j0oJ6mPj5K8nrj5J4j3KjJ2JOj0M%j5L3qj4K4n3M0LqM1k9l3L4
$$ 27 -5 7 -25 1 -9 -15 1 -3 4 -11 17 12 3 -12 2 -11 -9 -10 2 3 9 -1 3 3 -12 21 13 -1 23 -30 10 13 5 46 17 -16 18
6946A8j6Ok3J1JJ4nlk8K6OJ2j8J5k4J7j8%J1J6J2k3k4RL3m0nJ3klJ5%jLJ6l7K7
$$ 18 2 8 -15 -4 -3 11 6 3 -25 1 7 19 1 16 -8 9 -9 -9 2 18 30 7 -17 -8 25 -15 -20 -7 -9 -12 3 3 2 5 21 -16 11
6983A1L0j3l6L1Qk9J5J3k1j4K3Jj5j5mMj5L1nrJ0nJ8k9QJ1K2m3NJ7k8J6lK7k6
$$ 11 41 28 -8 23 31 2 17 30 9 -5 18 19 4 -11 -15 -11 -26 5 0 -9 1 -4 14 -15 -7 4 26 -17 -12 5 -23 -7 -10 17 -9
7018iK7mQj9j9lL1J1ql0J1%KNnOkL1l5J1j5K9k7J0k8L7j6jj7K7lK1m9j3PL5k1
$$ -9 18 14 22 3 -16 -19 12 23 15 -15 -4 -4 -2 3 -2 4 2 33 -2 9 -6 23 -4 6 -22 15 -1 -2 -19 8 5 26 -23 -36 -29 6 -15
7055a5K9k1J4Rl2J2oJ6jpKJ6j4K3n5O6k2l4K7JK0l1M0k6J3j9l4L5j2K2j0j1nJ0
$$ -15 14 -7 7 16 -16 -4 -10 6 5 -2 0 16 2 25 -30 36 14 -20 7 8 28 -3 37 11 24 5 -29 6 -6 16 6 -5 -10 0
7089@k8L2k9J2%MKk8K6Nj8J3K0Pk4J7jj4QRnJ2j7Kj7nM9k4p%JJokj1K5k4L0Om3
$$ 0 -28 4 -25 -13 -13 -9 -7 -35 -9 -4 -22 -9 11 18 -6 11 10 -4 4 13 8 20 3 5 -12 -17 32 8 1 1 2 3 -3 -5 -16 9 -15 15 21 -22
7129b2QL6j4j4nJ7Rrj7LPkJ4j0RJk5L5jk3QqJ6Pj3Rjj0Pl9K6K4k1jj4L1j9Jj2
$$ -22 -14 22 8 -6 -11 6 15 6 -11 -8 -1 -3 11 1 10 11 -14 21 20 -3 5 -3 13 20 7 16 15 5 12 -27 -1 23 2 1 -13 18 -1 0 -12
7168a2j7K5j9QJ0j6K0J1j4%Kj0mj6L7rkK7m1J9j3PJ3rmL2l1l0K1L0Rk8jK2J1k0
$$ -12 -29 -4 -23 -15 -5 -21 -1 10 -4 -4 -2 -12 -16 -32 5 -4 -6 21 -20 -1 -14 -7 6 -3 -7 25 -6 -36 -15 15 24 -4 -5 17 28 8
7204Hj7kL1j0lK7k3j5mL4j8j5qJK1Rl1K0j2J6Jj8J6j2Qj6M8o0J1L2j6RJ6k7J4
$$ 8 -9 -11 20 10 7 34 11 -4 -8 26 8 -7 -15 -14 7 16 -15 5 -7 9 10 -8 8 -4 4 -12 36 -24 -13 19 3 12 28 1 15
7239A5j9mK1k0J5J6k4pNK1m1N5m1RK0J2n9N0j3Mj1j8M1m9j5J0Pj0L6rJ3Lok2J6
$$ 15 -4 -8 13 -7 8 24 0 -7 -2 19 -22 33 -8 1 21 33 -26 24 11 15 4 -14 27 -22 -37 -27 -20 -30 6 -3 10 13 7 -15 1
7274AJlj1J9jJ9k5QLpL0m3PJ3ojRj8J3k2M1qk9J7rLK4k4MnNqpj7K7Qj6rL7l0K2
$$ 1 2 -1 -12 7 6 25 0 8 11 4 34 -9 -2 11 5 4 13 -5 8 -14 27 19 -10 7 -2 1 25 1 5 0 5 -3 -10 -27 0 8 -8 -17 20 -10 12
7315A2J6k0m2L4K3j8MJ3k5mK2mP%mqJ1J1m1K0l3J6Pk3L8j0kk0J9l1M2j3J8j1J2
$$ 12 28 8 -34 0 23 5 9 22 -3 -7 15 11 18 18 14 6 17 28 -13 7 -26 -10 -3 -26 12 2 0 -20 -1 -32 10 -3 15 4 16
7350A6j5K1l6nJ4NJ3rlj5J2RJj1j2N1l7M3l0J9j9J5j5j4J6nLmJ5j9K1k0j1NJJ4
$$ 16 1 22 -14 -19 -5 0 13 4 1 -14 -2 7 8 -3 -15 36 -1 42 12 31 12 27 12 -2 14 9 12 8 23 4 25 5 -6 -1 0 14
7386A4k2J1Lj2J7ml7RK6Km1K8j2K4NOk4OQj2K7j3jKk5L6k4J8oJ4j4%pQL6n5OJ2
$$ 14 -8 3 6 -6 11 7 -30 -21 5 7 -34 -6 -18 6 11 17 -7 -1 7 -5 22 9 8 10 -15 21 -3 15 9 23 9 9 2 10 46 -9 -3 9
7424IL%Lpkk4Q%J2pj1J4J3k0J5jk9K4MJ6j8J9k1Nj6N6k7l6KK3l2J6JjL0j7M2m4
$$ 9 12 12 15 8 6 -18 -10 -10 2 -5 -16 -2 11 -9 6 5 -24 0 4 20 2 21 0 5 -11 45 18 -18 -16 7 -25 -9 -8 -9 21 4 46 2
7462Blj3J7k0K8J7k6l%j9M2k6J0mKOk2J2j3QK1l0L6l1J8k0Oj3K7Jl1N6k9k6J3
$$ 2 -1 -14 3 -17 11 28 2 -1 -1 -20 22 -4 6 2 4 10 -12 0 -13 -5 16 -14 22 -9 9 -11 -5 -18 9 10 -21 35 6 -20 -7
7497gJ6j2onK5m3M3J4o3N7k5J3J3pk4J8oj0kjK5l0j5PK9K6l8J6pJ4k6J1%NK6l7
$$ -7 9 -3 -9 -14 11 -32 11 25 -38 19 -6 7 20 13 -11 7 1 -9 -11 -12 13 -17 -32 -25 4 30 -8 8 1 15 -11 0 0 5 31 -6
7533fK1J3jk8J5Kk5M3j8l3L8qj4lQJ5k9M3l3k6J7Nl3M1Kl1J6J8j6J0qL2n1K5N
$$ -6 15 28 27 -1 14 16 -9 34 16 -17 21 13 -1 -4 4 19 -10 33 0 -26 -9 -4 -37 4 6 -25 -9 9 -7 3 -5 27 -24 1 6
7568Fj5OJk9L0J8LrKj0J5j0k1M0J5j5j2l3K6q%%j7J2J4nQj9qkKLOqj1K2mPJ0j8
$$ 6 -9 -3 -2 -31 -1 17 20 11 13 3 18 8 -13 27 42 27 15 -18 8 0 0 0 -17 -5 9 4 12 -7 -15 -17 -15 -12 -6 -14 -25 -3 -7 0 10 -8
7608hJ7k5J7j7J4K5j7%KJ5j1m1N6l5J7k7J4J5oj6QqJ6J0k9J3pK1j4J%J1l9L2k2
$$ -8 9 -16 1 -16 -2 23 6 6 8 23 12 -29 27 -8 9 -18 -4 11 5 -11 -3 -11 5 15 -14 -1 -8 13 -1 0 0 11 -28 4 -18
7643a8J8k8K6mrj1K1jj3J1l3M0MKj7PLLL1l3RJ7l0J5Poj2Oj4JPpMmMLPl7L9pk0
$$ -18 0 -28 -2 -6 -15 -26 -5 -6 -19 -8 -41 -1 3 5 -12 -5 -2 1 32 -1 8 25 -5 10 17 11 -1 5 -9 -8 -1 -8 -4 -8 -4 -1 6 -31 8 1 -19
7684a9J0OKj8K7km2L3jk1M0j0j7J2Ql2L1Nj1J0qjl0K9KJ5j9rL4k7K2j9k0K1K0
$$ -19 -9 -3 -1 -19 8 6 -36 -3 -4 -25 15 5 -12 0 8 -24 7 12 1 11 3 2 -28 1 3 18 -1 -10 24 -3 19 0 -20 1 21
7719B1l5j6K5j4J3L4j7k3%K4o%n5J8K0J1Jj9J3J7j3J8jj9J4m4M6k9L2%j7j4K2
$$ 21 -14 -30 -5 -19 -6 28 11 -12 -12 12 6 6 -49 -31 -11 0 1 -18 -5 12 -1 17 16 -3 11 -33 13 -16 16 16 -1 -15 7
7752GjjJ2kj9L7pk9K9k8PpRk2K3j8J1nnJMJJ6Nl3K2qJ4Lk0qJ4J0pkMJ2l4K3k7
$$ 7 6 5 17 15 -4 33 26 -3 26 -2 5 -2 7 -15 8 -10 1 -4 -9 -8 -4 -3 13 18 -15 7 -1 13 16 -4 -12 2 12 5 3 7 19 -15 8 -19
7792a9pL5j2Nl0M3oNk3pM2k5J1QrMk3OOj3%nL2m1J8KJ6j6qJ3j1J2j5K1Kk3Qlo
$$ -19 -26 9 -3 2 -28 15 9 14 -9 -16 26 1 12 20 11 15 -8 -2 4 -9 -9 -14 18 -23 -5 -3 13 -3 -11 2 -9 3 -12 9 11 -12 -4 -7 -13
7831a3MNK3Kqol3N3m6L4l6K3Kj7L4k1qNlk0K0NJ1n3L6RnK0k0Rk2J1ljmnJ6%k0
$$ -13 -9 -4 19 21 13 7 -26 27 -19 15 -21 2 4 -13 21 0 -8 -3 -6 -26 -6 -1 10 -43 -7 2 -3 17 -3 6 -16 -5 -8 -9 -13 -18 -2 -2 -22
7870b2K8Nnj0M5k8k7K7OpmMK9n0J4l7L9k3J9qMJ9Mk4Pj6j5L2nQj6nKJ2%k4L7k8
$$ -22 6 11 6 -4 41 13 -14 13 19 12 8 12 41 -9 5 -32 7 -16 3 -5 -1 18 22 -2 5 -11 -26 6 1 9 -7 -12 -10 2 2 -22 15 -13
7908a3PJ5lLmnj0j0J6J7j1Lj1Kj5L4oRj8J2l2M3l4L1k0LJ1k3L5k0j5QrMPk5J8
$$ -13 -6 9 6 9 5 0 -10 -20 -4 13 2 5 -6 -4 -19 15 9 18 0 12 -20 23 -11 20 0 3 14 -9 26 6 -9 -1 -10 -6 1 -24 -6
7945fk3K8KJ2%oMj0K4nj4J5l9J8JJ6l5L1LJ8j7qqJ0m2N3mrmrJ3k2N2l9kKj9K2
$$ -6 -29 -1 1 13 13 7 11 1 25 20 6 21 -18 0 1 17 -18 13 16 34 17 9 1 11 -31 22 18 9 5 -4 9 -13 39 0 -2 0 -19 3
7983CK4l4K6j1Lj8j0%KK4j4L5j6mJ7k3kRpJ1l5J9J0Qmk9MJ4QMk9J3rLPj1K0lo
$$ 3 27 -7 19 8 11 -7 -17 -17 -15 9 -5 30 14 10 27 4 2 11 4 15 -20 -1 9 17 13 -16 -12 2 10 14 -15 -2 -11 -8 -1 -12 8 5 -1
8022akJ6l0RJ1Nk1J5j8QJ0Qnj4J0j2J2J0kKj5K7j3qJ6pj9J9lPOj0roK0j3%k4P
$$ -1 -3 13 -17 -8 3 8 -13 2 -16 -8 2 10 5 -9 1 -11 1 11 9 11 -4 23 10 2 18 11 -8 11 8 15 21 11 2 -4 16 3 3 -21 -14
8061a4J2j8K8j3J2j5k7M9K7n4lrJ0jJ7Nj7LJ0J3k3K7k5nJ0J0nJ0Lol0J8L1k1j0
$$ -14 -2 -20 8 -5 7 -8 -35 14 41 -13 -16 -25 -15 -16 1 6 -11 -8 2 15 -8 19 -6 -11 -1 9 4 14 17 11 -19 -1 30 9 -1
$$ [...]
8191c9
##END NTUPLES=NMR FID
##END=
