##TITLE=1H_Pr 4432-38
 CDCl3
 8 sc, 
 20.2.2023
##JCAMPDX= 6.0         $$ Bruker NMR JCAMP-DX V2.0
##DATA TYPE= NMR FID
##DATA CLASS= NTUPLES
##ORIGIN= UXNMR, Bruker Analytische Messtechnik GmbH
##OWNER= root
$$ XWIN-NMR		Version 3.5
$$ Mon Feb 20 14:34:37 2023 Russian Standard Time (UT+4h)  she@DPX200
##.OBSERVE FREQUENCY= 200.13135
##.OBSERVE NUCLEUS= ^1H
##.DELAY= (6, 6)
##.ACQUISITION MODE= SIMULTANEOUS
##.ACQUISITION SCHEME= undefined
##.AVERAGES= 8
##.DIGITISER RES= 18
##SPECTROMETER/DATA SYSTEM= spect
##.PULSE SEQUENCE= zg30
##.SOLVENT NAME= CDCl3
##.SHIFT REFERENCE= (INTERNAL, CDCl3, 0, 15.7039)
##AUDIT TRAIL= $$ (NUMBER, WHEN, WHO, WHERE, WHAT)
$$ ##TITLE= Audit trail, XWIN-NMR		Version 3.5
$$ ##JCAMPDX= 5.01
$$ ##ORIGIN= Bruker BioSpin GmbH
$$ ##OWNER= she
$$ F:/spectra/data/she/nmr/H-F/1/audita.txt
$$ ##AUDIT TRAIL=  $$ (NUMBER, WHEN, WHO, WHERE, WHAT)
(   1,<2023-02-20 14:33:20.35 +0400>,<she>,<DPX200>,
      <created by zg, POWCHK disabled, PULCHK disabled
       configuration hash MD5:
       00 E9 B6 7A A2 85 ED C7 34 08 36 98 17 FE 4E 26
       data hash MD5: 16K
       E0 BB 21 47 D7 BA 75 90 7B A2 67 6A E0 0F 05 EF>)
$$ ##END=
$$ 
$$ hash MD5
$$ 28 EB 0B 82 B6 AC 3F EE 33 7E 26 EF E4 52 2D 73
##$RELAX= 
##$RELAX= 
##$RELAX= 
##$RELAX= 
##$RELAX= 
##$RELAX= 
$$ Bruker specific parameters
$$ --------------------------
##$DU= <F:/spectra>
##$EXPNO= 1
##$NAME= <H-F>
##$PROCNO= 1
##$TYPE= <nmr>
##$USER= <she>
##$AMP= (0..31)
100 100 100 100 100 100 100 100 100 100 100 100 100 100 100 100 100 100 
100 100 100 100 100 100 100 100 100 100 100 100 100 100 
##$AQSEQ= 0
##$AQ_mod= 1
##$AUNM= <au_zg>
##$AUTOPOS= <>
##$BF1= 200.13
##$BF2= 200.13
##$BF3= 200.13
##$BF4= 200.13
##$BF5= 200.13
##$BF6= 200.13
##$BF7= 200.13
##$BF8= 200.13
##$BYTORDA= 1
##$CFDGTYP= 0
##$CFRGTYP= 5
##$CHEMSTR= <none>
##$CNST= (0..31)
1 1 145 1 1 1 1 1 1 1 1 1 1 1 1 1 1 1 1 1 1 1 1 1 1 1 1 1 1 1 1 1 
##$CPDPRG= <>
##$CPDPRG1= <>
##$CPDPRG2= <>
##$CPDPRG3= <>
##$CPDPRG4= <mlev>
##$CPDPRG5= <mlev>
##$CPDPRG6= <mlev>
##$CPDPRG7= <mlev>
##$CPDPRG8= <mlev>
##$CPDPRGB= <>
##$CPDPRGT= <>
##$D= (0..31)
0 1.2 0 0 0 0 0 0 0 0.06 0 0.03 0 0 0 0 0.0002 0 0 0 0 0 0 0 0 0 0 0 0 
0 0 0 
##$DATE= 1676889199
##$DBL= (0..7)
120 120 120 120 120 120 120 120 
##$DBP= (0..7)
150 150 150 150 150 150 150 150 
##$DBP07= 0
##$DBPNAM0= <>
##$DBPNAM1= <>
##$DBPNAM2= <>
##$DBPNAM3= <>
##$DBPNAM4= <>
##$DBPNAM5= <>
##$DBPNAM6= <>
##$DBPNAM7= <>
##$DBPOAL= (0..7)
0.5 0.5 0.5 0.5 0.5 0.5 0.5 0.5 
##$DBPOFFS= (0..7)
0 0 0 0 0 0 0 0 
##$DE= 6
##$DECBNUC= <off>
##$DECIM= 32
##$DECNUC= <off>
##$DECSTAT= 4
##$DIGMOD= 1
##$DIGTYP= 9
##$DL= (0..7)
0 120 120 120 120 120 120 120 
##$DP= (0..7)
150 150 150 150 150 150 150 150 
##$DP07= 0
##$DPNAME0= <>
##$DPNAME1= <>
##$DPNAME2= <>
##$DPNAME3= <>
##$DPNAME4= <>
##$DPNAME5= <>
##$DPNAME6= <>
##$DPNAME7= <>
##$DPOAL= (0..7)
0.5 0.5 0.5 0.5 0.5 0.5 0.5 0.5 
##$DPOFFS= (0..7)
0 0 0 0 0 0 0 0 
##$DQDMODE= 0
##$DR= 18
##$DS= 0
##$DSLIST= <SSSSSSSSSSSSSSS>
$$ [...]
##$SUBNAM2= <"">
##$SUBNAM3= <"">
##$SUBNAM4= <"">
##$SUBNAM5= <"">
##$SUBNAM6= <"">
##$SUBNAM7= <"">
##$SUBNAM8= <"">
##$SUBNAM9= <"">
##$SW= 18.05172834244
##$SWIBOX= (0..15)
0 0 2 0 0 0 0 0 0 0 0 0 0 0 0 0 
##$SW_h= 3612.71676300578
##$TD= 16384
##$TD0= 1
##$TE= 0
##$TE2= 300
##$TE3= 300
##$TEG= 300
##$TL= (0..7)
0 120 120 120 120 120 120 120 
##$TP= (0..7)
150 150 150 150 150 150 150 150 
##$TP07= 0
##$TPNAME0= <>
##$TPNAME1= <>
##$TPNAME2= <>
##$TPNAME3= <>
##$TPNAME4= <>
##$TPNAME5= <>
##$TPNAME6= <>
##$TPNAME7= <>
##$TPOAL= (0..7)
0.5 0.5 0.5 0.5 0.5 0.5 0.5 0.5 
##$TPOFFS= (0..7)
0 0 0 0 0 0 0 0 
##$TUNHIN= 0
##$TUNHOUT= 0
##$TUNXOUT= 0
##$USERA1= <user>
##$USERA2= <user>
##$USERA3= <user>
##$USERA4= <user>
##$USERA5= <user>
##$V9= 5
##$VALIST= <valist>
##$VCLIST= <CCCCCCCCCCCCCCC>
##$VD= 0
##$VDLIST= <DDDDDDDDDDDDDDD>
##$VPLIST= <PPPPPPPPPPPPPPP>
##$VTLIST= <TTTTTTTTTTTTTTT>
##$WBST= 1024
##$WBSW= 4
##$XGAIN= (0..3)
0 0 0 0 
##$XL= 0
##$YL= 0
##$YMAX_a= 801478
##$YMIN_a= -1006204
##$ZGOPTNS= <>
##$ZL1= 120
##$ZL2= 120
##$ZL3= 120
##$ZL4= 120
##$ABSF1= 10
##$ABSF2= 0
##$ABSG= 5
##$ABSL= 3
##$ALPHA= 0
##$AQORDER= 0
##$ASSFAC= 0
##$ASSFACI= 0
##$ASSFACX= 0
##$ASSWID= 0
##$AUNMP= <proc_1d>
##$AZFE= 0.1
##$AZFW= 0.1
##$BCFW= 1
##$BC_mod= 2
##$BYTORDP= 1
##$COROFFS= 0
##$CY= 11.3945322036743
##$DATMOD= 1
##$DC= 2
##$DFILT= <>
##$DTYPP= 0
##$F1P= 2.36226072786647
##$F2P= -0.459571619588291
##$FCOR= 0.5
##$FTSIZE= 0
##$FT_mod= 4
##$GAMMA= 1
##$GB= 0.15
##$INTBC= 1
##$INTSCL= 1
##$ISEN= 128
##$LB= 0.24
##$LEV0= 0
##$LPBIN= 0
##$MAXI= 10000
##$MC2= 0
##$MEAN= 0
##$ME_mod= 0
##$MI= 1.114404
##$NCOEF= 0
##$NC_proc= 0
##$NLEV= 6
##$NOISF1= 3.799351
##$NOISF2= 2.8
##$NSP= 1
##$NTH_PI= 0
##$NZP= 0
##$OFFSET= 15.70392
##$PC= 1
##$PHC0= -19110.66
##$PHC1= 13.20078
##$PH_mod= 1
##$PKNL= yes
##$PPARMOD= 0
##$PSCAL= 0
##$PSIGN= 0
##$REVERSE= no
##$SF= 200.130013532006
##$SI= 16384
##$SIGF1= 3
##$SIGF2= 2
##$SINO= 400
##$SIOLD= 16384
##$SREGLST= <1H.CDCl3>
##$SSB= 0
##$STSI= 0
##$STSR= 0
##$SW_p= 3612.71676300578
##$SYMM= 0
##$S_DEV= 0
##$TDeff= 0
##$TDoff= 0
##$TI= <>
##$TILT= no
##$TM1= 0
##$TM2= 0
##$TOPLEV= 0
##$USERP1= <user>
##$USERP2= <user>
##$USERP3= <user>
##$USERP4= <user>
##$USERP5= <user>
##$WDW= 1
##$XDIM= 8192
##$YMAX_p= 0
##$YMIN_p= 0
$$ End of Bruker specific parameters
$$ ---------------------------------
##NTUPLES= NMR FID
##VAR_NAME=  TIME,          FID/REAL,        FID/IMAG
##SYMBOL=    X,             R,               I
##VAR_TYPE=  INDEPENDENT,   DEPENDENT,       DEPENDENT
##VAR_FORM=  AFFN,          ASDF,            ASDF
##VAR_DIM=   8192,          8192,            8192
##UNITS=     SECONDS,       ARBITRARY UNITS, ARBITRARY UNITS
##FACTOR=    0.0002768,     1,               1
##FIRST=     0,             0,               0
##LAST=      2.2672688,     0,               0
##MIN=       0,             -1006204,        0
##MAX=       2.2672688,     801478,          0
$$ Real data points
##PAGE= N=1
##DATA TABLE= (X++(R..R)), XYDATA
0@%%%%%%%Qj6J6j6K4l2M0n6P2q8J11j35J60j93K33k80L28l87M59n35O18p14Q23
30D40r42J074j223J387j567J769j990K230k499K794l110L457l840M257m713N210
46B734n751O345o996P710q493R354j0308J1369j2551J3880j5386J7103j9084K1404
60A1330k4163K7503l1649L6955m4026N3969o9076R5049j51627M87418m63494r02880
72i74691J031325N93655o01432n11997N46176K50161l72445k11375K01102M6470
82c051J27050J40831k82674m49362K84636N84034j44688n52562J14559L75527
92A94300j42874k65559J84065K01354r8722r2227L038j47988L2021L89502O0501
103C17411m85395j55118M08689J58886l11260o4575K66762j7998k43827J2426
$$ y = [0, 0, 0, 0, 0, 0, 0, 0, 8, -8, 8, -8, 16, -16, 24, -32, 40, -48, 63, -72, 88, -105, 128, -152, 176, -211, 248, -287, 331, -383, 440, -502, 572, -651, 736, -831, 938, -1052, 1178, -1321, 1473, -1637, 1820, -2020, 2237, -2476, 2734, -3017, 3328, -3668, 4042, -4451, 4903, -5405, 5964, -6587, 7293, -8093, 9010, -10074, 11330, -12833, 14670, -16979, 19976, -24050, 29919, -39157, 55892, -95735, 391683, -71811, -974691, 56634, 650289, 48857, -463140, 83036, 333197, -39248, -250623, -49521, -3051, 123999, 264830, -17844, -467206, -182570, 401464, 256776, -295786, -181227, 194300, 51426, -214133, -30068, 171286, 72564, -19663, -16625, -164613, -132592, 256910, 317411, -167984, -323102, 85587, 244473, -66787, -131362, 135400, 117402, -126425, -113999]
113a13999J23511J6084O9735K7962k42272j49358L01775K21675k89100j55928
123a89915K98082J8142l64258Q0487M41654j05619m39195J55683L71640k75526
133h825l11042M14847L25364m63445l64840M03283L31271l13040k10878K53232
143E5927Q1210k24968k9349J55173R783l2843N2129j00813j73616J68700K66594
154B27927j62418k62586J48569J98658j77211j43979K33903J33851k33947j09664
164a46897J68725L8867r4532O5662Q0193j38599j00865J45743P9531j20349l967
175b6488J06105p3649j25874Q5323J24996o1028p1020N2167k4668q1217R6747
186A394J04443j16987p8831J33615K1540j89276L0464K74608l6466l14593K3375
$$ y = [-113999, 9512, 25596, 95331, 123293, -118979, -268337, 33438, 255113, -33987, -189915, 108167, 126309, -237949, -157462, 284192, 178573, -260622, -104939, 266701, -8825, -319867, 94980, 420344, -43101, -407941, -4658, 326613, 13573, -197305, 55927, 137137, -87831, -117180, 37993, 47776, 14933, 67062, -33751, -207367, -38667, 227927, 65509, -197077, -48508, 150150, -27061, -171040, 62863, 196714, -37233, -146897, 21828, 60695, -33837, 31825, 112018, -26581, -127446, 18297, 97828, -22521, -26488, 79617, 5968, -119906, -34583, 90413, 29385, -41635, 10532, -14136, -95353, 1394, 105837, -11150, -89981, 43634, 65174, -124102, -93638, 180970, 144504, -170089, -146714]
197a46714K93013k1707k44927M7960K21735p0551k10467M9711J61307j679o9466
208H215l2040l4865J3271J00031J3857j31177j0145J49081k6078j75369M4371
219h0848J98282k2290j83802J943J29624j7012n5239O7374J1178r9537M823J01750
231E6246j9335r0086N7873R2353r5316j07315Q8494J02849m6385p0615O675J2096
243a2466o399L5957J2223o2335M099P1912m0518r2023O2735J26433n2759j40058
255i3199L8874J16085l7247o5071N6249L7254o9732l1030O8229K0737n2112J5196
267D233L7681n4325m1003O0120M6884m2550l9119K2643J860k3575L2128K3795
279B8772m3791j2270L9593j1700m9809L5000Q1457m1265r8737L7772Q7478k7547
$$ y = [-146714, 146299, 124592, -120335, -72375, 149360, 78809, -131658, -81947, 79360, 77681, 8215, -23825, -58690, -45419, 54612, 68469, -62708, -72853, 76228, 50150, -125219, -80848, 117434, 95144, -88658, -86715, 42909, 25897, -29342, 38032, 49210, -50327, -45504, 56246, 36911, -53175, 4698, 97051, 1735, -105580, -17086, 85763, 39378, -31237, -24562, -12466, -18865, 17092, 29315, -33020, -28921, 42991, 2473, -89550, -26815, 99618, 46859, -93199, -54325, 61760, 24513, -40558, 15691, 52945, -16787, -47817, 20412, 41149, -10963, 4233, 41914, -12411, -53414, 6706, 53590, 11040, -28079, -5436, -3576, -27151, 4977, 28772, -15019, -27289, 12304, 604, -49205, -14205, 67252, 25987, -72750, -34978, 52500, 24953]
291B4953n7741L3145M5539m3696m3793M3352L4793k1993r322k108k2043L077L6561
304B0724O555m0660o694L4763j7856l5518L5299L8702l2155l9278J9605K6123
316I610j9903N55L7242j6938m4468J8447L9993j0624k5292K0361J9352l6940j8334
329b6939M0312J7172k2561j1339K646m774l756J8866Q301k5674n889J7178j1623
342h080j4050K2785K1247k2519l0178J7395K4531j5204l797K1451n466k4015K581
355a3319K5472M681j6014M299N836j7797k35K1194K822j3782o547N790l658r403
369a0661J3730J0926j4744j0862J065J660N143Q101J207j6188r564K0498Q579
382H890j8403J076K1404J665k5417j1075K8610K2171j5918k1467k896J6405J5310
$$ y = [24953, -32788, 357, 45896, 2200, -41593, 1759, 36552, 14559, 5237, 3129, -18914, -15837, 20724, 27279, -13381, -20075, 14688, -3168, -38686, -3387, 35315, 3160, -36118, -16513, 9610, -10293, -9738, 27504, 10566, -33902, -15455, 24538, 13914, -11378, 8983, 28335, -8605, -26939, 13373, 30545, 7984, -3355, -709, -5483, -9239, 9627, 17928, -7746, -13635, 3543, -8080, -22130, 655, 21902, -617, -30795, -13400, 11131, -4073, -7870, 13581, 8115, -15900, -13319, 12153, 16834, 820, 5119, 10955, -6842, -7077, 14117, 16939, 3157, -3390, 2400, -1258, -10661, 3069, 13995, -749, -11611, -10546, -8886, -3743, 4358, 5565, -10623, -20187, 311, 8890, -9513, -8437, 12967, 14632, -10785, -21860, 6750, 28921, 13003, -8464, -11360, 5045, 20355]
395B0355j2778j7319Q076J8971n593l1477l447L8741J2173l4823k3965J7276K7174
408A3364n330k0868K174R429J066j688o324J135J3377P930r681k0777L687L0738
422A8232O551k3801j3238J1503J5259o073j2027N446N172n204l039k654j840K994
436b719Q237M223k0592j7841K2608K7362j1419l2824k433L5346J0911k9610j3034
449b1785K2402K1496r027k7347l618K4599K2472n765l9153j7760M4661L7613l6692
462A2096n7247K0509P2699r062q4833q202Q3113L0679p4604n4176N6265O2338
474D9575l1846n4334N604M1300J5253k4979k1959N128K7350K3368k6453m6988
486c8981J8965O3261K455o8309k5856O6326L7656n7440m1755M1044M2211k9177
$$ y = [20355, 7577, -9742, -1666, 17305, 11712, -19765, -23212, 15529, 27702, -7121, -31086, -13810, 13364, 8034, -12834, -10660, -1231, -165, -1853, -8177, -7042, 6335, 14265, 4584, -16193, -12506, 18232, 24783, 982, -12256, -753, 14506, 8433, -3594, 1852, 7024, 1820, -1219, -3873, -5713, -2719, 5518, 9741, -10851, -28692, -6084, 21278, 9859, -22965, -25398, 9948, 20859, -8751, -21785, 617, 22113, 13086, -14261, -17879, 6720, 29192, 23427, -15726, -33486, 11175, 48788, 12096, -45151, -24642, 48057, 38995, -45838, -54040, 29073, 59752, -14852, -69028, -12763, 49575, 17729, -36605, -31001, 10299, 25552, 573, -21386, -16258, 11092, 34460, 8007, -38981, -20016, 43245, 45700, -22609, -48465, 17861, 55517, -1923, -43678, -2634, 39577, 10400]
498A0400m3624J7495L4016r885j7558J926j52l891J0077J5771j4234k7005J7612
511i052L1812j5254k8537J1949L0635p367k9196R737K2247j2768q178J9399j481
524A3946l4175R42N3758L103p3246j1157P9756K0688q2726l7981Q1686N0790p5798
537a0414n7814N6805N8556l0759n1239J0768L5234L605p451j0780j8577J7039
549e027M2793j2182o0987k083P8520J9869q5432l6246P6559M7943o0194n7276
561e3743M1042N5813k7014m8100Q797L3753O372j9512j5037K472J2245J6710l175
574A0623k8859l992L2712J4449k8480k3519K8904L2109k7072l4068K3150L5190
586C1147j7143l6035J6299L4214k3461l2491K9502L0695l4759l6465L5594M0796
$$ y = [10400, -33224, -15729, 18287, 8402, -9156, -7230, -7382, -11273, -1196, 14575, 341, -26664, -9052, 22760, 7506, -21031, -9082, 21553, 14186, -15010, -5273, 16974, 4206, -3972, 15427, 13946, -20229, -19287, 34471, 37574, -35672, -46829, 32927, 53615, -29111, -67092, 14594, 65384, -10414, -68228, -11423, 47133, 16374, -34865, -24097, 11137, 14742, 7291, -3489, -22066, -5027, 37766, 25584, -35403, -37486, 41034, 60903, -24529, -60775, 15784, 63727, 3533, -53743, -12701, 43112, 16098, -32002, -23205, 10548, 16920, -2592, -17629, -15157, -2912, 13798, 10623, -18236, -22228, 10484, 24933, -3547, -27066, 1838, 33947, 6875, -27193, -4043, 31147, 14004, -22031, -5732, 28482, 5021, -27470, 2032, 32727, -2032, -38497, -2903, 37893]
598C7893l8845m2750L7286L9812l0181l8498K1512L5463j1856k3277N837N788
610a816K128J3824l416k6632k46M0078Q910n0384j6306N4791K2917m9814l2603
623c8569L7192L7467k4649l6822Q605K5818N376j5268j8090M104K2573Q235k1400
636e428k2393J8251L3043r423l4125j252L0867J6435k4557k3556J7817K7644n978
649A7345k9874m820L2724J0188l0660j3310K2247J3490j7070j3141J4149N378
661F646j5063J495J2258o708j0603P597J2339r733j4111J3684J2960j0983p532
674g754O392M843q76L71J746o325q88J4000j896j7024L199J6642j314j7956l032
689i872J7070J581j4094o94N046r83K36L43k039m351M441Q888q147r917J0872
$$ y = [37893, -952, -43702, -6416, 33396, 3215, -35283, -13771, 21692, 9836, -13441, -7604, -1816, 312, 14136, 10720, -15912, -16158, 23920, 32830, -17554, -33860, 20931, 43848, -5966, -38569, -1377, 36090, 11441, -25381, -16776, 9042, 14418, -850, -18940, -14836, 7737, 15972, -5428, -27821, -9570, 23473, 14050, -20075, -21327, 9540, 25975, 1418, -22138, -4321, 23323, 17345, -12529, -17349, 15375, 25563, -5097, -18407, 3840, 17330, 260, -12881, 1268, 6646, -8417, -6922, 5336, -1372, -11975, -4378, 7961, -1772, -15883, -2199, 10761, -222, -7754, -1362, 3481, 2605, 2976, 4722, -1603, -2491, 11509, 9613, -7411, -4212, 12430, 11116, -6840, -9872, 7198, 8779, -5315, -6009, -963, -1946, -1710, -1367, -3406, -7757, -3316, 5572, -2575, -12492, -1620]
704a620J0212o523r324L123J0962K66p335m69J778N226K379r776l674J0444N357
719A1026j0343j0839R596J2546j2086j1471R204P827o379q617M298Q722n532m097
733f145L673N0J321K407j741j449J359M650o59n863M613N365n676k268L720M42
749C799j735j474L545k247p152N596N474p728n848N453O726o157r145P223Q199
764D529n570n641J482N132L416l287k776J253L867L858n242m886P761M813n641
779C068n314K239O764j972o300R97J253m67J719l372l472J945L814j22q127n53
795g900J0469K39q890q73O673M423m305m674N257L156m63j383l437L386N281k269
811D690n939n56P195K754j0254l390Q992J615p249l775N034M163o027l335L518
$$ y = [-1620, 8592, 2069, -7255, -4132, 6830, 7096, -239, -708, 1070, 6296, 8675, -1101, -4775, 5669, 11026, 683, -10156, -560, 11986, -100, -11571, -2367, 5460, -919, -9536, -5238, 3484, -2048, -6145, -2472, -2422, -1101, 1306, -435, -1884, -525, 4125, 3466, -2397, 2216, 7581, 1905, -363, 3357, 3799, 2064, 590, 4135, 1888, -5264, 332, 5806, -1922, -7770, -2317, 4409, -1748, -10893, -3670, 4529, -1041, -6682, -5200, -68, 3348, 61, -2715, -1462, 2405, 6263, 1021, -3865, 3896, 8709, 3068, -2246, -7, 6757, 4785, -1515, -518, 735, 268, 1987, -1385, -4857, -2912, 902, 780, -7347, -7900, 2569, 2808, -6082, -6955, -282, 4141, -164, -4838, 419, 3575, 3112, 1729, -1708, 1678, 6959, 4690, -1249, -1805, 5390, 8144, -2110, -5500, 3492, 5107, -2142, -5917, -883, 3280, -2747, -6082, -2564]
826b564O62L20O7k557M18L411J393k385k799N701M026o322j522N632J542k550
842B473j979K443M95l531K162K289n643m03M350m91n287j934N883J240p001j16
858e050M091q94k32K84o24o95J953L962k938m936O488N139n028l644K871N211
874E958j461m234J385j82j17L968l440o554K932P393k301j0889k13J2807j030
889D022j1963M89P882J158m178j931K495K50K293L810o757l399J0170M307q464
904A84o385Q253Q830q067p149O403K987l190j214m20p97o37K834K25p240M81P687
921B785k598m942Q23J869M23Q30J993l929m589J0133O967j3215o047J3971P956
936A2430j2014r473J2293Q514j1067l724O496k134k436N773M19j2241j642J8753
$$ y = [-2564, -1902, -1582, -1515, -4072, -3654, -243, 1150, -1235, -4034, 1667, 5693, -629, -2151, 3481, 5023, 2473, 494, 2937, 3432, -99, 2063, 4352, -1291, -1694, 2656, 2165, -3122, -5056, 827, 2067, -4934, -5050, -959, -1853, -2085, -1801, -2425, -3120, -1167, 2795, -143, -5079, 1409, 6548, 1520, -2124, 747, 5958, 4497, 263, 1648, 1466, 1349, 5317, 1877, -4677, -1745, 5648, 3347, -7542, -7755, 5052, 4022, -7941, -7452, 430, 1588, -2590, -4521, -2026, -1776, 517, 4327, -2430, -5829, 4341, 8648, 184, -6201, 2052, 10882, 2815, -4334, 2069, 5056, 1866, 652, 232, -565, -1202, 1632, 1857, -5383, -4902, 2785, 187, -4755, -3932, -2063, -1640, -810, 1183, -2746, -7335, 2798, 9765, -3450, -9497, 4474, 12430, 416, -9057, 3236, 11750, 683, -3041, 3455, 1321, -1115, 4658, 5077, -7164, -8806, 9947]
950I947k30k4737Q19K4824L22k3523l124K2088L628j7706n01J1046j048k107K276
965A974j098m813M476J0744p357j3190Q975J3093p088j2417K609J1647q06j0235
979c486j029M096K950O9p418k019Q007J471p102j726P020J020q528L788J0738
994G851r551r211J4324J0300j5969j1072J8907J2253k1143q995K0507M876j7520
1007d443j535J4436m653j3658J2174J1189k1832r272K7344O736l0578p658L2295
1020A0545Q176l2932o162K9447L951k0950j763J4289K60p978N923K346j1165M115
1034a898J5515p582j6969O758J8729n298j9943L355J6527j778j1238m131N438
1047b515P955k173r997k571R935P426j1856q608J3596O367j1861k494J0978m0
$$ y = [9947, 9717, -15020, -14201, 10623, 10945, -12578, -15702, 6386, 10014, -7692, -8193, 2853, 1805, -302, 1974, 876, -3937, 539, 11283, 3926, -9264, -289, 12804, 5716, -6701, -4092, 7555, 6749, -3486, -4515, -419, 2531, 2600, -4818, -6837, 1170, 2641, -4461, -6187, 833, 1853, -6675, -2887, 7851, -1700, -10911, 3413, 13713, -2256, -13328, 5579, 17832, -3311, -12306, 8201, 13077, -4443, -5978, 8458, 3805, -9853, 2321, 13510, -8322, -17594, 9750, 16486, -14092, -21750, 10545, 18721, -14211, -20373, 9074, 13025, -7925, -9688, 4601, 4861, -3117, 2806, 5152, -6013, -1898, 13617, 6035, -10934, -4176, 14553, 9255, -10688, -7333, 9194, 7416, -3822, -7953, -2515, 5440, 3267, -6730, -9301, 634, 8060, -3796, -12404, 1192, 7559, -4302, -6796, 4182, 4142]
1061D142r610M654J1391j0146j0353J6205Q047j8820o194K0193M379k2025j338
1074i475K1642n115k0664J0465J6212j5153j4213J8423J1941k2760q938K5442
1086G807M294k3757n09K1516j611j7685N288J4685q902q472J3420K529j4851K307
1100c941J5497m182j7119O520J6243q910j3940Q205Q731o904m855L612O92k943
1114c294M213N85r597L120J2315n894j2076O888J2641o833j1314R330R425j0922
1128a413l201J0671j201r372N353Q754r078q613J3356N232j6659j698J5959j795
1142F295j5866K934J5455p256j4103J0894R721j3091m685J3782J176j3356K540
1155e560J4223o227j2727J1872R674j3203o009J4305L898j4985q99J5130l250
$$ y = [4142, -5468, -814, 10577, 431, -9922, 6283, 14330, -4490, -10684, 9509, 13888, -8137, -9475, 12167, 7052, -13612, -3147, 13065, -2088, -16301, 2122, 14063, -8697, -17635, 7807, 12101, -11656, -12165, 9351, 7740, -9945, -4657, 10028, 1126, -7346, 6074, 8603, -6248, -3941, 11556, 7374, -9745, -3225, 13018, 4108, -9832, -1627, 7104, 200, -4655, -1043, -351, -3294, 919, 1504, -8093, -4973, 7342, 1448, -10628, -3740, 8901, 2068, -9246, 84, 9509, -1413, -4614, 6057, 4856, -4516, 837, 9591, 513, -8100, 5256, 10488, -6171, -7869, 8090, 6295, -9571, -6637, 8818, 1562, -12541, -1647, 8074, -5017, -9702, 4080, 5256, -8100, -5560, 8663, 2436, -10291, 1581, 11255, -1948, -7957, 6348, 10246, -4739, -5638, 9492, 6242]
1168F242j3539O428R184q913n889Q770K706j0813RJ1501n251j0088Q575P092r741
1183c727m764J0407L798j1437K66J2486m155r709P748P121q135n070R638M025
1197H492j1766k88J0878l815q500N965M879p328l884Q401J121j1306K452J0571
1211E872o220q723P448P069q161n393J0432K921j0745J527J0851m616q092O943
1225A113P517q765n989J1021L441j1791o8J0187k745q313L176O815n926o067Q415
1240B021J753r815J186R005l563q096M791P679o037o394Q686L497p866K56P321
1255D424j641o475M011O749o309n128Q600K195q625m31P083q68p145K100N363
1270C903m861l844O374O97p486J758O472l120o580M603P097o742m606P736K951
$$ y = [6242, -7297, -869, 8315, -598, -6487, 2283, 4989, -5824, -5815, 5686, 435, -9653, -1078, 6014, -3727, -8491, 1916, 5714, -5723, -5457, 7029, 2874, -6835, 913, 8034, -101, -5171, 4467, 8492, -3274, -3562, 7316, 3501, -4999, 966, 5845, -1483, -5367, 3034, 4155, -7151, -4699, 5872, -348, -9071, -1623, 5446, -2715, -8108, 2324, 5245, -5500, -3973, 6878, 2262, -5830, 1113, 8630, -135, -6124, 4897, 8338, -3453, -3521, 6666, 3921, -4392, -1216, 5599, -327, -6394, 2021, 3774, -6041, -4855, 4150, 587, -7509, -2718, 4961, -1076, -7470, 1216, 4713, -3153, -2897, 4424, 2783, -3692, 319, 7068, 759, -4369, 4231, 6426, -2199, -2630, 4453, 3585, -3560, -1460, 3903, -958, -4802, 1572, 2269, -5217, -3459, 3013, -107, -6687, -2084, 5013, -1729, -6335, 1401, 4352]
1285D352o769l32O175J74o247K723N613m925l405O155J122o375K31N646j546o594
1301d002K799N569n509l815N733J105n792k03N626n58o291L263O009n294l257
1316d617O272K053n501j025O680K93o877K233O284m013m065L770K877m347k450
1331b433M781M70n865J437M344l557k946K837K230l567j875M749j70m391K337
1346a619L537k595j707K985K162l116j223M276j41l340J858K460k575j368K404
1361A998P62l626l18M261k265m735L532L183m207k919L589L011m797j998N399
1376H70J01m368J606L388j453k767K751L571m188j993N493O29m107Q9L129K01
1392B952l588M73K900k037j695K031o32j716P3J439o44k430J179J992k053o36
$$ y = [4352, -2417, -2749, 3426, 3600, -2647, 76, 5689, 764, -2641, 3514, 4636, -1739, -1508, 4138, 2592, -4002, -1203, 4366, -1143, -4958, 775, 1880, -3912, -4115, 1511, 953, -5338, -2075, 3934, -1360, -4617, 1655, 3708, -1793, -2818, 3862, 4155, -2722, -489, 5795, 1782, -2283, 1487, 4364, 17, -2433, 2348, 2818, -3047, -1610, 2734, -823, -3769, -932, 1298, -2269, -4144, 605, 435, -3956, -1619, 1918, -677, -2384, 601, 2763, -353, -1576, 2700, 2559, -781, 1077, 3537, 962, -406, 1998, 2760, -866, -1184, 3077, 812, -3923, -391, 2792, -1415, -4334, -745, 2266, -2531, -4529, 870, 971, -3397, -1791, 1597, 144, -2623, 128, 3699, -489, -2482, 3011, 3640, -467, -378, 2751, 2952, -636, -163, 2737, 700, -995, 1036, 404, -1312, -1239, 200, -444, -2874, -1695, 297, -1756, -2392]
1408b392J924m69m27R06Q51r31n70K777O81l393R65L324j056k623M92L045j299
1425A805k696J700J565l377J80K209p51l301M04M047j527m817K180L894k217k849
1441c551J430L703q97l172J903K247j485k52J011O74q32l95J674J62k481N64J848
1458B151m17j835j011J612J166k733r16J257O84q46j998J486J887k043j191K468
1474b79O62j471m74K431R80l436O28M036r26l132N77L853m08m405Q13L955j858
1491A546l282J908K054k283k589K545J965l955j290M251K57m209l58M135R66m714
1507c053j13N316j12l681K9L211J252l609L61L002p74k378J574J267j266j704
1523f78J201J895k792j675K242J290k435k013J681K475k491k110K860J385j874
$$ y = [-2392, -468, -937, -1364, -458, 393, -538, -1108, 1669, 2350, -1043, -78, 3246, 2190, -433, 59, 3104, 1805, -891, 809, 2374, -1003, -823, 1386, 635, -2666, -2262, 1785, 258, -4559, -2379, 1515, -702, -3551, -2121, 1582, 685, -2487, -584, 1663, 178, -74, 937, 1611, 779, 384, 2058, 2220, -261, 303, 2151, 1734, -101, -1112, 500, 1666, -1067, -1983, -726, -42, -888, -2886, -1400, 487, -1556, -2747, -279, 383, -1088, -1562, 869, 1849, -1587, -959, 3077, 2151, -981, -404, 3449, 3041, -1364, -551, 3404, 1546, -1736, 172, 2226, -57, -2646, -101, 1864, -2091, -3381, 870, 1127, -3082, -3440, 695, 1661, -3053, -3166, 2150, 2038, -1643, -1614, 1597, 2849, -760, -399, 2603, 1829, -549, 1025, 2292, 1026, -678, 523, 2418, -374, -2049, 193, 1483, -952, -2965, -1284, 1191, -1300, -3410, -550, 835, -1039]
1538a039j375K045J742k083r79L100N12k516L90K504J24k544l47L498q45l483
1554a296J207K443j154k662P61K679k379k635K603J387k675j164K390J396k738
1569a837r69L383N79k768L32K140O78j943k93K847k66j989R31J081p31r55L71
1586E91J307j210j544J293P98j779l55K93Q47r71j243J013Q66j061m71O36J123
1603A33l85j357J603J246j566k6J235O91q69p86J817K39j857K11J360l65j465
1620a41l2J554q34k239J010J507j706j080J142J087j468r06J761M13j540L67J182
1637G7O5m14n4J183J15r49O03Q87n97j61M64n6q1r14O51K52j114P7k90j12L17
1658e1r38j87O16m47J05k34L53O96j208M68J217o60l17O91P05kq73O02J373j115
$$ y = [-1039, -2414, -369, 1373, -710, -1689, 1411, 1923, -593, -203, 2301, 2425, -119, -466, 3032, 2187, -1296, -89, 2354, 1200, -1462, -701, 1978, -401, -3036, -433, 954, -1721, -2885, -495, 901, -1837, -2806, 577, 1156, -1612, -1280, 860, 1538, -405, -698, 2149, 1883, -106, 825, 1906, 1175, 220, 591, 1898, 688, -856, 437, 1235, -544, -899, -606, 241, -730, -1973, -960, -94, -1155, -1626, -990, 133, -252, -1609, -6, 1240, -326, -352, 883, 1574, 705, -81, 1736, 1975, 118, 329, 1689, 1324, -141, -173, 1381, 547, -1692, -682, 825, -881, -1961, -819, 268, -1200, -2106, -345, 68, -1472, -1105, 77, 142, -272, -326, 857, 972, 23, 626, 1513, 916, 755, 1219, 1163, 1082, 168, 819, 1071, -43, 34, -256, -368, -51, -989, -1176, -560, -1007, -902, -1136, -783, -87, -1295, -827, 390, -270, -587, 104, 809, 807, -66, 536, 1909, 794]
1678G94o98R73M22n67r31R12M78j642l58J225r80n49K83N03l35j099L28J073r40
1697a108k64Q83K0J43m03L90P68j68j04N53r7J57J71m60O98j63n23M64m88K6m03
1718I2m29Q70p36j222Q83M40q29m59L85R60p56q49J361L59q68K65M73O94p28k14
1738c08J201J85q44K09P55j58q25L4J268q55q22O98n4q43lj13J25l93j6K71j44
1759f32l18K78K10j08J73l59P78m9j24L13O1N87J87o64M63L00j96l33J26K19j6
1780H96r86K50P10j064k11k6j09M3q03O31M44j171K54P14j4k68O6N64K33p81M27
1801b01J034l71O7M02k43M79n11l8M66q96J72M07m55l7o62r8M23o95L52k49m21
1822a075N46l27n33Q86J09o31L71M47M74n10k13J562n94m46N68L68m3o78K32J156
$$ y = [794, 96, 1069, 1491, 924, -7, 905, 1383, -259, -617, 608, -372, -921, -638, -135, -470, -1569, -1241, -168, -1108, -1372, -489, -469, -326, -729, -339, 429, 261, 157, 710, 613, 770, 941, 481, 1179, 1016, 493, 957, 469, 495, 92, -337, 533, -203, -1425, -542, -102, -931, -1390, -1005, -45, -801, -1650, -289, 70, -798, -533, -60, 634, -94, -308, 893, 1078, 234, 443, 1198, 1040, 215, 249, 1517, 662, -160, 538, 484, -359, -362, -475, -350, -743, -759, -488, -632, -950, -672, -462, -570, -397, -756, 22, -27, -151, 162, 223, 810, 997, 333, 796, 1096, 900, 567, 693, 912, 896, -90, 160, 870, -194, -405, -431, -540, -497, -1300, -669, -225, -1396, -1142, -428, -442, -710, -644, -80, 153, -628, -201, 833, 462, 529, 931, 688, 1167, 656, 618, 1084, 188, 360, 767, 312, 275, -387, -485, -62, -757, -405, -654, -1075, -529, -856, -1389, -503, -394, -1025, -654, -207, 267, -243, -456, 1106, 512, 66, 634, 1002, 959, 281, 513, 1669]
1842A669q61j253J160K57j148n77N90Q55j397r39J687r6j254M7R87K8r96pJ531
1861B83k93j072J163J68P7m35K40J070n13m00P53L8l08k80j06K40j23n31J50p8
1881D3j89l35n92R39j41j304Q19L75j41o18K52R62kj265Q52J265q73l67Q63Q77
1901A420p27j066J599O75j937j99J507k24j406k04J597l80j922N28J304j189r30
1918a554Q52P28m05j409J224R49j404J73J206J23m48o68J180K41p11M47N65k03
1936H86l58l16L11O70j036N2N0J20l52o04J69N83p59q64Q76K44m95n62Q97Q67
1956C79j108m74J592K01j099J12J199M03j654L92J927j082j109Q04O67n72j101
1973e23J047J021k036m19J089J52j188n70J095K64j301K9J541n61p57P51N54r2
$$ y = [1669, 808, -445, 715, 972, -176, -753, -163, 692, -705, -1644, 43, -53, -1307, -1260, -273, -245, -1241, -1248, 283, -10, -1082, 81, 249, 326, -109, 131, 1201, 688, 288, 1041, 1079, 771, 491, 385, 625, 502, -29, 121, 43, -146, -481, -1073, -134, -275, -1579, -760, -385, -526, -1144, -892, 70, 68, -1197, -345, 920, 47, -320, 543, 1420, 693, -373, 1226, 1901, -36, -235, 1272, 1048, -358, -562, 1035, 655, -1267, -739, 565, -624, -1554, -702, 26, -379, -1788, -564, 385, -1019, -846, 360, 483, 35, -633, 547, 788, 77, 524, 1089, 886, 528, 212, 523, 1193, 157, 209, 259, 379, 27, -577, -408, 175, -584, -1448, -572, -328, -823, -1385, -488, 379, -729, -1203, 389, 590, -509, -397, 802, 1205, -449, -57, 1870, 788, -321, 483, 1150, 578, -523, 524, 1545, -491, -910, 179, 331, -857, -1427, -332, -68, -1369, -1340, 201, -360, -1117, -366, 188, 96]
1991I6o11K69J199q27j0N52Q3q2J50m34M34m4o85L29r0J41m24o16P03K46j153
2012g74kO24j74p26j92J312l76j264J125Q30m56n18M59J340j020r85J830M18j423
2031B8J6Q02M07r87k56J353n06j452N20R01j152o03N85M97r47l77J209o9r87j15
2051a133Q83J26k40k34R41k47n44P49J70j74L81m00L79J40K4k47j87M9J14n57
2071gk99N80k11l86j56J66L86j440M73J196j144k59J013P5n75m41J215O69j344
2090d89N16J203o93p70O99O67m85r86R68N92j285k15J172m23r20l03J123k80j262
2109a171P27Q25j480P0R67J47q00m11J284j75p07N97O92p32J12N83J9k70K33K23
2129G33k78m25J015l67r78M10J95j38r58N14P50r85p09J287m0j216P9J271j49
$$ y = [96, -515, -246, 953, 126, 116, 668, 751, 669, 819, 385, 819, 775, 90, 419, 329, 470, 46, -570, 133, 379, -774, -776, -152, -326, -1052, -1244, 68, -308, -1572, -447, 383, -73, -591, -132, 1208, 188, -797, 1033, 1451, 28, 44, 846, 1253, 266, 10, 1363, 857, -595, -75, 826, -326, -929, -344, 153, -794, -1171, 38, -31, -1018, -1133, -250, -124, -364, -598, 343, 96, -448, 301, 471, 297, 678, 278, 657, 797, 821, 574, 387, 436, 550, -7, -306, 274, 63, -323, -479, -313, 73, -1367, -894, 302, -842, -1101, -88, -13, -588, -1029, 186, 855, -489, 27, 1230, 537, -233, 466, 1133, 648, -338, 630, 1222, -63, -278, 894, 471, -449, -752, 371, 91, -1171, -444, 381, -1099, -1029, -62, 85, -715, -1126, 158, -17, -724, -127, 565, -167, -55, 528, 547, 277, 510, 733, 455, 30, 1045, 678, -300, 110, 305, 167, -791, -277, 473, -512, -1221, 66, 26, -1190, -1111, 160, 11]
2148A1j328Q38J351r61r36J442O68j313q8J410L4j314K21J374o80j029R40N27
2166A167j094n38Q21N15j637j92J650j012q19R45K67n83m62N17O85r40K70R31
2184D91o58k36P47K59m03r5R13j67r71M61P70q13m65P10J98q85k43J142k57j609
2204a111N55J092j433l90J076K92r28l34J430J58j561P13J349n47q65O19J000
2221A115q41n87J185M36j683K50J333o55q62N75N97q51r11J138L9q45j27Q19l33
2240b08q33N73L37l40n27R10l5l26K78O93j73o92O36M57m80m58Q94K43r60L61
2260C50N51m78p92M08O80r08k92R10O8j361L28M76j43q87L86J063r30m58J008
2279b1M67r48rP72J75p96O18P87o50l86N66K66l91l71N29k44p72L32N05q70lM41
$$ y = [11, -1317, -479, 872, -89, -1025, 417, 1085, -228, -316, 1094, 1128, -186, 35, 1409, 729, -300, 640, 1167, 73, -465, 356, 871, -766, -958, 692, -320, -1139, -194, 73, -510, -972, -455, 230, -710, -440, 491, -167, -403, 344, 603, 200, 105, 1018, 851, -120, 341, 1111, 298, -167, 543, 741, -144, -387, 755, 498, -1111, -556, 536, -897, -1287, -211, 81, -847, -1181, 249, 407, -1154, -441, 908, 361, -504, 115, 1115, 274, -313, 872, 1308, -375, -125, 1208, 553, -309, 266, 863, 12, -899, 239, 278, -567, -694, 125, -208, -1041, -468, -131, -471, -998, -88, -123, -449, -171, 522, 349, -343, 293, 750, 270, -188, 706, 949, -11, 350, 901, 423, -369, 39, 719, -189, -481, 429, 497, -864, -536, -60, -203, -1090, -704, 359, -571, -1029, -21, 446, -502, -511, 261, 436, -360, 258, 1045, 395, 9, 575, 841, 450, 79, 608, 364, -408, -76, 429, -441, -444, -3]
2301cq1m24n5N59j39q02N05O59r34J78O22r6l49L16O59j70n71M90O74q78j78R21
2323I03n0q56l47J132m32q57O63M15p42m96M31O55p39o70J070k1j044Q51K52l42
2343b24p7R3O76n74j38P70ll64L07K6J91m91J64M21q67L7Q99p27k52K93k38j98
2365b76j93J04L40p90K76O92o47q3L98K59p40M8Q58qp88L72J091o57m59M37N79
2386H13m10m12J49P78j140l9O04k4q76J25Q62l55r09M62N63n22m73N25K97m58
2406d40j51M77K24k32J7M74j12k06K33r2N07l64J7Q8r9L8k21J57j44J71k51q2
2428Ik18K9nl75N02p0n20J28L72q2m10O02J73l90j36Q22J8o88M79N45k91n24J41
2451A11O50m07o48O49L2m01m73P00J40r31j30P39n23j65K93K97k85m15K17O38
$$ y = [-3, -84, -508, -563, -4, -143, -945, -440, 219, -715, -537, 85, -11, -360, -44, 615, 445, -126, 364, 1038, 160, -18, 903, 853, -3, -350, 782, 350, -507, 156, 571, -171, -667, -236, 419, -320, -990, 80, 59, -985, -134, 118, -224, -301, -208, 468, -106, -244, 526, 523, 159, 466, 492, 683, 192, 356, 777, -90, -53, 846, 119, -133, 160, -78, -276, -469, -365, -25, -815, -539, 153, -494, -577, -179, 80, -660, -612, 246, 238, -550, -178, 913, 256, -203, 234, 813, 403, -9, 140, 918, -222, -261, 343, 319, -557, -432, 430, 75, -834, -372, 191, -331, -804, -279, 18, -440, -591, -114, 110, -122, -105, 369, 257, 51, 284, 192, 699, 335, 352, 440, 341, 379, 158, 315, 171, 342, 91, 9, -209, -180, -185, -560, -58, -128, -648, -520, -148, -230, -640, -38, 135, -255, -391, 431, 449, -239, 240, 785, 494, -30, 111, 761, 354, -294, 355, 387, -14, -487, 213, 353, -578, -708, 31, -492, -657, -364, -67, -352, -767, -550, 88]
2471H8m30n6O18k42J52P8J02K15k87Q6J49m56M91Om42j9K86j61jl32K70J8l67
2494b34K73l23l81L73J43k89r1J23N93k84l00M61K63l60r9N09k1j31j0K97M8l88
2516A72K42L69n52l84M54L3m35j64L13l3n83L40p0K57l47k02K70Q7j40J00J52
2537a21j98K09J16J18L2j08L47k00j32M34O6l16j33oJ38q9j07k2j35QM9j18J66
2560bm66J08M01m44J21K1L6k11N96m40M6K77k7J33N0j8L59k76J89j74k3j07P7
2583B26K53k53k51J91o8j16j26n6O4q8K38k82k85L78l6J36l37J23K25j81J05J53
2605A3K77k09J23J9Q2l57L96j2L14l68k19L7J41m58L19j19J2J79n73J60M6m07
2627f04K64L42k98j85J94K68j84nJ97J51k72J58K36j53K1j70K18J45p6K4j68m4
$$ y = [88, -342, -398, 220, -22, 130, 208, 310, 525, 238, 324, 473, 17, 508, 514, 72, 53, 339, 178, 177, -155, 115, 133, -234, 39, -284, -665, -292, -149, -438, -529, -406, 187, -97, -397, 64, 327, -33, -132, 377, 356, 225, 215, 512, 560, 172, 414, 783, 231, -153, 301, 334, -101, -265, 48, 15, -568, -228, -298, -41, -388, -590, -320, -233, -373, -273, -121, -319, -110, 6, 124, 156, 48, 395, 195, 63, 497, 563, 247, 114, 108, 246, 157, 50, 28, -107, -99, -50, -168, -2, -468, -360, 41, -403, -282, -261, -225, -436, 160, -280, -234, 43, 16, 149, 199, 181, 540, 264, 453, 279, 256, 149, 226, 479, 226, -25, 166, 98, -18, -144, -200, -136, -224, 14, -268, -553, -175, -211, -75, -412, -289, -64, -245, -140, 13, 290, 81, 204, 223, 305, -52, 344, 332, 646, 278, 59, 96, 237, -221, 98, -21, -9, 170, -403, -243, -197, -604, -340, 2, -296, -481, -287, -19, -203, -208, -11, 140, -132, 26, 262, 109, 130, -40, 178, 323, 247, 271, 103, 59]
2649E9J93m48J61K95n80p6J11L09k15k03J53L1j00j82N07l4j46J04J96K8n34N51
2671A80L19k59j01L3K44J68n91l0P42p61l61M67l4P0m03J10P77q56k75P06k08
2692f3m74O1L74K27o78M31L99l60N4K62L83j08m04N2M50k87j63k1J30k3j57m05
2714c20O86n92K17k0l0K8l48O7K12k39j30N47j29m2l79M45K83l43j16O86l08k56
2736h1J50J66J38l13OL87m41l0j9M63j86m48r7M71k07m77N76j35l22p7L52J99
2758G5l12l18N22K17m90J89J56J42j94L7M15j91k79J9L90r0k3k85N11m42N5r7
2780GJ56Ol73j96M00L4m92K79P2k41o6L32J92j44k07K30J75Q7l77J71L07j51q0
2803A21L62L0l17j91P8K26j67k74K88j12k36Q7r9J74n53L47J41p1m29M07L8k04
$$ y = [59, 252, -196, -35, 260, -320, -396, -285, 24, -191, -394, -241, -210, -310, -492, 15, -19, -165, -61, 135, 163, -371, 180, 499, 240, 139, 172, 416, 584, -7, -37, 705, -56, -417, 50, 16, 86, -317, -207, 570, -286, -561, 145, -63, -537, -476, -102, 125, -553, -122, 277, -83, -29, 233, 616, 508, 104, 156, 606, 319, 156, 135, 265, 242, 85, -320, 366, -226, -9, -29, -59, -31, -379, -312, -100, -339, -469, 78, -51, -93, -472, -27, 256, -87, -203, 483, 175, -81, 69, 235, 373, 60, 66, 453, 12, -18, -37, 426, 240, -208, -305, 166, -41, -518, 58, -77, -399, -476, -124, 75, -237, -555, -33, 184, -306, -117, 39, 181, -13, 24, 439, 248, -31, -12, 378, 288, 265, -20, 491, 49, 104, 7, 163, 169, -204, -400, 0, 34, -458, -179, -107, -348, -414, -82, 110, -34, -241, -11, 164, 251, -126, 45, 352, 201, 121, 483, 513, 196, 5, 83, 309, 142, -132, 156, 44, -192, -105, -204, -30, -583, -236, -95, -166, -595, -188, -150, -354]
2825c54J33N3K96j32k92M33J88j72j87K79J78N6m62K25J31k89m1J23Q8j61l03
2846b10K54p5k82K4L39k17j21q0K48K81q13K43P52m19j44L44J00j39j53NL11j62
2868H6J14J14J3k17j5M4Q9j65K9j34j19q3j74M09j32l78J01M43k21k31j46L97
2890a76Q5j43J40L75j92l43M16R9R8l93P2M73m35p8J07L09k27k40P3R1ok9j35
2913e9Q2l28l93P15Rj52m17L55O8j11N1K21L61p45M07K20n3l81L34K32L3m38N9
2936G0L40j94k58R0J32j18l91J90K88k89k10K22M6m58K29K32J76n05K51K51Mk20
2958a22L13j59J35j07n7K81n2l75L58J77k28o5N9j0j39m42L02J50J6l70J95O0
2980h0N3l42K12l4k4J42R0N3j52j80O49k08k51QK47K29l58j82O26n2m37O0J76
$$ y = [-354, -221, -168, 128, -4, -296, 137, 325, 153, -34, 245, 423, 479, 17, 242, 373, 84, 43, 166, 254, 93, -210, 44, -31, -313, -289, 50, -167, -288, -368, -120, 161, -652, -409, 343, -76, -220, 124, 224, 85, -68, -63, 248, 86, 200, 314, 327, 110, 95, 139, 228, 63, 92, -42, -161, -244, -418, -9, -141, -519, -418, 25, -196, -427, -573, -176, -91, -234, -94, 281, 89, -254, 162, 261, 359, -34, 38, 511, 76, -2, 105, 414, 187, -53, 20, 111, 105, 76, -59, 23, -305, -698, 17, 26, -126, -543, -188, -120, -231, -180, 41, 402, -343, 64, 284, 231, -150, 184, 416, 449, 11, 70, 410, 216, -42, 48, 180, 62, -329, -139, 149, -140, -350, -128, -82, -540, -311, -79, 97, -408, -157, 94, 98, -122, 191, 32, 167, 60, 3, 284, 232, -143, 215, 392, 164, 99, 158, 148, 9, -433, -131, 19, 35, -335, -140, -80, -27, -369, -157, -191, -215, -73, 17, 70, -82, -262, 387, 179, -72, -64, 183, 412, 54, -128, 498, 446, 9, 69, 245]
3003B45j87l89L97L16l23n00M63p3j67k07M76N3m36P1N5M87o84L04K0J02p3J08
3025E8K78j83p0K55n1q0r5j40K10l58M48j97J20l11J56l4p5k2K3k12O5O7R7r7
3049a48o5j64J73m9M55k60j36N49n9j71J72j71L04l96J18M3l04%K41j20j90m2
3071b20J58M8j84pL19j41l87K36K09p6k15J04J4J19j2J5Q5Q4J6J21J8l31O9O8
3095A10J08j93K31k1k65k25L44K2k64J46j28R4J1k98L92k03o2j22J02j54L20J58
3117A03j35J83l6O3j48QN0m8j91M92k16j25J94j35M9j37K62j44l71R6M30p7l88
3140b21k27M44k93j89J30N80l82P9j34J85J04m6p2J80j69J94J47rl15N5M16m47
3162A0m19L18N03k83l08L96j15m1Nl27L64l49L0K15j30r8L31K8l57K83K52j80
$$ y = [245, 58, -331, 66, 382, 59, -441, 22, -51, -218, -425, 51, 104, -332, -261, -206, 281, -403, -99, -79, 23, -50, 58, 336, 153, 83, 338, 287, 207, 112, -28, 182, -176, 272, 75, 195, -116, 40, 6, -69, -91, -68, -280, -215, -148, -51, -148, -213, -377, -204, -253, 202, -58, -194, 355, 296, 125, 297, 126, 430, 34, 152, 195, -109, -109, 132, 12, -178, -220, -62, -14, -198, -205, 114, -27, -414, -178, 31, -45, -260, -156, -142, -23, -35, -20, 65, 149, 165, 286, 304, -27, 42, 110, 218, 25, 256, 235, -30, -255, 89, 111, -153, -7, -135, -41, -30, -328, 64, -139, -201, -323, -221, -375, -55, 103, -32, 151, 115, 178, 30, 38, 88, 40, -151, 341, 125, 0, 194, 59, 108, -29, 233, 89, -282, -186, 244, 167, -221, -448, -4, -297, -486, -356, 224, -158, -79, -213, -28, 76, 30, -42, 138, -31, 163, 310, 301, -14, 41, 457, 10, -409, -91, 412, 129, -179, 217, 102, 61, 66, -261, 103, -246, -216, -1, -131, -229, 102, 130, -227, 56, 308, 128]
3184A28o8p8J35J45k19n7J64l5O3j46j44K12L97n32k0R2j25p5k64N80Ln51j91
3207e86P45k78k80K68K42J6m43K90K72j93l57N24K26n03J81N6J31m02M7M90l83
3228F3j78J4L02k93Q9k9J69k41j30J19K0j5j57K16j43K62J8J14l44M42j18k4O1
3251B17q2O6j71J78l8l48J51J64J74m39O9L94l44j14J39m0j47m77P17J51m80k61
3273e21O58k02q8J41K9K64n82K69K07m17N12o5p0Qj30O8J33k28q9N03m55P2j89
3296a72L38j72q1K53m91p1J45R0l09K66M12l43j30O1N0K88l39J40J6Q4kJ08j18
3319B3M3j09M85n80J58L0J55j95l45L89R3n61M42J61n2n30J65O01m66q4K54K24
3341C01m05p3K19K4n1J38J84k33j0N4o2J42l16L65j4k02M6J4k8l16ML40l69M5
$$ y = [128, 60, -18, 117, 262, 43, -14, 150, 115, 178, 32, -112, 100, 497, -35, -55, 37, -88, -163, -427, 153, 156, -395, -586, 159, -119, -399, -131, 111, 127, -316, -26, 246, 53, -304, 220, 446, -57, 124, 180, 311, -91, -44, 446, 63, -115, -101, 201, -92, -3, -32, 137, -104, -234, -115, -95, -110, -267, -51, -194, 68, 86, 200, -144, 298, 180, 156, 217, 135, 201, 30, 208, 170, -178, -27, 137, 311, -128, -59, 335, -9, -123, 16, -24, -171, -648, 69, 220, -260, -521, 137, -65, -153, -12, 17, 281, -301, -32, 175, -242, 270, 205, 135, 143, 13, 81, 214, -14, -103, 400, -55, 17, -172, 166, -6, -87, 166, -325, -396, -251, -161, -470, -204, 208, -135, -265, -204, -154, 134, -205, -65, -49, 35, 33, 141, 23, 66, -43, 442, -138, 20, 50, 205, 10, -335, 54, 147, -414, 28, 189, 137, -393, -228, 373, -93, -177, 77, 301, -104, -177, 42, 66, 15, 153, 337, 104, 94, 148, 86, 228, -88, 277, 263, 61, 107, 121, 93, -223, -219, 121, -248, -203]
3365b03M13l16Pk48L24M5J11j09J57k12M9J15p0K02j93k7m6n1L69m3j72k21L03
3388A84k26j37K80j17j79J69K29j08m97J04L02j26j98O8P09l48n64L79L53m21
3408a44j14K93L08l11j41N35j38k26j69L93j17k23J86P8k69K4J62j92j67P3k1
3429a80J37j20n1K45N3l44J74n9K62n5P1j30J13k7j22J12J62j6m17K93J90k76
3451A5kj9J63k24k73P22j44o78K69L18N5n01P2J61K29m46J89J18Q1m14K43L86
3473C20m90J03J20J31l87L67k9J8j13k54M64J39o57J42L41k29l09L85R1l39K11
3494B5n0k3J04k51oj03L43n1o9K48l70m0M48o1Lj2k3K83l19j25N1J0J45K7O9R8
3520C51k55n5J0O4m6l92N03k56r5J09O2j6j96l5l0L02K7k17L88j90q0R0L8j39
$$ y = [-203, 210, -106, -99, -347, -23, 22, 133, 24, 181, -31, 18, 133, 63, 265, 72, 45, -1, -52, 317, 274, 102, -119, 184, -42, -179, 101, -16, -195, -26, 203, 95, -402, -298, 4, -122, -320, -252, 457, 109, -455, -76, 277, -144, -258, 35, 343, 32, -109, 426, 288, 62, -107, 286, 169, -54, 132, 210, -59, -35, 127, -65, -232, -159, -180, -43, -163, -214, 31, 84, -260, -86, -145, 117, 62, 133, 3, 116, 89, -33, 79, 241, 225, -192, 101, 291, 15, 13, -6, 157, -67, -340, 382, 238, -440, -171, 147, 202, -299, -227, -66, 163, -283, -94, 24, 105, -309, -66, 320, -170, -67, 53, 184, -203, 164, 135, 153, 40, -214, 250, 389, -268, -126, 215, -14, -323, 62, 153, -186, 25, -25, -48, 56, -195, -201, -304, 39, -12, -81, 167, -203, -243, 205, 144, 147, 135, 112, 395, 76, -49, 2, 12, 157, 184, 253, 351, 96, 41, 51, 115, 69, -323, 180, -76, -171, -62, 0, -16, -212, -247, -277, 25, 52, -165, 223, 33, -47, 43, 81, -58]
3544e8P7K52K25l41l37M40N1l85o1K0J33q8p7J41k02N6l1K36k53J58k28K70JQ0
3568G9M3l2P3j12N9O9J22m24K48q2L68p13L21J62n1j49M4q9q4J53j34R5j88J48
3592g4rQ7k27Jo3J44o6j08R8P0J08K49k49j01J73q5M42j76n07N11K04n38J16J02
3616A02j6l26J85J37m0m00M86l00O9m8P7K06j66k26L07K31l34l6J46J40q2nQ6
3639A93J5j24K38j26l0n4P5k66J77k69K63k40P1k1j84M07k77k6J95l74M06j04
3661e5l12J67M1J97k14K36k95L91l58K27q5J45r1qJ75L6j75Kk37k5P2L06m68L98
3685G0j24J14j21l45L01j0j96L26j69l5J79OJ32l29J53L63j40j86O1L09o1j80
3707A18P1j93J41J6j63J24k12J20j68K18l43q6M60r1j16K06l79L75k14j34J55
$$ y = [-58, 19, 271, 496, 155, -182, 258, 309, -76, -137, -117, 16, -72, -149, -8, -210, -154, -185, 51, -202, -44, -272, -2, -1, 79, 122, 90, 163, 51, 110, 179, 301, -123, 125, 43, 411, -302, 19, 181, 130, -19, 25, -64, -148, 5, -129, -34, -222, -74, -83, 4, -223, -222, -285, -141, -207, -315, -217, -147, -39, 210, -39, -140, 33, -52, 390, 214, -293, 218, 422, -116, 0, 102, 86, -240, -55, 82, 42, -358, 128, -172, -103, -151, -74, 132, -34, -260, 47, 278, -56, -92, 54, 194, 112, 107, 193, 208, 84, 322, 196, 166, 112, 187, -79, 98, -171, 92, -148, -77, -98, -282, 125, -152, -178, 17, -357, 49, -55, -367, -200, -159, 38, -176, 60, -235, 156, -202, 25, -60, 85, -6, -14, 161, 197, 22, 24, -213, -238, -166, 140, -328, 70, -54, 60, -61, -406, -105, -115, -311, 15, -154, -189, -10, -4, 128, -201, -48, 315, 175, -11, 50, 359, 298, 118, 189, -4, 137, 153, -10, 114, -98, 22, -146, 72, -271, -357, 103, 12, -104, 102, -277, 98, -116, -250, -95]
3728i5N7L0k2j54J49J27M7j21j23n2J57J78j5j07r3q6K30q9j1k38K0K64k63J15
3752i5mp0L5K36p6k56J27J34p0M0LJ82j75j02J41K9J29l63J90P8p4j19K18j99
3776f1k89K72K02j26j30K32K0k49k6L07r1k66O6m1K72l31lJ66J02p0r3m4O3nK58
3801A35N2l10P6L28l42K17j35N9J88l27L9j19q1K46j98j13K87o6l21M90o2R6k00
3824f1O8N6k15K02n9m1r6L13l99J27L84j91K17k95L5K0J21J31j96k95J76J44j52
3847fj8j09J26n3q9K05j94M41k44l12L24j5P8l20Oo4M54k36J31p1j9k0q6j9J46
3872C6M0k6n3lr2j40J89j30P4j89K97j44K08k64J43r5K95k39M6N1Po9j66N42l08
3897A0j61K86p8n0L6m7n9K01k21J70J28n3j6pk94J18k48K92K34l88J01J27o5j94
$$ y = [-95, -38, -8, -30, -184, -35, 92, 139, 18, -105, -157, 0, 178, 163, 56, -37, -123, 107, 18, 7, -231, -211, 53, -210, -95, -99, -169, -134, 102, 26, -230, -103, 31, -39, 1, 4, 186, 11, -91, 50, 79, 208, -155, 35, 113, 39, -80, 138, -61, -350, -78, 124, -2, -132, 100, 120, -129, -155, 152, 61, -205, -139, -180, 92, -239, -242, -76, 26, -44, -137, -181, -118, -123, 135, 187, -123, -47, 281, -61, 156, 21, 80, 268, -59, -20, -139, -220, 26, -172, -285, 2, -64, -385, 105, 43, 139, -61, 7, 63, -152, 50, -9, -50, -146, 167, -232, -105, 279, 88, 305, 10, 45, 65, 186, 317, 121, -174, 2, 146, -6, -24, -133, -7, -60, -149, 56, -138, 303, 59, -253, 71, 56, 134, -186, -180, -244, 210, -26, 105, 34, 15, -5, -91, -110, 36, 76, 50, -3, -6, -98, -238, -49, -179, -105, -294, 3, -141, 67, -197, -54, -149, 146, -93, -47, 4, 11, -58, -224, 318, 10, -151, 135, 57, 7, 43, -4, -63, 138, -83, 87, 215, 162, 146, 139, -155, -37, -285, 7, 241, -147, -46, 81, 16, -178]
3921a78J09J58q4K49j30k9N0k35K66m0M4k57J35J13kk07J15k87K66o5L4J52j79
3944bo1Q0M6l2M5l41K17R8k92L00j96J15P7Kj00m5kP9K43j7j12k07M51j48l27
3969a29J90%K8l48O94m82Mm7J15O9k10j91K64k5p2K30j37R3j84L77j11J58l21
3992c5j60N22l92j02M52k02j44J12N1N3j68M6n1K04j91N8Q9k03Q0l61M83j27q5
4015g1j73j0K78N3j87M34p9l34K52n6O1r3J73o5K3j35r2K44k13J42m5k9J32m83
4039b73Q8R3j67M5jK13O5n45K83M14j70r2O1l8N3ML6M0R3l38N8L3L49m57J81k2
4065Fl9J38j62j10K02O0Mj69o0M90m32q9P3J86J6j38j35K56k92J22P5Rj31L27
4089B07m3q4J52k93K09j48J24O5m63L23l6r8K40k38j64K52J4j41K7j9k29M98j90
$$ y = [-178, -69, 89, 5, 254, 124, 95, 145, -90, 176, 136, 180, -77, 58, 171, 169, -38, 77, -210, 56, -9, 25, 177, -2, -63, 17, 63, 31, 76, -265, -48, 50, -242, 58, -138, -23, 54, 56, -44, -89, -91, -12, 231, 214, 102, -105, 346, 198, -129, 61, 61, 89, -259, 435, -47, -43, -90, 25, 94, -116, -307, -43, -68, -140, 90, -47, 46, -138, 239, 128, 286, -35, -195, 327, -65, -167, 285, 83, -61, 51, 102, 155, -13, 33, -18, 186, -5, 53, 142, -61, 19, -342, 141, 14, -71, -244, -254, 24, 77, -110, 324, 245, -89, 163, 107, 168, 75, 248, 183, 206, 71, -21, 223, 10, 152, 107, 78, 210, -273, -185, -92, -259, -214, -215, -2, 63, -482, -199, 215, 45, -47, 14, -24, 29, 33, 69, 109, 202, -136, -78, -45, 304, -153, 28, 6, -33, 105, -57, -167, 35, 95, 99, -70, -130, 360, -72, -161, -88, 98, 114, -24, -159, 97, -195, -73, 2, 11, -120, 207, 164, 80, 232, -61, 148, 0, 124, 189, -274, 49, 13, -85, 155, -83, -247, 5, 19, -122, -95, -114, -343, 155, -35]
4112c5j25L31k06P8L2M9k86J03J15J29k2j15J02j32K23N2j40J50k82j40K11j4
4134G8j66O2j22J68j71M2j50J58k00L09Q1J90k08K1j84K82l43L80L5Qq7j26J3
4157G0l46M00k08K58r4j43J03o4k4K04mk14q2j54K85r1R7j61M7J62p0j95M9N0
4181a25Q8q1O1KJ07j67N2J90K41m07J03j31R8p5J18j54m6l4Q1j08J48j4j36K30
4205D1j41M6m0j68L58m8k16p8K29j55k1J89J70N6k01o2M26l98J12J14k27J4Q9
4228H9k6O5j76R3J10l21Q0J11j0j07k14J20J69l17J71J38j01K24m6K20j25k47
4250a00K44K9j12j33K77j70O7o3J13j84l3J00l1K7j65J00O0n8j6J71k37J50j76
4273a40J36m0j31J44K88r6q9j12J23Q7q8K23k81K94j50j20jO2p8j19k6L85m51
$$ y = [-35, -160, 171, -35, 43, 75, 124, -162, -59, 56, 185, 163, 48, 150, 18, 241, 293, 153, 303, 21, -119, 92, 78, -88, -26, -148, 20, -151, -109, -259, -101, -301, 8, 89, 279, 71, 92, -92, 190, -153, 227, 262, 270, 183, 57, 70, -276, 124, -84, 174, 80, -63, 40, -24, -48, 156, 152, -62, -144, -298, -13, -104, -7, -168, -121, 41, -29, -224, -175, -125, -37, -118, -57, -55, 52, -115, -63, 127, 368, -39, 64, -67, 31, -44, 74, -80, -126, -160, -79, -187, -39, -53, -189, 41, -100, -54, -94, -262, 96, 48, -168, -246, -17, -172, -193, -4, 166, 222, 21, -41, 385, -13, 99, 213, -14, 0, 89, 63, 128, -48, 45, 155, -166, -86, 25, 15, -92, -306, -186, -17, -334, -163, -25, -126, 98, 52, 272, 147, -100, 144, 173, 61, -72, 205, 35, 102, 39, 152, -32, -65, 35, 4, 31, -134, -34, 26, -32, -48, 123, -114, 36, -140, -4, -44, -175, -31, 257, 161, 72, -40, 83, 170, 82, 305, 24, 318, 168, 48, 47, 109, 31, -88, -114, 271, -180]
4296a80O6J10j90N2Q4J86j67J69j55J52k30PJ88Q7j61J42j65J53m5j89J34j6J24
4319A56n8J59j41j97M2J92k73J53M1j58K3k48L85l73Q5R1J05K3p4J66j80K6n2
4342a07J73j55NK97j98N7J84o7j38J11L3M3j55n0j29J25j2J62l24K93l40K41j53
4365a04Nj58q9J93O5L6J4QL9l30M58k38N74o15J13RP3j52J06m9J32j17J23J87
4389B83m19K55j38k8J51j09k47K67l8J07k08K54m47L70J0k57M09k20M1K43j89
4410I0l6J34o6o0J09j64J21J23k54q4M7Q4j23n0K10k36K63m2j86OJ81k86N0n9
4434b28K89k59L29j31j38L36k16p9JK40j8k2j46M1P9K08k09L2M5j76N9K8J03p6
4458I2j84J20o5j81J20J34j48J25k17J00k3m6K71J68N6l51p5N9L1j66N66l23j40
$$ y = [-180, -114, -4, -194, -142, -58, 128, -39, 130, -25, 127, -103, -96, 92, 179, 18, 160, -5, 148, 103, -86, 48, 32, 156, 98, 257, 116, -81, -39, 153, -120, 33, 74, -84, -61, -309, 76, -297, -212, -121, -16, 7, -67, 99, -81, -55, -107, 66, -89, -84, 213, 15, 72, 256, 189, 51, 162, 195, 238, 83, 33, -96, 29, 17, 179, -145, 148, -192, 49, -104, -99, -257, -346, -153, -88, -52, -38, -30, 9, -321, 137, -101, 473, -142, -29, -20, 53, -99, 7, -42, 90, -27, 96, 283, -136, 119, -19, -47, 104, -5, -252, 15, -23, 84, -124, 130, -317, 53, 63, -194, 215, -5, 36, 279, 90, 54, 188, 122, 62, 171, 7, 128, 251, -3, -87, -40, 44, -79, -129, 81, -155, 108, 66, -120, -114, 67, -219, -169, -228, 61, -198, 131, 0, -138, 198, -18, -97, -96, 144, 126, 104, -42, -1, 78, 286, 77, 109, 154, -22, 37, 65, 168, 92, -92, 28, -37, -218, -98, 36, -112, 13, -204, -104, -127, -173, 98, 266, 322, -29, -104, -45, -14, -180, 386, 63, -77]
4481g7N03k80m35N41j65R9l63L49m42M55j52j42J31k91L84j48l6OJ8j23K08j06
4503f6J30k03N8J26j48K27J37j68n7j48k1M48l24j52K70k45K23l5l39M45n12L30
4525b4K37m22Q7l6K61r8p8j11j10K14K2J58l9o0o2K86J71q8k77K03k93L31k7j94
4549E1J85J2L2j80l7j84n0N8k10J33k35K17J21r4NK2p7L73k28jjK12k50J48K34
4574B56k97j26N31l06k26K93R0p4k2j58j29L7k01L83k66J61J37j67QJ0J92p2k23
4597a69J57qJ6j27Q9k03K75o3l3N4J20j6j73L74n18J10K06J57k29J24j26j48L02
4620A71j50K51l39%k77L07K1j02ML00k29o2O4K90j95k09M0J87J17k79L21Rk89
4643d9J84J59l02j75J26J47k85R5j46K19j75K07q4J64j17l24K10m4K38l00K79
$$ y = [-77, 426, 146, -289, 252, 87, 186, -177, 172, -270, 185, 33, -109, 22, -269, 115, -33, -69, -63, -45, -168, 40, -66, 64, -139, -81, 45, -103, 124, 261, 93, 36, -112, -133, 315, -9, -161, 109, -136, 87, 52, -287, 158, -354, -24, 213, -209, -122, -158, 103, 5, -73, -184, -294, -80, -58, 100, 61, 1, -61, 225, 396, 308, 31, 234, -59, 272, 245, 51, 236, 248, 280, 100, 63, -121, -171, -113, -323, -190, -425, -208, -87, -181, -176, -154, -231, 142, -86, -87, -88, 124, -126, 22, 256, -41, -167, 364, 58, -168, 125, 215, 141, 119, -39, -168, -131, -332, 51, -215, -54, 83, -84, -76, -66, 126, 54, -169, -12, -20, -4, -131, -42, -245, 30, -33, -66, -12, 108, 92, -81, 293, -225, -115, 91, 248, 19, 143, 17, -131, 171, 21, 272, -67, -67, -344, -37, -16, -118, -114, 186, -43, -105, -41, 249, 54, -155, -115, 72, 189, -90, 231, 240, -49, 135, 294, -8, -183, -57, 90, -195, -100, -246, -27, -202, 5, -79, 85, -32, -356, -146, -190, 48, -252, 27]
4664B7j15L25j06j07J1k52L48K5K13k76K50k02kr7j79L70j85k04p9J18l4J77j29
4687a03J57r2L7j32l5J29P8pj45J4kkJ36M9M8L8j58N8j65J28K26k71K15k16K3
4712HN0j69J72j69J04j93J31L9qJ19j81l4J74m7k43J38J88l2M6KK0j70O2k0rJ25
4738A03O3k66K35j00j62r5K57P9j28j77j03K50r1K27q6o6M1n9N1J1j28J15K0j55
4762a64L20p0m8r5o0O5L9M92l65K2q6j01K79n54L18l1J27j67m3K00k2j86J47R8
4786A15l70L50j49j50K23j16k1J69L3k6R7k73j20M10n4l5q8L9M6j14L9p9K50n5
4810A21j86Q7k26J33p6J46k81L05J8j65L3J05n5L2O7M4r4j43J71o9K45m4j86J40
4834A22J76k11J11l2j31J72k68L9J26m30K91J9K65l58k8J98k47M7K7R8j18Q5J62
$$ y = [27, -88, 237, 131, 24, 35, -217, 131, 156, 369, 93, 343, 141, 139, 42, -137, 233, 48, -156, -235, -117, -151, 26, -103, 54, -38, -1, -133, -168, -39, 39, 32, -113, -99, -101, -103, 33, 82, 130, 168, 10, 68, -97, 31, 257, -14, 201, -15, 8, 58, -111, 61, -108, -4, -197, -66, -27, -35, 84, -97, -131, 43, -4, -247, -109, 79, 47, 93, 95, 115, -55, 7, -13, -22, 103, 166, -100, 135, 35, -127, -222, 35, 114, -14, -191, -294, -44, -135, 92, 6, -60, -19, -78, -27, -16, -144, -29, -9, -164, 156, 86, 38, -57, -117, -52, -13, 479, 114, 136, 50, -51, 228, -326, -8, -39, 88, -79, -122, 78, 56, -130, 17, 115, -255, 95, -54, -204, 19, -97, -118, 51, 84, 58, 155, -118, -238, 172, 118, 83, -5, 34, 80, -34, 5, -74, 176, 121, -65, 22, -204, -71, -147, -1, -282, 23, 41, -124, -91, 14, -41, -9, 58, 102, 8, -135, 36, -33, 212, 168, -18, 122, 298, 87, 198, 166, 35, 207, -61, -22, 104, -326, -35, -16, 249, -109, -137, 61, -186, -139, -112, -14, -132, -47, 115]
4857A15q3m9P2K74l32o0R4l9l7K72n99L56K45j73J4J81l43j73J58j49N52m31N1
4880h4J40m2l1K7r5q9J4J84j49J01k08R5J90O6j77K88j84k70L04NJ78j4N0k46
4904E3P0j3p7j67K09q6J08P3j87k3R0J49k76K83l90R0J91j76n8K81j61L6n3j27
4928a61K28p0k9L8M3J74j2k28K65j99r8K2j9j35J59J16k22P4j07K90k42K21j94
4951h6K9J57j34m5N9L4m8p1pQ9J90q6j84K36J21l33L40j28n3MJ8j41K98m63K69
4976F5Kn0l07J59J87j96Q4K85j98j05J60l29K15R0QN1q3P1j38k00J76J75o1L8
5000I9R3L7m28o9J85ok82M93j32J2L22m68j69L51m27L18J93m9Or9J67J8j58j57
5024a50J64o4k7J61P2k36K73j04p2p2J45k85L9J16L8k17J09j95J78J54q2J28l94
$$ y = [115, 32, -17, 55, 329, -3, -63, 31, -8, -45, 227, -372, -16, 229, 56, 70, 251, -92, -265, -107, -256, 296, -135, -84, 56, 14, -17, 10, -85, -174, -160, 24, -125, -24, -232, -137, 53, 119, -58, 230, 46, -224, 80, 85, 263, 249, 299, 53, 123, 110, 33, -134, 75, -11, 97, 170, -17, -40, 50, 199, -77, 206, -184, -94, 97, -79, -137, 144, -17, 19, -34, -161, 67, -3, -32, 6, 49, 223, 211, -17, 248, 49, -49, -27, -46, -181, -22, 94, -128, -54, -161, 129, -113, 108, -86, -57, 100, -34, -79, -20, 14, -34, -105, -112, -23, 167, 81, -103, 133, 254, -79, 261, 133, 80, 84, 102, -39, 259, -204, 65, 67, 17, -290, -131, 56, -140, -56, 229, 31, -74, 86, -243, -28, 62, 70, 121, 38, 109, -29, -229, -53, 122, 61, 99, 192, 229, -199, -268, -83, -89, -371, 122, -10, 2, 324, -144, -313, 38, -389, -71, 122, 73, 79, -20, 147, 165, 7, -150, 14, -50, -77, 84, 156, -80, 193, 89, 17, -55, 90, -195, -156, -40, -2, -219, -110, -305, -127, 27, -55, 73, -321]
5047c21L13n6o9J52oj21K64L9j94L4o7Q5P8K0j66O6k25L29K5j60m9J74l56J97
5071a4J95k83K37m63K58k2j18M4M46n09N2j11M92j90j89Q7J27R6m0O4P9j80j09
5094e1J26Q5j3L22l87j35J94j09j75k6pK53k09R9j06N3Q0K3k20P6N7J07N6j76
5118h3k8K01p8J48J01j95r1K44l48K92j05J3J15q6k45n5K44j14K1r3K87l8k40
5141a33M3j0k51M66j90l5N7j5J27J98l93N8L06l51K17N6n2o0K34k42K4J5j22o0
5165a13L1J4j2j46N60l10o5K3j42K09l3LJ21mo4PJ75k15p8J90O0k88J63K33k35
5190H4M6P4j60kp5k2J69j54p9K47j4o8k1l7j75K02k31J54l58K56l7M1J44L88l94
5215b2K42l8r6j45M02k9k92Q6o2M2l07K64j94J43p3K22j02J3q4M7j52j27M62j31
$$ y = [-321, -8, -64, -133, 19, 13, -108, 156, 195, 1, 35, -32, 53, 131, 151, -15, 51, -174, 155, 180, 20, -29, 145, -211, -14, 181, -102, 135, -328, -70, -92, -210, -166, 280, -229, -177, -288, 204, 14, -175, -88, 39, 135, 95, 159, 238, 58, -51, 75, 160, 147, 469, 82, -53, 141, 32, -143, -169, -176, 77, -132, -33, -139, -86, -6, 17, -203, -127, -70, 37, 93, -83, -111, 90, 12, 160, 261, 66, -25, 219, -129, 163, 58, 71, 186, 100, -145, -200, 44, -70, -49, -142, 145, 107, -133, -90, -100, -351, 115, -75, -110, -53, -68, 59, 257, -136, -78, 228, -123, 94, 150, 98, 38, 272, 30, 54, 69, -53, -113, -82, -68, -80, -226, 334, 24, -41, -18, -160, 49, 16, 19, 140, 136, 72, 79, 254, 39, -39, 151, 211, -77, 86, 319, 84, 130, 204, 44, 42, -33, -55, 114, -40, -119, 128, 114, 46, 25, -12, -187, 15, -216, -62, -420, -164, -201, -160, -16, 372, -22, 220, 182, 86, -59, 343, 314, 22, 108, 46, 88, -219, 45, -149, -6, -79, 143, 41, 54, -30, 17, -135, -262, 200, 69]
5239F9r5O4j02j02K48j29r0L39k79N7J67N9k11R3K6k8J58r5j83m8j12K51l30K43
5263c0n0Q5k48lJ99m2m1J92Lk62M30m40K60Pj02k9K62j76O0j93K36o6RJ78l8j6
5289A85j09n3J33j72R8l87K40j10L16l99r2M06n5r2p0L59m29L64n28K59J89p9
5311b6J57m21O14l9k28J95j10J34L3k80L6K38m13J05n8p0L89m97K32L0K59k97
5333a7j07k15K75k2Rq2J59J62j13J5q3n5J34K22l48J56n1J35k07K52L6l31K11
5356A35j79Q7j2j62K36j03p7J54k01Q7r0j64J08J68Q3r9N8n2O1l7j16J82j94L
5380a24L03k21K94j38m71M93j52rJ47k63J5j7K54J8j54M8r0j71L47n2J08k35K3
5403d7o5l9J87p2l6J0M6o6L60k20k37K88J31j54K59l48J5j08O1P5J5J7k42J41
$$ y = [69, -26, 38, -64, -166, 82, -47, -137, 202, -77, -20, 147, 206, -5, 88, 114, 86, 244, 149, -34, -82, -194, 57, -273, -30, -80, 5, -243, -246, -47, -89, -130, 62, 65, -197, 233, -207, 53, 60, -42, -71, 191, 15, 75, -118, 118, 52, 61, 239, 201, 185, 76, 23, 156, -16, 82, -305, -65, -175, 141, -258, -350, 56, 1, -91, -161, 198, -231, 133, -395, -136, 53, -26, 131, -290, 324, 285, 57, 252, 142, 276, 309, 29, 65, 303, -110, -5, -63, -133, 256, -241, -9, 21, 280, -17, -124, -339, -64, -86, -77, -159, 0, 162, 49, 64, -19, -74, 60, 282, -66, 90, 39, 174, -33, 219, 255, -76, 135, -44, 43, 31, -131, 105, 2, -75, 79, -122, -35, -125, -289, -181, -13, 70, -29, 29, -23, 38, 1, -115, 67, -127, -124, 179, -42, 252, 114, -357, 136, -16, -25, 122, -141, -126, -143, 111, 129, -25, 23, -67, -238, 109, 57, 165, -70, -47, -112, -151, 36, -36, -72, -62, -16, -82, 278, 58, -179, 109, 240, 86, 345, -3, 12, -96, -35, 40, 55, 72, -170, -29]
5427b9k92M59Q8k40n6k9J04l01K56j74K27k68J98J22j41p0K52j01p5J98j25J49
5449A52j81R9j06m2n4JqQ8p2K71n1l84L09p6J46n3k53j83L99m1j79K83r0%J19
5474I4r1j47K66j25J38J19k38L53k56j26q7J16o2J89m08K91j96Q0J00l04R3Q8
5496a13R7K45k89M5K26l29J30P3l2j48J92j66J30O4j67L11l53K69p3k7J28k33
5518b0R5M9k02K31k66K15p2J41nk87K9M7Q6J46m23K33jn6J9J6J45j74j65K29L6
5543D6j04J84r6L02l90N8j58Q7k7P4j76QJ09J2J53q4k89J72k6N4j86M43o1lk71
5568a69K16J45j85Qpk6J7K69j94R2k50J47j50K65O0r8j58J62k87r3K43k12k67
5591d72M13O1j22q2P0n6o4K72l43L79j8k8M23n05P4j9K96l56Q2j33J11n2K1J27
$$ y = [-29, -321, 138, 226, -14, -70, -99, 5, -296, -40, -214, 13, -255, -57, 65, -76, -146, 106, 5, -70, 128, 3, 152, -29, 70, -36, -78, -132, -131, -139, -51, -123, 148, 97, -287, 22, -54, 92, 39, -214, -397, 2, -39, -218, 65, -25, -25, 94, 3, -144, 122, -3, 135, 254, 16, 369, 113, -13, -100, 16, -46, 143, -265, 26, -170, -90, 10, -294, -201, -113, -16, 229, -60, -15, 211, -118, 12, 85, 53, -95, 97, -69, 61, 125, -42, 269, -84, 185, 112, 85, 213, -20, 75, 124, -78, 153, -113, 102, 30, 171, 166, -121, -92, -45, 41, 187, -236, -3, -4, -60, -41, -25, 120, -54, -219, 10, 46, -58, 126, 30, 332, -58, 0, -158, -71, -98, -24, -200, -192, -83, -71, 82, -2, -291, -119, -145, -91, -277, 166, 105, 102, -169, 47, 192, 7, 15, 8, -18, -1, 268, 74, 166, -84, 63, -87, 178, 238, 140, -18, 144, -143, -236, 7, -205, -472, -59, 2, -120, -202, -132, -188, -252, 20, -323, 56, 38, 10, 433, -72, 2, -17, 279, -77, 5, -128, -17, -69, -48, 79]
5615G9l0Q8l24K76j39p3J29k31K40J50m9j09r1J16n8m6L2j3j3J63r4L4J7Q2K25
5640C61j31l9j59J02k46OK54J04m13M2o2m9K66j76J68j94K69j83J11j58l0N4L2
5663g1J37j00R5K19j04r3O7J27m52M6L75l60K0Q3K94l30K89k66K54l02K3N1q6
5686h4L0J26q7j6J9P7j51J16l14L77Rj16j62L91l11q7K88J37k17J79k3j11p3K42
5710B39l78J1P1J04l21P1M3o1J3K14n3lJ01j3q1j58K63j41J86l1J02m9r6K74l10
5735cJ73J18j78o5m6J58q1p0J76m7O8k47J29j82M1m4m1J37l3J7j01J26k15J83
5759b7Q3k08o9N4J69j16K95j13r9J80j16j13J31K12j01K13m12l2k86J46J5K52
5781E8k54J15O6j99K43k4j07J38j6o7l8K05J21m7j40J70k36L9J14o1Jm1K1k09
$$ y = [79, 49, 137, -187, 89, -50, -123, 6, -225, 15, 165, 116, 7, -84, 32, -26, -72, -40, -53, -66, 97, 3, 37, 54, 136, 361, 230, 191, 32, 134, -112, -106, 148, 252, -161, -119, -181, -230, 36, -140, 28, -166, 103, -80, 31, -127, -157, -103, -71, 66, -34, 61, 280, 176, 83, 150, 277, -175, -129, 246, -114, -94, -11, 283, -47, 242, -24, 230, -72, -49, 2, -84, -54, 72, -15, -31, -12, 65, -86, 30, -284, 93, 102, -14, -176, 215, -96, -183, 105, 242, 25, 204, 181, 70, -3, 239, -139, -128, -57, 47, -274, -203, -160, -221, -208, 6, -47, -50, 51, 38, -43, -201, 62, -79, 107, 76, 178, 129, 33, 307, -3, 170, 288, 110, 45, -1, 157, 76, 6, 182, 135, 203, -44, 85, -97, -56, -100, -141, -4, -37, -20, -121, 5, -210, -27, 56, -152, -221, -167, 2, -114, 181, 68, -31, 149, 33, -80, 51, 263, 162, 375, -37, -69, -355, -209, -194, 58, -196, -81, -15, -214, 29, 5, -102, 36, 20, -47, -85, 120, 241, 194, 54, 224, -12, 27, 141, 80, 81, 40, 61, -148]
5805a48K50j71J65Q9l74J81J21O6j80o5J41l77K00J79j30N1j32p2m7L51J2j53
5827d3J60k56J61J4j63J30K94j88Oj47l1J83K9OJ00k82j42Q4q9J2m0P6O6o6J94
5852F8k7O9j41p9J51J73j67N5j42M8N4k61K95Q2j88L50L5j27l44j5K15j30l3Q8
5876B9k1l21R0J86J06l24M11k79J78r2j08J55r3K35j83J57m4P3k11n2J50J52l0
5899A64j18J16L5l6M5j37o8j64L25j0k67K4J49k28J00K0j7J51j29k69L22p8r6
5922a66L04n6mj9ol2j05O9%Q6R2k52K15j74Q3n0o1K50j97KqR0o3J84j58j34K69
5949A59k23j5o7K84k36K36J28m30K09R3q7j14P4M9M5j44j8K40k11J30j8l7P3j89
5973f9o2K53k84P4K61n7k93L7k1j8K49m4M4J53m3j72K23K7m8j94%j8M4Q5j80J02
$$ y = [-148, 102, -69, 96, 185, -189, -8, 113, 179, -1, -66, 75, -302, -102, 77, -53, -2, -134, -206, -253, 98, 110, -43, 117, -139, 22, 36, -127, 3, 297, 109, 115, -32, -63, 120, 149, 155, 255, -27, -169, -85, -174, -162, -202, -126, -60, -126, 68, 41, 110, -31, -110, 41, 214, 47, 102, -40, 8, 62, -199, 96, 178, -10, 340, 375, 248, -96, -111, 104, -26, -59, 29, 8, -313, -223, -37, 69, -255, 156, -123, 55, -37, -145, 10, -83, 152, -31, 126, 82, 155, -56, -108, 42, 194, 164, 46, 162, 197, 161, 206, 69, 1, -163, 162, 152, -115, -91, 58, -170, -70, -50, -67, 84, -45, -314, 8, -70, -166, 138, 82, 78, 59, 53, 21, -84, -15, -15, 71, 163, -89, 126, -48, 35, -15, -76, 174, -23, -21, -29, 61, -2, 182, 24, -110, 159, -64, -79, -146, 138, -98, 138, 266, -164, 45, 138, 51, -63, 11, 60, 105, -39, -57, 183, -28, 102, 84, 47, 120, -69, -131, 122, -162, -88, 173, 116, -177, -140, -161, -179, 70, 26, 70, 223, 180, 8, 231, 258, 210, 16, 16, -2, 42, 127, -53, 49]
5999D9K21k60nj99r3K08J50k91P2J47p0K23j87o7j9m6J5N7K44k54L49q1n7j33
6023b7N4R3q5j29J02q6J88J46j23j67P7kk4K47l46N3k51K33N4m8k38M6L12m58
6047c79K27j09M27L4j88j03L8P2L3J22k48J74j25J1j2L19p8n5j17o8P7%l30J79
6071i9mJ23j2p4P2p2J52j38lL5j77K27J60j95K38k13J44j95K50k16N2J12q9n0
6095B8m5j29J5O4o7j5K73j56K83m58K27j2%Q1j93J93j98J47K03l57KQ7L82l65
6119a0M9n2Pj37J16pJ8K20J4j7j43P3k26N7j05R2p6J58n6lj25kJ70J48j66m0k43
6146b86K87K20k28J64r1M4o3J03p4r7q5M8O4k4k20L74j43j9j27J13r9q7J93mq0
6171a17j87K95K11k7m20J70J75mJ52l47K84j96L10n3j25j26J08J70j44J07q9J0
$$ y = [49, 270, 10, 5, -194, -287, -79, 71, -220, -148, -1, -71, 152, -35, -102, -121, -167, -152, -95, 149, -105, 244, 163, 106, -27, 27, 120, 35, -94, 8, -78, 110, 256, 133, -34, 43, 41, 17, 264, -82, -29, -280, -47, 7, -41, -279, -233, 79, -379, -152, -261, 166, 200, 12, -91, -53, 19, 52, 174, -74, 100, -25, -14, -26, 293, 215, 160, 43, -25, 52, 52, -278, -99, -103, 20, 8, -66, 6, -66, 86, -52, -55, -20, -197, 30, 190, -5, 233, 20, 164, -31, 219, 3, 55, 167, 78, 28, -17, -146, -131, -67, -134, -149, 124, -32, 251, -207, 20, 8, 8, 89, -104, 89, -109, 38, 241, -116, -114, -27, 355, -10, 39, -13, -6, -143, -27, -34, -16, 204, 218, 201, 58, 131, -95, -38, -143, -51, -127, 31, -25, -28, -153, -155, 15, 163, -3, -43, -286, 1, 221, -7, 157, 66, 110, 47, 150, 76, -21, -106, -58, 6, -18, -238, 136, -7, -26, -153, -40, -139, -226, -33, -37, -117, -304, -9, 202, 175, -245, -75, 100, 96, 248, -99, 185, -11, 299, 246, 121, -5, 103, 273, 129, 236, 147, 157]
6193A57j82K45j29L8n6j97J18k17L89l08J68l8J11k9l16j71N72k21K50O3n27O17
6215C37m14J73k07K05L9j79K11j40j71J85J64r8J02m11J25r9J80q5J83j6j7k95
6237b28L16n7K06k20K11k10J31l95L60J71m35J12J72k8q0k3J63J45j33k05l8m8
6259a13J52l1O2k24J08j22j66K58J05J08k68R1l7m5J28J68j48j86L8J60j7q6J83
6282A18k01j7K76q2j06J77l26J82j45K92J04l59K65M5m05J36K14l34J70L9j8q7
6304f2l9K30kk75l0M70k35r2K30j38r0q0J98j53pL7Q5k7o8n9r7J80J3k9J1k3J
6331e1M9n1J29j43l6N3k15L33j52Ml6J50M7J09l55K90r0j04J3K72j69k23K01j52
6355a27p1n5K24J01j02Kj49J03J80J0n34K39K7Q5J55m6L4k52J00J15M3K16l89
$$ y = [157, -25, 220, 91, 129, 73, -124, -6, -223, 166, -142, 26, -12, 99, 70, -246, -417, 155, -66, 184, 247, -280, 337, -77, 96, -111, 94, 133, -46, 165, 25, -146, 39, 203, 105, 207, -204, -79, -178, 2, -83, 100, 84, 67, -228, 88, 31, 237, 17, 228, 18, 149, -246, 114, 285, -150, -38, 134, 106, 26, 3, 166, 311, 178, -27, -65, -113, 39, 8, 70, -154, -46, -168, -334, -76, 29, 137, -131, -40, -77, -122, 6, 174, 26, -160, -122, 38, 21, -65, 118, -83, -100, 176, 94, -12, 165, -161, 21, -124, 168, 272, -87, 178, 223, -182, -46, 168, -166, 4, 43, 25, -62, -101, 129, 127, -148, -178, 292, 57, -35, 195, 57, -33, -113, 85, -68, -75, -38, 47, 20, -48, -107, -204, -24, -11, -40, -29, -52, -51, -2, -53, 76, -67, -103, -50, -265, 68, -84, -80, -116, 34, 81, 190, -165, 125, 35, -69, -56, 216, 47, -176, 25, -127, -198, -253, -29, 72, -30, -28, -177, -74, 106, 116, -418, -179, -152, -67, 88, 42, 76, -176, -76, 39, 82, 298, -91]
6378i1K94m1K9L3l45K22R5n3j32k03M08m8j92J05j77J90mk75L4K17j12p3K08k40
6402a51qK39j63j19J30J28j79L54q5l48K71j54K86k50o6m2J02o9q9J10O4Q8j4
6425C5p4R8j97K09l17J80J19j87J14K51j79lj52k1R4K13j5o2J20j71R9j20K27
6448B61k49J7lL5k00R6Q6m8j62Q7K5J27J15m72R1J34J59p7o6RJ81j09J22j23O5
6473A01q7j52L52p9r5J97k20L13k71N1k10m7J67J32q9L5Pm42K61J23L9k32J42
6496dJ09k16n6N96o65L63r8R1J52l76K19j25P2k14K55J38k09J02Pp2o1P1j5l1
6520C3j09j34K6K08j52j4R8q4O9r0k1L33k17Q6J72m5k31N2N8K1l54K32L06k65
6544b2p0L23l55J18J83l51o5L00k2j71R1q6j86M75j71k69J45O0j0R4j65k4K96
$$ y = [-91, 203, 162, 191, 224, -121, 101, 196, 143, 11, -192, 216, 168, -24, 81, -96, 94, 90, -185, -151, 66, -46, -119, 89, -151, -159, 80, -83, -202, -72, 56, -123, 231, 146, -202, 69, -85, 201, -49, -115, -157, -55, -124, -213, -103, -39, 49, 35, -39, 59, -138, 71, -246, -66, 53, -134, -20, 231, 52, 49, -103, -124, -30, 183, 168, 106, 226, 55, 154, 34, 261, 12, 29, 26, 61, -139, -43, 43, -5, -167, -80, -55, 72, 187, -285, -194, -60, 99, 22, -44, -35, 146, 37, 159, 36, 101, 14, -138, 214, 135, 40, 237, 17, 330, 59, 110, -100, -147, 20, 152, 63, 98, 105, -337, -76, 47, 86, -146, -4, 105, -111, -167, 429, -236, 127, 29, 120, 272, -104, 115, -10, 62, -152, 103, 241, 32, 134, 141, 69, 8, 79, 64, 33, -76, -210, -184, 24, -128, -142, -44, -128, -59, -149, -170, 163, -54, 32, 204, 159, -72, -20, 38, 59, -295, -63, 243, -22, -92, 231, -124, -6, 177, -174, -239, 61, 39, -132, -41, -127, -313, 162, -9, -278, -133, -73, -83, 11, -154, -178, 118]
6567A18Q3p3j36N1Kk5J78j80jM7j89k1M8O1p6K41k68K53k11j96J88K62j24j77
6591a45L6K63J08n13K55j32J10K33j27j5J52K7q7L2k96K78j31p9L21l32j79L12
6613I1p2J25p3k04J45j49J23j98J43N5m7j54K33j21k39L49O2Q0k76M6O5J69j5
6636A38M4j99K7j54P7R8K00R3l59k4M6o9K1K35n5K6l22j55M85k67J80l12K62l0
6660a4j91L48k30J39j28N0J38p2J22k08O1L91n74M15k23J2J83r3J50j60j33k87
6682c04L35o6R1k21J85M0j84R2J63j03P0q3K0j97J73R6Q7Q1k30p8j4N8lK3L2%
6708F3o4j31K31L0j42J50M0j55j48K25M2m06J15M0P5l4P7R1j51J59j10J38j49
6731a4k51J96K20j15k7j97J81K4P4k04O2j4J58k68J40J43j16N4m1k17L72j97j20
$$ y = [118, 201, 128, -8, 43, 45, 20, 198, 18, 17, 64, -125, -146, -98, -37, -113, 128, -140, 113, -98, -294, -106, 156, 32, -145, -109, 154, 262, -251, 4, -128, -18, 215, 88, 73, 225, 252, 165, 197, -99, 179, 48, -31, 290, -42, -221, 91, 19, 144, 71, -133, 12, -137, -14, -212, -69, -14, -61, -215, 18, -103, -342, 7, 69, 149, -127, -81, -16, 153, 138, 182, -17, 10, -144, -67, 31, 231, 324, -35, -59, -13, -82, -61, 174, 119, 145, -177, -332, 153, -114, 66, -246, 16, -14, -205, 143, -87, 52, -76, -26, 112, 40, 162, -46, 15, 406, -168, 247, 24, 36, 219, 126, 276, 116, -17, -304, 31, -35, 56, -165, 20, 60, -124, -32, 131, 28, 98, 15, 35, -162, 11, 107, 194, 275, 45, -33, -47, 11, 8, 31, 63, 63, -1, -132, 99, 129, -13, 137, 177, 22, -126, 99, 141, -265, -150, -110, -35, -69, 8, 99, -52, 107, -3, 135, -14, -265, -69, 151, 36, 9, -188, -7, 17, 91, -113, -51, -65, 93, -175, -35, 108, -8, 46, 5, -212, 160, -37, -157]
6754a57J38n1K08j25J46j59k9m5J69o9j80J97j3K96j96j8q2O1l54M95m4l10O6
6777e6J14N3Lj39m0J53l4m5O3q7P2q6k3R1n8jJ88k46r6L70j70K51k51j02L09j50
6803H3M1k48J09J20j87J82j14q4n1L57m89K87J73k37J10j86p1JQ6M62j51k01q2
6826i0k3J72k0q9M3L8k53K62j90K54k6j32o7J14k63K66%K35k31r4Q6r9J58p5J04
6851H0j03j1J7J75Q9j36K9j90L22j28j92L5J50l6j78N8J20L3k19N5j36K70j28
6874b4k97L13J86rk54K11l72L3M54l84L72k25K41l85K52j76K80j46L5n0o1J91
6896A85j70J33M8j57l4m2jJ49n3p4J95k01k1R1j5Mk30O1J05L4l49J59J64K4k0
6921a5J16R9k07m4q5L94k02O0L3q6l0O2J2r2rj67J22M8M5l43K85J30k23j73J11
$$ y = [-157, -19, -70, 138, 13, 159, 0, -29, -74, 95, 26, -154, 43, 30, 326, 130, 112, 30, 91, -263, 232, 188, -122, -56, 58, 111, 114, -25, -65, 88, 54, 9, 72, -15, 57, -29, -52, 39, -19, -20, 168, -78, -174, 196, 26, 277, 26, -76, 233, 83, 124, -124, -15, 105, -82, 100, -14, -98, -149, 208, -281, 6, 179, -58, 52, -134, -205, -204, -118, 344, 193, -8, -90, -113, 59, 39, -50, -7, 31, -222, 40, -150, 104, 78, -54, -121, -7, -270, -4, -4, 231, 0, -94, -8, -107, 51, -24, 80, -23, -34, -17, 158, 247, 111, 140, -50, 272, 144, -48, -13, 137, 101, -77, -19, 101, 134, -85, -30, -166, 104, -24, -321, -8, 178, 169, -85, 126, -246, -213, 241, -143, 229, 4, 245, -140, 112, -64, 216, 70, 105, 55, -6, 185, 15, 148, 196, 39, 5, -37, -38, 111, 58, -16, 179, -22, -43, 48, 33, 37, -193, -132, -27, 7, -342, -183, -19, 5, -15, 101, 200, -7, -51, -136, 258, 56, 116, 149, 63, 33, 95, 107, 15, 6, -161, -39, 9, 54, -289, -4, 126, -97, -270, -159]
6946a59J53N6k15L6K51j30K27k8O2k48mp1N3Q3L17m93J66K60k02q6j20J38q3J07
6970G0n5J14n0J31m66J17J32k6n0J48j44K81k76ML4n6j8L20j80L25j79k96K22
6993A02q6P6j14J96j74J5Q3Nk38K39j09j63j2J52p7J41k06qj4M20j03O1p6k75
7017a65J52J85j19k29N6J93O5M7l84K21R1l17l2K87Kj79K11j19R3j79l7K12J71
7040B26l28J11M6j28J80r7j10J92j61M0K6j80J5J00J42j13J65k13L43k37j24J28
7062B3n1R8r5k0j29J44L4R2k38J15K5j86K53R8l44P9K83k39R5O0Qo8k12K38j60
7087i7l5J29J79j27j57L49m55J70J64p0Jj02j65J25J57j46J30K1j86k72M65M9
7109A27q4J28m20L33j00P6K2j1kK26l06L56k89n4j11L23j94r1J0mJ02l2j00K20
$$ y = [-159, -6, 50, -165, -129, 122, -8, 219, 191, 253, 5, 1, -70, -17, 66, 383, -110, 56, 316, 114, 28, -92, 46, -37, 70, 15, 129, 79, 210, -256, -139, -7, -33, -83, 65, -79, 202, -74, -70, -36, -92, -110, 210, 30, 355, 176, -120, 102, 16, 92, -22, 174, 0, 15, 98, 103, -135, 104, -5, -168, -180, -28, -105, 36, -170, -178, -192, 228, 125, 186, 110, -165, -13, 172, 53, -176, -120, 73, 138, 185, -199, 22, 113, -204, -236, 51, 53, -126, 85, -34, 59, -120, -157, 55, 226, -102, 9, 55, -73, 107, 10, -100, 92, -69, -29, -3, -183, -168, -68, 74, -39, 126, -87, 256, 19, -105, 23, -28, 70, -25, -45, -174, -30, 4, 96, -142, -27, -2, -188, 65, 163, -181, -102, 181, -58, 37, 97, 105, 37, -175, 63, -97, -132, -3, 176, 49, -108, 241, -214, -44, 120, 50, 51, -51, -216, -91, 66, -80, 50, 71, -115, -387, 78, 127, 43, 171, -249, 84, -16, 60, 82, 71, 69, 295, -11, 345, 56, 2, -109, 214, 20, -71, -61, -65, 37, 5, -95, 125]
7133A25l16K77p1l9j01j06K99K1J9l63K04K24k77J64j13o0J25J1Q6j35J23k88
7155a91P2L31k81L1Q2p3J51l24K54K02l14q6j22J83Q8O3p3l54K30K98k04r7jL91
7179B56k89Q7J89j19m4j95J69J62l89J27K10k72K05k34j60K3L20r7O5n0Q1O1j57
7202e1k5j28K66k94M56k23K5KK0k3J92j68j5j02J52q7N0r4J07J45j66m1n8J27
7226F7j44J15q1r4K62J4j72K1L5j22j09L32l7j41j9J35J46j50Nl1L9P8j11k25
7250a87J58N0L04k32k53K16j03j13J14M4l21L24m8q4J53N3j93M3n8J75k78K74
7272C8n0J51k7J21j9k60O0J36m5j86k8J30k55K84n3m2J20O1j77K7J8j9Q4k21K8
7297a24J91l14K23p4K4L6R0n6J04qJ11K7k72K37l99K17j28N9K01j67N6K21l31
$$ y = [125, -191, 86, 15, -24, -125, -231, 68, 89, 108, -255, -51, 173, -104, 60, -53, -113, 12, 23, 109, -26, 97, -191, -119, 212, -69, -38, 44, -29, 122, -202, 52, 254, -60, -146, -268, -85, 3, 66, -7, -361, -131, 167, -37, -134, -135, 256, -33, 54, 243, 124, 80, -115, 54, 216, -173, -46, 164, -108, 97, -137, -297, -274, 46, -51, 14, -36, 45, 106, -51, -76, -204, 62, -232, 224, 1, 26, 28, 48, 25, 217, 49, 34, -68, 84, -3, 47, -47, 60, 205, 39, -2, -60, 67, -77, 38, -43, -137, 125, 139, -33, -12, 23, -99, -208, 124, 87, -54, -73, 62, 208, 58, 63, 32, 71, 149, 38, -187, -29, 21, 325, 93, -160, 56, -47, -160, -46, -2, -323, 1, -47, -131, 22, 75, -118, -75, -133, 42, -236, 38, -12, 139, 112, 233, 214, -46, 14, 150, 105, -81, -109, 21, -234, 50, -3, -45, 75, 136, -41, -14, 4, -15, 69, -152, -124, 67, -247, -24, -98, -74, -38, 52, -4, 100, 92, 203, 230, -42, 195, -204, 13, -115, -56, 145, -22, 34, 255, -76]
7320g6J28j5k35J63J57k45R9q7k17L57l9J71K3m25L95Jj17Rq8n2j8K87K1k75J12
7345C4j17L18j90p6J20O2k42K73k75R1j88K88m48K79m7k7J16J18j5k3j74r9M52
7368B30m14K46m8m7N8m6J07L5k19K40j57K18k12p2M1K51j35k52J8P0n2K69l44
7391b15L93R2m83L63r5K5J4j56j66L14m2J71n4J54j26m9j38q8K6K36q1kO2j32
7415B3q1J71k00K59l12K6J9j3P0o2K56j70n5j48N3L06Pj93J52j65OmL4N6N1l17
7441b31L33K50l41j31K44k90R8K08k42pJ66k05J65r3Kq7J87l4n9K20j17r1N0J28
7465A23J21l16J63n7J57J2k62J82j31K70l26R9K78m13J1l7L36k65q0R4k08L04
7487E5l62N03m03J54j5j42M46m30K23p9K5n8J31l8K0j28J45O4j6q7j2k7J76k53
$$ y = [-76, 52, 37, -198, -35, 122, -123, -24, -111, -328, 29, -10, 161, 184, -241, 154, 155, 38, 47, -41, -93, -111, 176, 197, -78, 34, -83, 235, 45, -31, 89, 151, -91, 182, -93, -2, -190, 98, -350, -71, -118, -145, -29, 89, 74, 51, -123, -222, 230, -184, 62, 14, -33, 25, -21, 86, 121, -98, 142, -15, 203, -9, -81, -40, 211, 76, -176, -158, -88, -140, 129, -215, 178, 270, -213, 150, 55, 80, 94, -62, -228, 86, 44, 215, 161, 315, 189, 140, 2, -86, -60, 176, 95, 93, 155, 23, -58, 113, -87, 172, -140, -114, -95, -108, -38, -100, 156, -14, -69, -217, -164, 142, 149, -44, 108, -57, -51, -55, -21, 35, 86, -231, 102, 352, 11, -120, 124, -166, -68, 140, -102, -109, 57, -148, 17, -76, -74, -161, 26, -8, -67, 153, 36, -55, -5, 123, 244, -72, 91, 34, 191, 203, -59, 123, -8, 262, -64, 35, 313, -100, -89, -126, 210, -55, -135, -41, -249, 55, -307, 196, -207, -53, -68, -210, 236, -194, 29, -50, -25, -83, 48, 10, 30, -98, 47, 111, 95, 8, -4, -31, 145, -108]
7511a08J68J28m7l1j14L4n8k4j02J43k06K30L0Jj89K22O9j20R2j73J04K0J7p1
7535A5K28l25K04k54K02j83K57j38P1j33P1Q9M0j82j05N0r1j3J90K60l27J01K5
7558E2k42J33O5m1j66K96j09n0J81q5m8k36K94rK4r3Q8m3J08j09L55k42k22j4
7582a13J69o0j77J81Q3j62M5m5l9J52k4N0k17J10J57R5j98J87j97J33lj06k06
7605a85K54q5P5o8J34k65L01j30r7R5j21K1P2j58J2L5j63K41J19l00L53k39L78
7628B79j61j30J39k16L06j12j32j1Q0j86K89m1nj34l9K00m16J39O4qQ0j78J86
7651gK37l68R2r7J24K55l57m8J32K07j11J35k60L6k19J59Q9j11m5K10p6R3j52
7674h2L4P7k8n08O55l18K47p4k4L8J30m79K13J88k84K71J22O7j17J8k8j06n8n5
$$ y = [-108, 60, 188, 141, 110, -4, 30, -28, -52, -154, -11, -217, 13, 43, 44, -145, 77, 146, 26, 118, -55, 49, 69, 86, 15, 243, -82, 122, -132, 70, -113, 144, 6, 77, -56, 15, 104, 144, -38, -143, -93, -184, -197, -7, 253, -74, 27, 52, -190, -57, 8, -33, -199, 97, -12, -62, 119, 34, -14, -250, 44, 35, 59, -34, 54, 11, 119, 10, 365, 123, -99, -113, 56, -4, -181, 0, 83, -79, -34, -79, -118, 34, 10, 60, -157, -47, 110, 205, 7, 194, -3, 130, 127, 21, -185, 69, -16, 59, -9, 125, -140, 161, 31, -66, 29, -92, -71, 1, -157, -145, -110, -273, -32, 87, -213, 140, -99, 279, 118, -12, 127, -89, 217, 105, -27, -38, 42, -144, 145, 104, 99, -35, -74, 126, -290, -151, -87, -95, -15, -193, -7, 230, -138, -46, -143, -19, 236, -121, -169, -37, 170, 59, 194, -66, -30, -249, -90, -1, -112, -157, 53, -23, 70, -82, -48, 29, 1, -507, 148, -170, 77, 3, -21, 17, 147, -332, -119, 69, -215, 56, 178, 245, 128, 146, 118, 12, -46, -101]
7698a01K2K39R5k50q6J79j93J32j26J7K6K10k68K19l55K39L8l77O8M46k38M3m3
7721f4K19k99m2L75p7J81k42J49k40J29J05k51j92J89J9J53k53J30m8j42L26k08
7743h3l0rO8K62k38j74J29J83J6M6j17L4n9O7j13n7p6L71j29j80P2j68J19J45
7767G9j23J79l3k03L5J15P2o0q2j31J01J07k31K43K5r2j07j31N02l89q6K74q4
7790b0J52l6Nk3N0o9K10l42L59r6o7o8l61M03o7j19K27Mn04M52k40j04M72l70
7814a52J83n9L0L8n4l9J86k48O3p8K08p2J27M9J1n03M79k9j14r6N6j02o8P9J50
7839D5m0j09M6J95j60MJ0P8J40j43k01J07r1J72p7K13pk91J99pk8J59l38K5J80
7864H1o2K17m78K18pJ18j21M1j14Q6l5n9J78m9K4J46k09J38j19N9k04J36kJ1R6
$$ y = [-101, -79, 160, 255, 5, -81, 98, -95, 37, -89, -72, -46, 164, -104, 115, -240, -1, 37, -340, -272, 174, -64, -21, -64, 155, -144, -186, 189, 112, 293, 51, 200, -40, 89, 194, -57, -249, -60, -41, 112, -141, -11, -59, -201, 125, -83, -113, -122, -54, 208, -30, -204, -75, 108, 124, 170, 53, 87, 28, 95, -18, -75, -151, 220, 91, -89, -17, -185, -66, 79, -44, 135, 102, -101, -66, 49, 121, 61, -21, -152, -51, 56, -175, 68, 93, 1, -106, -237, 265, -124, -210, 64, -20, 132, 96, 101, 78, 128, 59, 269, -73, 286, 190, 123, 55, -306, 97, 30, -89, 138, 142, -362, 90, -150, -254, 218, -152, 31, -28, 2, 40, -14, -53, 133, -115, -52, -130, 78, 6, 133, 182, 193, -310, 169, 140, 26, -70, -14, -116, -184, -105, 45, 5, -104, -58, 137, -23, -19, -9, 69, 209, 66, -135, -28, -119, 53, -24, 189, 182, -109, 90, 83, 55, 214, -124, -99, 81, 19, 236, -242, -24, -31, 87, -34, 7, -107, -21, -56, -115, 63, 14, 38, 184, -25, 113, -6, 53, -151, -15, -17, -6, 90]
7889I0J29j17k25J23N8k04K55n1j57J29j48K15j96R5j9L5K3L8o8l12R1j25L10
7912c1J20N4l54M55m62L47j04J76l85L44N7q2j57k4N0o3p1K52j00J73k19%j09
7935a33J9J11j76K8M4P8R5j8n2j52L15j43P0j09k22K59J09k91K11K66j27l9J2
7958A55j87L07j95q8j05L11j46j20K1j04n5J5M45l30K10k94J30J5k4K23j06o9
7980IK8r3lP4qQ5J26L9j74m2NJ12J72n27J81J27j72Q4n3m0P4O9k83K87P0l42J37
8007e8K61j00j45L41l09Kn6O2o2J45J40l32L77rK4l69Q2j12J2K60r0J8k34J27
8031b5n5J71O7l65L9J49L2K60j67m7R0j8M0j5k80r5J93K76k34P7J21k29P9L2k3
8056G3P5J85m11J20P5k97p3J49K28j7k22K75j83J08kr1j27O6J78K69m20O2M7J16
$$ y = [90, 219, 102, -123, 0, 58, -146, 109, 58, -99, 30, -118, 97, -99, -4, -23, 12, 35, 73, 5, -307, -216, -341, -31, 89, 143, -211, 244, -218, 129, 25, 201, -184, 160, 217, 135, -22, -46, 4, -59, -130, 122, 22, 195, -24, -24, -133, -114, -3, -179, -151, -107, -29, 66, 48, -4, -156, 159, 16, 86, -23, -245, 14, 123, -168, 43, 309, 182, 143, 155, -32, 275, 80, -8, -113, 198, 52, -68, -47, -151, -206, -191, 254, -76, 134, -160, -30, -15, -39, 184, 78, 9, 37, -56, -59, 15, 7, 92, 218, 257, 83, 41, 46, 158, 330, -197, -16, 111, -61, 23, -30, -70, 4, 73, -210, 77, 147, -195, -58, 203, 103, -42, 299, -10, -8, -64, -2, -64, 81, 221, -111, 266, 257, 281, -88, -6, -118, -106, 154, 64, 82, -152, -25, -80, 91, 158, -207, -168, -19, 13, 273, 106, 59, 149, 131, 171, 156, -124, -219, -26, 250, 16, 93, 214, -15, 64, 96, 73, 148, 333, -78, 42, 117, -180, -253, -104, 124, 107, -115, 160, -23, 85, 83, -8, -135, -69, 109, 378, -42, 20, 67, 183]
8080A83j56jK53k80J13J06l31L14k93J25j18K1L3O8k75j9K88Q1N9j09k21K48N
8103I4km9j01J99N9j91J4J11k35K0j27J98K77J40m78L0lq6K46k22O8k43J88L2
8127f1j32K6n3L01n1q8L49m58K60m8l6j00P0J66j31N1j02M3J83k22o0L7R5j60
8151a21K02k3m7k03K44l9k65M31k04o9M0m2o4J65QQ2k12j09K67J9R9n5LJ05l20
8176a08K9KK13j33R2oj09j18J26kM1K45k13n6J26
$$ y = [183, 27, 26, 279, -1, 112, 218, -113, 201, -92, 33, -85, -64, -31, 37, -238, -257, 31, 112, 171, 62, -159, 89, 94, 92, 43, -58, 141, 200, 9, 23, 134, -101, -81, -208, -10, 267, 407, -71, -41, -44, -130, 116, -106, -38, -281, -93, -61, -193, -167, -220, 81, 30, -58, 291, -167, 93, 45, 9, -91, -21, 145, 14, 65, -37, 6, 189, -33, -93, -56, 39, -121, 81, 58, 11, -192, 52, 13, -252, 179, -25, -94, -54, -96, -160, 5, 13, 95, -117, -226, 41, 60, 159, 104, 107, 212, -108, -79, -77, 136, 3, 95, 89, -20, -138, -12, -14, 27, 272, 59, 3, 129]
8191A29
$$ Imaginary data points
##PAGE= N=2
##DATA TABLE= (X++(I..I)), XYDATA
0@%%%%%%Qq%qJ6j6J6j6K4l2L7m5N6o9Q2r5J09j31J55j79K08k42K78l17L61m11
32b19M66n26N93o67P48q38R36j039J155j287J427j576J741j922K121k337K573
49A349k834L121l440L795m188M631n136N710o372P148q072R190j0576J2347j4697
64h024J7966k2828L0802m6044Q4924l56528p06472J097704P09978p62958n84462
75e45942N81756L55414m50460k35754L13803J30091k9043K4840k25150l06159
85c86604L09177N34515k13004n98357J16269M61825j21810l13419J74891K29101
95A92584j51342j63197M9956j6527L3056K79937P463m60593j11876M62527J75200
106B97188l53136j15680K82043J5939k60680K5794J96804N199l2675q365j68771
$$ y = [0, 0, 0, 0, 0, 0, 0, 8, 0, 0, -8, 8, -8, 8, -8, 16, -16, 21, -24, 32, -37, 45, -50, 59, -72, 83, -96, 112, -130, 148, -169, 192, -219, 247, -279, 314, -353, 395, -443, 493, -546, 609, -678, 749, -827, 914, -1008, 1113, -1224, 1349, -1485, 1636, -1804, 1991, -2197, 2434, -2702, 3008, -3364, 3784, -4288, 4902, -5674, 6673, -8024, 9942, -12886, 17916, -28128, 56796, -299732, -1006204, 91500, 801478, 38520, -545942, 35814, 391228, -59232, -294986, 18817, 148908, 119865, 144705, -80445, -386604, -77427, 457088, 244084, -354273, -238004, 223821, 102011, -211408, -36517, 192584, 41242, -121955, -71999, -88526, -55470, 224467, 231930, -228663, -340539, 121988, 297188, -55948, -171628, 110415, 126354, -134326, -108532, 88272, 93471, 60796, 52431, -116340]
117a16340q7669K83783J98663l01160k07589K84276Q6746l26675M1103M07311
127B62449r7693m51696J22801M11202k06265l32365L52287L11461m52283l45900
137d26002M45056L62724l54582k77299K78039J40465k39278m5716J96958J9412
147I9777j00514J0031l9793j11390J43480K27868j73416k78479J49955K32229
157A59748j57496j66122K07035J36343k43668j25769K08446Q2577j25026J4852
167i080Q1177j07515q9504J51152R9930j32630m5603J09551l9959j14199Q6866
178i814J30367p5374j07702N0340K2922o5656O5363R5517j13405r9747J21370
189A4181N1094j55701P954K32851l7700l02684L1323L11947j7166k66526L4062
$$ y = [-116340, -204009, 79774, 278437, -22723, -230312, 53964, 140710, -185965, -144862, 262449, 164756, -286940, -164139, 247063, 40798, -291567, 60720, 372181, -80102, -426002, 19054, 381778, 27196, -250103, 27936, 168401, -70877, -116593, 80365, 99777, -737, 9294, -30499, -141889, 1591, 229459, 56043, -222436, -72481, 159748, 2252, -163870, 43165, 179508, -64160, -189929, 18517, 101094, -23932, -9080, 72097, -35418, -124922, 26230, 126160, -6470, -52073, 57478, 17519, -96680, -9814, 120553, 45179, -62523, -12183, 10739, -54917, 10446, 105963, -7442, -107189, 14181, 65275, -90426, -82472, 150379, 112679, -190005, -158682, 153265, 136099, -130427, -96365]
200i6365K30849o0918k15997O7274J93516k5846j19164k0308J4981K7219P2561
211F7802J200j19864j9290J37996p980j63303L8865J88081l8413j98040Q545J60240
223E5839l834r1046M0998K9014q6740O62J05424q226r3655L7260R0313p8331r8747
236a01069R9525J09614o9489r0180K2301M2514l467J3776J0009n3928r608O6139
248C6137k3358q1151N3886J08059o1357j38884M4337J32660l5243r0036M6049
259h901M7653o3180l1321P2751L0217n9869l964M4984l6252l6320O2882M5170
271F3850n2959m6249L0640K1842k2178J6310K3902m2660k2004M0528l74m2956
283c2308K3500O3906m1207r4223M0725R6510l1723p2009K9674N0117l7441m3280
$$ y = [-96365, 134484, 73566, -142431, -75157, 118359, 92513, -26651, -46959, -31978, -4759, 67802, 69002, -50862, -70152, 67844, 59864, -103439, -64574, 123507, 85094, -112946, -104401, 55839, 52005, -39041, 1957, 30971, -55769, -55107, 50317, 42091, -51564, -14304, 76009, -2322, -101069, -1544, 108070, 38581, -51599, -29298, 13216, 9749, 23525, 33534, -20394, -30002, 36137, 12779, -68372, -14486, 93573, 32216, -106668, -62331, 70329, 35086, -54950, -8901, 38752, -24428, -55749, 17002, 47219, -12650, -16614, 28370, -7882, -44202, 18680, 63850, 10891, -35358, -4718, 17124, -5054, 11256, 35158, -7502, -29506, 11022, 10648, -32308, -8808, 55098, 13891, -80332, -39607, 56903, 25180, -46829, -17155, 32962, -4479, -47759]
295d7759M7692M2502l3345k2379R437o319O662L1914J932l9783r567L7090m701
308A3376l5263K7833L5593l7681m1489K3919L3944j8983j3994K7434j1714m3132
320d0157J9890M4172j3052l2197J4329K1763k7417j6962M2382J9732l2041j4185
332a3743J1772M429J75J2877O319k4310r545K1845k998j5745J7586J5169k4733
345i02k8413J8586K9455j6964j5354J7227l012k3532O180K5800K973k0889j125
358i970J1573j0166m79K2624J977j7669m642R629L246o239R223J0487j6487j2514
372i407P916N764K779J944m283j3793p284J7985R561k0327l935J9105j227k3322
386a8524n553K8783J8329k3096k2040P733K0537J1450j3423j6092J1524J7931
$$ y = [-47759, -67, 42435, 9090, -13289, -3852, -10171, -3509, 28405, 30337, -9446, -19013, 18077, 13376, -21887, 5946, 41539, 3858, -37631, -13712, 20232, 1249, -12745, 14689, 2975, -40157, -20267, 23905, 10853, -21344, -7015, 14748, -12669, -29631, 12751, 32483, 442, -13743, -1971, 2458, 2633, 15510, 21829, -2481, -12026, 9819, 6821, -8924, 8662, 23831, -902, -29315, -10729, 18726, 1762, -13592, 3635, 623, -22909, -16729, 9071, 12044, -8845, -9970, 1603, -8563, -9042, 13582, 15559, -2110, -6752, 2877, 6123, -116, 9107, 19594, 3107, -9407, -1491, 4273, 7052, 8996, 4713, -9080, -16364, 1621, 11182, -9145, -13080, 6025, 4798, -18524, -24077, 4706, 23035, -61, -22101, -14368, 6169, 17619, 4196, -11896, -372, 17559]
398A7559p071k3722J635L6071P118l9117j9249K5933K5998j1667k5996K105J3573
411C170j875n663l288M55J0264J815j2305j3818P770K7803K399k8328q955J8306
425b250J6146o300j3372O060R491n973k874J385M58L966M022j283j5340j1817
439a7681K2214K2506j9699l1534K986L3579P190l3774j2102K6598J6381j5438
451A226k5133L872K8793J3649j5741l0717m879M4644K9347m1356m6873K8901O5904
464E1637j4589q0089J107Q4918J8173q0618m4218O5508N9609m5478o0911J7419
476b7532M7403N171l3986j9789J5623K4886Q909k7083l5581K5002N7212q606o5838
489c4209j3641O9071L4301o2006l9583M9802M2394l4734m3364K2796L9838j4072
$$ y = [17559, 10488, -13234, -11599, 24472, 31590, -7527, -26776, -843, 25155, 13488, -12508, -10403, 3170, 1295, -4368, -7656, -7201, 3063, 4878, -7427, -21245, -13475, 14328, 16727, -11601, -20556, -2250, 13896, 7596, -5776, 284, 9775, 3802, 928, 2313, 2771, 6737, 10759, 9476, -5864, -17681, 4533, 27039, 7340, -24194, -21208, 12371, 19561, -14213, -26315, 283, 16664, 1226, -23907, -20035, 8758, 22407, 6666, -24051, -28930, 15714, 45061, 3705, -43168, -14267, 51637, 37048, -43041, -41934, 42984, 61157, -19461, -63679, 1829, 61438, 15960, -44951, -27532, 19871, 25042, -8944, -28733, -13110, 11776, 20685, -6398, -41979, -16977, 40235, 31629, -34209, -47850, 21221, 55522, -6484, -46067, 3735, 46129, 11395, -31969, -9173, 30665, 16593]
501A6593k7300M706P055k351N369P919j3449k2971J5818K9739j7197l0386J3722
514a2733K8969q578l0278Q743K7769j0221j4135J6250L133k5108L414M3923J231
527C2379o3786o630P7536J5419q2089k9625Q1906M4095q0432n6131O6723N8315
539E7680m4811n7071J9215M3935k818k2700p158n859J4895L1759j5489n1127O562
552c2987P1205J2130q3411k7376Q4063M2933o8356n3106N0426N7984l4006n3453
564c3954J7851M0072q57k7766j3377J1150J3874O367q834k4206r67L1286Q655
577A9294l0624j9057K8656K8911k7484l3140K6210L6027j9224l5133J6296L6732
589B7464j8768l3216K7617L1338l2635l3331L4663L8900l7759m3407L8294M0452
$$ y = [16593, -10707, -6001, 1054, -1297, 4072, 11991, -1458, -24429, -8611, 21128, 3931, -26455, -12733, 16236, 7658, -22620, -13877, 13892, 3671, -10464, 5786, 8919, -16189, -12775, 31148, 32379, -31407, -38037, 39499, 54918, -27171, -56796, 25110, 69205, -11227, -67358, -635, 57680, 12869, -44202, -24987, 18948, 16130, -6570, -13728, -19587, -4692, 27067, 11578, -39549, -32987, 38218, 50348, -33063, -60439, 23624, 66557, -1799, -54905, -4479, 53505, 19499, -33954, -16103, 23969, 23112, -4654, -18031, -6881, 6993, 13360, 4526, -19680, -20647, 10639, 19294, -11330, -30387, -1731, 27180, -304, -33444, -7234, 28793, 9569, -25564, -9268, 27464, 8696, -24520, 3097, 34435, 1800, -31531, 3132, 42032, 4273, -39134, -840, 39612]
601C9612l4960m0078K5278L6854j7096l1360Q555J5016j683M431l572k0274L052
614a6225L3961N304m5043j1979N4759K0194n3036k6673M4244L6085l0258l8368
626b7035J6296L1756j598k0817j3615R215K0673O72k2851j6480J9265K8485j5119
639H847l5211M364L2984R507k7825k0840K2174K6484j1496k8057J465L2401Q254
652B3051l1486j1352K7436J3927j8816j3713J5182R310j5019k564J3550n357j1506
665g357O426J0186r131j4236J1489J3496j3296j0807Q819O090k747k478J285k344
679d605p36J0669P70j5456L723J7861k233j6941l68J8132K724j6145j123R378
693E650j228k154k76j864k934K147O217o724j0709R801R697r677r472M510J0633
$$ y = [39612, 4652, -35426, -10148, 26706, 9610, -21750, -13195, 1821, 138, 4569, 997, -19277, -16225, 17736, 23040, -22003, -33982, 20777, 40971, -12065, -38738, 5506, 41591, 11333, -27035, -10739, 21017, 19419, -1398, -15013, -5798, 14875, 15547, -7304, -23784, -4519, 23966, 8847, -26364, -22000, 10984, 20491, -7334, -28174, -6000, 20484, 8988, -19069, -17604, 14797, 23051, -8435, -19787, 7649, 21576, 2760, -10953, 4229, 13539, -1480, -4044, 9506, 4149, -7357, -931, 9255, 124, -14112, -2623, 10873, -2423, -13230, -4411, 1679, -1068, -3546, -2261, -4605, -5341, 5328, 6098, -9358, -5635, 12226, 9993, -6948, -7316, 10816, 13540, -2605, -3728, 5650, 4422, 2268, 1992, 128, -2806, -659, 5558, -1166, -11875, -2074, 7623, -2054, -11526, -7016, 3617]
708C617p55r427L53N112L278J724p452k288J1383M201r419p696R754J2621j1070
723C936j2532J0757R414q210q864M429Q252n996p350M316J476j830J403k515j724
738e038J603K797k37n294K918O887n038l119N644J740j707o34L020j16n209M593
754B810O641p688n700O732N327n741q679N602Q673p727p367L336M210J206m810
769c175l496K612L225J760l968m530P298N649o490m132M390O836j399o898K283
784c5M394q36N75j333k975K468K951j589o127j572R156k80j0555r05P127K603
800C067o127n023N171L977k857j552j279K520N389k186n312J124P201K997q349
815a239k976J0191K217q189k065N674L632n781m590M624J461k530n49k452j93
$$ y = [3617, 2862, -6565, -6212, -1100, 2178, 3902, -3550, -5838, 5545, 9746, 327, -7369, 2385, 15006, 3936, -8596, 2161, 11575, 3365, -5499, -1070, 7182, 1186, -6164, -1848, -372, -2202, -799, -3314, -5038, -3435, -638, -875, -6169, -3251, 3636, -1402, -4521, 1123, 2863, 1156, 522, 3542, 3426, -1783, 2810, 9451, 1763, -3937, 2795, 8122, 2381, -6298, -696, 7977, 250, -7117, -3781, 429, 1635, -3175, -6671, -4059, -834, 926, -3042, -7572, -274, 5375, -1115, -5247, -857, 5979, 4580, -2318, -35, 4359, 3523, 4098, 2765, -210, 2258, 5209, 3620, -2507, -4079, 5077, 4797, -5758, -6663, 464, 3067, -3060, -8083, -2912, 1065, -1792, -3344, -4623, -2103, 3286, 1100, -4212, -3088, 4113, 7110, -1239, -4215, 5976, 8193, 4, -2061, 3613, 7245, 1464, -3126, 1498, 2959, 429, -120, -2572, -2765]
830b765K723l77k838k301L850L934o133l274O999J976l666r73L018K033k599J036
846F43L974l997j113N462k52m537j131N356J654p239j478N861r72l048k18q86
862a921l47O98J690k206n133N053N372o012m083M896M776j684m141J767L112n11
878A326K584j161n564L965P365l298r089O04J1932l86j3905L99J0001m29o524
893b180k484K943J002p85J746m702l607Q774M161r060n016Q631Q572p928p717
908g650Q162N849m677j643J270N83L76J356O03n157p27P637k128o582R51K874
924A097o52j134J15k407l685O752O099j2107o626J4443P081j2601q781J2944R993
939A0531j1676n573R479J059l855M203J279q667r12J5348P51k2493O8K4698q95
$$ y = [-2765, -42, -419, -3257, -5558, -1708, 2226, -3907, -7181, -182, 1794, -1872, -2845, 173, 2206, -393, 643, 4617, 620, -493, 4969, 4717, 180, -951, 4405, 6059, -1180, -2658, 3203, 2231, -817, -1035, -1921, -2268, -1570, 120, -2086, -7219, -2166, 3206, -2806, -6889, -1993, 2783, 1099, -3042, -1275, 1837, 1326, 3910, 2749, -2815, 1150, 8515, 5217, -3872, -3268, 8664, 8278, -5627, -5228, 4773, 4344, -2180, -4664, -1721, -719, -1504, 242, -4460, -8067, 707, 4868, -4192, -9208, -577, 7995, 67, -7650, 512, 6361, 1684, 41, 1311, 1894, 2270, 3626, 4229, -928, -1655, 5982, 3854, -2728, -1777, 1097, 445, -689, -574, -2981, -6666, 86, 6185, -5922, -12548, 1895, 8976, -3625, -12406, 538, 10531, -1145, -6718, 2761, 3820, -35, 4168, 5447, -3220, -4132, 11216, 11967, -10526, -10458, 14240, 13345]
954A3345k4616k189K2297L221k0778k786J4556m77o633J434N35k989K849P773
968E542n263j1468Q447J4307q118j2343N300J2799j538j0791j39P424J754j888
982D025n432j683P497J365q349k149O486J592q433P15R713p077j0103J2183R429
997I779j4799j0299J7142J2736j9770j0889K2038P424j8510k846J6003j151j3634
1010f776Q325J2687j7309j0417K4893P131k9053p616L0659P919l3235p843L0969
1023A0334M732k5501l331J7514J581j1351K629N428q412J625J3745o050j5371
1036a2428P834J8252n656j9165M539J8842k443j3907j073P990N983l969r451r14
1050e566R732M804j1317q874J2268P777j3184n110J1122J490j0281K268J0911
$$ y = [13345, -11271, -13460, 8837, 12058, -8720, -11506, 3050, 2573, -4060, -2626, -2091, -5080, -2231, 5542, 279, -11189, -2742, 11565, 3447, -8896, -3596, 9203, 7665, -3126, -3265, 4159, 5913, 4025, -1407, -3090, 4407, 5772, -2577, -4726, 1760, 3352, -5081, -4366, 5347, -1730, -11833, 350, 9779, -5020, -15319, 1823, 14559, -5211, -16100, 5938, 13362, -5148, -7994, 8009, 6858, -6776, 1549, 14236, -3073, -13490, 11403, 18534, -10519, -18135, 12524, 20443, -12792, -20635, 10334, 15066, -10435, -13766, 3748, 5329, -6022, -3393, 2035, -6377, -4752, 8993, 2943, -12428, -4594, 13658, 8002, -11163, -6624, 12218, 9775, -4132, -5205, 2785, 8768, 4799, -4652, -5566, 4166, 8970, -2347, -11221, 1047, 8824, -4360, -9470, 1652, 3142, -7139, -4871, 6040]
1063F040p027j0923J3991R563j7747o217K0121N641k0466k871K2220j321k1533
1076a0529P826J8030j2803j5380J6388J2519k0901j0998K4038O017k5333k311
1088a3437K2136p17j9535K907J6253o941j1244J1342N581j3549N74J5162k671
1101E861j5855N373J7491p350j5465R253J1395p615o575M305K859l397J307J618
1115C205p642J108J0761n293j2656O335J2326p307j2150Q049J0874j0584n832
1128h806J1605J199r697K956R414n923q602J1372P723j5165l838J7445m14j6310
1142g041K504J5454n020j5836Q975J1766j2961p564J3424K587j3640K87J3408
1155F343m208j3954R341J1253j2449p225J4000N079j3811k534J5715n94j4481
$$ y = [6040, -987, -11910, 2081, 11644, -6103, -12320, 7801, 13442, -7024, -9895, 12325, 11004, -10529, -2703, 15327, 2524, -12856, 3532, 16051, -4850, -15848, 8190, 14207, -11126, -13437, 8699, 7982, -11553, -8646, 7607, 666, -10578, 764, 6345, -7204, -6630, 8532, 5861, -9994, -4621, 12870, 5520, -9945, -692, 10703, 3088, -3487, 818, 3677, 280, 1587, 3205, -4437, -3329, 7432, 2139, -10517, -4182, 8144, 837, -11313, -3264, 7610, -2974, -8806, 2799, 3998, -5699, -2743, 6671, 748, -7854, 3518, 11241, -3924, -7762, 9683, 9269, -7041, -4537, 10917, 5897, -9939, -964, 10802, -2159, -9723, 3701, 6288, -7352, -7065, 6343, 2135, -11819, -2478, 8775, -3674, -10899, 3101, 8180, -5631, -8165, 7550, 6956, -7525]
1168g525N643J1712q280o794Q700M335j0042j454J0974k963j1509O778Q478r682
1182a629o440R477M139j0917j813J1834k226j1458O393Q391p348o000Q862M804
1196F069j0056j672J1766j580r548N286O780o286m476P693L013j0550O27J0725
1210G791m966r810O647P156q051o728Q782M525j1204q35J1198l573r071O071P553
1225E485p288o128R978N185j1256j433J1831j325r303L526P677m909o110P223
1239C153L635r326p00R501l345q534L490P632n504p406O827N067q446j732P916
1254B228j141o723K733P087m686n940Q199M067q484j081Q253J58o979J230O554
1269E475l117n393N925J745o995O49O391k517p303L510O929o339n965O909L863
$$ y = [-7525, -1882, 9830, 1550, -5244, 3456, 7791, -2251, -3705, 7269, 4306, -7203, -425, 8053, -1629, -8069, 1408, 5547, -5370, -7183, 4651, 2425, -9033, -2640, 5751, -1597, -7597, 1265, 6069, -3987, -5659, 6107, 4527, -5021, 265, 7045, 759, -3717, 3976, 6989, -3561, -2934, 7791, 2825, -6985, -338, 6818, -1233, -7961, 821, 5346, -5858, -6693, 4505, 932, -8139, -2068, 5485, -1803, -7931, 2047, 7232, -4024, -5457, 6374, 5049, -4254, -728, 6949, 2040, -4070, 3153, 6788, -2538, -3238, 6263, 2918, -5616, -2126, 5506, 2, -7404, -577, 4490, -3956, -5688, 2228, 1087, -5636, -2903, 4184, -502, -6442, 1757, 5824, -2660, -3741, 4512, 4670, -2309, -1079, 5475, 2358, -3035, 2890, 4635, -2360, -1711, 4680, 2163, -5140, -1630, 5299, -1040, -7005, -96, 3767]
1284C767p696j341O368L83n861J371O533m087l804O247K095n795k44O486p28o107
1300b413K257O387m597m867N781K065n810j315N621n53o509J487O056m599m825
1315e834N810K426n737j507N913J264o594R16P101k864m869M410L683l746k353
1330a981M603J504n491Q48N418l007l413K672K090l382k208L707Q69m857M74M062
1346A908l065k657K892J621k827j624L866J020l927J503L482k525j231K902J037
1361B375k665l33M279r13n030L208L861m057k915L164K808m508k871N331M02n434
1377c298Q90L598j692l383K042L555l719k317M832J670m736M06L568N14k946Q1
1393i35L638j086j993K168N17k053N84R34l35j884N06J851j864j436J749o74j090
$$ y = [3767, -3929, -5270, 1098, 1481, -4380, -3009, 3524, -563, -4367, 1880, 3975, -1820, -2064, 4422, 3694, -2413, -156, 6231, 1634, -3233, 2548, 4613, -1197, -2512, 3109, 2556, -3953, -2466, 3590, -1009, -5834, -24, 2402, -3335, -4842, 1071, 2335, -4259, -3343, 3758, 894, -3975, 435, 4118, 372, -1981, 2622, 4126, -1365, -517, 4901, 1894, -1519, 1153, 3243, -139, -2347, 1360, 2229, -2628, -2154, 1908, -1157, -3814, -922, 699, -2128, -3752, 114, 1134, -2793, -1290, 2192, -333, -1564, 1338, 2375, -290, -623, 3656, 2743, -2287, 921, 4782, 725, -2190, 974, 3782, -726, -3597, 1734, 2136, -3298, -2408, 1190, -502, -3885, -1843, 1712, -2007, -4324, 508, 2178, -2558, -2152, 1416, 1930, -1016, -935, 2703, 1617, -376, 1792, 2309, 256, 840, 1774, 1439, -445, 61, 1912, 48, -1388, 361, -313, -1403]
1410a403M09K01o31q80J801J030l518N23L700p64k786J240K768l27k395J422K434
1427B824k427o65K903n12k754P44L122j210m653J829M048k549l844J623K794j353
1443h0l190J118L016k147j066J703K22n00r4J274M62j889Q60K374o88j195j2J714
1461A882Q38k067j108K173N99j602j451P84J720k037j753K105O9j598o49J396
1477f99R89k960k60L978o45l397J142L560k70l688O98M711j362l203K065K576
1493C235j830k236K017K234l360j932L986M46m570n85M279L70m625j200M967L5
1509A231m437P2L455P05l057n23L535j00k634J351J999p25j770J532K276k375
1525E35j597K655J381k492j731J968K214k633k595K401J578k584j677K039J189
$$ y = [-1403, -994, -793, -1424, -2304, -503, 527, -2991, -2468, 1232, 468, -2318, -1078, 1690, 1363, -1032, 390, 2824, 397, -268, 2635, 2123, -631, 113, 3235, 2025, -2628, -799, 3249, 700, -3144, -1521, 1273, -80, -3270, -2152, 864, -1283, -2349, -646, -424, -924, -1018, 256, 718, -1171, -311, 2063, 1375, 180, 168, 1882, 2720, 653, -455, 1718, 2317, 715, -736, 48, 1768, -269, -2022, 83, 152, -1446, -2095, -699, 290, -2670, -2930, 1048, 403, -2994, -1852, 1708, 1438, -2250, -1552, 3159, 1797, -1406, 659, 3235, 1405, -831, 1186, 3420, 60, -1872, 2114, 2560, -2010, -2595, 1684, 2054, -2571, -3771, 1196, 1231, -3206, -3134, 321, 1026, -2031, -2554, 981, 881, -1753, -402, 1597, 872, -898, 634, 2910, 535, -1062, 1593, 2974, 482, -1249, 719, 2933, 300, -2295, 106, 1684, -900, -2577, -538, 651]
1540F51j835j562K782N19l079K07K735K01k112J19L046j26l401J614L097j342
1556A514k082R72K583j214l194K135K312l158j518K308J273k918j531L092P96
1571A370l653j75K631m0j908o83K480L97k446Q61K104p36o07P03J150p56j105
1588d13J740P87j630l00R32N45p44j472P16J313j806r70Q29M86n65j669J152J373
1606C04j790o44J501M26o78m88J362R50j629k14K227l94q96l9J875j1k013Q71
1624G20J727j734j092J093P07r53j562J273P79k354j28J642p15n13k28P83K35
1641c20j102J53J694q02k72N34L54J52l91O91P87p68M1K81j11N03p74o38R35m67
1661D80m77k99J4N60q90o12Q64k43q04J75Q55l45o22L25J091m51q97J336O83l53
$$ y = [651, -1184, -2746, 36, 555, -2524, -2317, 418, 619, -1493, -1374, 1672, 1546, -1855, -241, 2856, 1514, -568, 404, 2987, 1773, -1421, 714, 3026, -132, -1650, 658, 1931, -987, -2518, 574, 1370, -2283, -2458, 173, 133, -1775, -2458, 22, 419, -2027, -1166, 938, 202, -405, 298, 1448, 692, -413, 1327, 2114, 484, 184, 1116, 1661, 917, -555, 161, 1474, -332, -1302, -473, 13, -552, -2221, -1069, 304, -1486, -2130, -629, -203, -881, -1369, -7, 943, -686, -900, 1327, 933, 37, -2, 1873, 1862, -151, 720, 2447, 713, -379, 714, 1421, 468, -1094, 179, 958, -1396, -1524, 118, -597, -1110, -1338, -555, -320, -1422, -1269, 425, -377, -649, -115, 239, 391, 0, 691, 1478, 710, 751, 1032, 921, 1424, 650, 12, 947, 480, 3, -296, -282, 278, -612, -1224, -360, -603, -1407, -1232, -377, -722, -1344, -1019, 72, -379, -1276, 60, 743, 390]
1681C90m98N04J267j050l64J274j79r68L46P37o13o03l20J016o68j204Q14k45
1699c64l12j25p01R92k34n91R30j56J08%j8O31K0k03P36J10Lr5k49J044l29q60
1721C37N21N13r95m13K26O99q45j212R23J99j073J3M91P8p68R0P98M2r81O72J203
1742E18n79o01O16J006M6j205R17N48m88k5K09J87n50k15L15k18q39N08j13l10
1762b73j29n86K14L49m70L0N1M5J53l23K14Q91l48j8M52K5N91m06J06R35o73n15
1784C15P10K08n74o90O50N36j460j71Q63n04n15L0J58K34r13o3Q39n20j42L53
1804f56K16K50p4J66P98l70q0O60k59J14J18j79R5L09m86J93n48J00j40o88M45
1825a6J46r10P8J46K61o65m31J031N9j091M67R30j08m43N2J431l01j226J428O82
$$ y = [390, -108, 396, 1663, 613, 249, 1523, 1344, 376, 722, 1459, 846, 243, -77, 939, 271, -933, -119, -364, -676, -801, -1502, -510, -744, -1335, -405, -561, -453, -453, -471, 160, 180, -23, 713, 823, 826, 731, 482, 1526, 1197, 337, 858, 1371, 376, -37, 189, 888, 43, -1169, -246, -47, -1120, -1107, -616, -538, -1306, -1216, -418, -376, -1357, -685, 518, -61, -662, -46, 960, 1006, -199, 718, 1266, 778, 753, 962, 1149, 599, 384, 699, 481, -358, 150, 37, -273, -402, -988, -774, -425, -895, -865, -814, -769, -616, -939, -725, 166, -182, -200, 252, 277, 868, 462, 568, 1503, 830, 315, 1025, 1233, 659, -31, 619, 1155, -305, -476, 387, -117, -632, -602, -444, -210, -1123, -1186, -347, -867, -1009, -656, -440, -190, -264, -98, 700, 330, 250, 910, 651, 765, 883, 704, 799, 1108, 622, 815, 267, 367, 227, -461, -16, 130, -780, -702, -556, -295, -960, -1391, -360, -301, -1392, -925, 5, -103, -546, -494, 937, 636, -590, 838, 1520]
1845A520r19n21J027M40j121p98J447L26j965J73J141k02j000p03J089kj436P11
1863g93R56r24k27J43N21pr04J394K38o10L25L40J78J60l10K52J85j93n4k06L26
1884G90j3r48J48P19p63n17pN36n2j449N88J073r26m46O47P42o36r01J441R94
1904A020j282n15J711R3j037o3J480L9j826P48J480j139j133P84N15p93j193Q10
1922c01R28j516n71J235P2p01l81N46P36r13j25R05Nk01J83L80M98l01k26N30
1942G82K14j26o41K26Q43p92p94Q45K37p15o03M19N35j174p87J495o8j230K46
1961a088R17J27j125Q5J725o53j158R07J368o92j018J061J097j135o42J285O95
1978A756j841Q4Q64Q5j155m41J164k05j385O10N60m20q11J60R82n93m63M89L33
$$ y = [1520, 601, 80, 1107, 1547, 426, -372, 1075, 1401, -564, -391, 750, 548, -452, -1155, -66, -68, -1504, -793, 163, -761, -988, -845, -324, -331, -1235, 159, 397, -213, 112, 452, 630, 790, 480, 732, 917, 724, 670, 464, 790, 777, -171, -23, 696, -67, -584, -591, -55, -107, -1556, -968, 105, -821, -1267, -620, 122, -514, -1415, 26, 1020, -262, -777, 934, 1027, -10, -73, 1407, 1446, -380, 368, 1848, 709, -424, 360, 875, 82, -1111, -301, 627, -889, -1460, -225, -153, -854, -1235, -689, 47, -866, -991, -86, -81, -282, -99, 281, 779, 478, 252, 782, 996, 870, 229, 455, 1298, 506, -288, 557, 794, 79, -524, -105, 430, -744, -1531, -36, -104, -1334, -1088, -171, -44, -1169, -1084, 641, -12, -1170, -263, 1105, 413, -605, 456, 1553, 418, -224, 1061, 1756, -85, -1, 863, 948, -207, -648, 516, 311, -1074, -464, 96, -324, -1135, -975, 7, -586, -1049, -560, -227]
1997b27n1L4O9M56K87p02N96K47r8j42l9N09L26j218J05O07l93o36K48N52q6j766
2019a322O70J061r11q48N91P22m63j290J736P00j636r7J720M6j103l7J580n7j240
2038a78L91J491j296l41M96M46k91j510J263R9r58k16Q82o36l72j75P31k52n68
2057i94M29L78k81O0j7K52n4L11J34k45M67J44j73k96Q90m9p21q0O27N2q09n1
2079b6Q31j087n59Q88j23n31m87P82M50j073l32J491n62r25P38R08j85j323J179
2098E4J176j488k57J571J83j283K10J003l66j120N35Q32q71r13R75J9n56m53O57
2117i2j26n92P9M66l46k63M92N4k10K70O08k57p28J201R1p44L66P06l18m87L6
2138B06J060o65j175J442J21j358j70J331m94j347K4J529r19j476J690O38j198
$$ y = [-227, -278, -244, -175, 281, 568, -134, 462, 709, 611, 469, 430, 939, 1265, 47, 152, 759, 366, -270, -22, 530, 444, -1322, -652, 409, -502, -1350, -759, -37, -500, -1790, -54, 646, -990, -1087, 633, 679, -424, -461, 1119, 1062, -178, 213, 1704, 408, 67, 563, 1009, 718, -792, 471, 570, -388, -604, 278, -358, -730, -905, -174, -426, -994, -565, -187, -468, -408, -425, -173, -227, 84, 218, -27, 440, 584, 411, 115, 1005, 956, 235, 155, 782, 834, 25, -26, 805, -282, -841, 47, -76, -607, -1094, -312, 138, -935, -1267, 224, -338, -1263, -525, 383, 198, -1125, 54, 1230, -258, -515, 1056, 1239, -44, 166, 1169, 803, -317, 218, 1050, 179, -734, 241, 260, -296, -749, -92, -218, -810, -731, -265, -611, -874, -382, -328, -538, -268, 340, 83, -645, 556, 647, -97, 269, 975, 657, 170, 206, 1266, 601, -574, 868, 989, -369, -539, 792, 298, -1049, -1025, 504, -415, -1891, -201, 437, -761]
2155g61l86J393M72j609O3J790o81q21P65J059q38q71J083N79r32n30J145j58
2173G62j221N90M44l61q13M71K53q49j46J007n66o43P12K15k45l56O46J44p68
2192g24N15R71o12l94Q91L92j025l73J283K53j488M15Q54m18j084J028M36j211
2210b91q88J602J59j905L02J452p70p83O01J016r58p99J355P56j442J0J492k53
2228F56j008L90J181o55o49N45R03j010m57P42J0q93p2Q17l10r33P19L6p89o2
2248h39P26n13k5j05R54n81p49J339M9p64P02O88p49l21N14Q40p17p26J198j88
2268G33p22j18R45m44r49J66J116r17p60P03L54j004J29N14K74r40L84J007o79
2287b08q51J143M92q55M2O43N23r39J52P90m27n30M57Q0m77j34O01k75o84K20
$$ y = [-761, -1147, 246, 718, -891, -828, 962, 281, -540, 225, 1284, 446, -425, 658, 1237, 305, -225, 920, 762, -459, 131, 575, 214, -599, -128, 125, -724, -870, 137, -429, -1072, -360, -145, -390, -746, -100, 44, -724, -209, 762, 150, -244, 647, 1039, 14, -359, 924, 1177, -311, 104, 958, 540, -544, 484, 920, -291, -1179, 423, 582, -1323, -1021, 431, -339, -1122, -521, 495, -463, -1262, 93, 849, -593, -583, 909, 656, -352, 38, 1219, 564, -85, 460, 1363, 353, -104, 638, 648, -245, -317, 500, 190, -743, -24, 12, -777, -839, -113, -626, -651, -756, 198, -383, -1132, 207, 256, -508, 194, 882, 133, -188, 326, 1166, 449, -277, 921, 733, 11, -107, 838, 394, -555, -389, 727, -190, -950, -247, 107, -897, -768, -254, 20, -920, -536, 471, -208, -1059, 84, 576, -279, -237, 406, 929, -10, 142, 932, 505, -25, 432, 512, 35, -99, 502, 227, -457, -237]
2307b37P31j083j04N47J68o10k17P25p1q62O56Q21j039J3P01O71j169J39J171
2326I51m71m07J97R87p19n40M30M06p76m49P27m4p15k42R82m63m88N1K71K5m76
2347g63M51K44n55K47K6L52k96L20K93k31l1M40R4m54L24J64k22j67K31K7m35
2368E9m5M70p60p34R84M7k23o02P18K12r59L76O43k04q69R05M31m47l81O10M72
2389G03n50l05O12J51k92k73P79l8q69J54P45p48l92M93J1l02k32K64K07o77j44
2410g03O72m2m76J40J65k5L15Q6J75j72p6K45j28%O1J32k25J66j88J90j63K35
2432C84k31m06L70R2l73k68K6L87o08o2N85K11o86M68J18j58k23K15M64j04m78
2453b77L90P00m58m10O68Q6n52j33M60Q5r90N64J27Q2l95j40L03l59l80O34k89
$$ y = [-237, 494, -589, -693, -146, 22, -588, -805, -80, -151, -1013, -357, 464, -575, -562, 139, 810, -359, -220, 951, 480, 73, 270, 1257, 538, -2, 428, 834, 58, -391, 336, 292, -423, -665, 317, -146, -634, -583, -312, -287, -763, -312, -68, -623, -376, -350, 2, -294, 26, 319, 88, 57, 497, 591, 137, 461, 625, 403, 236, 467, 494, 59, 14, 484, -276, -1010, -26, 21, -202, -804, -86, 126, -833, -457, 186, -18, -887, 18, 449, 2, -379, 231, 703, 153, -152, 460, 611, 319, 46, 825, 787, -82, 72, 817, 69, -323, 170, 181, -121, -353, -89, 118, -559, -703, -31, -73, -549, -409, -244, -269, 46, 132, 307, 135, 59, 304, 176, 176, 237, 369, 144, 310, 122, 312, 149, 384, 153, -253, 117, 209, -164, -432, -406, -19, -627, -689, -104, 107, -579, -111, 7, -151, -374, -159, 305, 201, -277, 113, 813, 355, -55, 613, 699, 147, 14, 474, 559, -431, 133, 260, 342, -53, -193, 110, -249, -629, 5, -284]
2474b84k69K56k73M92k72J21K42k10P1L18p6J52K8j67J39J96k52J55j26N4J49
2495D44m31L4J38n7m16J10Q8j63j56j36M63m07J08J01P6k59l1N59m2p1k81O32
2517C03j28L6Q3K91j81l74K48L37m80j7J13Ok70N6k7o2l43J62K82m32j01J20j16
2540d94M4M1M74l75j15L95J76k20R7K70j21J39O3r9P2k48K78j57j10J70j57J85
2562C08l52pP5j54j20k4K22j34j90J30m7J29OJ73k78J25J26n0k8M32l18K95M2
2585C61j57K77k90L17N6n21j21L11j49r5j03o1J05k36jmj5j2j29L03M5m68N18
2608f9K24l98K46M2J69o5L9j3L29m48K45j7k9K2J00j43p9k92n6L39j79j59K45
2631E3m5k33j82J45J05j94J00p9J83j58k1L81NNK66O6k99J19j70L24R2l83j16
$$ y = [-284, -553, -297, -570, -78, -350, -229, 13, -197, -126, 192, 116, 268, 296, 129, 268, 464, 212, 367, 241, 295, 444, 13, 47, 185, 128, -288, -178, -90, -253, -409, -545, -82, -489, -381, -280, -204, -463, -494, 65, 23, -48, -329, 303, 175, 211, 294, 585, 404, 30, 278, 615, 135, 118, 231, 237, -33, 23, -4, -66, -409, -247, 35, -397, -498, -378, -494, -450, -409, 65, -310, -425, -30, 146, -74, 23, 293, 172, 311, 374, 275, 347, 99, 377, 220, 110, 280, 123, 308, -44, -51, 24, -130, -250, -274, -52, -186, -376, -246, -293, -164, -158, 15, -263, -138, -12, -62, -90, 342, 24, 319, 361, 204, 481, 191, 508, 564, 43, -78, 233, 84, -11, -114, -175, -70, -306, -307, -311, -326, -338, -467, -164, -119, -587, -69, 155, -243, 3, 45, 214, 149, 188, 175, 504, 56, 301, 284, 255, 277, 377, 234, 155, -137, -193, 146, -33, -192, 53, 8, -225, -407, -262, -157, -351, -251, -330, -147, -305, -326, 55, 60, 65, 331, 397, 98, 217, 47, 371, 463, 80, -36]
2654c6K33K96l62J51l82M93m81k15K55j22j94L4K91p7j63J30K96k14l49L48K17
$$ y = [-36, 197, 493, 131, 282, -100, 393, -88, -303, -48, -170, -364, -330, -39, -116, -279, -149, 147, -67, -416, -68, 149]
$$ [...]
8191B14
##END NTUPLES=NMR FID
##END=
