##TITLE=1H_Pr 4432-20
 CDCl3, 8 sc, 
 5.2.2020
##JCAMPDX= 6.0         $$ Bruker NMR JCAMP-DX V2.0
##DATA TYPE= NMR FID
##DATA CLASS= NTUPLES
##ORIGIN= UXNMR, Bruker Analytische Messtechnik GmbH
##OWNER= root
$$ XWIN-NMR		Version 3.5
$$ Wed Feb  5 14:08:57 2020 Russian Standard Time (UT+4h)  she@DPX200
##.OBSERVE FREQUENCY= 200.1315
##.OBSERVE NUCLEUS= ^1H
##.DELAY= (6, 6)
##.ACQUISITION MODE= SIMULTANEOUS
##.ACQUISITION SCHEME= undefined
##.AVERAGES= 8
##.DIGITISER RES= 18
##SPECTROMETER/DATA SYSTEM= spect
##.PULSE SEQUENCE= zg30
##.SOLVENT NAME= D2O
##.SHIFT REFERENCE= (INTERNAL, D2O, 0, 15.7039)
##AUDIT TRAIL= $$ (NUMBER, WHEN, WHO, WHERE, WHAT)
$$ ##TITLE= Audit trail, XWIN-NMR		Version 3.5
$$ ##JCAMPDX= 5.01
$$ ##ORIGIN= Bruker BioSpin GmbH
$$ ##OWNER= she
$$ F:/spectra/data/she/nmr/H-F/1/audita.txt
$$ ##AUDIT TRAIL=  $$ (NUMBER, WHEN, WHO, WHERE, WHAT)
(   1,<2020-02-05 14:07:45.79 +0400>,<she>,<DPX200>,
      <created by zg, POWCHK disabled, PULCHK disabled
       configuration hash MD5:
       00 E9 B6 7A A2 85 ED C7 34 08 36 98 17 FE 4E 26
       data hash MD5: 16K
       D6 AA FB 88 E2 3A 04 02 98 07 71 2E AD 1C 89 50>)
$$ ##END=
$$ 
$$ hash MD5
$$ 93 DC B3 86 C5 66 87 91 D6 77 F8 70 3F E4 67 FD
##$RELAX= 
##$RELAX= 
##$RELAX= 
##$RELAX= 
##$RELAX= 
##$RELAX= 
$$ Bruker specific parameters
$$ --------------------------
##$DU= <F:/spectra>
##$EXPNO= 1
##$NAME= <H-F>
##$PROCNO= 1
##$TYPE= <nmr>
##$USER= <she>
##$AMP= (0..31)
100 100 100 100 100 100 100 100 100 100 100 100 100 100 100 100 100 100 
100 100 100 100 100 100 100 100 100 100 100 100 100 100 
##$AQSEQ= 0
##$AQ_mod= 1
##$AUNM= <au_zg>
##$AUTOPOS= <>
##$BF1= 200.13
##$BF2= 200.13
##$BF3= 200.13
##$BF4= 200.13
##$BF5= 200.13
##$BF6= 200.13
##$BF7= 200.13
##$BF8= 200.13
##$BYTORDA= 1
##$CFDGTYP= 0
##$CFRGTYP= 5
##$CHEMSTR= <none>
##$CNST= (0..31)
1 1 145 1 1 1 1 1 1 1 1 1 1 1 1 1 1 1 1 1 1 1 1 1 1 1 1 1 1 1 1 1 
##$CPDPRG= <>
##$CPDPRG1= <>
##$CPDPRG2= <>
##$CPDPRG3= <>
##$CPDPRG4= <mlev>
##$CPDPRG5= <mlev>
##$CPDPRG6= <mlev>
##$CPDPRG7= <mlev>
##$CPDPRG8= <mlev>
##$CPDPRGB= <>
##$CPDPRGT= <>
##$D= (0..31)
0 1.2 0 0 0 0 0 0 0 0.06 0 0.03 0 0 0 0 0.0002 0 0 0 0 0 0 0 0 0 0 0 0 
0 0 0 
##$DATE= 1580897265
##$DBL= (0..7)
120 120 120 120 120 120 120 120 
##$DBP= (0..7)
150 150 150 150 150 150 150 150 
##$DBP07= 0
##$DBPNAM0= <>
##$DBPNAM1= <>
##$DBPNAM2= <>
##$DBPNAM3= <>
##$DBPNAM4= <>
##$DBPNAM5= <>
##$DBPNAM6= <>
##$DBPNAM7= <>
##$DBPOAL= (0..7)
0.5 0.5 0.5 0.5 0.5 0.5 0.5 0.5 
##$DBPOFFS= (0..7)
0 0 0 0 0 0 0 0 
##$DE= 6
##$DECBNUC= <off>
##$DECIM= 24
##$DECNUC= <off>
##$DECSTAT= 4
##$DIGMOD= 1
##$DIGTYP= 9
##$DL= (0..7)
0 120 120 120 120 120 120 120 
##$DP= (0..7)
150 150 150 150 150 150 150 150 
##$DP07= 0
##$DPNAME0= <>
##$DPNAME1= <>
##$DPNAME2= <>
##$DPNAME3= <>
##$DPNAME4= <>
##$DPNAME5= <>
##$DPNAME6= <>
##$DPNAME7= <>
##$DPOAL= (0..7)
0.5 0.5 0.5 0.5 0.5 0.5 0.5 0.5 
##$DPOFFS= (0..7)
0 0 0 0 0 0 0 0 
##$DQDMODE= 0
##$DR= 18
##$DS= 0
##$DSLIST= <SSSSSSSSSSSSSSS>
$$ [...]
##$SUBNAM2= <"">
##$SUBNAM3= <"">
##$SUBNAM4= <"">
##$SUBNAM5= <"">
##$SUBNAM6= <"">
##$SUBNAM7= <"">
##$SUBNAM8= <"">
##$SUBNAM9= <"">
##$SW= 24.9337058887773
##$SWIBOX= (0..15)
0 0 2 0 0 0 0 0 0 0 0 0 0 0 0 0 
##$SW_h= 4990.01996007984
##$TD= 16384
##$TD0= 1
##$TE= 0
##$TE2= 300
##$TE3= 300
##$TEG= 300
##$TL= (0..7)
0 120 120 120 120 120 120 120 
##$TP= (0..7)
150 150 150 150 150 150 150 150 
##$TP07= 0
##$TPNAME0= <>
##$TPNAME1= <>
##$TPNAME2= <>
##$TPNAME3= <>
##$TPNAME4= <>
##$TPNAME5= <>
##$TPNAME6= <>
##$TPNAME7= <>
##$TPOAL= (0..7)
0.5 0.5 0.5 0.5 0.5 0.5 0.5 0.5 
##$TPOFFS= (0..7)
0 0 0 0 0 0 0 0 
##$TUNHIN= 0
##$TUNHOUT= 0
##$TUNXOUT= 0
##$USERA1= <user>
##$USERA2= <user>
##$USERA3= <user>
##$USERA4= <user>
##$USERA5= <user>
##$V9= 5
##$VALIST= <valist>
##$VCLIST= <CCCCCCCCCCCCCCC>
##$VD= 0
##$VDLIST= <DDDDDDDDDDDDDDD>
##$VPLIST= <PPPPPPPPPPPPPPP>
##$VTLIST= <TTTTTTTTTTTTTTT>
##$WBST= 1024
##$WBSW= 4
##$XGAIN= (0..3)
0 0 0 0 
##$XL= 0
##$YL= 0
##$YMAX_a= 226782
##$YMIN_a= -195572
##$ZGOPTNS= <>
##$ZL1= 120
##$ZL2= 120
##$ZL3= 120
##$ZL4= 120
##$ABSF1= 10
##$ABSF2= 0
##$ABSG= 5
##$ABSL= 3
##$ALPHA= 0
##$AQORDER= 0
##$ASSFAC= 0
##$ASSFACI= 0
##$ASSFACX= 0
##$ASSWID= 0
##$AUNMP= <proc_1d>
##$AZFE= 0.1
##$AZFW= 0.1
##$BCFW= 1
##$BC_mod= 2
##$BYTORDP= 1
##$COROFFS= 0
##$CY= 11.3945322036743
##$DATMOD= 1
##$DC= 2
##$DFILT= <>
##$DTYPP= 0
##$F1P= 16.9975609425685
##$F2P= -3.02152046262296
##$FCOR= 0.5
##$FTSIZE= 0
##$FT_mod= 4
##$GAMMA= 1
##$GB= 0.15
##$INTBC= 1
##$INTSCL= 1
##$ISEN= 128
##$LB= 0.24
##$LEV0= 0
##$LPBIN= 0
##$MAXI= 10000
##$MC2= 0
##$MEAN= 0
##$ME_mod= 0
##$MI= 1.114404
##$NCOEF= 0
##$NC_proc= 0
##$NLEV= 6
##$NOISF1= 3.799351
##$NOISF2= 2.8
##$NSP= 1
##$NTH_PI= 0
##$NZP= 0
##$OFFSET= 15.70392
##$PC= 1
##$PHC0= -9784.919
##$PHC1= 13.80081
##$PH_mod= 1
##$PKNL= yes
##$PPARMOD= 0
##$PSCAL= 0
##$PSIGN= 0
##$REVERSE= no
##$SF= 200.130013532006
##$SI= 16384
##$SIGF1= 3
##$SIGF2= 2
##$SINO= 400
##$SIOLD= 16384
##$SREGLST= <1H.CDCl3>
##$SSB= 0
##$STSI= 0
##$STSR= 0
##$SW_p= 3612.71676300578
##$SYMM= 0
##$S_DEV= 0
##$TDeff= 0
##$TDoff= 0
##$TI= <>
##$TILT= no
##$TM1= 0
##$TM2= 0
##$TOPLEV= 0
##$USERP1= <user>
##$USERP2= <user>
##$USERP3= <user>
##$USERP4= <user>
##$USERP5= <user>
##$WDW= 1
##$XDIM= 8192
##$YMAX_p= 0
##$YMIN_p= 0
$$ End of Bruker specific parameters
$$ ---------------------------------
##NTUPLES= NMR FID
##VAR_NAME=  TIME,          FID/REAL,        FID/IMAG
##SYMBOL=    X,             R,               I
##VAR_TYPE=  INDEPENDENT,   DEPENDENT,       DEPENDENT
##VAR_FORM=  AFFN,          ASDF,            ASDF
##VAR_DIM=   8192,          8192,            8192
##UNITS=     SECONDS,       ARBITRARY UNITS, ARBITRARY UNITS
##FACTOR=    0.0002004,     1,               1
##FIRST=     0,             0,               0
##LAST=      1.6414764,     0,               0
##MIN=       0,             -195572,         0
##MAX=       1.6414764,     226782,          0
$$ Real data points
##PAGE= N=1
##DATA TABLE= (X++(R..R)), XYDATA
$$ [...]
1974c13j75o0l98N52M29n77n13q4P94K18l06m75J52M38N77n04j018Q13L59J54
$$ -313 -488 -548 -946 -394 35 -542 -1055 -1139 -345 -127 -433 -908 -756 -318 259 -245 -1263 -450 -91 63
1994F3r35j86M34N05N4q35L59N44P8n53j62L28P42l81l58l62J027M9m13l65O2
$$ 63 -872 -1058 -624 -119 -65 -900 -541 3 81 -472 -634 -306 436 55 -303 -665 362 411 -2 -367 -305
2015c05J065j07n21q99O72P80k80o71k22P11P00n96o60N73N51k93o91K9Q74L88
$$ -305 760 653 132 -767 -95 685 405 -266 -488 223 923 327 -333 240 791 498 -193 -164 710 1098
2035A098o54p86L11Q82J85j004m62Q01P98m54m90l74N17O34m15n85J70K82KJ99
$$ 1098 444 -342 -31 851 1036 32 -430 371 1169 715 225 -149 368 1002 587 2 172 454 456 655
2055F55n08k00M22O82p99mm5P54p80L92m83J97J38j4n01J64P20J47j069l75J001
$$ 655 147 -53 369 1051 252 248 203 957 177 569 86 283 421 407 -94 70 790 937 -132 -507 494
2076D94J02k30p01j54N45P83p22q44M8J126K40r23n14J91R25j12o60n75O29R65
$$ 494 596 366 -335 -489 56 839 117 -727 -679 447 687 -236 -750 -559 366 254 -406 -981 -352 613
2096F13p60n22J5Q07j77o60m17O69Q30l18j381L28R18J54r24k11N28M14j54o07
$$ 613 -147 -669 -654 153 -24 -684 -1101 -432 398 80 -1301 -973 -55 99 -825 -1036 -508 -94 -248 -855
2116h55j55R31J55p49m69M68N82J20p13l80R01J53k89l54J45P12j22o47k95R96
$$ -855 -1010 -79 76 -673 -1142 -674 -92 28 -685 -1065 -164 -11 -300 -654 -509 203 81 -566 -861 135
2136A35M4k83l14N1N18J70l87m10J67N83j49l07L9K32J56J51l05oL60Q2k72r4
$$ 135 179 -104 -418 -367 151 321 -66 -476 -309 274 125 -182 -143 89 245 396 91 85 445 527 255 161
2158A61J04R9K0j96L7k06M14J29m82l69N57M20K70o31k32L14L30j81l67l27P56
$$ 161 265 364 384 188 225 19 433 562 80 -289 268 688 958 327 95 409 739 558 191 -136 620
2179F20M65p66l76K74N79m9p04J7L57N03n50m01j5J172o50k98j67K96N89n15n05
$$ 620 1085 319 -57 217 796 747 43 60 417 920 370 -31 -46 1126 476 178 11 307 896 381 -124
2200a24O6N06L26q71k50L44N18m02l67j00P88l04k02l5q7P65m52q56K87N02j24
$$ -124 -58 448 774 -97 -347 -3 515 113 -254 -354 434 130 -72 -107 -194 571 119 -737 -450 52 -72
2221g2k06m46K86M68l60k26J59L55j45k6q58P93j61l4O7J37K8j77j66QJ00m0K3
$$ -72 -278 -724 -438 30 -330 -556 -397 -42 -187 -213 -1071 -278 -439 -473 -406 -269 -241 -418 -584 -576 -476 -516 -493
2244d93k51M11j62pj14K30K25n07R0j46N84L6m38j33L77L70j19n28L68K91j7k85
$$ -493 -744 -333 -495 -502 -616 -386 -161 -668 -578 -724 -140 -104 -542 -675 -298 72 -47 -575 -207 84 67 -218
2266b18k7K42N76o14l36J38P43j58o55J49L01K35m24k80L3P57j55l11k14P56K29
$$ -218 -245 -3 573 -41 -377 -239 504 346 -309 -160 141 376 -48 -328 -295 462 307 -4 -218 538 767
2287G67m65j67j09O49J13q85L79K66K54l13l29L57K29j86n38J01M03J75k42l11
$$ 767 302 135 26 675 788 -97 282 548 802 489 160 517 746 560 22 123 526 701 459 148
2307A48K05K39J48o72M8L61M6j03P6P3J66l4l43l67M41k37O5rj00L98m07j04K80
$$ 148 353 592 740 68 116 477 523 420 496 569 735 701 358 -9 432 195 260 251 151 549 142 38 318
2330C18n4N8l09k28L30K33n81J5M86Rn01k67N91L6k09l78K59m6J23n7k80K42m0
$$ 318 264 322 13 -215 115 348 -233 -218 268 277 -224 -491 100 136 -73 -451 -192 -238 -115 -172 -452 -210 -250
2353b50J48n78j59P92J94p10KM19q7P8n61PK64J87P5o69O83J21l97j42m49O17
$$ -250 -102 -680 -839 -47 147 -563 -561 -142 -229 -151 -712 -705 -441 -254 -179 -848 -165 -44 -441 -583 -1032 -415
2375d15L90l77m67N69M73k30o93J18J87L42m20K65l48M59J31m69n6L21K9j9J46
$$ -415 -25 -402 -869 -300 173 -57 -750 -632 -445 -103 -523 -258 -606 -147 -16 -485 -541 -220 -191 -210 -64
2396f4k87K67L6j49k64P62kl71PL26k4m84J77KK09j03K9K76k72L06k00J8J84p7
$$ -64 -351 -84 -48 -197 -461 301 299 -72 -65 261 237 -247 -70 -68 141 38 67 343 71 377 177 195 379 302
2420C02N8m24L95J87n09J00K05L51l51P0m01L77L83n55Q6j39K59j06p7J38q7M50
$$ 302 360 -64 331 518 9 109 314 665 314 384 -17 360 743 188 274 135 394 288 211 349 262 712
2442G12l75k65J50J62j1J05l63L59J61l55j24j66K10J89L8p29O06K54k97l98L25
$$ 712 337 72 222 384 373 478 115 474 635 280 156 -10 200 389 427 -302 304 558 261 -137 188
2463A88L1l07L9J68q9P2j19j14J26p7o7k23K82K2p9P7j8K4j52k64J02j67O6K18
$$ 188 219 -88 -49 119 30 102 -17 -131 -5 -82 -149 -372 -90 -68 -147 -70 -88 -64 -216 -480 -378 -545 -479 -261
2487b61n5K12m3j77k64K94J56l73mK38m0N8J76l87J25K9k1J78l24k39P01j60l89
$$ -261 -316 -104 -147 -324 -588 -294 -138 -511 -515 -277 -317 -259 -83 -470 -345 -316 -337 -159 -483 -722 -21 -181 -570
2510e70O8L45O3k51j87J31N45k28l58j1N18j50Q4n19j22O50M02o42j54N13k9k4
$$ -570 -502 -157 -94 -345 -532 -401 144 -84 -442 -453 65 -85 -1 -520 -642 8 410 -232 -386 127 98 74
2532G4l18K99M39n35K94l06K6M68q1J43q17L31K24j6J09j34K07o5K00l74O3P5
$$ 74 -244 55 494 -41 253 -53 -27 441 360 503 -314 17 241 225 334 200 407 342 542 168 231 306
2554C06M23k47o2j1L2K9j97k06M30j90r0q1K84j47K06j6k50J96K07l4l19k25N4
$$ 306 729 482 420 409 441 470 273 67 497 307 217 136 420 273 479 463 213 409 616 582 263 38 92
2577I2N31n9l70k04N23J8j96m78J86L36J8l88R2j40L47j5l91j98L01N74n96m28
$$ 92 623 564 194 -10 513 531 335 -143 43 379 397 9 101 -39 308 293 -98 -296 5 579 -17 -445
2599d45nL34J86r2O5k2J49k40m6m18O39k71K25j58m38M17n7K5m49K04K99o3l22
$$ -445 -450 -116 70 -22 43 21 170 -70 -116 -534 105 -166 59 -99 -537 -120 -177 -152 -601 -397 -98 -161 -483
2622d83M2Q9J07j89m06L26J45j28k5r9K94M27n78J85J22k24L94k35M8j80J94k4
$$ -483 -441 -352 -245 -434 -840 -514 -369 -497 -522 -621 -327 100 -478 -293 -171 -395 -1 -236 -188 -368 -174 -198
2644a98k48N8J71P0k4m8r0q7O92m15l08K50K79P7j00l02j52J48O59j19n80K94
$$ -198 -446 -388 -217 -147 -171 -219 -309 -396 296 -119 -427 -177 102 179 79 -223 -375 -227 432 313 -267 27
2666B7L06n9l42k56O30l3K01q32N11M10l29k02j12K90L76m2n96L0K44L28j07k50
$$ 27 333 274 -68 -324 306 273 474 -358 153 563 234 32 -80 210 586 544 -52 -22 222 550 443 193
2688A93J81K35L9k34k84K73L1j11jJ27j07Q9K13n38N1L64J01m99k59K25N46l76
$$ 193 374 609 648 414 130 403 434 323 322 449 342 431 644 106 157 521 622 123 -136 89 635 259
2710B59l67K17o5N23m57l18J44L34J50m07Q7l58N74r4Pl98m2J40j65K28Nj3L44
$$ 259 -108 109 44 567 110 -208 -64 270 420 13 100 -258 316 222 229 -169 -211 -71 -236 -8 -3 -16 328
2733C28n47l6K61M8K8q08N05K05q0k39p7J96K86l35L0Q4k75L89N2m40k5J34J51
$$ 328 -219 -255 6 54 82 -726 -221 -16 -96 -335 -412 -216 70 -265 -235 -151 -426 -37 15 -425 -450 -316 -165
2756a65o1j44j35J52K43l26J28r0M4j39K98o9j89K63R9j11k73L65K45l20j38J71
$$ -165 -226 -370 -505 -353 -110 -436 -308 -398 -354 -493 -195 -264 -453 -190 -91 -202 -475 -110 135 -185 -323 -152
2778a52L8k1Ml6k68K98L66l31l88M25K46l1n48J93L37J80m41n0K45N51n78l2k11
$$ -152 -114 -135 -131 -167 -435 -137 229 -102 -490 -65 181 150 -398 -205 132 312 -129 -179 66 617 39 7 -204
2801b04N91k9l01j71Q7P37m54o62O9P02J81m43O5J45L67J2n30j78O65O4k53k60
$$ -204 387 358 57 -114 -27 710 256 -406 -337 365 546 103 168 313 680 692 162 -16 649 713 460 200
2823B00K40O3k75j00J63Q7K3L2l44J73L05k02l18K07J5l22K17K17j66l38N79p57
$$ 200 440 503 228 128 291 378 401 433 89 262 567 365 47 254 269 -53 164 381 215 -123 456 -301
2845c01N63J12l20L06m11K64j5j77k54M00Kl03l3L26K73j61o52K24L00k8k51j56
$$ -301 262 374 54 360 -51 213 198 21 -233 167 169 -134 -167 159 432 271 -381 -157 143 115 -136 -292
2867b92J75J62j95l50J32K20J76n22j43M96M22n20m05L67J50J3l44K46J15Q3m58
$$ -292 -117 45 -150 -500 -368 -148 28 -494 -637 -141 281 -239 -644 -277 -127 -114 -458 -212 -97 -14 -472
2888d72k03J88N48j28m28j13N62K60k52m53j5P06l43n43K16L02K69m68k90M71
$$ -472 -675 -487 61 -67 -495 -608 -46 214 -38 -491 -506 200 -143 -686 -470 -168 101 -367 -657 -186
2908a86K63p3k02l61O61O1n97k9O72k32j87m3M5O02l40o4J5K01M1l37J36L00J56
$$ -186 77 4 -198 -559 102 163 -434 -463 209 -23 -210 -253 -208 394 54 -10 5 206 247 -90 46 346 502
2931E02m10j34M20j07Q4k56l80Q13l89J70k06m1Q48o25l79k5N32k2l77j00O64
$$ 502 92 -42 378 271 355 99 -281 532 143 313 107 66 914 289 -90 -115 417 395 18 -82 582
2952E82o6k58m02J90P42R1j001j71O26K56m94k48J47Q05k68o65J33J84M33o34
$$ 582 516 258 -144 46 788 879 -122 -293 333 589 95 -153 -6 799 531 -134 -1 183 616 -18
2972a8k03J77L99J1o15P3K94K77j37p17L51M84k94k87%J36M47p67K24q2O84o67
$$ -18 -221 -44 355 366 -249 -176 118 395 258 -459 -108 376 82 -205 -205 -69 378 -389 -165 -247 437 -230
2994b30l48M07M57k19m88Qj8O66l92N5j52J97J02o05p3O06J36p35J68J56P7l11
$$ -230 -578 -171 286 67 -421 -413 -431 235 -157 -102 -254 -57 45 -560 -633 -27 109 -626 -458 -302 -225 -536
3016e36N9M43M5k22k85j93O67J51j60m73Q1N65j35n75PL99J94l32j80N39J79m43
$$ -536 -477 -34 11 -211 -496 -689 -22 129 -31 -504 -423 142 7 -568 -561 -162 32 -300 -480 59 238 -205
3038b05m08M15K81M93q75k36O74L78o28k08L27K56L95p64n4M54K1k55l53L47K96
$$ -205 -613 -198 83 576 -299 -535 139 517 -111 -319 8 264 659 -105 -159 295 316 61 -292 55 351
3059C51L38j045K99L30J96j99o13K68O75K44r15J71L22L08o49J61L23J22m13l35
$$ 351 689 -356 -57 273 469 270 -343 -75 600 844 -71 100 422 730 81 242 565 687 274 -61
3079f1M01O0N2j44j36L57K3n53L75K6K68l61m12j6N53j23k80j82N35P8n08k91
$$ -61 340 400 452 308 172 529 552 -1 374 400 668 307 -105 -121 432 309 29 -153 382 460 -48 -339
3101c39L67P25l78m27j20M81K07p29QL10K97l00o7j89K55Q5n07L8J55N09m25l68
$$ -339 28 753 375 -52 -172 309 516 -213 -205 105 402 102 35 -154 101 186 -321 -283 -128 381 -44 -412
3123d12j25Q57m23j67k02J86N56k92q20L06K91L39l65m08N22N5k68m19L68K37
$$ -412 -537 320 -103 -270 -472 -286 270 -22 -842 -536 -245 94 -271 -679 -157 -102 -370 -789 -421 -184
3143a84R1n21J13R9K66k44K07l72O87k81m55M49o3J06l57m53P76M7j68l01J29
$$ -184 -93 -614 -501 -402 -136 -380 -173 -545 142 -139 -594 -145 -208 -102 -459 -912 -136 -89 -257 -558 -429
3164d29O80k36k88j72N41RL5n56K52M14j44n66Q6M06K47l86j95K49J89K34o32
$$ -429 251 15 -273 -445 96 105 140 -416 -164 250 106 -460 -374 32 279 -107 -302 -53 136 370 -262
3185b62L29K17J58o24K66L64J66k32m76L83M39m35k31l7K66N02o03K59p1L03o67
$$ -262 67 284 442 -182 84 448 614 382 -94 289 728 293 62 25 291 793 190 449 378 681 14
3206A4J9R1N89K3m27m77J24N84l37q5k91M71K89l16j17J63l7j92N2j60L76j12
$$ 14 33 124 713 736 309 -168 -44 540 203 118 -173 298 587 271 154 317 280 88 140 -20 356 244
3228B44k77k1L83o7m56R1K48j48K21k07n9Q9J11j02k58K96j81o6j57L76K01j81
$$ 244 -33 -54 329 262 -194 -103 145 -3 218 11 -48 41 152 50 -208 88 -93 -159 -316 60 261 80
3250H0j61k54L15J79j12j025J076J16l12n52J33L88r4j65k01M95M04p08j00K1
$$ 80 -81 -335 -20 159 47 -978 98 214 -98 -650 -517 -129 -223 -388 -589 -94 310 -398 -498 -477
3270d77L92j54k29N9M24q0l18m4j19N75k45j99l46L31O43m51l40L33L25j47p5
$$ -477 -85 -239 -468 -409 15 -65 -383 -427 -546 29 -216 -415 -761 -430 213 -238 -578 -245 80 -67 -142
3291a42j86K66j27K31o32N64J53k84l71M16J35Jj8j87J42J22L73n78k34M68J02
$$ -142 -328 -62 -189 42 -590 -26 127 -157 -528 -112 23 24 6 -181 -39 83 456 -122 -356 112 214
3312B14n4q6R6L03m17L05k39J22k04J21r9L29k3j65j11L22k39l2l1m5L24j55k71
$$ 214 160 74 170 473 56 361 122 244 40 161 62 391 368 203 92 414 175 143 112 67 391 236 -35
3335c5K88K4Pk15J62K50o0j96p2J68K35M6k74k26k36M51m6l35L5L73qk11j74N10
$$ -35 253 277 284 69 231 481 421 225 153 321 556 602 328 102 -134 317 271 -64 -29 344 336 125 -49 461
3359D61Q4l56J4M6p0Om45K3K88J37k31l17L26JN1j53j41pL13j13l94K96M90m82
$$ 461 545 189 203 249 179 185 -260 -237 51 188 -43 -360 -34 -33 18 -135 -276 -283 30 -83 -477 -181 309 -173
3383a73r5J87k5o4r3O6J44L9j61K38n39K17Q3j76K0K18j89R6k1j25K28j85J37
$$ -173 -268 -81 -106 -170 -263 -197 -53 -14 -175 63 -476 -259 -176 -352 -332 -114 -303 -207 -228 -353 -125 -310 -173
3406a73k41L62k37J73j68J88M5n22M26J64k02J72j57m6K63k30m3q9K16M7k84M96
$$ -173 -414 -52 -289 -116 -284 -96 -51 -573 -147 17 -185 -13 -170 -216 47 -183 -226 -315 -99 -52 -336 160
3428A60m25K52J5o0K79j68K28k27j59O23l07l09j9J40R2p5L42l52o5K21J17l37
$$ 160 -265 -13 2 -58 221 53 281 54 -105 518 211 -98 -117 23 115 40 382 30 -35 186 303 -34
3450c4L43l16J64j4J55J43j17p2J07l68K59J44l86L62P4l92j36J82K62k18L56
$$ -34 309 -7 157 143 298 441 324 252 359 -9 250 394 8 370 444 52 -84 98 360 142 498
3471D98m13K88l45K15j37P2N6N3L7J9k6k78m2M6N8J7J5j43j93J93Q7J5k02K51
$$ 498 85 373 28 243 106 178 234 287 324 343 317 39 -3 43 101 118 133 -10 -203 -10 77 92 -110 141
3495A41q9k86L44j15M8k15M26k22j53K23l0k40J77P7r5L9l9P3k65J90Mp1N8j09
$$ 141 52 -234 110 -5 43 -172 254 32 -121 102 72 -168 9 86 -9 30 -9 64 -201 -11 -7 -78 -20 -129
3519a29k43M46j59m54J38K90j00jj00nk55k6K26k2L53K0j83j18K49J95O1j20m0
$$ -129 -372 74 -85 -539 -401 -111 -211 -212 -312 -317 -572 -598 -372 -394 -41 -21 -204 -322 -73 122 183 63 23
3542B3k29O9jJ32l19M70k64K63m10rK69J50l40j8L88j22j37j36N8J22N4j95j21
$$ 23 -206 -137 -138 -6 -325 145 -119 144 -266 -275 -6 144 -196 -214 174 52 -85 -221 -163 -41 13 -182 -303
3565c03N55r9k93N09m46L2L81j21j14R7k2j55j02K74n4m8q7N30m15J74M0m05L37
$$ -303 252 153 -140 369 -77 -45 336 215 101 198 176 21 -81 193 139 91 4 534 119 293 333 -72 265
3588B65R9k3j36L79j13k56K01o6L7j02Rl25M28k78P9m4P6j4P7l14J78m6l8J91
$$ 265 364 341 205 584 471 215 416 350 387 285 294 -31 397 119 198 154 230 216 293 -21 157 111 73 264
3612B64j50L01M7m05M3J82J3J7m50L83k49K88l07m0Q0l8Q2N9r1J54J07l54k58
$$ 264 114 415 462 57 100 282 295 312 -138 245 -4 284 -23 -63 17 -21 61 120 29 183 290 -64 -322
3635c22L87l3r8J00j46P5j71N0l5R9Jj06r0K44kj24j19j28K83j36K23j23L67m6
$$ -322 65 32 -66 34 -112 -37 -208 -158 -193 -94 -93 -199 -289 -45 -47 -171 -290 -418 -135 -271 -48 -171 196 150
3659A50l24j35pR4j95J11K52l2P1K5k90J61j03J76j29K80m83N26o57M14L5n4O6
$$ 150 -174 -309 -316 -222 -417 -306 -54 -86 -15 10 -280 -119 -222 -46 -175 105 -378 148 -509 -95 -60 -114 -48
3682d8k41K94J5K45o36K33L70k31K72l20K8L73k21k03O1J67j91P9k44L71K41l13
$$ -48 -289 5 20 265 -371 -138 232 1 273 -47 -19 354 133 -70 -9 158 -33 46 -198 173 414 101
3704A01j30L8J05J92j0l15L00Q5m40P6R6K81KJ15n75L31J58J08l88J19m2J46l18
$$ 101 -29 9 114 306 296 -19 281 366 -74 2 98 379 381 496 -79 252 410 518 130 249 207 353 35
3727C5p2M93J2n8n33m1L45Q6l96M55n09P77o45K76J8k74K44l10k2J83O1lj29J08
$$ 35 -37 456 468 410 -123 -164 181 267 -129 326 -183 594 -51 225 243 -31 213 -97 -119 64 125 122 -7 101
3751A01k8J74l79M3J83K64j65k49K96k43k95K40J75j10K14l69k51L77K60m59p
$$ 101 73 247 -132 -89 94 358 193 -56 240 -3 -298 -58 117 7 221 -148 -399 -22 238 -221 -228
3772b28J29l7J08k42k7Q6J14k67J37L92k80l29J77l53M95K09o84K60M30J81o19
$$ -228 -99 -136 -28 -270 -297 -211 -97 -364 -227 165 -115 -444 -267 -620 -125 84 -600 -340 90 271 -348
3793c48l47O18j3N9n01M21l67P53l62m38N12L63k05m55J09M43j92j71n2L17k0
$$ -348 -695 -77 -90 -31 -532 -111 -478 275 -87 -525 -13 350 145 -310 -201 242 50 -121 -173 144 124
3814A24j22j72N9K25k9n6K7j70L83k37l50N24k20K07r9l26K11J66n6l11K94J41
$$ 124 2 -170 -111 114 85 29 56 -114 269 32 -318 206 -14 193 94 -232 -21 145 89 -222 72 213
3836B13lk11K22j13K39k23J42k8k2Lj58J13m5J24K3J30j68N9l11K05k0M19m98
$$ 213 210 -1 221 108 347 124 266 238 216 219 61 174 129 253 276 406 238 297 -14 191 171 590 92
3859I2m8Q0J10J48m23l10M26N63p72K21J75l3j31j22j89L97L29k19l24L80j81
$$ 92 44 124 234 382 -41 -351 75 638 -134 87 262 229 98 -24 -213 184 513 294 -30 350 169
3880A69J32k95J04o3J51j70k05p4M27j49r9j65K52l3j09j67J72K23k12P3J29Q7
$$ 169 301 6 110 47 198 28 -177 -251 176 27 -72 -237 15 -18 -127 -294 -122 101 -111 -38 91 178
3902A78l32k81M60m20N24n06R4J06j08N61n90J51K31o0J4n61M20M0k13j22N49
$$ 178 -154 -435 25 -395 129 -377 -283 -177 -285 276 -314 -163 68 8 22 -539 -119 -79 -292 -414 135
3923A35o27O34l23j02L53j18k23P6J52M4n8k54K06k53J01K38j90M31j73m6k02
$$ 135 -492 142 -181 -283 70 -48 -271 -195 -43 1 -57 -311 -105 -358 -257 -19 -209 222 49 3 -199
3944a99O8M14k92k67O3J34J39J13k82L02j12J22l07J11K6M46l49O0M4k53K0N1
$$ -199 -131 283 -9 -276 -213 -79 60 173 -109 193 81 203 -104 7 33 479 130 190 234 -19 1 52
3966E2k72q5O86k69n7l85P37m11J24j15j92M72L4j59j2M04j42k74j07J29K8r4
$$ 52 -220 -305 381 112 55 -330 407 -4 120 5 -187 285 319 160 148 552 410 136 29 158 186 92
3988I2j24K31P8q0J57j67P7J00n67K86r5M94pl70j3P0M9P6k91L30l16j30K97p4
$$ 92 -32 199 277 197 354 187 264 364 -203 83 -12 482 475 105 92 162 211 287 -4 326 10 -120 177 103
4012A03j21j38J25J27J95j72l37jOK21k10q8L62K45n09k07N04o7j60N8q4K88n9
$$ 103 -18 -156 -31 96 291 119 -218 -219 -213 8 -202 -290 72 317 -192 -399 105 38 -122 -64 -148 140 81
4035H1n2O9j08J13j91m7k71L0L47Kk80L00J1o9l24J40K2J40j04l44M71j27n2j73
$$ 81 29 98 -10 103 -88 -135 -406 -376 -29 -27 -307 -7 4 -65 -389 -249 -227 -87 -191 -535 -64 -191 -243 -416
4059d16l8K36M09k60k09J81n5J48p5j72M51n29M09k16q7N97j4j51l22Q3J05j57
$$ -416 -454 -218 191 -69 -278 -97 -152 -4 -79 -251 200 -329 80 -136 -223 374 360 209 -113 -30 75 -82
4081h2K89l5l9Q8k04n01O12M0R2l06K3K0o3K25m01k0L28J84rm3L9L5j04k0k69
$$ -82 207 172 133 221 17 -484 128 168 260 -46 -23 -3 -66 159 -242 -262 66 250 241 198 237 272 168 148 -121
4106a21M32M2M1j49m16M62k81K08k0o3K5k44L54k60K98j9j08k47K63j07J24k36
$$ -121 311 353 394 245 -171 291 10 218 198 135 160 -84 270 10 308 289 181 -66 197 90 214 -22
4128b2J35n7j65K75k57Q3M6n4J46L5J5k74R0K14r7k04m5K27k87l0L79k97j74L07
$$ -22 113 56 -109 166 -91 -8 38 -16 130 165 180 -94 -4 210 113 -91 -136 91 -196 -226 153 -144 -318 -11
4152a1o5J17p6j42J01o8K34Oj85r4J14n2j02K59m7k55R3L13k47J59o0Q8n20L59
$$ -11 -76 41 -35 -177 -76 -144 90 96 -89 -183 -69 -121 -223 36 -11 -266 -173 140 -107 52 -8 80 -440 -81
4176h1k4K76m78j55P1K16k84L06k68J32J85j37J54q9k10K88Q8k02n0J26J77J0
$$ -81 -105 171 -307 -462 -391 -175 -459 -153 -421 -289 -104 -241 -87 -176 -386 -98 -10 -212 -262 -136 41 51
4198E1n1RP0m28J99j93N20j10KM6j76J80l12j62M39k22L44l79K37p0m4N00m39
$$ 51 0 9 79 -349 -150 -343 177 67 69 115 -61 119 -193 -355 84 -138 206 -173 64 -6 -50 450 11
4221A1n4L26l95K36J94k12L27k74L50m26L68l00p2L00j34k13J67Q4j45p9M41p01
$$ 11 -43 283 -112 124 318 106 433 159 509 83 451 151 79 379 245 32 199 283 138 59 500 -201
4243b01K35j54L17M6l21L19l2p3k85J1M3K68j04j0J21j34l9J47l04J40K08j42
$$ -201 34 -120 197 243 -78 241 209 136 -149 -138 -95 173 69 59 180 46 7 154 -150 -10 198 56
4265E6n4k18L77j99J7M3R9N5l03k8K18J59J5k19l03K37j40q2L57r9k41K60l73
$$ 56 2 -216 161 -38 -21 22 121 176 -127 -155 63 222 237 18 -285 -48 -188 -270 87 -12 -253 7 -366
4288c66L48k60K90k21J72L0j75M6P1j27J69k74L7j08M82k31n1L13l22P6jk5k99
$$ -366 -18 -278 12 -209 -37 -7 -182 -136 -65 -192 -23 -297 -260 -368 114 -117 -168 145 -177 -101 -102 -127 -426
4311d26L54R2j87p9K37l89JJ89K23P7j17j02o4K4J38o5p1K50r8J44j29K00l49
$$ -426 -72 20 -167 -246 -9 -398 -397 -208 15 92 -25 -127 -191 -167 -29 -94 -165 85 -13 131 2 202 -147
4334a47L20j46j05O5J34O4k12L40l12j0J60p8J87k34Jn8K96q4k3j83J43J21l57
$$ -147 173 27 -78 -13 121 185 -27 313 1 -9 151 73 260 26 27 -31 265 181 158 -25 118 239 -118
4357a18K48R7j39J60j52J70J68k32J37j29q2K92k64J09R7L8l09m1J3Q7J84o6l48
$$ -118 130 227 88 248 96 266 434 202 339 210 128 420 156 265 362 400 91 50 63 150 334 268 -80
4380h0l6M28j65l39L13n1j93K85m20L53L72j77l08pJ56J21q8n6j72J35J06l68
$$ -80 -116 312 147 -192 121 70 -123 162 -258 95 467 290 -18 -25 131 252 164 108 -64 71 177 -191
4402a91l8K60L7l7k5p1R8j7k01R7j24J72j93J9J78q6K95ol26Q4J71k84j00K45
$$ -191 -229 31 68 31 6 -65 33 16 -185 -88 -212 -40 -233 -214 -36 -122 173 167 -159 -75 96 -188 -288 -43
4426d3N14q89L69J64j18k65m0J07j32K80J34m15L3K91K65o47K73j1k25J58M9k4
$$ -43 471 -418 -49 115 -3 -268 -308 -201 -333 -53 81 -334 -301 -10 255 -392 -119 -130 -355 -197 -148 -172
4448a72P4q3K1LM7j72J51K75J2m0k46M9K38J18m46N5qK28J8k37N7J32Q2k32J61
$$ -172 -98 -181 -160 -157 -110 -282 -131 144 156 116 -130 -81 157 275 -171 -116 -124 104 122 -115 -58 74 156 -76 85
4473H5j20K50J59l17k73K05K48j78k70L42J84l86J14J51p3O2L1O5l3M9l05j4o9
$$ 85 -35 215 374 57 -216 -11 237 59 -211 131 315 -71 43 194 121 183 214 279 246 295 -10 -24 -93
4496i3L66J23j85l74K96J14p2K1n3L7K75n24r6K58L5K48o79M78L33l98m7j62O4
$$ -93 273 396 211 -163 133 247 175 196 143 180 455 -69 -165 93 128 376 -303 175 508 110 63 -99 -35
4519c5K79k18J7l66L28M8N4j47K17J5k84J51j0n3J6O0o1k27J81Q4k21m8L28p0
$$ -35 244 26 43 -323 5 53 107 -40 177 192 -92 59 49 -4 12 72 11 -216 -35 49 -172 -220 108 38
4543C8j44o8J51j33m00M49K31j21j26k5Ol6l2K90l95J39J62j76m7Q7RM6k59L1
$$ 38 -106 -174 -23 -156 -556 -107 124 3 -123 -148 -142 -178 -210 80 -315 -176 -14 -190 -237 -150 -141 -95 -354 -323
4567c23n4N40j31j00m8K77j25k21j58K10j19k5k1K83J4j62j48q6M70K61l18Rj97
$$ -323 -377 163 32 -68 -116 161 36 -185 -343 -133 -252 -277 -298 -15 -1 -163 -311 -397 73 334 16 25 -172
4590a72J78K59m70J74j1K39j32l47K86j1m0K74ql42k11L45J93j06j83k35L80l3
$$ -172 6 265 -205 -31 -42 197 65 -282 4 -7 -47 227 219 -123 -334 11 204 98 -85 -320 60 27
4612B7J73Ol3j6k35L12j1j6L0p6Lj13Q7L1l4p1L90k63J3k65k89O74r1q9m12K90
$$ 27 200 206 173 157 -78 234 223 207 237 161 164 51 138 169 135 64 454 191 204 -61 -350 324 233 144 -268 22
4638B2L3L00o14L56N15n98Q8M2J56o9M2m41K76J4j98L34l87J46L12k96j57J10
$$ 22 55 355 -259 97 612 14 102 144 300 231 273 -168 108 122 -76 258 -129 17 329 33 -124 -14
4660a4N3J65k48k91J51J20K53m59k70N88j60L3k26J29l2RN61o43J36K09Rl68K41
$$ -14 39 204 -44 -335 -184 -64 189 -270 -540 48 -112 -79 -305 -176 -208 -199 362 -281 -145 64 73 -295 -54
4683e4K99m99K81k96K99m02J95L74l39L35k70PL0k33Qr9K44l60K36J50k1j3m5
$$ -54 245 -254 27 -269 30 -372 -177 197 -142 193 -77 -70 -40 -273 -265 -364 -120 -480 -244 -94 -115 -128 -173
4706a73J85q0p9j1K8M4J8K05j81j64L6L69k67J99l35J64j08L4J41Q7j67j22L2
$$ -173 12 -68 -147 -158 -130 -86 -68 137 -44 -208 -172 197 -70 129 -206 -42 -150 -116 25 112 -55 -177 -145
4729a45j2K59o1O8k78J10J67J52l06J51J15J90m77P6m9M27l25k7J91n83M98K05
$$ -145 -157 102 41 109 -169 -59 108 260 -46 105 220 410 -67 9 -40 387 62 35 226 -357 141 346
4751C46l38Q5J18k0k10p5Q3K89M1r2j75N47k90L0l40K95k05k2J9K7m8j06P7J0
$$ 346 8 93 211 191 -19 -94 -11 278 319 227 52 599 309 339 -1 294 89 67 86 113 65 -41 36 46
4775D6O8q7q0M96k91K8k56J93R5k03l2j18M66m52l4m5J09N4J39k22J99m46L15
$$ 46 114 27 -53 443 152 180 -76 117 212 9 -23 -141 325 -127 -161 -206 -97 -43 96 -126 73 -373 -58
4798e8p0r1L25j93N0l13L01P0o1L4o6j27N6l28O31l94O5k29L80j55J05J96j10
$$ -58 -128 -219 106 -87 -37 -350 -49 21 -40 -6 -72 -199 -143 -471 160 -234 -169 -398 -18 -173 -68 128 18
4821A8l34J54K5K31j39j06K21l31Q7J60M6j88j40J82p6M7J06j6Rj35J35L3n0M9
$$ 18 -316 -162 -137 94 -45 -151 70 -261 -174 -14 32 -156 -296 -114 -190 -143 -37 -53 -44 -179 -44 -11 -61 -12
4845a2k28K96k05q6L39Q6k93L57m57J98J64n3J0l0K4j62K3J79j28k60K04N4k09
$$ -12 -240 56 -149 -235 104 190 -103 254 -203 -5 159 106 116 86 110 -52 -29 150 22 -238 -34 20 -189
4868a89L33j18j6k59K42O3k5K07k64J17o4O2J16k98L65k02q4K72J92n10K36j03
$$ -189 144 26 10 -249 -7 56 31 238 -26 91 27 89 205 -93 272 70 -14 258 450 -60 176 73
4890G3Q9j1m1J09j13j69K17k77K04O1k00k61L32K84l70k7J25o6K41P1m46L82o2
$$ 73 162 151 110 219 106 -63 154 -123 81 142 -58 -319 13 297 -73 -100 25 -41 200 271 -175 207 145
4913A45j71k40J29J56J70k26K03j44j45R0j2j37K67M3j31j73K1J06k17K91j5k39
$$ 145 -26 -266 -137 19 189 -37 166 22 -123 -33 -45 -182 85 128 -3 -176 -155 -49 -266 25 10 -229
4935b29j2n5K88j21n8r2K38Q1j18nr3K43j47R2q7J31j03j8j8R8j12K8j70K17o6
$$ -229 -241 -296 -8 -129 -187 -279 -41 40 -78 -83 -176 67 -80 12 -75 56 -47 -65 -83 15 -97 -69 -239 -22 -88
4960h8k99R8J98J53k07J14L3j02N7K6l22K33J62k82J78p5K59J76l14J42r1l85
$$ -88 -387 -289 -91 62 -145 -31 2 -100 -43 -17 -339 -106 56 -226 -48 -123 136 312 -2 140 49 -336
4982c36M55j26K18j21j17K74l32R1k09R2L26k84J84J65k16K4O1k32J70J86l14
$$ -336 119 -7 211 90 -27 247 -85 6 -203 -111 215 -69 115 280 64 88 149 -83 87 273 -41
5003d1L06j15j55K89j33K51l44l7K54n6j68K35j83P2j22K87j73K20k85k64K41
$$ -41 265 150 -5 284 151 402 58 21 275 219 51 286 103 175 53 340 167 387 102 -162 79
5024G9R9l41K80J56k20J29j56J18K48m10J52J00l20M1K9P8r2O4Q6k99Q6k12J91
$$ 79 178 -163 117 273 53 182 26 144 392 -18 134 234 -86 -45 -16 62 -30 34 120 -179 -93 -305 -114
5047a14M98j83l27K04K95k60k93N43m18j19N07k51k23J38J58j65j61ML9P8l48
$$ -114 384 201 -126 78 373 113 -180 363 -55 -174 333 82 -141 -3 155 -10 -171 -167 -128 -50 -398
5068c98M35k75O6J29Nk97K90r0Q4j55J67r2%k50J75m6J65r6J04n4o7P5j51L37
$$ -398 37 -238 -172 -43 -38 -335 -45 -135 -51 -206 -39 -131 -131 -381 -206 -252 -87 -183 -79 -133 -200 -125 -276 61
5092F1j40k53M19k23Rj43k8L03k27K18R3j09j37J63N5m7r1P6l47M32n50O19j24
$$ 61 -79 -332 87 -136 -127 -270 -298 5 -222 -4 89 -20 -157 6 61 14 -77 -1 -348 84 -466 153 29
5115B9N9lk2K4L0j83N91m71N9l51J67J62J57M1p6p3j4J25l64J09K75j18j86k04
$$ 29 88 85 63 87 117 -66 525 54 113 -238 -71 91 248 289 213 140 126 251 -113 -4 271 153 -33 -237
5139b37J73L47k9j25k25L03p3q6L9Rj47Q4J40j82L56k83l48K42J13r3J56K28m82
$$ -237 -64 283 254 129 -96 207 134 48 87 96 -51 33 173 -9 347 64 -284 -42 71 -22 134 362 -120
5162a20L97k57q3o5j10L00k9j5k62M80l26J76k37J42j32Q7p9j15J93o3K01p7j80
$$ -120 277 20 -63 -128 -238 62 33 18 -244 236 -90 86 -151 -9 -141 -54 -133 -248 -55 -118 83 6 -174
5185a74J47O8l60K97L80l86j0r6L09l12J02j70L87m01R0K0K19k72K66q9k85M37
$$ -174 -27 41 -319 -22 358 -28 -38 -134 175 -137 -35 -205 182 -219 -129 -109 110 -162 104 15 -270 167
5207A67q5l56K02N5N5k14J0m9J59o3j10K27J90m32L5J9lK22k35L12j68K1Q4j19
$$ 167 82 -274 -72 -17 38 -176 -166 -215 -56 -119 -229 -2 188 -244 -209 -190 -193 29 -206 106 -62 -41 43 -76
5231g6P4l77N01qO0j53p6L02k46R8m2m9M09m01lr3R1J97k13J22j00j2p5K23n8
$$ -76 -2 -379 122 114 174 21 -55 247 1 99 57 8 417 16 13 -80 11 208 -5 117 17 5 -70 153 95
5256I5R9l61O12l77L76M0p75K55L08k13k19N7K27L14m60J62q9r5qJ06J26j07N4
$$ 95 194 -167 445 68 444 484 -291 -36 272 59 -160 -103 124 438 -22 140 51 -44 -52 54 180 73 127
5279A27J76l66N9J08k33J10J94q2o3R1j57K30J0n0m67J30J20J41l1J10j28j0J32
$$ 127 303 -63 -4 104 -129 -19 175 93 30 121 -36 194 204 154 -313 -183 -63 78 47 157 29 19 151
5302A51L0k46R4oK23k18L0J10l39K45J4k8p8J02j38P6j12P5k91K77O0n2p2J34
$$ 151 181 -65 29 23 246 28 58 168 -171 74 88 60 -18 84 -54 22 -90 -15 -306 -29 31 -21 -93 41
5326D1j9j81l0L53m27L70m57L26r5k49M14j17J19k38o1J17p3j70K89J19p6j19
$$ 41 22 -159 -189 164 -263 107 -350 -24 -119 -368 46 -71 48 -190 -251 -134 -207 -377 -88 31 -45 -164
5348a64J91O9n20L22K06l36J62L03m32J18k08L03k6k67M41lK34l76k1L23j76k07
$$ -164 27 96 -424 -102 104 -232 -70 233 -199 -81 -289 14 -12 -279 162 159 393 17 -4 319 143 -64
5370f4M5q6j52L82L0Jj45n1j42K55R8J96k68J31K24k70m2L00l66KK17P4l97J07
$$ -64 -19 -105 -257 125 155 156 11 -40 -182 73 171 367 99 230 454 184 142 442 76 78 295 369 -28 79
5394G9j39P9k17R6O8J69K9j75K63j12k47J83J25K1j46J4j32R0J33l34M10m62M05
$$ 79 -60 19 -198 -102 -34 135 164 -11 252 140 -107 76 201 222 76 90 -42 48 181 -153 257 -205 200
5417B00j33l39L13j47lJ35J3m1J73l49k1L65M5L7k38m3N2jj30k07L71K07n09n6
$$ 200 67 -272 41 -106 -109 26 39 -2 171 -178 -199 166 211 248 10 -33 19 18 -112 -319 52 259 -250 -306
5441c06M03l0k47o2J77J7k10L1o2K62l84K35q1L6J18m8K62j40R4j29m7k11K29
$$ -306 97 67 -180 -242 -65 -48 -258 -227 -289 -27 -411 -176 -257 -221 -103 -151 111 -29 65 -64 -111 -322 -93
5464i3N1l39O4L7K90k34O0l1J02K78k64L5k04N0K66m82L93K3l72M74r6k77N37
$$ -93 -42 -381 -317 -280 10 -224 -164 -195 -93 185 -79 -44 -248 -198 68 -414 -21 2 -370 104 8 -269 268
5487B68k17l34L59Q0j70j3k49J24L3L29k83l33L00J99J2p9o1O8r5J99LJ1l07K80
$$ 268 51 -283 76 156 -14 -27 -276 -152 -119 210 -73 -406 -106 93 105 26 -35 33 -62 137 140 151 -156 124
5511A24J05l16K69K99m97K37R7k05j41P6K88p8k23ml02K63M8K42j07k72K87l7
$$ 124 229 -87 182 481 -16 221 318 113 -28 48 336 258 35 31 -271 -8 40 282 175 -97 190 153
5533A53O0Pl0p4K27j75R6q9j07K51l14J22k44J84J11j44M6J42k35N56l46k60K10
$$ 153 213 220 190 116 343 168 264 175 68 319 5 127 -117 67 178 34 80 222 -13 543 197 -63 147
5556A47J20k02R9j14n1J64l50J25K19j35j98K39j23l1k14O9L66k43K0L1P3l7j89
$$ 147 267 65 164 50 -1 163 -187 -62 157 22 -176 63 -60 -91 -305 -236 130 -113 -93 -62 11 -26 -215
5579b15J7K92j81K9j51k4L67q5K01m44Jl5P9J06l7j30o5K54k45J35J9P2l7p3j57
$$ -215 -198 94 -87 -58 -209 -233 134 49 250 -194 -193 -228 -149 -43 -80 -210 -275 -21 -266 -131 -112 -40 -77 -150 -307
5604c07L55J40k01j3jj54OK16q2j92J36L27l41J40j85K77j37R1L60o81J20J07
$$ -307 48 188 -13 -26 -27 -181 -175 41 -41 -233 -97 230 -111 29 -156 121 -16 75 435 -246 -126 -19
5626a9l2J98k42J34j59J17k5Q0j32O9k57O1L15l96J57K47k67M80m22J21J18L9
$$ -19 -51 147 -95 39 -120 -3 -28 52 -80 -11 -268 -207 108 -288 -131 116 -151 329 -93 28 146 185
5648A85j79N7p7q0j51J43L79K34l66K36o59M12j36J47K4j18N7m7O9j93K11k30
$$ 185 6 63 -14 -94 -245 -102 277 511 145 381 -278 134 -2 145 169 51 108 61 130 -63 148 -82
5670h2L6J15p4p8L56j84O0K4j61Mm3j16K59p5l3P1n88M27J10l6J69l94M80k37
$$ -82 -46 69 -5 -83 273 89 149 173 12 16 -27 -143 116 41 8 79 -509 -82 28 -8 161 -233 247 10
5694A0J4j23n0J43m9J08P2j47Jmo2l57L37O5j06P4j00K84k28Q1N6m9n7J3J44r8
$$ 10 24 -99 -149 -6 -55 53 125 -22 -21 -25 -87 -444 -107 -42 -148 -74 -174 110 -118 -37 19 -30 -87 -74 70 -28
5720b8j97M7J26J50j95p2q7K96j75j55R6J59K1k73N48j2m81J22K63k66Q8q8L32
$$ -28 -225 -178 -52 98 -97 -169 -256 40 -135 -290 -194 -35 -14 -287 261 249 -232 -110 153 -113 -25 -113 219
5743B19j47j94J10k01m8J32P8K4K3j7J02Kj46l2l7J52n8J3j1K51j96j1L02j55
$$ 219 72 -122 -12 -213 -261 -129 -51 -27 -4 -21 81 83 -63 -95 -132 20 -38 -25 -36 215 19 8 310 155
5767A55k5l0j56J89k3L1j84N2k24j08L42J93Mk56K30O5l99K98j46J69m5k37j7
$$ 155 130 100 -56 133 110 141 -43 9 -215 -323 19 212 216 -40 190 255 -144 154 8 177 132 -105 -122
5790a22N24k46k05K71j40q2J31k60J91j28M03j13k14l3J11q5P9l28J83K51j65
$$ -122 402 156 -49 222 82 0 131 -129 62 -66 337 224 10 -23 88 3 82 -246 -63 188 23
5811B3l0m8j6J8K49l3k8j72n0j23R8L69l54N8j94r5J69M07p2j47j67K06r2K62
$$ 23 -7 -55 -71 -53 196 163 135 -37 -87 -210 -112 257 -97 -39 -233 -328 -159 248 176 29 -138 68 -24 238
5835B38k36j28L75n38M68r5k06P2j73k3K40K50l94K39k77K08k19J76j57L25k32
$$ 238 2 -126 249 -289 179 84 -122 -50 -223 -246 -6 244 -150 89 -188 20 -199 -23 -180 145 -87
5856h7J14l71K64J05k91R1r4K08k00L0J94j18L6o8J84k82L54j21J74m32K74J8
$$ -87 27 -344 -80 25 -266 -175 -269 -61 -261 -231 -37 -155 -119 -187 -3 -285 69 -52 122 -310 -36 -18
5878a8k3R5j84K72o9n4l2J77k27J58K58k30R7k09mM50n81J42l4K50k40J96k78
$$ -18 -41 54 -130 142 73 19 -13 164 -63 95 353 123 220 11 7 457 -124 18 -16 234 -6 190 -88
5901h8O9J52K27k78M4J6r0R5P5m7l6l8j79M49k45j34K5R0K48k64J63nj94J31J31
$$ -88 -19 133 360 82 126 142 52 147 222 175 139 101 -78 371 126 -8 17 107 355 91 254 249 55 186 317
5926C17m30O9pr1J97j93M62k07m4K02k14j71K6K18J91n06L29j33Q2J4k5K50Ro03
$$ 317 -113 -44 -51 -142 55 -138 324 117 73 275 61 -110 -84 134 325 -181 148 15 97 111 86 336 345 -258
5950b58R7O2L0J73r6l7o3j06j64L88J22j25n9J69l79K73j15J22J8j29Q7J14l87
$$ -258 -161 -99 -69 104 8 -29 -92 -198 -362 26 148 23 -36 133 -246 27 -88 34 52 -77 10 124 -263
5973b63M51o1j55jj51J64N5k63K76k6M3N0k21J43r2p3J74N2k32K40k03N4j40L11
$$ -263 188 127 -28 -29 -180 -16 39 -224 52 26 69 119 -102 41 -51 -124 50 102 -130 110 -93 -39 -179 132
5997A32J7l3k13J57n7j02l64P23j25l23K91M7j11O7L49l11j23R9k03O8j8j76K25
$$ 132 149 116 -97 60 3 -99 -463 260 135 -188 103 150 39 106 455 144 21 120 -83 -15 -33 -209 16
6020A6j58J92M8k6q2O3q6J73j27O5J5K83k65N4k19M00o3k85r0L93j85J02J59k70
$$ 16 -142 50 98 72 -10 53 -33 140 13 78 93 376 111 165 -54 346 283 -2 -92 301 116 218 377 107
6044A07k38K84j75J49j21M8j61L15j84k2J86L7k64J13K46m53J20J1p8L35l44j26
$$ 107 -131 153 -22 127 6 54 -107 208 24 2 188 225 -39 74 320 -133 -13 -2 -80 255 -89 -215
6066b15K96j73j5K15o8N0j31LL9n7L05l68J85o1j13K80j34p0O0j04K98l44M6J3
$$ -215 81 -92 -107 108 40 90 -41 -38 1 -56 249 -119 66 5 -108 172 38 -32 28 -76 222 -122 -76 -63
6090f3j17m7o7L17l91K93lKp5k5j5J60j48j01L86k95j10J62Q8N3j93k5L97l59
$$ -63 -180 -227 -294 23 -368 -75 -78 -76 -151 -176 -191 -31 -179 -280 106 -189 -299 -137 -49 4 -189 -214 183 -176
6114a76J58j45R7j7j99K04m8L4J4j84j53M42k0K7j23m5N6K46l00j07P9K52L8l2
$$ -176 -18 -163 -66 -83 -282 -78 -126 -92 -78 -262 -415 27 7 34 -89 -134 -78 168 -132 -239 -160 92 130 98
6138I8mj73j75J13J28l18K99J47J47m52K37P0mj51K75j18j08J8M30o64J16M9K61
$$ 98 94 -79 -254 -141 -13 -331 -32 115 262 -190 47 117 113 -38 237 119 11 29 459 -205 -89 -40 221
6161B21j98J00m7nJ29k48K08j8j73K21m13J44K72k45Q9K14k42k08N65l66J4J49
$$ 221 23 123 76 71 200 -48 160 142 -31 190 -223 -79 193 -52 37 251 9 -199 366 0 14 163
6183A63J51j13l71M07j95J72l81K45j2p9L24o7k08J96j64k00L74j2k58J44P0l05
$$ 163 314 201 -170 237 42 214 -167 78 66 -13 311 244 36 232 68 -132 242 230 -28 116 186 -119
6205a19K2P4O8k05K15l21J66l5M57n02K00l98K40J43j3J24j07N9j62K18k13M70
$$ -119 -97 -23 45 -160 55 -266 -100 -135 322 -180 20 -378 -138 5 -8 116 9 68 -94 124 -89 381
6227C81l51k72j44J81m6J28ro2L90l26K69j21l57r9O26K25m63o8j0l4J34L4K25
$$ 381 30 -242 -386 -205 -251 -123 -132 -194 196 -130 139 18 -339 -438 188 413 -50 -118 -128 -162 -28 6 231
6250B31m04j22K39P0Q7J00j34p0pP0o9l67O12k17o9J43j7K29l79J1j48N28k31
$$ 231 -173 -295 -56 14 101 201 67 -3 -10 60 -9 -376 236 19 -50 93 76 305 -74 -63 -211 317 86
6273H6j84K53j83k3N2P2k81J52J43P8k08K57Q2l47L47k25m7J97J47m88K34o9j05
$$ 86 -98 155 -28 -51 1 73 -208 -56 87 165 -43 214 296 -51 296 71 24 221 368 -120 114 45 -60
6296f0K67j56j05L36l19J71J57m51L40p1K20o5k32j03K32Q6J15n54N58l29k4L02
$$ -60 207 51 -54 282 -37 134 291 -160 180 109 329 264 32 -71 161 247 362 -192 366 37 13 315
6318C15l24J08k43L40J0k76J68j02K98k06k76J30M08l42K9j75N19l37J4J10k56
$$ 315 -9 99 -144 196 206 -70 98 -4 294 88 -188 -58 350 8 37 -138 381 44 58 168 -88
6339h8K11l12rJ11m7J83O5K2J24q1j73j21l1J17l63M96k53J82j34l93N21r2n8
$$ -88 123 -189 -198 -87 -134 49 114 136 260 179 6 -115 -146 -29 -392 104 -149 33 -101 -494 27 -65 -123
6362a23o6J82k61L42j55l1J5m7jJ88j72j26M7N4J17j20q3K29K44r1j97k93M30
$$ -123 -189 -7 -268 74 -81 -112 -97 -144 -145 43 -129 -255 -208 -154 -37 -157 -240 -11 233 142 -55 -348 82
6385H2l28K39J75K8j80R2k8m2q2l8j22L28k07L45k51O7O2k37J33k71K91j52L8
$$ 82 -246 -7 168 196 16 108 80 38 -44 -82 -204 124 -83 262 11 78 140 -97 36 -235 56 -96 -58
6408e8J06O9k33K04K88k99k9j50K49k05J20j0J77l26J41K0LQ7M2Qq7k42K47l10
$$ -58 48 117 -116 88 376 77 48 -102 147 -58 62 52 229 -97 44 64 67 154 196 204 117 -125 122 -188
6432a88L38l81L38L3K02p5l04J80J03j37j6j4J74k26M5k6k66K63o9P2j38K17j36
$$ -188 150 -231 107 140 342 267 -37 143 246 109 93 79 253 27 72 46 -220 43 -26 46 -92 125 -11
6455a1J12l0P5O3k61K46r9j70n9K34J30k53N4j06J86j66j09J4K14j78K33l32K81
$$ -11 101 71 146 209 -52 194 95 -75 -134 100 230 -23 31 -75 111 -55 -164 -150 64 -114 119 -213 68
6478F8j12OJ46n51L54LJ09j60J88k42j6K93j62j96K70j54K50j42k08K15j3O3k53
$$ 68 -44 -38 108 -443 -89 -86 23 -137 51 -191 -207 86 -76 -272 -2 -156 94 -48 -256 -41 -54 9 -244
6501b44Q8L00l19P9J58q7j64J63k01J19J08k69K53j61K01R5k21k45L85p1o6K13
$$ -244 -156 144 -175 -96 62 -25 -189 -26 -227 -108 0 -269 -16 -177 24 119 -102 -347 38 -33 -99 114
6523A14o1p0J40L6j29p4m7M8k3j83M27k28r9K29M3J47l09M8M5J5q8l7J69n1k92
$$ 114 53 -17 123 159 30 -44 -91 -43 -66 -249 178 -50 -149 80 123 270 -39 9 54 69 -19 -56 113 62 -230
6548b30J22J89M5j66K8K42R1l30o3K16j27m8L52p6j84K24k02P0j30n9J71L00n88
$$ -230 -108 81 126 -40 -12 230 321 -9 -72 144 17 -31 321 245 61 285 83 153 23 -36 135 435 -153
6571a53L09l2p5l91N36r1J6m4l4kj76K7N9J2J48k88L93j74MJ15k03Q6j47J09l55
$$ -153 156 124 49 -342 194 103 119 75 41 39 -137 -110 -51 -39 109 -179 214 40 44 159 -44 42 -105 4 -351
6596c51J44K69J34j27j94J95J4N3n2j30J38k42l7K2J01j90J08j62K85j41J29J15
$$ -351 -207 62 196 69 -125 70 84 137 85 -45 93 -149 -186 -164 -63 -253 -145 -307 -22 -163 -34 81
6618H1M3m7j09J18m9k24nj16J92rj06L29r6j73OJ92k33K82j96K22j94L8N6j43
$$ 81 124 77 -32 86 37 -187 -192 -308 -116 -125 -231 98 2 -171 -165 27 -206 76 -120 102 -92 -54 2 -141
6642a41L3j6k1N0J6M2j8r8L5J16l28K19J22k6P2j80J1J36K11q8n4j03o4J6L6J14
$$ -141 -108 -124 -145 -95 -79 -37 -55 -153 -118 -2 -330 -111 11 -15 57 -123 -112 24 235 147 93 -10 -74 -58 -22 92
6668I2O6n1m0q4k2K54j82J4J55k15q6J99K2m5m29Q05o33M58k5l20K35k34L10r3
$$ 92 158 107 67 -17 -39 215 33 47 202 -13 -99 100 122 77 -352 453 -180 278 253 -67 168 -66 244 151
6692A51k12k1J45P3K13k39n47N21P2o2m9k32L23k44M6k11L64N7k60J01k05M67
$$ 151 -61 -82 63 136 349 110 -437 84 156 94 45 -187 136 -108 -62 -273 91 148 -112 -11 -216 251
6714B51k97J63k05J27l14J97J29o0n7R5N2k59J61JK79k90k30J69l1j25J79Nk6
$$ 251 -46 117 -88 39 -275 -78 51 -9 -66 29 81 -178 -17 -16 263 -27 -257 -88 -119 -244 -65 -60 -86
6737h6n7k0Q1j23K8K8J02K81j85P3k58Pj67M37j69k36L05M8j16K08k86O5J18J68
$$ -86 -143 -163 -82 -205 -177 -149 -47 234 49 122 -136 -129 -296 141 -28 -264 41 89 -27 181 -105 -40 78 246
6761B46j69Nl51K00J0K5K08k08k0K03j88o2L38k25Q2J2q8q3o0K68Ok09n9L64j05
$$ 246 77 82 -269 -69 -59 -34 174 -34 -54 149 -39 -101 237 12 94 106 18 -65 -125 143 149 -60 -119 245 140
6786A40j17j78N44n11J4J63o3K4K21j99j55O44n11P9J51j45Q5Q4n46L54P5j52
$$ 140 23 -155 389 -122 -108 55 -8 16 237 38 -117 527 16 95 246 101 186 270 -276 78 153 1
6808AJ08r2K4q3r4J7K06k95M33j14%l6L19l66J22k48L33p5Nk00j7p0L7mJ96P7
$$ 1 109 17 41 -42 -136 -119 87 -208 225 111 111 75 394 28 150 -98 235 160 165 -35 -52 -122 -85 -89 107 184
6834A84j72p7K16k30n8J68nP2k89Q1K01k06n6R1L56k32K41l36k51p2M67j56k4
$$ 184 12 -65 151 -79 -137 31 26 98 -191 -110 91 -115 -171 -80 276 44 285 -51 -302 -374 93 -63 -87
6857h7Q8j40r4J30R7j96J93J8j47M6k91R9mM11Pk83L8r7n1K28%J91k80RJ92n8
$$ -87 1 -139 -233 -103 -6 -202 -9 9 -138 -92 -383 -284 -288 123 130 -153 -115 -212 -263 -35 -35 156 -124 -115 77 19
6883A9k66Q7j90L50j08j00O1K6lK34k14L0N6m5R6J13k87J69O3k31L5K71l16K06
$$ 19 -247 -160 -350 0 -108 -208 -147 -121 -124 110 -104 -74 -18 -63 33 146 -141 28 91 -140 -105 166 -150 56
6907E6J17j00Oj70O4O9r7K48j68K64k05k63J80j03L04l1l0q8K39k20j96L73j25
$$ 56 173 73 79 -91 -27 42 -55 193 25 289 84 -179 1 -102 202 171 141 53 292 72 -124 249 124
6930A24MJ73l94K88k27K64o5r1j32K31n0m48L11L04l76k8J85J10l07K01J27l71
$$ 124 128 301 -93 195 -32 232 167 76 -56 175 125 -323 -12 292 -84 -112 73 183 -124 77 204 -167
6952a67J20j05K33L46l02j20j86P4J03J56rm4N0j6p9j34qj90L57k5j13K62j62
$$ -167 -47 -152 81 427 125 5 -181 -107 -4 152 143 99 149 133 54 -80 -88 -278 79 54 -59 203 41
6975D1k3j14L04j50k55k7N45k89k5k51rL9J29K87k77J75J69k42j84K7K2J8R0Q5
$$ 41 18 -96 208 58 -197 -224 321 32 7 -244 -253 -214 -85 202 -75 100 269 27 -157 -130 -108 -90 0 85
6999H5J20j91n01K82O07k78j51j27kR6r8J34J00%l97K13R3j30K33j78J50k96K34
$$ 85 205 14 -487 -205 402 124 -27 -154 -156 -60 -158 -24 76 76 -321 -108 -15 -145 88 -90 60 -236 -2
7022bj2l43L48j02rR0m8k9J20p6k99K12N43l94j95K67K35j53k46n0M7K13nN8l12
$$ -2 -14 -357 -9 -111 -120 -30 -78 -107 13 -63 -362 -150 393 -1 -196 71 306 153 -93 -143 -96 117 112 170 -142
7047a42N2Q2Q9j16m7j62M88J4j68j55J97J29k10j75L11j05l72M84o3j05j16K40
$$ -142 -90 -8 81 -35 -82 -244 244 258 90 -65 132 261 51 -124 187 82 -290 194 131 26 -90 150
7069A50l5j20j12J84r4k96L69l84N37n4l45J78j26L91l13L80m42K16l72L60n6
$$ 150 115 -5 -117 67 -27 -323 46 -338 199 145 -200 -22 -148 243 -70 310 -132 84 -288 72 16
7090A6k16R1m4M1J4M10n87L37k76K63K8L0Q6J19l49L4k22K46k04Q7K47k05R2j27
$$ 16 -200 -109 -153 -112 -98 312 -275 62 -214 49 77 107 193 312 -37 -3 -225 21 -183 -96 151 -54 38 -89
7114h9K11o9j54j61K30j95L91k80j6k0OK4LJ00j1k34K85j42O8M21k36J45n20L90
$$ -89 122 53 -101 -262 -32 -227 164 -116 -132 -152 -146 -122 -119 -19 -30 -264 21 -121 -53 368 132 277 -243 147
7138A47k96K54k21J73m6j13j96P5l36M89M05k10j7k34J00k09K19j11O0K58l52
$$ 147 -149 105 -116 57 11 -102 -298 -223 -559 -70 335 125 108 -126 -26 -235 -16 -127 -67 191 -161
7159a61K67M4j97K33Kk47L08k15K1k42J52Q0J82l54J01m0O5j3q4J68k34J66K53
$$ -161 106 150 -47 186 188 -59 249 34 55 -187 -35 45 227 -127 -26 -66 -1 -14 -98 70 -164 2 255
7182B55K27n89k46K98j53K95K35R8l11j58M11m51J75P5K21k86Pl33K38K4k7J23
$$ 255 482 -107 -353 -55 -208 87 322 420 109 -49 362 -89 86 161 382 96 103 -230 8 32 5 128
7204A28j20L48l86Q6K5L5m4k19J33K8J41j4P3q4j37J74o3K34l89J59K78l00K2
$$ 128 8 356 -30 56 81 116 72 -147 -14 14 155 141 214 130 -7 167 104 338 -51 108 386 86 108
7227A08l6j25q3K20j85J89p3j96L46jj11Pq7m24O05j87J56L1N3m06o5K99k0k91
$$ 108 72 -53 -136 84 -101 88 15 -181 165 164 53 60 -27 -451 154 -33 123 154 207 -199 -264 35 15 -276
7251b76K14k19K67j07J37J40j22r4J07j57L5j1R3j46J66N6l55K10J23L5l04M5
$$ -276 -62 -281 -14 -121 16 156 34 -60 47 -110 -75 -86 7 -139 27 83 -272 -62 61 96 -208 -163
7273a63m7K65k90M50l19J09K62m37M9j7lJ70r7p7K90j19k41J06N7L36l54L94l89
$$ -163 -210 55 -235 215 -104 5 267 -170 -121 -138 -141 29 -68 -145 145 26 -215 -109 -52 284 -70 324 -65
7296f5L46k01n6%J00J62j70j55j34J38k84L67k00M25l85J77K6n2K29n98L71r2
$$ -65 281 80 24 24 124 286 116 -39 -173 -35 -319 48 -152 273 -112 65 91 39 268 -330 41 -51
7318e1J9Q0o6p9J86r6L6J22j0Nq5r4J19L7J40k47l0J13k41R7J46m1j42K22J13
$$ -51 -32 48 -18 -97 89 -7 29 151 141 146 61 -33 86 123 263 16 -14 99 -142 -45 101 60 -82 140 253
7343B53l74K84k20L98k54k08R7K79m73O7K00j11O9M7k04K32R0k34K02o2j78j85
$$ 253 -121 163 -57 341 87 -121 -24 255 -218 -151 49 -62 7 54 -150 82 172 -62 140 78 -100 -285
7365b85L89N0l80J35R4k1K0o2j81N11n23P4J01M21j83l21K5N3r7P4M2j75J11Q5
$$ -285 104 154 -226 -91 3 -18 2 -60 -241 270 -253 -179 -78 343 160 -161 -136 -83 -180 -106 -64 -239 -128 -43
7389d3p5j8K32l8j10J60k35Oj31J32M13q30L75N0K44k04M14n78O1L21k52J60J7
$$ -43 -118 -136 96 58 -52 108 -127 -121 -252 -120 293 -537 -162 -112 132 -72 342 -236 -175 146 -106 54 71
7412G1m28M01k61M40m60K65K0j28L55o13N16k11j94K04j33n3J46J90j91K0N0j31
$$ 71 -357 44 -217 223 -237 28 48 -80 275 -338 178 -33 -227 -23 -156 -209 -63 127 -64 -44 6 -125
7434a25K97k20K1J54J0k38J58j90N3K5m1L93j15m09N10n6l65M51Rr4k44P0jJ41
$$ -125 172 -48 -27 127 137 -101 57 -133 -80 -55 -96 297 182 -227 283 227 -138 313 322 228 -16 54 53 194
7458A94j32l5L8k04L01j92M6P1n6k1n9L83n9l61N08n25N8K1k8M1K04r1P1r9M8
$$ 194 62 27 65 -139 162 -30 16 87 31 10 -49 334 275 -86 422 -103 -45 -24 -52 -11 193 102 173 74 122
7483A22J26j53j00J51l21L41l15O8R0o8J94r9j73p1K38n6J13k9J04k64k25L90
$$ 122 248 95 -5 146 -175 166 -149 -81 9 -59 135 36 -137 -208 30 -26 87 58 162 -102 -327 63
7505F3n72P14k78K06j11N2k02K03K0o7K66j96k37O0J09j29L71m99J58K21m51L78
$$ 63 -509 205 -73 133 22 74 -128 75 95 28 294 98 -139 -79 30 -99 272 -227 -69 152 -299 79
7527G9j53J98j53k30K31J03k21J3K18k12J66j52J08j31M35l63r1J81k66K30R3
$$ 79 -74 124 -29 -259 -28 75 -146 -133 85 -127 39 -113 -5 -136 299 -64 -155 26 -240 -10 83
7548H3l2j5K07m41K18j14J65J3m5K1j36M6J06No0NJ55M9r1l29K41L52k62k81K04
$$ 83 51 36 243 -198 20 -94 71 84 39 60 -76 -30 76 81 21 26 181 230 139 -190 51 403 141 -140 64
7573F4J1m9J51k37J43k04K26L8K3j87J36J47m43J26J74M8k5p5L84l40k17J7J28
$$ 64 75 26 177 -60 83 -121 105 143 166 -21 115 262 -181 -55 119 167 142 67 451 111 -106 -89 39
7596C9J1k08M7J3l6L80k50j95K86k0q4R6J86m41L47k36J99m78N36k05m3j06J57
$$ 39 50 -158 -111 -98 -134 246 -4 -199 87 67 -17 79 265 -176 171 -65 134 -344 192 -13 -56 -162 -5
7619eq5K03k23Q0j85p7L32n1m22K78K36q7J31j23m0kj00NJ26q5J83l16Q1J6p7
$$ -5 -90 113 -110 -30 -215 -292 40 -11 -433 -155 81 -6 125 2 -38 -40 -140 -135 -9 -94 89 -227 -146 -130 -207
7644b07m6M52j45k94K67rK9r4O0j30k3J90m17M41j56J99l36M11P2l42R7k46L00
$$ -207 -253 199 54 -240 27 18 47 -47 13 -117 -140 50 -367 74 -82 117 -219 192 264 -78 19 -227 73
7667G3Pl98L53j34K9K87l20p2J65j88O2L22l25J95k21K33k05L07k91l6L12j11
$$ 73 80 -318 35 -99 -70 217 -103 -175 -10 -198 -136 186 -139 56 -165 68 -137 170 -121 -157 155 44
7689D4j27K6J03k00K90j48Q2j35K05p1j4Q7M2j94P4j94L35l17J33m1L7k35L19
$$ 44 -83 -57 46 -154 136 -12 70 -65 140 69 55 142 184 -10 64 -130 205 -112 21 -20 17 -218 101
7712A01J43j73j77L0j4j12N66m77P2j35K49L9j5j46JJ68o8n1J11j26R9J82l89
$$ 101 244 71 -106 -76 -90 -202 364 -113 -41 -176 73 112 97 -49 -48 120 52 1 112 -14 85 267 -122
7735a22J92J4J48j44j9n8Ql2J27j01p1j49K93J77j91k20K00l02J37M76l32k49
$$ -122 70 84 232 88 69 11 19 -13 114 13 -58 -207 86 263 72 -148 52 -250 -113 363 31 -218
7757b18J8k0K90k48j85M71k15K35m21K73j51K08n0o2M6r5J10k17R4J67O6o7p4
$$ -218 -200 -220 70 -178 -363 108 -107 128 -293 -20 -171 37 -13 -75 -29 -124 -14 -231 -137 30 96 29 -45
7780d5Nn6j72J31K39j27k5J50o2K82n52k32M38j27J33q2L06l49J60J1p0qP7k79
$$ -45 -40 -96 -268 -137 102 -25 -50 100 38 320 -232 -464 -26 -153 -20 -102 204 -145 15 26 -44 -52 25 -254
7804b54J63M68m95O2L77l99j54L12j5p8o4L4r0R7J92k29J08J32N0k16j36R6J36
$$ -254 -91 377 -118 -56 321 -78 -232 80 65 -13 -77 -43 -133 -36 156 -73 35 167 217 1 -135 -39 97
7827I7J22k55J1m3j35K44J23j94L78l39LK36k12K64l86q0J92qM34l62K8j22J57
$$ 97 219 -36 -25 -68 -203 41 164 -30 348 9 12 248 36 300 -86 -166 26 18 452 90 118 -4 153
7850A53j40j84L22n1k8k56J04J89k54K25n8l1N6j76L06j93q9J90k6k17J31l4J09
$$ 153 13 -171 151 100 72 -184 -80 109 -145 80 22 -9 47 -129 177 -16 -105 85 59 -158 -27 -61 48
7873D8N6m4j07j24J69q9L96m48K53l77J31L0Q9QO6R5o8J66l14J92j87Q0j04J02
$$ 48 104 60 -47 -171 -2 -91 305 -143 110 -267 -136 -106 -17 -9 57 152 84 250 -64 128 -59 21 -83 19
7897A9j46q8L48p8j73J11k7p8kj23J76r2j21J42M74n41J05J0L31m87J84j20K42
$$ 19 -127 -215 133 55 -118 -7 -34 -112 -114 -237 -61 -153 -274 -132 342 -199 -94 -84 247 -240 -56 -176 66
7920F6l2l05K89q0L9j58K86q4K88j42n5J57j74oM3J12l91J50j60K44r3j3Mk71
$$ 66 34 -271 18 -62 -23 -181 105 21 309 167 112 269 95 89 132 244 -147 3 -157 87 -6 -19 -15 -286
7944b86L68l25o3L15k94L52k17l8K32m8l3j34K89j92n4L7J0J39J41j32J92J77
$$ -286 82 -243 -306 9 -285 67 -150 -188 44 -4 -37 -171 118 -74 -128 -91 -81 58 199 67 259 436
7966D36o09J40P1l3L63l83o5J54q8K16K38m58Q5j24J62l0P0M5k47J93l54j41K89
$$ 436 -173 -33 38 5 368 -15 -80 74 -14 202 440 -18 67 -57 105 75 145 190 -57 136 -218 -359 -70
7989g0J27k0J78J5j94J14j13l07m8L77J75J30l17l60L24J84k45K18k42L2r6J14
$$ -70 57 37 215 230 36 150 37 -270 -318 59 234 364 47 -313 11 195 -50 168 -74 -42 -138 -24
8011b4J58o8k81N5P3J03l5J16q2J12j87k4j90M34j64j93MM2L3K59o4n0k13L2K4
$$ -24 134 66 -215 -160 -87 16 -19 97 15 127 -60 -84 -274 160 -4 -197 -193 -151 -118 141 77 27 -186 -154 -130
8036a30P7j83J43l9J73j58J1J48k21L05j46N5k8M5k62L25J82k45k37L49l08L03
$$ -130 -53 -236 -93 -132 41 -117 -106 42 -179 126 -20 35 7 52 -210 115 297 52 -185 164 -144 159
8058A59j56Q7J40l21o9K27j78j20Q7K24r5J5J74l92M71j09j80OM04m19j54j25
$$ 159 3 90 230 -91 -160 67 -111 -231 -144 80 -15 0 174 -218 253 144 -36 -30 374 -45 -199 -324
8080c24M35j69j33N8J92j77K12j77K98l62j85O4QK91J39K74o40K90r4j59K49P9
$$ -324 111 -58 -191 -133 59 -118 94 -83 215 -147 -332 -268 -260 31 170 444 -196 94 0 -159 90 169
8102A69l03N6J78o5O1j53R3m9J20K08n36K46J01J10m92J94L41l80J65Pj96R7q7
$$ 169 -134 -78 100 35 96 -57 36 -13 107 315 -221 25 126 236 -256 -62 279 -101 64 71 -125 -28 -115
8125a15L79r6j80J73nj03l34M37k71J76k30m0L65j81J5K01k52l6K50k78L8j46
$$ -115 264 168 -12 161 156 53 -281 156 -115 61 -169 -209 156 -25 -10 191 -61 -97 153 -125 -87 -233
8147b33L6K66j18r2J17j3O1l6j72K40k62J65j04j02Q7rJ39R5k3n49N86j70Q9j45
$$ -233 -197 69 -49 -141 -24 -37 24 -12 -184 56 -206 -41 -145 -247 -160 -169 -30 65 42 -507 79 -91 -2 -147
8171a47J68N0p5j04M5j5j28L00k38NJ03L2P6K9k08J15J21m5l4J22
$$ -147 21 71 -4 -108 -63 -78 -206 94 -144 -139 -36 -4 72 101 -107 8 129 84 50 172
8191A72
$$ Imaginary data points
##PAGE= N=2
##DATA TABLE= (X++(I..I)), XYDATA
0@%%%%%%%qJ6j6J6k4L2l2M0m8N6p2Q8j04J20j37J61j89K15k46K83l21L62m11M64
$$ 0 0 0 0 0 0 0 0 -8 8 -8 8 -16 16 -16 24 -24 32 -40 48 -56 64 -73 88 -101 114 -132 151 -170 192 -219 245
31B45n21N85o55P31q13R05j005J114j235J369j517J679j859K059k283K535k822
$$ 245 -276 309 -346 385 -428 477 -528 586 -649 720 -797 882 -977 1082 -1201 1334 -1488
48a488L152l532L979m516N170n989P052q488J0554j3802J9684l3663J24391J20451
$$ -1488 1664 -1868 2111 -2405 2765 -3224 3828 -4660 5894 -7908 11776 -21887 102504 222955
62B22955k75543j42984J15609K15101j0560j60994p7919J09053R7195l8833j04431
$$ 222955 -52588 -195572 -79963 135138 124578 -36416 -114335 -5282 91913 53080 -51351
73e1351j1901O2899M9548p040k1991l2901l3296j239O5192O4382k4973r7728l9448
$$ -51351 -63252 -353 49195 42155 20164 -12737 -46033 -47272 17920 82302 57329 -40399 -79847
86g9847O8462P4933k4176o8549k100N6982J2990n1420l2092L7616M4036j2400
$$ -79847 -11385 63548 39372 -29177 -31277 25705 38695 -12725 -44817 -7201 36835 24435
98B4435l4563L909J8332k1702l2051L0722O7975K002q2315n6232M7101Q2596M785
$$ 24435 -10128 -6219 12113 -9589 -41640 -10918 57057 59059 -23256 -79488 -32387 50209 54994
111E4994o4838l3264L3465L3341j6514k8379N726K2864P049n818o699j6104k1123
$$ 54994 -9844 -43108 -9643 23698 7184 -21195 -15469 7395 14444 8626 1927 -14177 -35300
124c5300J0660N1528L1780m7464p5815M178Q3720M1815n9712o3294L2478P1455
$$ -35300 -24640 26888 58668 11204 -64611 -60433 23287 65102 5390 -57904 -25426 46029
136D6029j2278q1889j7509Q4202N9293o0321q8264J8016Q7874J6715p2654l5136
$$ 46029 33751 -48138 -65647 18555 77848 17527 -70737 -52721 35153 51868 -20786 -55922
148e5922O0920N5076m6224q0222J1226Q9042L5252o2305o1154K0821N2815M873
$$ -55922 4998 60074 13850 -66372 -55146 33896 69148 6843 -54311 -33490 19325 24198
160B4198l1234o373K0661L866k0353n718J7843N919j7382L39K9391N560m4013
$$ 24198 -7036 -13409 7252 11118 -9235 -14953 2890 8809 -8573 -8234 21157 26717 -17296
173a7296l2843L7716O2804k618o6469l5721M3352N3303j6118n0165j808M5751
$$ -17296 -50139 -12423 50381 47763 -18706 -54427 -11075 42228 26110 -24055 -25863 19888
185A9888J5297l8524l1255K1374L8442J784k6489j2198R367L307o331P792J7546
$$ 19888 35185 -3339 -34594 -13220 25222 27006 517 -11681 -2314 993 -5338 2454 20000
198B0000l749k5023q311J9592J4104j3583j3285J4323K0399j3610l4040q20L8064
$$ 20000 16251 -8772 -17083 2509 16613 3030 -10255 4068 24467 10857 -23183 -24003 14061
211A4061K1147k5596l0602Q470K6320j249k2415l86K4609P498k5286j8647J7335
$$ 14061 35208 9612 -20990 -12520 13800 12551 -9864 -10250 14359 21857 -3429 -22076 -4741
224d741K2074q834j8993Q709K0312j0210l2650j162M0552K4858l1439m3515Q811
$$ -4741 17333 8499 -10494 -1785 18527 8317 -24333 -25495 15057 39915 8476 -35039 -26228
237b6228M4877J0548l5556k2388K5063K9659j2400l4529n399K8699J8485j2228
$$ -26228 18649 29197 -6359 -28747 -3684 25975 13575 -20954 -26353 2346 20831 8603
249H603j7259p1M466l594K575J5295N662j9562k0359J0402K6834L152k5480j3391
$$ 8603 -8656 -8727 -4261 -7855 -5280 10015 15677 -3885 -24244 -13842 12992 16144 -9336 -22727
263b2727K1879K1681j4585k9769P83K9128J4969j6038k0321R97J2009K556j706
$$ -22727 -848 20833 6248 -23521 -22738 6390 21359 5321 -15000 -14003 -1994 562 -1144
276a144N720L968j3363j4711R812K3542J89k4009j0898K0942K0262j3130k9471
$$ -1144 4576 8544 -4819 -19530 -9718 13824 14013 -9996 -20894 48 20310 7180 -22291
289b2291o19L2609J8133k0433k8436J090K3039J2023q303j0719j405L765L37J837
$$ -22291 -22910 9699 27832 7399 -21037 -19947 3092 15115 6812 -3907 -5312 -1547 -1210 627
303F27L747j224p239O14J1394K307j4844j1179J3030K2518j363k5372j3803J7494
$$ 627 4374 3150 -4089 -3475 7919 10226 -4618 -15797 -2767 19751 18388 -6984 -20787 -3293
317c293K1475n799k0061o64J7045L822j5750r116J3206J5964n685j7792k636J4053
$$ -3293 18182 12383 -7678 -8342 8703 12525 -3225 -12341 865 16829 11144 -6648 -9284 4769
331D769O435j0388p023Q997R817o478j3378j027J1635P962m152p971j779J955
$$ 4769 11204 816 -6207 2790 12607 6129 -7249 -8276 3359 11321 7169 -802 -2581 -626
345f26N11K114N045j692q001k763Q277N435p398j0188N137J6532K238j9744j4764
$$ -626 -115 1999 7044 5352 -2649 -5412 2865 8300 902 -9286 -4149 12383 14621 -5123 -19887
360a9887J3614K3340q73k2517j1310J4501J5923n124j6660j835J4649Q461j0754
$$ -19887 -6273 17067 16194 -6323 -17633 -3132 12791 7667 -8993 -10828 3821 12282 1528
373A528j2878K423J0924M729l579n685k976K66K977L755J347l658n238K037O264
$$ 1528 -11350 -8927 1997 6726 3147 -2538 -5514 -5248 -2271 1484 2831 -827 -6065 -4028 2236
388B236p12q154j389R484O280p326j1647P82J2339O329q797q710M396R266l130
$$ 2236 1524 -6630 -8019 1465 7745 419 -11228 -10446 1893 8222 -575 -9285 -4889 4377 1247
403A247r851O61J0745N379q472j0672K761J1281L069p796m974M875M811k784m919
$$ 1247 -8604 -7943 2802 8181 -291 -10963 -8202 3079 6148 -1648 -6622 -1747 3064 280 -4639
418d639N66M320L298j174m394k286N58K967M292J371m784n920J573P939K059o251
$$ -4639 -4073 247 3545 2371 -2023 -4309 -3751 -784 3508 4879 95 -5825 -4252 3687 5746 -505
434e05m818M884P310j605r944l478R897R328m275j1649k433R187O185l771o959
$$ -505 -5323 -439 6871 5266 -4678 -8156 1741 11069 6794 -4855 -7288 1899 8084 4313 -2646
449b646N93O194J946n579l972L143N109P29k614l068j595J851L397J582k048l321
$$ -2646 -2053 4141 6087 508 -3464 -321 4788 5517 2903 -165 -1760 91 3488 5070 3022 -299
465b99q32K766L050j948m026J236M612O24m833m033K681O106Q02n082l737K606
$$ -299 -1131 1635 4685 2737 -1289 -53 4559 5183 350 -3683 -1002 5104 5906 824 -2913 -307
481c07L391j133l346J470L816q97m564k119L204M531m76n057j975L062K648j421
$$ -307 3084 1951 -1395 75 3891 2994 -1570 -3689 -485 4046 3570 -1487 -3462 -400 2248 827
497H27l174m30K499L026p04m528l487K745N865K575m305p606r85P206O941l830
$$ 827 -2347 -2777 -278 2748 2044 -2484 -5971 -3226 2639 5214 909 -6697 -7682 -476 6465 2635
513B635q870k259Q101O480l971r036k631Q531Q475l398j1146l773P560Q449j61
$$ 2635 -6235 -8494 -393 6087 2116 -6920 -9551 -1020 7455 4057 -7089 -10862 -3302 5147 4986
528D986q010n036L257N913J680l838l383Q74K754K134j067l752j166L270L233
$$ 4986 -3024 -8060 -4803 1110 2790 -1048 -4431 -3557 -803 1331 264 -3488 -4654 -1384 1849
543A849J4k939k576J87L240K709j154k514j052N16J235J290j77o81j13n13k02
$$ 1849 1863 -1076 -3652 -3465 -225 2484 1330 -1184 -2236 -1720 -485 805 628 -53 -166 -679 -881
560h81Q91K077k94k529q94K382K504k25l952k575K983N720J039o321n418K501
$$ -881 10 2087 1793 -736 -1630 752 3256 3031 -921 -3496 -513 5207 6246 -75 -5493 -2992
576b992P630L867n030q158j89P668N388m037o978j073N374M843j449n109k902
$$ -2992 4638 8505 3475 -4683 -4872 2796 8184 4147 -2831 -3904 1470 6313 4864 -245 -3147
591c147K854L588J928j019m080l740O71P183M726l985r370l702Q348J0712j918
$$ -3147 -293 3295 5223 4204 124 -3616 -2945 4238 8964 4979 -4391 -8093 255 10967 9049
606I049j2851p266R098J2982n58j3622q602P383J4494J473j2785r529M651J1489
$$ 9049 -3802 -11068 -1970 11012 10454 -3168 -11770 -4387 10107 11580 -1205 -10734 -6083 5406
620E406L851o286q426j654N808O039O70n216n200j193N888O892j768r512n632
$$ 5406 9257 2971 -5455 -7109 -1301 4738 5408 192 -5008 -6201 -313 6579 4811 -4701 -10333
635a0333O505J1149J714j1451j0331M315J4743N131j1735j2140K569J3548O225
$$ -10333 -3828 7321 9035 -2416 -12747 -8432 6311 11442 -293 -12433 -9864 3684 9909
648I909q396j1344J044J0639N227p043p773J320O991L322l900m540Q86L574O9
$$ 9909 1513 -9831 -8787 1852 7079 36 -7737 -6417 574 3896 -4 -4544 -3658 -84 -15
663a5k013L04K763j423l268o42M340L147k329n156m98N150L018l577l826J968
$$ -15 -2028 -1724 1039 -384 -3652 -4294 46 3193 864 -4292 -4790 360 3378 -199 -4025 -2057
679b057L785m74l315J77L154P62m470j804N798N323m996j0153J171J2745O906
$$ -2057 1728 1254 -2061 -1884 1270 2032 -2438 -4242 1556 6879 1883 -8270 -7099 5646 12552
694A2552j0425j3909K304J6991Q174j3097j6016M409J7926O264j2892j3970L741
$$ 12552 2127 -11782 -9478 7513 15687 2590 -13426 -9017 8909 15173 2281 -11689 -7948
707g948J4955N255r441r748K129P982L455k670l594j968q6K464L544K091m019
$$ -7948 7007 12262 2821 -6927 -4798 3184 6639 3969 375 -1593 -1679 785 4329 6420 2401
722B401p192n72Q919P421n687j2253j548J1273J0136n363j3680n019J1631J1752
$$ 2401 -4791 -5363 3556 10977 5290 -6963 -8511 2762 12898 7535 -6145 -11164 467 12219
736A2219l196j3192n695P643J0805N44r917p130L973Q897J938n813n261K39M674
$$ 12219 9023 -4169 -9864 -2221 8584 9128 -789 -7919 -3946 4951 6889 1076 -4185 -3946 728
751G28L156r10l451k933M01K760L888J81n320n082K475Q193K037o948p013K539
$$ 728 3884 2974 -477 -3410 -3009 -249 3639 3820 -1500 -6582 -4107 4086 6123 -825 -7838 -5299
767e299R730K155q292p104M736R281j54r086m284P124P275m066q898M29R537L213
$$ -5299 4431 6586 -1706 -8810 -4074 5207 5053 -4033 -8317 -1193 6082 2016 -6882 -6453 3084 6297
783F297q607p568N803J0944r12j1200n971Q878J0541k931j1672l774Q891P711
$$ 6297 -2310 -9878 -4075 6869 5957 -5243 -11214 -2336 8205 5274 -6398 -10172 -1281 6430
797F430l260p933j930N069M887n44m021k364P59J463L252J863l234n178m30O111
$$ 6430 3170 -4763 -6693 -1624 3263 2719 -1302 -3666 -2907 -1444 1808 3671 437 -4741 -5171 940
813I40N563l149q065k902P127Q230j825r541l658N842Q106J10p754n575K862P642
$$ 940 6503 3354 -4711 -7613 -486 7744 5919 -3622 -7280 -1438 6668 6778 -976 -6551 -3689 3953
829C953L537n319o255m25N626N044j126o242l584L504N856J264m242m486J38M627
$$ 3953 7490 2171 -4084 -4509 1117 6161 5035 -1207 -4791 -1287 4569 5833 1591 -2895 -2757 1870
845A870L904j725m707l111K331N666K680m009p300k70P696N729m130r046j505
$$ 1870 5774 4049 -658 -3769 -1438 4228 6908 2899 -4401 -4671 3025 8754 4624 -4422 -5927
860e927P747O606l134r465j562P460N802l648p183r67N581L436k311m368O9K961
$$ -5927 1820 8426 5292 -4173 -5735 1725 7527 3879 -3304 -4271 1310 4746 2435 -1933 -1864 1097
876A097P11j698n88J004j00j209K08J606M36j732j790Q21K849o50k388r21J954
$$ 1097 1808 110 -478 526 426 -783 -575 1031 1467 -265 -2055 -1234 1615 965 -1423 -2344 -390
893c90J208q38j532M45N01J28p43K70Q14k02j388p23J979R37j302j480K82J765
$$ -390 818 -20 -1552 -1107 -606 -478 -1221 -951 -137 -339 -1727 -2450 -471 466 -836 -2316 -2034 -269
911b69L37j200j380P03J666K87j706j88N95J49O3J6J38o3o26R4Q65N48o84q78
$$ -269 68 -1132 -2512 -1809 -143 144 -1562 -1750 -1155 -1006 -943 -927 -789 -852 -1478 -1384 -519 29 -655 -1533
931a533J25J204l1n23j57J74M52J37k43j85o9J77K07M52J94m32j074R07J857k40
$$ -1533 -1408 -204 -235 -758 -915 -741 -289 -152 -395 -580 -649 -472 -265 187 381 -51 -1125 -218 1639 1399
951A399j771j221J807J559j71k660l28K361J779j433k369K50K341R06j396j300
$$ 1399 -372 -1593 214 1773 1602 -1058 -1386 975 2754 1321 -1048 -798 1543 2449 1053 -247
967b47K81J504Q35j342j064M57R89J00k79n94o71O53J107m7q25o73k65J325J259
$$ -247 34 1538 2373 1031 -33 424 1413 1513 1234 640 -31 622 1729 1682 857 184 -81 1244 2503
986B503j187j431K08J466Nn49j052M0J436L81j245j192J128O66m55p31L23N50
$$ 2503 1316 -115 93 1559 1564 1015 -37 3 1439 1820 575 -617 511 1177 722 -9 314 864
1004H64j21q27j12K74J129n95j392L98R18J47p50p96K56L47P46k31j250l65Q01
$$ 864 743 -84 -196 78 1207 612 -780 -382 536 683 -67 -863 -607 -260 486 255 -995 -1360 -559
1023e59O59J6n53r23l01J579L92q06j373K45J169M62p16r94l24J350R46q67j086
$$ -559 100 116 -437 -1360 -1661 -82 310 -496 -1869 -1624 -455 7 -709 -1703 -2027 -677 269 -598 -1684
1042a684L09Q11L7m08r2J4K6K38o07L72M13o76l26N54J149j73j006l20K82J035
$$ -1684 -1375 -564 -527 -935 -1027 -1013 -987 -749 -1356 -984 -571 -1247 -1573 -1019 130 -43 -1049 -1369 -1087 -52
1062e2J98q48q68Q67Q32l61L7m84m94R93O87r1r85n07Q06O98O84j090j134J24
$$ -52 146 -702 -1570 -703 129 -232 -195 -679 -1173 -180 507 416 -569 -1076 -270 428 1112 22 -1112 -988
1082i88J981M35j706r34P77J997L24j439j457P75J857J66j143r65N95R81K79n32
$$ -988 993 1428 -278 -1212 -435 1562 1886 447 -1010 -235 1622 1788 645 -320 275 1256 1535 1003
1100A003o65k25R05M40J66r00q07N06J097O39j364j099L21J477M66r08r39k5J225
$$ 1003 338 113 1018 1458 1624 724 -83 423 1520 2159 795 -304 17 1494 1960 1052 113 88 1313
1119A313P15j272r48P51P04j47l77j09Q0k8m3l38O09k14q48m72J347M52n21r78
$$ 1313 2028 756 -192 559 1263 1116 739 630 710 682 639 301 910 696 -152 -624 723 1175 654 -324
1139c24J08P69j44k10o16o2O49J00m91q5K42j46l77M15L40n60n67j38N08P96j58
$$ -324 -216 553 409 199 -417 -479 170 270 -221 -306 -64 -210 -587 -172 168 -392 -959 -1097 -589 207 49
1160D9j146m35J174L04o75n38L29J5J48k31K75J84J35j313M35J414N8j702p17
$$ 49 -1097 -1532 -358 -54 -729 -1267 -938 -923 -775 -1006 -731 -547 -412 -1725 -1290 124 182 -1520 -2237
1179b237J309J489l58j843o67J357J365m26j609j5J070L38r1m58k8k67J21P48
$$ -2237 -928 561 203 -1640 -2307 -950 415 -11 -1620 -1635 -565 -227 -318 -776 -804 -1071 -950 -202
1197b02M80L6r88o03O63J899n03k037l26J904J260j041j340k84J292J061p20p40
$$ -202 278 314 -674 -1277 -614 1285 782 -1255 -1581 323 1583 542 -798 -1082 210 1271 551 -189
1215a89N05J51j14j28R43k30j156k90J305J122l83j875n10J927J429j396j443
$$ -189 316 467 353 225 1168 938 -218 -508 797 1919 1536 -339 -849 1078 2507 1111 -332
1232c32O25J220M5j166J08R95q1j181o37J686J080j110k562R40K781M73k611k339
$$ -332 293 1513 1558 392 500 1495 1414 233 -404 1282 2362 1252 -1310 -370 2411 2884 273 -2066
1250b066J651K683O21k887j635J718J974j78k100l7R37k50M3L67K84q24j348N5
$$ -2066 -415 2268 2889 2 -1633 85 2059 1881 -219 -256 681 431 474 841 1125 301 -1047 -992
1268i92K403J182k522k869J114L517P40k611k927R12L318J179k345k697P34J880
$$ -992 1411 2593 71 -2798 -1684 1833 2573 -38 -2965 -2053 1265 2444 99 -2598 -1864 16
1284A6J371p86j726j566R60K203J029j890k273J94K368J634j100l179j38K697
$$ 16 1387 601 -1125 -2691 -1731 472 1501 -389 -2662 -2468 -100 1534 434 -2745 -2883 -186
1300a86J369j330j753Q5Q94J70K57K04l56j129n51J657K324q43l684r92L860K983
$$ -186 1183 -147 -1900 -1815 -921 -751 -494 -290 -646 -1775 -2326 -669 1655 812 -2872 -3864 -4 2979
1318B979k511m264N55M387K031l692l349K168L985m75l855o15L399J647k512k496
$$ 2979 468 -3796 -3241 1146 3177 -515 -3864 -1696 2289 1814 -2041 -2656 743 2390 -122 -2618
1334b618J611L481p54m167k14M040K195l461l309J750M381N48l877k534K850L181
$$ -2618 -1007 2474 1720 -2447 -2661 1379 3574 113 -3196 -1446 2935 3483 -394 -2928 -78 3103
1350C103j484k842L73K650j18k105m53K323R96j960k175J783L073o83l520j192
$$ 3103 1619 -1223 -850 1800 1682 -423 -876 1447 2443 483 -1692 91 3164 2481 -1039 -2231
1366b231L315K417j504k812o16K278J982q31k129j323J385J688P08j180j971n48
$$ -2231 1084 3501 1997 -815 -1431 847 2829 1998 -131 -1454 -69 1619 2327 1147 -824 -1372
1382a372K249J767j111k386o16K057K051r54k920l7J751J126j190l82N92m19j129
$$ -1372 877 2644 1533 -853 -1469 588 2639 1685 -1235 -1272 479 1605 415 33 625 206 -923
1399i23M50J859K19k206k493K158M000k41n210k549M836M535k679n801k49N223
$$ -923 -473 1386 1605 -601 -3094 -936 3064 2823 -2387 -4936 -100 4435 1756 -4045 -4294 929
1415I29L069l445n070J442N249K94m079k060L359K558k357l182J620L239l32l931
$$ 929 3998 553 -4517 -3075 2174 2468 -1611 -3671 -312 2246 -111 -3293 -1673 1566 1234 -2697
1431b697m90L911J543l220l119K109M412j240l483j334L623K233k391k939J092
$$ -2697 -3187 724 2267 -953 -4072 -1963 2449 1209 -2274 -3608 15 2248 -143 -3082 -1990
1446a990L160p2k928r57K851J560k054j821J138K189n7k145n83J640J046j005
$$ -1990 1170 1098 -1830 -2787 64 1624 -430 -2251 -1113 1076 1019 -1126 -1709 -69 977 -28
1462b8r51N73L59Q8j31M96K09j123n21J011J555n63k084M0K553M98j793j533J311
$$ -28 -979 -406 -47 41 -90 406 615 -508 -1029 -18 1537 974 -1110 -1070 1483 1981 188 -1345 -34
1481c4J645k12j370l34J229L79j088p94K024L22j840j255K142K210j139l450K23
$$ -34 1611 1399 29 -305 924 1303 215 -579 1445 1767 -73 -1328 814 3024 1885 -1565 -1342
1498a342L368J872l353l419K091M302L5m686j275L359K352j841k874L65L327J19
$$ -1342 2026 3898 545 -2874 -783 3519 3554 -1132 -2407 952 3304 1463 -1411 -1046 2281 2400
1514B400k762r75K624Q76k315j203J337K299j251k342l78L507O53k761k377K653
$$ 2400 -362 -1337 1287 2163 -152 -1355 -18 2281 1030 -1312 -1690 1817 2470 -291 -2668 -15
1530a5K671j555k989N6K801Q30k429j586J540K139p01k501N44J981J1k089o54
$$ -15 2656 1101 -1888 -1832 969 1799 -630 -2216 -676 1463 762 -1739 -1195 786 797 -1292 -1946
1547a946K115R21j710j125P12J773o28k063l9K635N34k236j389K144J384j176
$$ -1946 169 1090 -620 -1745 -1033 740 112 -1951 -1990 645 1179 -1057 -2446 -302 1082 -94
1563i4j844J72K210M08j766j101J503J458j390j495P32J832o65j527j62K059P38
$$ -94 -1938 -1766 444 852 -914 -2015 -512 946 -444 -1939 -1207 625 -40 -1567 -1729 330 1068
1580A068j996j178J717J826j267k455J109K695o10j908j119K208J603j146k302
$$ 1068 -928 -2106 -389 1437 170 -2285 -1176 1519 909 -999 -2118 90 1693 547 -1755
1595a755O66K790k06k215p42K220J233j614j824J295J972n40k251k19K471J192
$$ -1755 -1089 1701 1495 -720 -1462 758 1991 377 -1447 -152 1820 1280 -971 -1190 1281 2473
1611B473k388j535J653K091j399k041N68K101N03j819j296K142J538j768k188
$$ 2473 85 -1450 203 2294 895 -1146 -578 1523 2026 207 -1089 1053 2591 823 -1365
1626a365J142K623l03k483o13K037J483j741j798Q70K053k21k290l12K150J256
$$ -1365 -223 2400 2097 -386 -999 1038 2521 780 -1018 -148 1905 1684 -606 -918 1232 2488
1642B488k058j624J277J442l58j923m51K395N47j767j555J887J443j552j121K63
$$ 2488 430 -1194 83 1525 1167 -756 -1207 1188 1735 -32 -1587 300 1743 191 -930 -667
1658f67J697K64j585r24J101J350j565j103P82J504n22j749K52J690O53j764j201
$$ -667 1030 1294 -291 -1215 -114 1236 -329 -1432 -650 854 332 -1417 -1165 525 1178 -586 -1787
1675a787J016J843n81k152J90J893Q5j509q48J595J144r64j467K81J634O9j730
$$ -1787 -771 1072 491 -1661 -1471 422 507 -1002 -1850 -255 889 -75 -1542 -1261 373 442 -1288
1692a288p80J856J257j628j338J045J451k32j678l16J745N39j166j426J760P50
$$ -1288 -2068 -212 1045 -583 -1921 -876 575 343 -1335 -1651 94 633 -533 -1959 -199 551
1708E51o51j536O09J463J96j573m36J338J037j242j525O88K042N3k104n03J863
$$ 551 -100 -1636 -1027 436 632 -941 -1377 -39 998 -244 -1769 -1081 961 1014 -1090 -1593 270
1725B70J222j405j033K24J691M00j792o98K034N63j680n38J010J050n36j581M25
$$ 270 1492 87 -946 -722 969 1369 -423 -1121 913 1476 -204 -742 268 1318 782 -799 -374
1742c74J645K05j445r59J424J207j088j265R59J298n90j192l05J354O65o44j406
$$ -374 1271 1476 31 -928 496 1703 615 -650 309 1607 1017 -175 -480 874 1539 895 -511
1759e11N71J629o76j322J65J067M87q69p97N47J232l84j459R6J275K03j333n02
$$ -511 60 1689 1013 -309 -144 923 1410 541 -256 291 1523 1139 -320 -224 1051 1254 -79 -581
1777e81R99P26o15j040N72M11N17j177o80R24R90j088j046O32J093m07j151L13
$$ -581 418 1144 529 -511 61 472 989 -188 -868 56 1046 -42 -1088 -456 637 230 -921 -608
1795f08Q07N49j174n61R69Q48j041r47N09J134l07r32m07P26R11j107p09N27J136
$$ -608 199 748 -426 -987 -18 830 -211 -1158 -649 485 178 -754 -1161 -435 476 -631 -1340 -813 323
1814C23k04j350o8R77N69p92q28M16J166P0j404K11O84P99j187p20N01J200l09
$$ 323 119 -1231 -1299 -322 247 -545 -1373 -957 209 279 -1125 -914 -230 569 -618 -1338 -837 363 54
1833E4j424L57J404n1j174o05J058R97n83j238J08J595j44p14n9Q0P20Kq87o3
$$ 54 -1370 -1013 391 340 -834 -1439 -381 616 33 -1205 -1097 498 354 -360 -419 -339 381 383 -504 -567
1853e67Q87K08p59R4K85J74L6o71M82K37L1m38r1O51K96p00n12Q87K02j24k70
$$ -567 320 528 -231 -137 148 322 358 -313 169 406 437 -1 -92 559 855 155 -357 530 732 608 338
1874C38K47R2j55j64q7L17L6k46m67O24L47m53l10N55K58o1n36n53P50O65n27
$$ 338 585 677 522 358 271 588 624 378 -89 535 882 429 119 674 932 871 335 -218 532 1197 670
1895F70o18Q6P00r0m97J21Q1J57j36l96k78O59J43l53n07O31J41l95k82K58K30
$$ 670 52 138 838 748 251 372 453 610 474 78 -200 459 602 249 -258 373 514 119 -163 95 325
1916C25J35l76p01K84O93l26m11jJ65J68l29J76l63M05L0j42k55K46Q2l3m42M10
$$ 325 460 84 -617 -333 360 34 -377 -378 -213 -45 -374 -198 -561 -156 -126 -268 -523 -277 -195 -228 -670 -260
1938b60R0o6j68k76n8P80k58m67j22K08K17L2k91j00j50O16J14m84j33J21L49
$$ -260 -170 -236 -404 -680 -738 42 -216 -683 -805 -597 -380 -348 -639 -739 -889 -273 -159 -643 -776 -655 -306
1959c06J03q4m81L03J76l1j72k23L78J63r5j07K98J60k3l81k39L38O54o46l26
$$ -306 -203 -287 -768 -465 -289 -320 -492 -715 -337 -174 -269 -376 -78 82 59 -322 -561 -223 431 -215 -541
1980e41N84M21k83N2m52k43Q88J81j055j55Q33P01n61p48N32L36J61kp61K82O13
$$ -541 43 464 181 233 -219 -462 426 607 -448 -603 230 931 370 -378 154 490 651 649 -112 170 783
2001G83j35m37j07M14K17j56l68j74Q74M44j036m96M53J021k40j072o7O51K60
$$ 783 648 211 104 518 735 579 211 37 911 1355 319 -177 276 1297 1057 -15 -82 569 829
2020H29n7p22j23Q28L95r14m71K60J051m33p78K03M59N92r01o21N30Q01j77j125
$$ 829 772 50 -73 755 1150 236 -235 25 1076 643 -135 68 527 1119 218 -403 127 928 751 -374
2040c74l8P41N19m51q06j88N63P76o44n28K40M24J56n97k98K35Q9L69n93m33M55
$$ -374 -412 329 848 397 -409 -597 -34 742 98 -430 -190 234 390 -207 -505 -270 -181 188 -405 -838 -383
2061c83J34Q8j61J02k21N55o44q6K53J90q2m91N8K71M78n54m85j78Q58N86q60
$$ -383 -249 -161 -322 -220 -441 114 -530 -616 -363 -173 -255 -746 -688 -417 61 -493 -978 -1156 -298 288 -572
2082e72m59L8J145Q0j211j15P13N99k20p68l21J138R4l74o88L03J042m88l66m24
$$ -572 -1031 -993 152 232 -979 -1094 -381 218 -2 -770 -1091 47 141 -233 -921 -618 424 -64 -430 -854
2102h54R03M15o54m89jJ172J14j106k15Q83N88m70q73J59L45P34q53p9L47Q38
$$ -854 49 464 -190 -679 -680 492 606 -500 -715 168 756 286 -587 -428 -83 651 -202 -281 66 904
2122I04n13m96L7L22P02p73l78K45R08k56n79o8J41O42k81n79L66O04k47k96l78
$$ 904 391 -105 -68 254 956 183 -195 50 958 702 123 55 196 838 557 -22 344 948 701 405 27
2143B7K4O41j16l45r3J79K39j28K08m4m31L40K83m93M5K27j18J2k91j12M58N5
$$ 27 51 692 576 231 138 317 556 428 636 592 161 501 784 291 336 563 445 457 166 54 512 567
2165E67J00o87JO10l18n75L87j1K40j67m75k66Q69L9n37K12J52j40L19m73n74
$$ 567 667 -20 -19 591 273 -302 85 74 314 147 -328 -594 275 314 -223 -11 141 1 320 -153 -727
2186g27P35J70k63m41l6O27k42m25P8%N50j92o81k29J081j14m89m31P43L05l25
$$ -727 8 178 -85 -526 -562 65 -177 -602 -524 -524 26 -166 -847 -1076 5 -109 -598 -1029 -286 19 -306
2207c06j82k01N08j8r8n50M49M10l15o01P5O96K2l02k05J99L02j73k96R2N87L20
$$ -306 -488 -689 -181 -199 -297 -847 -398 12 -303 -904 -829 -133 -111 -413 -618 -419 -117 -290 -586 -494 93 413
2229D13p84J30J50J69k15j14l58Q10o9l86J24j14L57L8m25N44r2k19j56M34J92
$$ 413 -371 -241 -91 78 -137 -251 -609 201 132 -254 -130 -244 113 151 -274 270 178 -41 -197 237 429
2250D29j30k05LK79l60L07l96M60L09l33k07J50L55j99l41J75K89l06M02m81Q
$$ 429 299 94 97 376 16 323 -73 387 696 363 156 306 661 462 121 296 585 279 681 200 208
2271B08O86p19J19j42N98J29m38k19N7N67j93m39k00P85j65m81k33Q7P28l55q6
$$ 208 894 175 294 152 750 879 441 222 279 846 653 214 14 799 634 153 -80 7 735 380 294
2292B94l51L60K66j53l21K78P4m38l76N4Q21j01o35j75K53J83k7j47j77P40n55
$$ 294 -57 303 569 416 95 373 447 9 -367 -313 508 407 -228 -403 -150 33 6 -141 -318 422 -133
2313a33J51ql48K01j77Q9j70L56j23k37j90L16K43m42n5J83O0r8J94k10O8J53
$$ -133 18 10 -338 -137 -314 -225 -395 -39 -162 -399 -589 -273 -30 -472 -527 -344 -284 -382 -188 -398 -330 -177
2335a77l89K14N33n87j54j1J40M8O4k99K31Q5j1l10K46J10L14k00k92j46O62k99
$$ -177 -566 -352 181 -406 -560 -571 -431 -383 -319 -618 -387 -302 -313 -623 -377 -267 47 -153 -445 -591 71 -228
2357b28p5j14M18m8J62o61J07N68j80k31K00K85K46m39l12J95J83K55l92J45J98
$$ -228 -303 -417 1 -47 115 -546 -439 129 -51 -282 -82 203 449 10 -302 -107 76 331 -61 84 282
2378B82K50m6m39j15O12j24k52j99N47k13J25m07K09K07L06m87J18K9j10K36k33
$$ 282 532 486 47 -68 544 420 168 -31 516 303 428 21 230 437 743 256 374 403 293 529 296
2399B96J49k69K91j7k08j8O37l50l48K89Q7N9J8l47k0J17j00j14J78J9o7l59K08
$$ 296 445 176 467 450 242 224 861 511 163 452 539 598 616 269 249 366 266 152 330 349 282 -77 131
2422A31L77n12K47j02n1J28n16L59L7Lk26l3K40L04l49l85L46k44K62j11j0q5
$$ 131 508 -4 243 141 90 218 -298 61 98 101 -125 -158 82 386 37 -348 -2 -246 16 -95 -105 -190
2444a90J59P5o67K34K47K74m81K24j67r1J12j41l07K84Q4L6p7j85L79k15l32N20
$$ -190 -31 44 -623 -389 -142 132 -349 -125 -292 -383 -271 -412 -719 -435 -351 -315 -392 -577 -198 -413 -745 -225
2466b25n56M24l0q1l2J86j97J57J39j96o7L63k13M3k95R9N2Q6J03Lk4pJ40j57
$$ -225 -781 -357 -387 -468 -500 -314 -511 -354 -215 -411 -478 -115 -328 -285 -580 -481 -429 -343 -240 -237 -261 -268 -128 -285
2490b85K4j85L37M40m29LL21K5l69J37k80L76K99l36m33L48M21j21j35n7L87r2
$$ -285 -261 -446 -109 331 -98 -95 226 251 -118 19 -261 115 414 78 -355 -7 414 293 158 101 488 396
2512C96m6n01L61j41L34l99o3J44K79o1k34K88N1K8l01k11K58L92j71j46L25K6
$$ 396 350 -151 210 69 403 4 -59 85 364 303 69 357 408 436 135 -76 182 574 403 257 582 608
2534F08l18J15m6l02O51k43k15k34M39k2M7r7m10N63n8k05j97M1J51K49l94K14
$$ 608 290 405 359 57 708 465 250 16 455 433 480 383 -27 536 478 273 76 117 268 517 123 337
2556C37l20L50k31O2m3k90M45k89j35r7M65k0Kl74R1j07L19m10j85J47Q3J56n87
$$ 337 17 367 136 198 155 -135 310 21 -114 -211 254 234 236 -138 -47 -154 165 -245 -430 -283 -200 -44 -631
2579f31N79k85J51j72o8J4L21k36k20M18j36L30m34pm14J95P11o01k50K47L06
$$ -631 -52 -337 -186 -358 -426 -412 -91 -327 -547 -129 -265 65 -369 -376 -790 -595 116 -485 -735 -488 -182
2600a82K4m09K50k82N29J12q53L4P18K10l28k17m1K92rj89N9P4K29j55k36L90
$$ -182 -158 -567 -317 -599 -70 42 -811 -777 -59 151 -177 -394 -435 -143 -152 -341 -282 -208 21 -134 -370 20
2622B0rP5j22r3j26J42K94l29L6J75L10m11O3J1Q9K7j8JL27j79K60p08J05L27
$$ 20 11 86 -36 -129 -255 -113 181 -148 -112 63 373 -38 25 36 125 152 134 135 462 283 543 -165 -60 267
2646B67J5Q4k75j16O4K90K1J4j72K99J40k00l13J15L53k99J15k27P8M54k54k88
$$ 267 282 366 91 -25 39 329 350 364 192 491 631 431 118 233 586 287 402 175 253 707 453 165
2668A65j62M01m5j36j36J78K12j22j66l68M92M97m48P0o45O14j20l15k1L6L2o9
$$ 165 3 404 359 223 87 265 477 355 189 -179 313 810 362 432 -213 401 281 -34 -55 -19 13 -56
2690e6k58K17L30l3k61J50j61J3J15J28o13K19L65k15k71R0L7J53L4n71k2P11
$$ -56 -314 -97 233 200 -61 89 -72 -59 56 184 -429 -210 155 -60 -331 -241 -204 -51 -17 -588 -610 101
2712A01m00J6j68n0L07l17p4K21l0J34M30p06M5L12J19k38J87k09j67K10o9m64
$$ 101 -299 -283 -451 -501 -194 -511 -585 -364 -394 -260 170 -536 -491 -179 -60 -298 -111 -320 -487 -277 -346 -810
2734h10K56O87n85j97q6O98l1n44K52R2M31k69r9m33M19R0L5k31K37J87l91J50
$$ -810 -554 133 -452 -649 -735 -37 -68 -612 -360 -268 163 -106 -205 -638 -219 -129 -94 -325 -88 99 -292 -142
2756a42j15K92k37K96l32K33K9K55j31j38QP6m7L85k68p2K6K8K18k76o1K31K50
$$ -142 -257 35 -202 94 -238 -5 24 279 148 10 18 94 47 432 164 92 118 146 364 88 27 258 508
2779E08n9l83J37L00p5j83l6l6K87l91k01J06M78%k20n36N59M07l39l07J92L65
$$ 508 449 66 203 503 428 245 209 173 460 69 -132 -26 452 452 232 -304 255 662 323 16 208 573
2801E73k5o71J6L07K16J44l92L3L22k58l00j84M72K17l88k02j11L49J29k43l70
$$ 573 548 -123 -107 200 416 560 168 201 523 265 -35 -219 253 470 82 -120 -231 118 247 4 -366
2822c66P57k54o8m92K06K95k22M5K5J58J85k87k11j39J03J59j39o3K34k12n2K31
$$ -366 391 137 69 -423 -217 78 -144 -99 -74 84 269 -18 -229 -368 -265 -106 -245 -308 -74 -286 -338 -107
2844a07m29M17j97k69M5N21l19q5J15J05K28m97J11o1M58j86m74J40L75l17j19
$$ -107 -536 -119 -316 -585 -540 -19 -338 -423 -308 -203 25 -472 -361 -422 36 -150 -624 -484 -109 -426 -545
2865e45J38K32n5k14n3J55L48J9n53J80J78L00m99j08L57L14o2l96J46K09J53
$$ -545 -407 -175 -230 -444 -497 -342 6 25 -528 -348 -170 130 -369 -477 -120 194 132 -264 -118 91 244
2886B44m43k23M40M39m35p04O14L67Pr5l96J90N43k88l99J81M05L00p76J18J95
$$ 244 -199 -422 18 457 22 -682 -68 299 306 211 -185 5 548 260 -139 42 447 747 -29 89 284
2907B84M09l99J40j64j08N27m90k48L89L34l67k41L52J06k8l92mJ62J36l11J88
$$ 284 693 294 434 270 162 689 199 -49 340 674 307 66 418 524 496 104 100 262 398 87 275
2928B75O6N9k81M1N1L77n12j93JL93L03p25l2J04N19m44k58O08J67j17n26n8K48
$$ 275 341 400 119 160 211 588 76 -117 -116 277 580 -145 -177 -73 446 2 -256 352 519 402 -124 -182 66
2951F6N00n58l43J94N63k54n78j35M07N99o63l04K76L68j88l58k00P72j27j98
$$ 66 566 8 -335 -141 422 168 -410 -545 -138 461 -202 -506 -230 138 -50 -408 -608 164 37 -161
2971a61n45M90L23l95m88K95N39J47l83o90N09M46l28l91p4L10K89m61JK03K38
$$ -161 -706 -216 107 -288 -776 -481 58 205 -178 -868 -359 87 -241 -632 -706 -396 -107 -568 -567 -364 -126
2992a26k23J58m03P55J58p23j33M79N88r67L04j38L82j95l59K56L56R4r12L32
$$ -126 -349 -191 -594 161 319 -404 -537 -58 530 -437 -133 -271 111 -84 -443 -187 169 263 -649 -317
3012c17K49K13j64n9O0K94l2l85L96L19l83k71p6N11J01m15p2o1O93n8m68q6L79
$$ -317 -68 145 -19 -78 -18 276 244 -141 255 574 191 -80 -156 355 456 41 -31 -92 601 543 75 -11 368
3035C68J90l81J10k35P66j24q58m7M36M08m22m69M74N30P9q41n9O27o6P0o95K55
$$ 368 558 177 287 52 818 694 -164 -211 225 633 211 -258 216 746 825 -16 -75 552 486 556 -139 116
3057A16N23j20k58j97j4O03o03l20N37J68J4n74m1M20J82n01J38K70R0m98l28
$$ 116 639 519 261 64 50 653 50 -270 267 435 449 -125 -166 254 436 -65 73 343 433 -65 -393
3078c93M78J69j98l56J32N47j37l65r5L25L11k41k04k71M63l9r51L68Q28l60m38
$$ -393 85 254 56 -300 -168 379 242 -123 -218 107 418 177 -27 -298 165 126 -825 -457 371 11 -427
3099d27n2L65K01m03l95j24P34J47m25k41J90L72l31k87q2O24L82n61m13M82M15
$$ -427 -479 -114 87 -316 -711 -835 -101 46 -379 -620 -430 -58 -389 -676 -758 -134 248 -313 -726 -244 171
3120A71l05l68L82J69K82p01j54M67J85l19n45M71L64K77p10j40N66J04n14j4
$$ 171 -134 -502 -120 49 331 -370 -524 -57 128 -191 -736 -265 99 376 -334 -474 92 196 -318 -332
3140c32r9N22P0l63l36R01p4o69J05L09O62n59k74N4J97J08j67j94O01P5m05o1
$$ -332 -431 91 161 -202 -538 363 289 -380 -275 34 696 137 -137 -83 114 222 55 -139 462 537 132 71
3162G1J72L50j61n41K83K94k67M3j24L4J66l4m05J12N47k83L9m12L78L40n38k9
$$ 71 243 593 432 -109 174 468 201 244 120 154 320 286 -119 -7 540 257 296 -116 262 602 64 35
3184C5J56L76k7l37q3K64K9m44o3O43l52j13k43j71R55o6o49l52L77Q57n21m40
$$ 35 191 567 540 203 120 384 413 -31 -94 549 197 84 -159 -330 625 559 -90 -442 -65 792 271 -169
3206a69M7L38R0l33k98L69M3J62o68N3O27k7p57O4M23K4k03j98K06K88j64j90
$$ -169 -122 216 306 -27 -325 44 87 249 -419 -366 261 234 -523 -459 -36 -12 -215 -413 -207 81 -83 -273
3228b73r8R5M42o40L1K99k02j28K07l13M85M5l90R1J36K4j83J41J90O6m14J2J94
$$ -273 -371 -276 166 -474 -443 -144 -346 -474 -267 -580 -95 -50 -440 -349 -213 -189 -372 -231 -41 25 -389 -377 -183
3251a83L85l56l25Q8J29M77n54L1P9N07k05n67J06K57K94o5o23K49O35j93k85
$$ -183 202 -154 -479 -391 -262 215 -339 -308 -229 278 73 -494 -388 -131 163 98 -525 -276 359 166 -119
3272a19j42N33j08n15K58j39L15J27m41J48J68O10l75m59L16M12l43m21L56J06
$$ -119 -261 272 164 -351 -93 -232 83 210 -231 -83 85 695 320 -139 177 589 246 -175 181 287
3292B87l58K79k49K04J81M0m61J40M07k00j61j53K44J00P2m60J64K11j07O5k62
$$ 287 -71 208 -41 163 344 384 -77 63 470 270 109 -44 200 300 372 -88 76 287 180 245 -17
3313a7O16k09q2j10j03L27m13K29k9J80o6m85M16k5L2k94K35J39n10N26o16L66
$$ -17 599 390 308 198 95 422 9 238 209 389 323 -162 254 229 261 -33 202 341 -169 357 -259 107
3335A07L8m2J3k58M75J41o51k2K82J14j41l88K02l2K02j06m39M06P3k39k08L44
$$ 107 145 103 116 -142 333 474 -177 -199 83 197 56 -332 -130 -162 40 -66 -505 -99 -26 -265 -473 -129
3357a29j21K53l79l4J2M01k71r2l20M82J36j62j98lK76K0p7l7R7j53J44j74n3
$$ -129 -250 3 -376 -410 -398 3 -268 -360 -680 -198 -62 -224 -422 -425 -149 -129 -206 -243 -146 -299 -155 -329 -382
3380c82L70r7j5k19o8K65L2j7j19j87N18k78o3J25J09M9k39K42k28R1M5R4l01
$$ -382 -12 -109 -124 -343 -411 -146 -114 -131 -250 -437 81 -197 -260 -135 -26 23 -216 26 -202 -111 -66 28 -273
3403b73J26N2J47k07K60k06J22RJ57l54K48L7m0N5p0k43L27m0M5j53K97q0O2O4
$$ -273 -147 -95 52 -155 105 -101 21 30 187 -167 81 118 78 133 63 -180 147 107 152 -1 296 216 278 342
3427C42N1j06o4L2j05k0M57l80M2J02o5l8r5N51l77k8q0m6j94O18l85j13K81l51
$$ 342 393 287 223 255 150 130 587 207 249 351 286 248 153 704 327 299 219 173 -21 597 212 99 380 29
3451B9n6L13k86j4J06J75j77m14K75O3J53k48P9L05j38k7k16p6p8L27l94L68K1
$$ 29 -27 286 0 -14 92 267 90 -324 -49 14 167 -81 -2 303 165 138 -78 -154 -232 95 -299 69 90
3474I0k57J1K91j60l16K20j79N1K03P3l32j44K92J30M9j90J29k83J58j56m1K28
$$ 90 -167 -156 135 -25 -341 -121 -300 -249 -46 27 -305 -449 -157 -27 22 -168 -39 -322 -164 -320 -361 -133
3496a33J06l1P1j57l2N3J26k13K67l19j55N01k91j46MJ0N3n7L53j15K64k10j79
$$ -133 -27 -58 13 -144 -176 -123 3 -210 57 -262 -417 84 -207 -353 -349 -339 -286 -343 10 -105 159 -51 -230
3519b30L28l28k27J31O64l73l42J54N6J56qJ37j63N1J1o7J9N1k18K73j61L08p3
$$ -230 98 -230 -457 -326 338 -35 -377 -223 -167 -11 -19 118 -45 6 17 -50 -31 20 -198 75 -86 222 149
3542A49O7q5j48o0K44J45j96M9J89k29qQ5N3K48o16K28kk5K87p3m81M69j22J55
$$ 149 216 131 -17 -77 167 312 116 165 354 125 117 202 255 503 -113 115 113 88 375 302 -179 290 168 323
3566C23m3M6j04J31k67K63k43N4k9k01L69k86J88k95J41K1Q7k60qP0K35p1k38
$$ 323 280 326 222 353 86 349 106 160 131 -70 299 13 201 -94 47 68 155 -105 -113 -43 192 121 -117
3589a17n0O11n31j8K66j60J89l88K78j13J64k29M4m3K63l34n10K61L31K56j33
$$ -117 -167 444 -87 -105 161 1 190 -198 80 -33 131 -98 -54 -97 166 -168 -678 -417 -86 170 37
3610C7m65K15J56L4J47m73L65O1m05P8j77L96j89L8qj45L97l76J31m6L62l84k35
$$ 37 -428 -213 -57 -23 124 -349 16 77 -328 -250 -427 -31 -220 -182 -190 -335 62 -314 -183 -229 133 -251 -486
3633d86P5M70k88J27l0j77K11R9l56P1L09K0j30o3J18r0j40J82j02J50o1j29Q7
$$ -486 -411 59 -229 -102 -132 -309 -98 1 -355 -284 25 45 -85 -148 -30 -120 -260 -78 -180 -30 -91 -220 -133
3656a33J72j14R5j52L50m9n7j77j72L83k21j50J51J91K38l33J61k3k4k0L4lL5
$$ -133 39 -75 20 -132 218 169 112 -65 -237 146 -75 -225 -74 117 355 22 183 160 136 116 150 147 182
3679A82qJ60m51O2J80o4p3K73J51m04J24k36K97J43l63M8J66m0J87k51k83M91
$$ 182 174 334 -117 -55 125 61 -12 261 412 8 132 -104 193 336 -27 21 187 147 334 83 -200 291
3701B91o0k54J67R7K1j37N7q6q9J83M1j78k36P17j38k52l49L08O8nl46k7J34L21
$$ 291 231 -23 144 241 262 125 182 96 7 190 231 53 -183 534 396 144 -205 103 171 166 -180 -207 -73 248
3725B48q4l34L44q2l32k64L77J18M33l65j5k6J94m36M9J20r2K65l50Q7Ok1l89
$$ 248 164 -170 174 92 -240 -504 -127 -9 424 59 44 18 212 -224 -175 -55 -147 118 -232 -145 -139 -160 -549
3748e49L16J35j70j04K77m9j17L10l18J74n6j08Jj95L90N8j02k37J85M0J6j7n38
$$ -549 -233 -98 -268 -372 -95 -144 -261 49 -269 -95 -151 -259 -258 -453 -63 -5 -107 -344 -159 -119 -103 -120 -658
3771f58O12p8l58j06L47K84K23m83k62O25m6o54K60L81N30p90q1J27O6J74k58
$$ -658 -46 -124 -482 -588 -241 43 266 -217 -479 146 100 -554 -294 87 617 -173 -254 -127 -61 113 -145
3792a45k47N50Q7m2m76J52O65m78l7R3k7L56n6o09M81j60K23m02O4J85P0k70L96
$$ -145 -392 158 245 203 -273 -121 544 66 29 122 95 451 395 -214 267 107 330 -72 -8 177 247 -23 373
3815C73k72L27k94n5J6P1j23M6L1k33K96nR2l31K13l89L92l56L75L62n08K37J64
$$ 373 101 428 134 79 95 166 43 89 120 -113 183 178 270 -61 152 -237 155 -201 174 536 28 265 429
3838D29m10K10k22r1O5K1K15j88j54L57k98K20k2j07j43j21J02j8J00P0r2K8M33
$$ 429 19 229 7 -84 -19 2 217 29 -125 232 -66 154 132 25 -118 -239 -137 -155 -55 15 -77 -49 384
3861C84n04j82O1L15%k28L1K11n2r0l63L06m5J16Lj25J01Q1m50K42k49L91J86
$$ 384 -120 -302 -241 74 74 -154 -123 88 36 -54 -417 -111 -156 -40 -37 -162 -61 20 -430 -188 -437 -46 140
3884A40n70J27K0N53l70l51K35p9J39j25j88M18JK84l82l86M01K09k45l9J24m1
$$ 140 -430 -303 -283 270 -100 -451 -216 -295 -156 -281 -469 -51 -50 234 -148 -534 -133 76 -169 -208 -84 -125
3906a25J75j70j36J47L30j99l62J12K43Q6k75Q9L94k28q5J4M3l0p1N4O7m5J32
$$ -125 50 -120 -256 -109 221 22 -340 -228 15 101 -174 -85 309 81 -4 10 53 23 -48 6 73 28 160
3929A60k96R5K66k8k26J20J7M0j42K72J62k41M2l92M35J09l63j16L65j11l7k42
$$ 160 -136 -41 225 197 -29 91 108 148 6 278 440 199 241 -151 284 393 30 -86 279 168 131 -111
3951a11K9L73J81k58l48K77M44r0l85J19m0K41o9m52J05J24K92j70k75J52K56
$$ -111 -82 291 472 214 -134 143 587 497 112 231 191 432 363 -89 16 140 432 262 -13 139 395
3972C95l06kj17m4J06n7k35J43M94n00J29j6o7o0L53j04J9oq0m07K25J08o8k51
$$ 395 89 87 -30 -74 32 -25 -260 -117 377 -123 6 -10 -77 -137 216 112 131 125 45 -362 -137 -29 -97 -348
3996c48M62m8p3k30j6K8L2K69m06J94J92j76j05j59K24J31q1o2J22m23M10l25
$$ -348 114 66 -7 -237 -253 -225 -193 76 -330 -136 56 -120 -225 -384 -160 -29 -110 -172 -50 -473 -63 -388
4018c88K22M1J51l85K84K24k82K26k74j66M92k57j70P4J78l1l3o8n3K3J44k53
$$ -388 -166 -125 26 -359 -75 149 -133 93 -181 -347 145 -112 -282 -208 -30 -61 -94 -162 -215 -192 -48 -301
4040c01O0L40Q1m06M23K18j16j65k92r8O65l57k35J17O6L58m41O1j35K83R6k24
$$ -301 -241 99 180 -226 197 415 299 134 -158 -256 409 52 -183 -66 0 358 -83 -22 -157 126 222 -2
4062bj13L91K8N5k51j29J25M9L5%m4K7K33l42j14J99J68k50l2p5L06N6l40K01
$$ -2 -115 276 304 359 108 -21 104 153 188 188 144 171 404 62 -52 147 315 65 33 -42 264 320 -20 181
4086A81k11K41k2J62l10N5Ml33J97K00R6J09l18Oj29j5K19n42O92k49N4MJ9k43
$$ 181 -30 211 189 351 41 96 100 -233 -36 164 260 369 51 57 -72 -87 132 -410 282 33 87 91 110 -133
4110a33P8J92j82j96J41K36r7M6r5J9Q5J39j35j99K84k00Oj7k30n9O3L41k93m3
$$ -133 -55 137 -45 -241 -100 136 39 85 -10 9 94 233 98 -101 183 -17 -11 -28 -258 -317 -254 87 -206 -249
4134b49n9N8j04O1J81k2k54lj10O24j45k27j03j24K07J07N1J98l57J79M7o9P7
$$ -249 -308 -250 -354 -293 -112 -134 -388 -391 -501 123 -22 -249 -352 -476 -269 -162 -111 87 -270 -91 -44 -113 -36
4157c6J68k81M7r5R4k8k3J03k82J85J03j94N0K56k28K83k28J90m0n3m4l56J33
$$ -36 132 -149 -102 -197 -103 -131 -154 -51 -333 -148 -45 -239 -189 67 -161 122 -106 84 44 -9 -53 -409 -276
4180b76L58J23m24J23K4p0J57m3K9M2O7J00L5l86K50K42j78l34P01k42j91j07
$$ -276 82 205 -219 -96 -72 -142 15 -28 1 43 110 210 245 -141 109 351 173 -161 540 298 107 0
4202@L45Kj76K47n33K89j92p6rP9j18M72l00J97k50L35j05N1k68K03J1l49K65
$$ 0 345 347 171 418 -115 174 -18 -94 -103 -24 -142 330 30 227 -23 312 207 258 -10 193 204 -145 120
4225A20O5m3Nj28m10P19l85j9N31m23K67k28n6J00J1k66J49J16k32J25j63N5l5
$$ 120 185 142 147 19 -391 328 -57 -76 455 32 299 71 15 115 126 -140 9 125 -107 18 -145 -90 -125
4248a25K41j27m3P6q6j68J5O1P9M5l68L16k27M18n85K0K30N0K34j34j89N5j44
$$ -125 116 -11 -54 22 -64 -232 -217 -156 -77 -32 -400 -84 -311 107 -478 -458 -228 -178 56 -78 -267 -212 -356
4271c56J36K95k22L03l26o3L75K91o32m02K78L37l94L27K03o07O59k63J06j74
$$ -356 -220 75 -147 156 -170 -233 142 433 -199 -601 -323 14 -380 -53 150 -457 202 -61 45 -129
4291a29n2J46j14K78q5l31K50R4j95Q6K95q1k81j03R5K0K7L23l67J61J82l56K63
$$ -129 -181 -35 -149 129 44 -287 -37 57 -138 -52 243 162 -119 -222 -127 -107 -80 243 -124 37 219 -137 126
4314A26j8K53n73J62J78j04k11K36j06K66l9J5L11l77K18j03k78R1J94k28R3j33
$$ 126 108 361 -212 -50 128 24 -187 49 -57 209 170 185 496 119 337 234 -44 47 241 13 106 -27
4336b7K16r7P1j63kL89J22l70j80K02l20J52J51J92k76K02o7o6q2K3j90M66l06
$$ -27 189 92 163 0 -2 387 509 139 -41 161 -159 -7 144 336 60 262 195 129 47 70 -120 346 40
4359D0J60j67k5k42Q1P5j2K7QK68j75J91L2k54n9J28o2l4M06o39K09q6K39m71
$$ 40 200 33 8 -234 -153 -78 -90 -63 -55 213 38 229 261 7 -52 76 14 -20 386 -253 -44 -130 109 -362
4383c62J52K06O3j71O3k2p6L2j02l5J99J12Q9l99N9J77J75l61L35j06J61j53m97
$$ -362 -210 -4 59 -112 -49 -71 -147 -115 -217 -252 -53 59 148 -251 -192 -15 160 -201 134 28 189 36 -461
4406d61N79j53P0n01M01L82m45J8l11J86L04j27P3k1R3l9r5k55K43N2m10J85o9
$$ -461 118 -35 35 -466 -65 317 -128 -110 -421 -235 69 -58 15 -6 87 48 -47 -302 -59 -7 -417 -232 -301
4429c01M29k85k8J18P1L59l42l19J17O17n39L35k69J34k8l32K77J50R4l83O4K18
$$ -301 128 -157 -185 -67 4 363 21 -298 -181 436 -103 232 -37 97 69 -263 14 164 258 -125 -61 157
4451A57O0j6J19m69K18Q9Q9M6J2m7M6k84j7L71j45k80j09M54K21l00j71q0K43
$$ 157 217 201 320 -149 69 158 247 293 305 258 304 20 3 374 229 -51 -160 294 515 215 44 -36 207
4474B07N2m37L59m40L27j8J4k04J99J56l65M61o3ll29k9J04K00j60l41L07K12
$$ 207 259 -178 181 -259 68 50 64 -140 59 215 -150 311 248 245 -84 -113 -9 191 31 -310 -3 209
4496B09L3j09r3k04O6K14J9m36Q4M03m43R6K73j52l6j89L31j61J59K4k88q0J04
$$ 209 242 133 40 -164 -98 116 135 -301 -217 186 -257 -161 112 -40 -76 -265 66 -95 64 88 -200 -280 -176
4519a76J09Q7j36K4J03j45j50L04J04l94R3L02k22o6K7n3l9K73j38r6Q5k17J6
$$ -176 -67 20 -116 -92 11 -134 -284 20 124 -270 -177 125 -97 -163 -136 -189 -228 45 -93 -189 -104 -321 -305
4542c05k05N06k25j7K78m17M43K04k35l87M01j46Q8p5k10L21L23j18l68J28N5
$$ -305 -510 -4 -229 -246 32 -385 58 262 27 -360 41 -105 -17 -92 -302 19 342 224 -144 -16 39
4563C9j91K36j3Nl9N6k1k44N54k78m60L35J35q4K27l14L01M56o47l58K33J19L43
$$ 39 -152 84 71 76 37 93 72 -172 382 104 -356 -21 114 30 257 -57 244 700 53 -305 -72 47 390
4586C90l34k91M71Nk9p1J12j85J15k6J35J51l54j12J15j91L32k96J41K29n6L0
$$ 390 56 -235 236 241 212 141 253 68 183 157 292 443 89 -23 92 -99 233 -63 78 307 251 281
4608B81n4k69N1m4m5R7j25J69n5k4P0j09j0j47K08J03J8j85J24o9J0k7k13M09
$$ 281 227 -42 9 -35 -80 17 -108 61 6 -18 52 -57 -67 -214 -6 97 115 -70 54 -15 -5 -32 -245 164
4632A64p6l18K47o07N70J77j49j9j10K45o5l25k72N85k28j20K5K10p2J28K04l67
$$ 164 88 -230 17 -590 -20 157 8 -11 -121 124 59 -266 -538 47 -181 -301 -276 -66 -138 -10 194 -173
4654a73k86O09j1m34k49M25o7K04l35L7N5Qk03L98M7o6j31L7J90mK44o41K33O7
$$ -173 -459 150 139 -295 -544 -119 -186 18 -317 -280 -225 -217 -420 -22 25 -41 -172 -135 55 51 295 -346 -113 -46
4678d6j56j02K83n3J35r9o7J47k60L50j13j34n8L3K15j12m4J89r7o9J02K11l70
$$ -46 -202 -304 -21 -74 61 -38 -105 42 -218 132 19 -115 -173 -140 75 -37 -81 108 11 -58 44 255 -115
4701a15L22j23J0J97j86j66K10j8j7n8K38j07q3l54K16J10O5P5k87L60m7q3k55
$$ -115 207 84 94 291 105 -61 149 131 114 56 294 187 104 -250 -34 76 141 216 -71 289 242 159 -96
4724i6kL98j16k73NJ78Qr2MK16M9o3l18K25L66m26N9k40L38j78K46l2j99Q2j63
$$ -96 -98 300 184 -89 -84 94 102 10 14 230 279 216 -102 123 489 63 122 -118 220 42 288 256 57 139 -24
4749b4K14k37j2lP4l5p0rJ05J2j93J00K38j98O2l94K41L05l24L46m33N5k72M84
$$ -24 190 -47 -59 -62 12 -23 -93 -102 3 15 -178 -78 160 -38 24 -370 -129 176 -148 198 -235 -180 -452 32
4773C2j38k46J51Q7n0J59j30k16J35O0m1J15j21k45N51n26K10K52l70O30k39l01
$$ 32 -106 -352 -201 -114 -164 -5 -135 -351 -216 -156 -197 -82 -203 -448 103 -423 -213 39 -331 299 60 -241
4795b41J29j23K50l05J54j9J38R2k23j59R2J47K24k62O6K36k96j9N0J1N4j16O8
$$ -241 -112 -235 15 -290 -136 -155 -17 75 -148 -307 -215 -68 156 -106 -40 196 -100 -119 -69 -58 -4 -120 -52
4818e2N03l59j79K93q5j6j66j36K62rK0R9n48L62L92m67J30J44q9M8l87J99J86
$$ -52 451 92 -87 206 121 105 -61 -197 65 56 76 175 -373 -11 381 -86 44 188 99 147 -240 -41 145
4841A45MR3q2j40J48j27j81J66L80j34j22j57L23Q3j68k37K29J07l44j32M51m3
$$ 145 149 242 160 20 168 41 -140 26 406 272 150 -7 316 399 231 -6 223 330 -14 -146 305 262
4863B62l71J50m3J13j41r6J79L08l55p1J70q0J07j07o9J57R2J36l46K30l81J27
$$ 262 -109 41 -2 111 -30 -126 53 361 6 -65 105 25 132 25 -44 113 205 341 -5 225 -156 -29
4885b9O3k67K15m2p3J26k64M48n12K53LJ4Jj5J43j66L13J3o03M6M80k88J50m4
$$ -29 34 -233 -18 -60 -133 -7 -271 177 -335 -82 -79 -65 -64 -79 64 -102 211 224 -379 -333 147 -141 9 -35
4909c5q7j48J27O2j11J2O8q1Q0R8r9k25L87l5j67O0k02L77k59J07j89L47k10O0
$$ -35 -122 -270 -143 -81 -192 -180 -112 -193 -113 -15 -114 -339 48 13 -154 -94 -296 81 -178 -71 -260 87 -123 -63
4933f3J69m88L15j10M14j25k00J32q1j4KL25j57m3j80J39o1j23o5K47K08k3NM3
$$ -63 106 -382 -67 -177 237 112 -88 44 -37 -51 -49 276 119 76 -104 35 -26 -149 -214 33 241 218 223 266
4957B66j84p1L3q9j7J58l60Q4J32Q2J76M9k96RM3M37k48j06k6R8N7l66J4M17k04
$$ 266 82 11 44 -45 -62 96 -264 -180 -48 34 210 259 -37 -28 15 452 204 98 72 170 227 -139 -125 292 88
4982H8J33km01N8J96n0m8R1Q4M7k24K12J7k22J56k11N2k13L21n0k2oJ2l7L23o01
$$ 88 221 219 -182 -124 72 22 -26 65 149 196 -28 184 201 -21 135 -76 -24 -237 84 34 12 6 18 -19 304 -297
5008b97J59L07j74n1K62q7j71Q0l5k28N82k82j42j54K08J39l16N1L7l0j17L90
$$ -297 -138 169 -5 -56 206 119 -52 28 -7 -235 347 65 -77 -231 -23 116 -200 -149 -112 -142 -259 131
5030A31K22n23j49K13N6j75%K57J07l65n9M29j26J0m2j53J25j95j29N08k01J69
$$ 131 353 -170 -319 -106 -50 -225 -225 32 139 -226 -285 144 18 28 -14 -167 -42 -237 -366 142 -59 110
5052A10k69k56K43J82K7j12L39k14p4p7j39R2P1j79M35r4K8O4n03M32j6j00N2
$$ 110 -159 -415 -172 10 37 -75 264 50 -24 -101 -240 -148 -77 -256 179 85 113 177 -326 106 90 -10 42
5075D2k5Q5N3j93J21N4N8k02O8l7R6j91K63n1m2q8j32J92j70L4J42L59j15m22
$$ 42 17 102 155 -38 83 137 195 -7 61 24 120 -71 192 141 99 11 -121 71 -99 -65 77 436 321 -101
5099a01M49l07M1l4K20l46O5P2j47K19r3P4Oq0r4J39l7l5P0Qo3j23N8M17ql83
$$ -101 348 41 82 48 268 -78 -13 59 -88 131 38 112 118 38 -56 83 46 11 81 89 26 -97 -39 378 370 -13
5125a3M7J69K2n9R0ok9l57j80L87l9o6K31n08L83R6k69O1K32K4j53Q3q0R5k39
$$ -13 34 203 225 166 256 250 221 -136 -316 71 32 -34 197 -311 72 168 -101 -40 192 216 63 146 66 161 -78
5150g8L2J00O0L5j40k92J35K25m03K74m3k21M08j82k67J45L00j38l15K08K4j68
$$ -78 -46 54 114 149 9 -283 -148 77 -326 -52 -95 -316 92 -90 -357 -212 88 -50 -365 -157 -133 -301
5172c01j24K51j38j32K44j83K92o4J0kj08N78j34k45j01J17j62m6J87P5l21M17
$$ -301 -425 -174 -312 -444 -200 -383 -91 -155 -145 -147 -255 323 189 -56 -157 -40 -202 -248 -61 14 -307 110
5194A10k18K62j90N0j89L35o11L97J54l6P7l01J39J07j33oK63j95K20j46K36l04
$$ 110 -108 154 -36 14 -175 160 -451 -54 100 64 141 -160 -21 86 -47 -53 210 15 235 89 325 21
5216B1N0j81J44l7J27k81K88J7j21L66n68K45P7k44M7K6K21j61J90k92L02l1p4
$$ 21 71 -110 34 -3 124 -157 131 148 27 393 -175 70 147 -97 -50 -24 197 36 226 -66 236 205 131
5239A31j26J77j26L4J30k15lJ08l66J92N03k36l5kN6j67M10m16J70l61J26J64
$$ 131 5 182 56 90 220 5 2 110 -256 -64 439 203 168 166 222 55 465 49 219 -142 -16 148
5261A48o3q5O7l00L07K03n31O33j08j30l07L64l27J34k48K8K32r1q9R8J38m10
$$ 148 85 0 67 -233 74 277 -254 379 271 141 -166 198 -129 5 -243 -215 17 -74 -163 -65 73 -337
5283c37M02j59J92k01k3o8L5j10J06R3p5K55k22O4J25j10J46qk59j59Q8l7J5K70
$$ -337 65 -94 98 -103 -126 -194 -159 -269 -163 -70 -145 110 -112 -48 77 -33 113 105 -154 -313 -225 -262 -247 23
5307B3K46l44p9P4J14n5K47m60J60K54kl17J54Nj12J81j6j56j76K95m42J13J51
$$ 23 269 -75 -154 -80 34 -21 226 -234 -74 180 178 -139 15 20 -92 89 73 -83 -259 36 -406 -293 -142
5330a42K73m0j31J13j43l3k38L25N26j32n71o7L36o5r8Q0Mk8p4J65M0%J41O9k59
$$ -142 131 91 -40 73 -70 -103 -341 -16 510 378 -193 -260 76 11 -87 -7 -3 -31 -105 60 100 100 241 310 51
5355E1J22j46P2q3n5L15j11j8R8j07l63N98n13L04j58J17M4q1J37k53j03M44n22
$$ 51 173 27 99 16 -39 276 165 147 245 138 -225 373 -140 164 6 123 167 86 223 -30 -133 311 -211
5378b11K36Nr2J20k61K52l1l1k31K27n3L05r7k20j58M44m41N8J88j5Pj27P6K74
$$ -211 25 30 -62 58 -203 49 18 -13 -244 -17 -70 235 138 -82 -240 204 -237 -179 9 -6 1 -126 -50 224
5402B24k47J37K7j33r0r6J12J2M2J00m16J43J48j84K21j9Qj49k13L49k32P1J08
$$ 224 -23 114 141 8 -82 -178 -66 -54 -12 88 -328 -185 -37 -221 0 -19 -11 -160 -373 -24 -256 -185 -77
5425g7j56L75m55J66J21K5p3l5J20m3j45K52j25L6j5K1k0J64j86m2J03J0J47m09
$$ -77 -233 142 -313 -147 -26 -1 -74 -109 11 -32 -177 75 -50 -14 -29 -8 -28 136 -50 -92 11 21 168 -241
5449b41nM38m16K66l75j20K51J21k21m5O82m6k79K84l01J97j28J25r8k18K10j34
$$ -241 -246 192 -224 42 -333 -453 -202 -81 -302 -347 335 289 10 294 -7 190 62 187 89 -129 81 -53
5471e3L3L06j93n7K4J19R3k26j06rK36k57k02M57m2k87M9Q8KM2L19m06O7j40K46
$$ -53 -20 286 93 36 60 179 272 46 -60 -69 167 -90 -292 165 123 -164 -115 -27 -25 17 336 -70 -3 -143 103
5496A03j06j32k0J23j21N29k77j48K54P3k8r7j81Rn0j24M07l17L79k3j74J96l27
$$ 103 -3 -135 -155 -32 -153 376 99 -49 205 278 250 153 -28 -19 -69 -193 214 -103 276 253 79 275 -52
5519e2R6L7Q2l32K96K13k95K39k51J28j53j69K66j04J65m08J35K54k15J34J52
$$ -52 44 81 163 -169 127 340 45 284 33 161 8 -161 105 1 166 -242 -107 147 -68 66 218
5540B18k11k9j8l9n3J56Q1J0m49K12l2K6l1N3k06M84l17J10j53J57o1j59K96J3
$$ 218 7 -22 -40 -79 -132 24 105 115 -334 -122 -154 -128 -159 -106 -312 172 -145 -35 -188 -31 -92 -251 45 58
5564E8j61j20R5P2J1j52K00j97J90j44L20k37k15K08m8K15j10N8O7O6N2m88K62
$$ 58 -103 -223 -128 -56 -45 -197 3 -194 -4 -148 172 -65 -280 -72 -120 95 -15 43 110 176 228 -260 2
5587BJ11j32K72j95k9mq7J06j30J35n0k40Q8L59n4Q1j40J9K23j87n7k45L54l92
$$ 2 113 -19 253 58 29 25 -62 44 -86 49 -1 -241 -153 206 152 233 93 112 335 148 91 -154 200 -192
5611a92R1N36j09j57j51N4m48K01L93k27K39j93P7J22j96j8J78R7j23j11k32L54
$$ -192 -101 435 326 169 18 72 -376 -175 218 -9 230 37 114 236 40 22 200 297 174 63 -169 185
$$ [...]
8191B94
##END NTUPLES=NMR FID
##END=
