##TITLE=1H_Pr 4432-2
 CDCl3, 8 sc, 
 6.2.2020
##JCAMPDX= 6.0         $$ Bruker NMR JCAMP-DX V2.0
##DATA TYPE= NMR FID
##DATA CLASS= NTUPLES
##ORIGIN= UXNMR, Bruker Analytische Messtechnik GmbH
##OWNER= root
$$ XWIN-NMR		Version 3.5
$$ Thu Feb  6 16:38:05 2020 Russian Standard Time (UT+4h)  she@DPX200
##.OBSERVE FREQUENCY= 200.1315
##.OBSERVE NUCLEUS= ^1H
##.DELAY= (6, 6)
##.ACQUISITION MODE= SIMULTANEOUS
##.ACQUISITION SCHEME= undefined
##.AVERAGES= 8
##.DIGITISER RES= 18
##SPECTROMETER/DATA SYSTEM= spect
##.PULSE SEQUENCE= zg30
##.SOLVENT NAME= D2O
##.SHIFT REFERENCE= (INTERNAL, D2O, 0, 15.7039)
##AUDIT TRAIL= $$ (NUMBER, WHEN, WHO, WHERE, WHAT)
$$ ##TITLE= Audit trail, XWIN-NMR		Version 3.5
$$ ##JCAMPDX= 5.01
$$ ##ORIGIN= Bruker BioSpin GmbH
$$ ##OWNER= she
$$ F:/spectra/data/she/nmr/H-F/1/audita.txt
$$ ##AUDIT TRAIL=  $$ (NUMBER, WHEN, WHO, WHERE, WHAT)
(   1,<2020-02-06 16:37:20.76 +0400>,<she>,<DPX200>,
      <created by zg, POWCHK disabled, PULCHK disabled
       configuration hash MD5:
       00 E9 B6 7A A2 85 ED C7 34 08 36 98 17 FE 4E 26
       data hash MD5: 16K
       3B D2 6E 25 FF BC 9E 3B CB 5E 12 4B A4 6D 87 17>)
$$ ##END=
$$ 
$$ hash MD5
$$ B5 34 58 39 52 37 D2 43 FC 42 5C A0 0E F7 4F 3F
##$RELAX= 
##$RELAX= 
##$RELAX= 
##$RELAX= 
##$RELAX= 
##$RELAX= 
$$ Bruker specific parameters
$$ --------------------------
##$DU= <F:/spectra>
##$EXPNO= 1
##$NAME= <H-F>
##$PROCNO= 1
##$TYPE= <nmr>
##$USER= <she>
##$AMP= (0..31)
100 100 100 100 100 100 100 100 100 100 100 100 100 100 100 100 100 100 
100 100 100 100 100 100 100 100 100 100 100 100 100 100 
##$AQSEQ= 0
##$AQ_mod= 1
##$AUNM= <au_zg>
##$AUTOPOS= <>
##$BF1= 200.13
##$BF2= 200.13
##$BF3= 200.13
##$BF4= 200.13
##$BF5= 200.13
##$BF6= 200.13
##$BF7= 200.13
##$BF8= 200.13
##$BYTORDA= 1
##$CFDGTYP= 0
##$CFRGTYP= 5
##$CHEMSTR= <none>
##$CNST= (0..31)
1 1 145 1 1 1 1 1 1 1 1 1 1 1 1 1 1 1 1 1 1 1 1 1 1 1 1 1 1 1 1 1 
##$CPDPRG= <>
##$CPDPRG1= <>
##$CPDPRG2= <>
##$CPDPRG3= <>
##$CPDPRG4= <mlev>
##$CPDPRG5= <mlev>
##$CPDPRG6= <mlev>
##$CPDPRG7= <mlev>
##$CPDPRG8= <mlev>
##$CPDPRGB= <>
##$CPDPRGT= <>
##$D= (0..31)
0 1.2 0 0 0 0 0 0 0 0.06 0 0.03 0 0 0 0 0.0002 0 0 0 0 0 0 0 0 0 0 0 0 
0 0 0 
##$DATE= 1580992640
##$DBL= (0..7)
120 120 120 120 120 120 120 120 
##$DBP= (0..7)
150 150 150 150 150 150 150 150 
##$DBP07= 0
##$DBPNAM0= <>
##$DBPNAM1= <>
##$DBPNAM2= <>
##$DBPNAM3= <>
##$DBPNAM4= <>
##$DBPNAM5= <>
##$DBPNAM6= <>
##$DBPNAM7= <>
##$DBPOAL= (0..7)
0.5 0.5 0.5 0.5 0.5 0.5 0.5 0.5 
##$DBPOFFS= (0..7)
0 0 0 0 0 0 0 0 
##$DE= 6
##$DECBNUC= <off>
##$DECIM= 24
##$DECNUC= <off>
##$DECSTAT= 4
##$DIGMOD= 1
##$DIGTYP= 9
##$DL= (0..7)
0 120 120 120 120 120 120 120 
##$DP= (0..7)
150 150 150 150 150 150 150 150 
##$DP07= 0
##$DPNAME0= <>
##$DPNAME1= <>
##$DPNAME2= <>
##$DPNAME3= <>
##$DPNAME4= <>
##$DPNAME5= <>
##$DPNAME6= <>
##$DPNAME7= <>
##$DPOAL= (0..7)
0.5 0.5 0.5 0.5 0.5 0.5 0.5 0.5 
##$DPOFFS= (0..7)
0 0 0 0 0 0 0 0 
##$DQDMODE= 0
##$DR= 18
##$DS= 0
##$DSLIST= <SSSSSSSSSSSSSSS>
##$DSPFIRM= 0
$$ [...]
##$SUBNAM2= <"">
##$SUBNAM3= <"">
##$SUBNAM4= <"">
##$SUBNAM5= <"">
##$SUBNAM6= <"">
##$SUBNAM7= <"">
##$SUBNAM8= <"">
##$SUBNAM9= <"">
##$SW= 24.9337058887773
##$SWIBOX= (0..15)
0 0 2 0 0 0 0 0 0 0 0 0 0 0 0 0 
##$SW_h= 4990.01996007984
##$TD= 16384
##$TD0= 1
##$TE= 0
##$TE2= 300
##$TE3= 300
##$TEG= 300
##$TL= (0..7)
0 120 120 120 120 120 120 120 
##$TP= (0..7)
150 150 150 150 150 150 150 150 
##$TP07= 0
##$TPNAME0= <>
##$TPNAME1= <>
##$TPNAME2= <>
##$TPNAME3= <>
##$TPNAME4= <>
##$TPNAME5= <>
##$TPNAME6= <>
##$TPNAME7= <>
##$TPOAL= (0..7)
0.5 0.5 0.5 0.5 0.5 0.5 0.5 0.5 
##$TPOFFS= (0..7)
0 0 0 0 0 0 0 0 
##$TUNHIN= 0
##$TUNHOUT= 0
##$TUNXOUT= 0
##$USERA1= <user>
##$USERA2= <user>
##$USERA3= <user>
##$USERA4= <user>
##$USERA5= <user>
##$V9= 5
##$VALIST= <valist>
##$VCLIST= <CCCCCCCCCCCCCCC>
##$VD= 0
##$VDLIST= <DDDDDDDDDDDDDDD>
##$VPLIST= <PPPPPPPPPPPPPPP>
##$VTLIST= <TTTTTTTTTTTTTTT>
##$WBST= 1024
##$WBSW= 4
##$XGAIN= (0..3)
0 0 0 0 
##$XL= 0
##$YL= 0
##$YMAX_a= 143641
##$YMIN_a= -85563
##$ZGOPTNS= <>
##$ZL1= 120
##$ZL2= 120
##$ZL3= 120
##$ZL4= 120
##$ABSF1= 10
##$ABSF2= 0
##$ABSG= 5
##$ABSL= 3
##$ALPHA= 0
##$AQORDER= 0
##$ASSFAC= 0
##$ASSFACI= 0
##$ASSFACX= 0
##$ASSWID= 0
##$AUNMP= <proc_1d>
##$AZFE= 0.1
##$AZFW= 0.1
##$BCFW= 1
##$BC_mod= 2
##$BYTORDP= 1
##$COROFFS= 0
##$CY= 11.3945322036743
##$DATMOD= 1
##$DC= 2
##$DFILT= <>
##$DTYPP= 0
##$F1P= 16.9975609425685
##$F2P= -3.02152046262296
##$FCOR= 0.5
##$FTSIZE= 0
##$FT_mod= 4
##$GAMMA= 1
##$GB= 0.15
##$INTBC= 1
##$INTSCL= 1
##$ISEN= 128
##$LB= 0.24
##$LEV0= 0
##$LPBIN= 0
##$MAXI= 10000
##$MC2= 0
##$MEAN= 0
##$ME_mod= 0
##$MI= 1.114404
##$NCOEF= 0
##$NC_proc= 0
##$NLEV= 6
##$NOISF1= 3.799351
##$NOISF2= 2.8
##$NSP= 1
##$NTH_PI= 0
##$NZP= 0
##$OFFSET= 15.70392
##$PC= 1
##$PHC0= -9771.317
##$PHC1= -5.599191
##$PH_mod= 1
##$PKNL= yes
##$PPARMOD= 0
##$PSCAL= 0
##$PSIGN= 0
##$REVERSE= no
##$SF= 200.130013532006
##$SI= 16384
##$SIGF1= 3
##$SIGF2= 2
##$SINO= 400
##$SIOLD= 16384
##$SREGLST= <1H.CDCl3>
##$SSB= 0
##$STSI= 0
##$STSR= 0
##$SW_p= 3612.71676300578
##$SYMM= 0
##$S_DEV= 0
##$TDeff= 0
##$TDoff= 0
##$TI= <>
##$TILT= no
##$TM1= 0
##$TM2= 0
##$TOPLEV= 0
##$USERP1= <user>
##$USERP2= <user>
##$USERP3= <user>
##$USERP4= <user>
##$USERP5= <user>
##$WDW= 1
##$XDIM= 8192
##$YMAX_p= 0
##$YMIN_p= 0
$$ End of Bruker specific parameters
$$ ---------------------------------
##NTUPLES= NMR FID
##VAR_NAME=  TIME,          FID/REAL,        FID/IMAG
##SYMBOL=    X,             R,               I
##VAR_TYPE=  INDEPENDENT,   DEPENDENT,       DEPENDENT
##VAR_FORM=  AFFN,          ASDF,            ASDF
##VAR_DIM=   8192,          8192,            8192
##UNITS=     SECONDS,       ARBITRARY UNITS, ARBITRARY UNITS
##FACTOR=    0.0002004,     1,               1
##FIRST=     0,             0,               0
##LAST=      1.6414764,     0,               0
##MIN=       0,             -85563,          0
##MAX=       1.6414764,     143641,          0
$$ Real data points
##PAGE= N=1
##DATA TABLE= (X++(R..R)), XYDATA
$$ [...]
$$ plain form
1892 -45 431 9 73 382 140 250 396 -50 63 348 -73 -25 72 215 -91 -84 268 25 247 402 421 -81
1914 -81 -56 -76 4 145 28 178 -15 169 108 -9 -52 179 21 49 -13 110 -155 52 239 112 -20 98 -84
1937 -84 68 167 62 46 261 81 313 -77 31 14 -319 38 124 -97 -18 -51 -275 192 136 63 -148 -206 -94
1960 -94 -103 149 144 237 -421 83 70 -312 -151 -466 -17 83 15 -179 -22 19 -42 -8 -68 114 -306 -44 1 -223
1984 -223 -181 0 -123 69 61 33 -61 -57 22 -75 -162 -98 -86 -110 118 45 -327 -92 12 -299 -12 -6 -149 97 27 -81
2010 -81 -8 -8 -145 9 76 -90 87 -174 -86 197 101 -131 -66 -283 33 63 39 150 -177 186 29 -5 -36 179
2034 179 102 238 260 -82 120 188 -342 305 178 269 139 126 496 246 65 130 3 204 10 226 57 19
2056 19 116 -13 73 56 -49 15 -153 -79 19 125 97 29 103 15 36 17 92 301 -116 -284 7 -143 149 307 -53
$$ packed form
1892d5M76m22O4L09k42J10J46m46J13K85m21M8R7J43l06PL52k43K22J55J9n02
1914h1K5k0Q0J41j17J50j93J84o1j17m3K31j58K8o2J23k65K07J87j27j32J18j82
1937h4J52R9j05j6K15j80K32l90J08j7l33L57Q6k21P9l3k24M67n6p3k11n8J12
1960i4rK52nR3o58N04j3l82J61l15M49J00o8j94J57M1o1L4o0J82m20K62M5k24
1984b23M2J81j23J92qk8r4MP9r7q7O4J2k4K28p3l72K35J04l11K87Oj43K46p0j08
2010h1P3%j37J54O7j66J77k61Q8K83r6k32O5k17L16L0k4J11l27L63j57l4l1K15
2034A79p7J36K2l42K02O8n30O47j27R1j30j3L70k50j81O5j27K01j94K16j69l8
2056A9R7j29Q6j7j05O4j68P4R8J06k8o8P4q8K1j9P5K09m17j68K91j50K92J58l60
$$ plain form
2081 -53 -189 128 -118 2 86 -200 -1 -205 291 -70 -279 -25 123 -37 -289 102 142 31 -356 -44 114
2102 114 -49 32 52 -33 46 -324 171 203 -240 -71 9 22 -64 31 -189 189 -26 17 -368 -40 62 -53 -64 -102
2126 -102 -53 36 115 -210 170 4 56 -58 -143 -67 -137 -297 -146 45 -236 94 -61 -155 -49 -50 404 -359 -23
2149 -23 25 261 -1 -289 169 44 -138 107 310 347 12 171 89 70 -394 140 208 -43 455 264 -83 -133
2171 -133 -22 153 -35 -156 311 368 306 -9 -241 -116 92 -59 -23 -39 115 -53 10 -30 44 -165 20 -289
2193 -289 -226 -168 -217 167 -9 245 15 -110 65 76 -113 -100 -190 273 122 -82 -156 -77 21 -100 53 -99 216
2216 216 111 117 4 245 -95 148 -107 -69 36 -66 6 115 -288 139 58 50 -221 -52 55 -426 177 70
2238 70 -93 58 162 82 -94 -40 4 -314 -152 14 -172 71 -37 83 221 -45 -111 -188 -200 182 73 158 224
$$ packed form
2081e3j36L17k46J20Q4k86J99k04M96l61k09K54J48j60k52L91M0j11l87L12J58
2102A14j63Q1K0q5P9l70M95L2m43J69Q0J3q6R5k20L78k15M3l85L28J02j15j1l8
2126a02M9Q9P9l25L80j66N2j14q5P6p0j60J51J91k81L30j55r4J06jM54p63L36
2149b3M8K36k62k88M58j25j82K45K03L7l35J59q2j9m64N34O8k51M98j91l47n0
2171a33J11J75j88j21M67N7o2l15k32J25K08j51L6j6J54j68O3m0P4k09J85l09
2193b89O3N8m9L84j76K54k30j25J75J1j89J3r0M63j51k04p4P9R8j21J53j52L15
2216B16j05Oj13K41l40K43k55L8J05j02P2J09m03M27q1qk71J69J07m81O03j07
2238G0j63J51J04q0j76N4M4l18J62J66j86K43j08J20J38k66o6p7j2L82j09Q5O6
$$ plain form
2261 224 102 -171 -144 -149 -335 36 -96 -150 56 94 45 -135 -122 100 74 252 214 173 392 -133 85 -160 220
2284 220 141 19 -52 -11 106 1 -12 -55 -31 -71 67 6 -230 216 -166 -224 190 8 -83 77 177 -40 14 -8
2308 -8 46 49 68 47 -79 -161 156 83 58 9 248 202 104 -43 223 301 -158 197 -152 -148 -90 -186 145 122 29 127 -194
2335 -194 147 5 231 287 -242 96 -90 -221 -153 138 23 250 62 -7 -113 47 -273 49 27 163 -60
2356 -60 -78 87 -34 -48 -102 -151 -130 -268 -116 40 90 207 -111 -112 -306 109 54 -1 -221 -59 181 -341 89 -354
2380 -354 -42 127 31 -175 -119 -10 -108 -129 -158 242 32 -99 18 -107 -125 55 -51 -110 -138 -210 174 -175 106
2403 106 137 141 236 56 99 -201 102 -232 66 -46 247 170 20 212 228 -39 66 209 62 -124 -107 162 -84
2426 -84 261 -143 5 171 -109 258 28 183 233 -77 214 50 -257 -115 -243 72 -89 -56 4 1 8 -289 104
$$ packed form
2261B24j22k73K7nj86L71j32n4K06L8m9j80J3K22k6J78l8m1K19n25K18k45L80
2284B20p9j22p1M1J17j05j3m3K4m0J38o1k36M46l82n8M14j82r1J60J00k17N4k2
2308hN4LJ9k1j26q2L17p3k5m9K39m6r8j47K66P8m59L55l49MN8r6L31k3r3R8l21
2335a94L41j42K26N6n29L38j86j31O8K91j15K27j88o9j06J60l20L22k2J36k23
2356f0j8J65j21j4n4m9K1j38J52J56N0J17l18jj94M15n5n5k20J62K40n22M30m43
2380c54L12J69r6k06N6J09r8k1k9M00k10j31J17j25j8J80j06n9k8p2L84l49K81
2403A06L1MR5j80M3l00L03l34K98j12K93p7j50J92J6k67J05J43j47j86J7K69k46
2426h4L45m04J48J66k80L67k30J55N0l10K91j64l07J42j28L15j61L3O0lPk97L93
$$ plain form
2449 104 7 6 117 182 103 223 -59 169 -202 -7 106 213 34 394 -114 215 154 -192 -305 86 -181 -72
2471 -72 250 65 295 -232 -87 -33 143 150 124 -87 -33 -62 163 156 6 168 -67 -45 -123 -182 -255 228 -145 -245
2495 -245 -276 29 70 -29 -108 -8 180 -43 -58 -245 362 -292 29 -282 77 -133 244 -402 -21 -138 247 48
2517 48 -99 -53 22 56 -77 87 230 155 -33 162 -193 -249 4 -327 -84 193 47 -265 -80 3 41 231 2
2540 2 280 -235 -72 66 -107 -269 132 -132 -42 167 -153 153 219 19 -168 -32 82 -36 13 44 -219 -38
2562 -38 439 159 -132 119 9 -75 -32 189 -54 178 -130 136 -34 -124 115 49 116 211 121 48 -27 113 -49
2585 -49 62 75 77 -222 18 71 129 242 90 399 -146 156 -77 -114 21 -47 237 -170 179 133 30 -2 -163
2608 -163 39 26 -341 -214 147 213 -164 269 5 160 -330 -183 -293 -91 -45 168 -352 153 161 -134 33 -47
$$ packed form
2449A04r7jJ11O5p9J20k82K28l71J95J13J07j79L60n08L29o1l46j13L91k67J09
2471g2L22j85K30n27J45N4J76Pk6k11N4k9K25pj50J62k35K2p8n9p3M83l73j00
2495b45l1L05M1r9p9J00J88k23j5j87O07o54L21l11L59k10L77o46L81j17L85j99
2517D8j47M6P5L4j33J64J43p5j88J95l55n6K53l31K43K77j46l12J85Q3L8J90k29
2540BK78n15J63J38j73j62M01k64R0K09l20L06O6k00j87J36J14j18M9L1k63J81
2562c8M77k80k91K51j10q4M3K21k43K32l08K66j70r0K39o6O7R5r0p3p5J40j62
2585d9J11J3Kk99K40N3N8J13j52L09n45L02k33l7J35o8K84m07L49m6j03l2j61
2608a63K02j3l67J27L61O6l77M33k64J55m90J47j10K02M6K13n20N05Qk95J67q0
$$ plain form
2630 -47 -221 -359 -130 262 81 161 118 -181 -43 -41 -220 -255 251 -162 -51 -89 139 -143 211 66 -468 108
2652 108 248 -364 -174 -29 -73 -139 250 -21 -52 16 54 203 -31 8 200 156 177 -64 14 67 84 -26 -37 132
2676 132 263 136 -59 -59 323 45 -382 5 -37 308 -213 136 89 -108 276 135 26 143 -98 103 57 -106
2698 -106 100 -92 -139 60 134 63 -238 357 59 53 -138 -83 53 -119 178 72 162 -9 -34 132 46 -76 -84 111
2722 111 224 129 -17 -211 72 8 -173 -46 133 55 93 -102 -27 4 -220 139 78 176 42 81 -35 -327 30
2745 30 44 -68 16 -153 -41 -109 -96 65 122 62 -94 183 -311 14 128 -341 -152 -30 -94 44 -252 -84 123
2768 123 143 -51 -142 156 -11 -191 -58 58 223 -227 -78 -64 -559 -141 104 -58 91 112 -79 302 125
2789 125 -111 -286 -77 -52 -2 -111 -77 138 -19 117 -292 -82 39 -236 148 21 -86 31 -21 -149 418
$$ packed form
2630d7j74j38K29L92j81Q0m3k99J38Kj79l5N06m13J11l8K28k82L54j45n34N76
2652A08J40o12J90J45m4o6L89k71l1O8L8J49k34L9J92m4K1k41P8N3J7j10j1J69
2676A32J31j27j95%L82k78m27L87m2L45n21L49m7j97L84j41j09J17k41K01m6j63
2698a06K06j92m7J99P4p1l01N95k98oj91N5J36j72K97j06R0j71k5J66q6j22qJ95
2722A11J13r5j46j94K83o4j81J27J79p8L8j95P5L1k24L59o1R8j34L9j16k92L57
2745C0J4j12Q4j69J12o8J3J61N7o0j56K77m94L25J14m69J89J22o4J38k96J68K07
2768A23K0j94r1K98j67j80J33J16J65m50J49J4m95M18K45j62J49K1j91L81j77
2789A25k36j75K09K5N0j09L4K15j57J36m09K10J21k75L84j27j07J17n2j28N67
$$ plain form
2810 418 -122 76 -47 135 149 221 154 25 9 34 217 -250 -10 156 89 -168 22 -112 115 226 -208 251
2832 251 3 225 58 153 -43 -47 -19 -59 -124 151 -10 -66 226 -53 162 -21 19 108 -54 38 -154 228 -6
2855 -6 121 122 340 59 270 15 15 144 -10 465 -6 -198 -25 -140 -68 197 21 -110 227 -140 172 -10
2877 -10 -6 228 74 -65 -88 -92 136 -5 -168 -109 20 -62 -157 115 -150 -181 -129 -79 -202 -235 13 -234 -48 20 -94
2902 -94 -186 89 143 -262 -9 -128 62 -129 -41 -326 -176 -231 162 29 -154 51 -50 10 56 -57 109 -82
2924 -82 107 163 28 -84 -114 -187 -322 -75 159 -283 -152 206 -38 79 8 22 3 21 -116 274 158 273 24
2947 24 206 45 28 183 205 43 6 308 166 -43 368 28 -154 -1 14 -103 -124 -197 327 -113 -125 196 -105
2970 -105 162 206 481 -167 -235 102 -100 -9 -176 63 -5 -30 -101 -87 193 84 76 299 -188 33 -27 64 179 -47
$$ packed form
2810D18n40J98j23J82J4P2o7j29j6K5J83m67K40J66o7k57J90j34K27J11m34M59
2832B51k48K22j67R5j96mK8m0o5K75j61n6K92k79K15j83M0Q9j62R2j92L82k34
2855fJ27JK18k81K11k55%J29j54M75m71j92J73j15P2K65j76j31L37l67L12j82
2877a0MK34j54j39k3mK28j41j63N9J29q2r5K72k65l1N2N0j23l3K48k47J86O8j14
2902i4r2K75N4m05K53j19J90j91Q8k85J50n5L93j33j83K05j01O0M6j13J66j91
2924h2J89N6j35j12l0p3j35K47K34m42J31L58k44J17p1J4j9J8j37L90j16J15k49
2947B4J82j61j7J55K2j62l7L02j42k09M11l40j82J53J5j17k1p3N24m40j2L21l01
2970a05K67M4K75o48o8L37k02R1j67K39o8k5p1J4K80j09qK23m87K21o0R1J15k26
$$ plain form
2994 -47 201 285 -152 32 242 93 283 108 36 -249 317 9 -12 165 -59 305 196 114 -212 -61 34 121
3016 121 -194 209 -196 -76 52 342 -43 -151 -113 -128 278 -237 93 -1 -185 -84 100 61 94 -120 50 -190
3038 -190 -303 -37 12 -93 135 -28 -54 -243 -52 4 -97 151 -226 -139 7 -128 -61 -74 -11 -150 -290 -108
3060 -108 274 -118 -140 10 -39 -33 -139 299 78 100 109 155 437 270 -502 -5 -214 -55 -283 -273 -61 -57 -186 15
3084 15 -192 -214 -122 120 80 97 -39 42 37 58 234 -16 410 -13 311 -92 98 -35 -83 104 -130 152 -134
3107 -134 238 29 244 -194 -187 72 72 18 -280 360 98 85 20 250 -219 -36 36 48 -60 -119 -176 -37 60 22
3131 22 84 -207 -25 310 98 254 29 -217 -94 161 42 200 -27 -75 129 33 73 70 252 -94 142 76 164
3154 164 -140 140 89 16 50 -106 45 -111 28 -108 11 96 -106 73 232 -5 -179 6 301 -123 2
$$ packed form
2994d7K48Q4m37J84K10j49J90j75p2k85N66l08k1J77k24L64j09q2l26J51R5Q7
3016A21l15M03m05J20J28K90l85j08L8j5M06n15L30r4j84J01J84l9L3k14J70k40
3038a90j13K66M9j05K28j63k6j89J91N6j01K48l77Q7J46j35O7j3O3j39j40J82
3060a08L82l92k2J50m9Oj06M38k21K2RM6K82j67p72M97k09J59k28J0K12Mj29K01
3084A5k07k2R2K42m0J7j36Q1nK1J76k50M26m23L24m03J90j33m8J87k34K82k86
3107a34L72k09K15m38PK59%n4k98O40k62j3o5K30m69J83P2J2j08n9n7J39R7l8
3131B2O2k91J82L35k12J56k25k46J23K55j19J58k27m8K04r6M0lJ82l46K36o6Q8
3154A64l04K80n1p3L4j56J51j56J39j36J19Q5k02J79J59k37j74J85K95m24J25
$$ plain form
3175 2 83 -31 -255 -167 27 -256 18 272 119 -225 210 112 -242 -28 109 131 13 -134 163 -47 4 -46 209
3198 209 314 330 -48 -32 195 106 -40 -242 -158 238 -446 42 112 -72 5 201 144 -217 84 -121 27 -27 63
3221 63 10 -87 144 -4 185 159 -39 135 125 175 -336 95 190 115 56 -10 -65 38 87 246 -215 181 293 145
3245 145 -86 5 -312 190 55 102 288 100 258 -19 94 254 30 119 181 121 85 -298 -116 149 45 -5
3267 -5 -73 -28 89 123 -120 17 -149 -260 -67 -123 -79 124 -221 -303 -78 58 -61 34 315 26 -320 6 5 -89
3291 -89 206 -117 272 -147 -249 -108 -327 8 -296 46 41 -66 72 138 -34 31 -136 -175 41 69 209 25
3313 25 -140 39 -66 -52 -220 -61 63 203 174 141 39 221 -221 -300 -103 -14 -111 -55 62 44 -130 270 309
3336 309 199 176 -249 -96 -38 -102 180 -1 168 312 233 -162 -217 103 -111 114 -391 145 71 -144 -46 11 -79
$$ packed form
3175BQ1j14k24Q8J94k83K74K54j53l44M35r8l54K14J37K2j18j47K97k10N1n0K55
3198B09J05J6l78J6K27q9j46k02Q4L96o84M88P0j84P7J96n7l61L01k05J48n4R0
3221F3n3r7K31j48J89k6j98J74j0N0n11M31R5p5n9o6n5J03M9J59m61L96J12j48
3245A45k31R1l17N02j35M7J86j88J58k77J13J60k24Q9O2o0l6l83J82K65j04n0
3267eo8M5J17L4k43J37j66j11J93n6M4K03l45q2K25J36j19R5K81k89l46L26jr4
3291h9K95l23L89m19j02J41k19L35l04L42nj07J38O6j72O5j67l9K16K8J40j84
3313B5j65J79j05J4j68J59J24J40k9l3j02J82m42p9J97Q9r7N6J17j8j74M00L9
3336C09j10k3m25J53N8o4K82j81J69J44p9l95n5L20k14K25n05N36p4k15R8N7r0
$$ plain form
3359 -79 -96 93 33 157 128 146 -354 -34 62 -45 -133 30 -23 22 205 -151 312 19 34 56 147 -92 35 292
3383 292 -157 234 -125 13 -253 34 232 12 79 214 167 30 38 95 175 -14 218 -139 -41 -57 204 -212 -182
3406 -182 50 -87 123 183 49 -239 167 -165 17 -90 -43 101 -259 438 -89 -388 26 -29 -21 24 7 -16 -7
3429 -7 -118 -161 74 -250 -76 11 -76 -211 -47 -65 106 110 59 -80 -94 141 192 93 89 -9 -185 90 -261 -74 -96
3454 -96 98 -27 -108 68 -21 90 77 -151 -32 -206 -142 114 -61 48 -57 115 40 243 1 -67 -157 42 -80
3477 -80 101 -109 -97 -21 2 238 0 -34 7 206 -56 194 -81 223 132 -57 113 187 -39 -178 39 -155 245
3500 245 219 320 150 112 326 87 75 205 141 -249 5 168 98 88 139 -119 -28 -91 -63 196 -118 58 69 39
3524 39 213 -134 0 105 -37 -57 102 -97 23 83 17 -208 101 169 -19 -77 68 -63 -171 -13 -131 -48
$$ packed form
3359g9j7J89o0J24k9J8n00L20R6j07q8J63n3M5J83l56M63k93J5K2R1k39J27K57
3383B92m49L91l59J38k66K87J98k20O7J35m7j37QN7Q0j89K32l57R8j6K61m16L0
3406a82K32j37K10O0j34k88M06l32J82j07M7J44l60O97n27k99M14n5QM5j7k3R
3429gj11m3K35l24J74Q7q7j35J64j8J71Mn1j39j4K35N1r9mr8j76K75l51J87k2
3454i6J94j25q1J76q9J11j3k28J19j74O4K56j75J09j05J72p5K03k42o8r0J99j22
3477h0J81k10J2P6K3K36k38l4M1J99k62K50k75L04r1j89J70P4k26j39K17j94M00
3500B45k6J01j70l8K14k39j2J30o4l90K54J63p0j0N1k58R1o3K8K59l14J76J1l0
3524C9J74l47J34J05j42k0J59j99J20O0o6k25L09O8j88n8J45j31j08J58j18Q3
$$ plain form
3546 -48 111 -78 -135 -312 57 51 39 23 129 -93 109 171 -93 -56 -172 58 -282 30 114 56 -162 39 227
3569 227 -119 -76 83 -22 -257 251 129 25 -216 220 17 117 -140 130 -224 -54 13 223 73 -46 293
3590 293 -99 -48 -77 -129 378 275 348 235 143 -88 -110 -47 -36 174 -129 -209 50 343 149 -53 140 91 -129
3613 -129 288 30 338 177 49 -109 145 -62 -171 61 389 247 -16 -216 197 -88 -127 -238 124 83 24
3634 24 -160 74 -114 33 -144 5 171 -22 281 -111 -57 -33 200 72 222 308 181 -54 21 95 146 145 -75
3657 -75 -28 87 -172 10 -58 134 360 41 -60 -153 15 -198 -223 16 -128 156 -275 212 -166 -17 -148 77
3679 77 94 -60 67 -223 -163 235 3 -89 -100 290 -123 -77 -120 -116 -69 -36 -201 -37 -90 81 306 -100 128 -253
3703 -253 -478 94 50 -108 103 -161 -63 144 23 -86 -175 75 -43 -127 84 -14 249 -169 -193 -1 40 -247
$$ packed form
3546d8J59j89n7j77L69oj2j6J06k22K02O2k64L7j16K30l40L12Q4n8k18K01J88
3569B27l46M3J59j05k35N08j22j04k41M36k03J00k57K70l54J70O7K10j50j19L39
3590B93l92N1k9n2N07j03P3j13r2k31k2O3J1K10l03q0K59K93j94k02J93m9k20
3613a29M17k58L08j61j28j58K54k07j09K32L28j42k63k00M13k85l9j11L62m1n9
3634B4j84K34j88J47j77J49J66j93L03l92N4K4K33j28J50Q6j27k35P5P4N1jk20
3657g5M7J15k59J82o8J92K26l19j01r3J68k13k5K39j44K84m31M87l78J49j31K25
3679G7J7j54J27k90O0L98k32r2j1L90m13M6m3MM7L3j65J64n3J71K25m06K28l81
3703b53k25N72m4j58K11k64R8K07j21j09q9K50j18q4K11r8K63m18k4J92M1k87
$$ plain form
3725 -247 27 -113 8 -138 35 -56 -115 338 -51 115 2 -174 86 131 45 76 136 -79 -31 201 39 151
3747 151 82 -77 61 92 48 -2 146 18 -78 -35 42 317 -34 77 -11 -139 -34 218 -66 120 60 37 -19 -67
3771 -67 343 -105 19 132 -8 -148 209 152 -285 185 57 99 -42 -198 30 -74 27 -33 -25 -157 326 125
3793 125 -20 48 31 170 -374 33 -90 7 -291 -58 -43 -254 -25 101 264 -215 -67 -132 45 -126 127 27
3815 27 70 260 166 -43 -2 333 65 -362 -134 298 191 265 124 -161 -18 -63 -98 -387 179 -29 -255 120
3837 120 136 110 64 -135 -130 -76 -31 -196 -235 -21 333 -173 -355 191 -56 -206 -293 -60 146 91 104 -373 -95 54
3861 54 -12 60 -205 69 -1 126 -23 113 281 42 -130 31 202 123 -266 206 -25 247 -72 27 141 245
3883 245 61 37 234 7 216 89 112 230 61 174 -132 126 139 246 -122 -12 -12 85 -90 174 -13 303
$$ packed form
3725b47K74j40J21j46J73r1n9M53l89J66j13j76K60M5q6L1O0k15M8K32j62J12
3747A51o9j59J38L1m4n0J48j28r6M3P7K75l51J11q8j28J05K52k84J86o0k3n6m8
3771f7M10m48J24J13j40j40L57n7m37M70j28M2j41j56K28j04J01o0Qj32M83k01
3793A25j45O8j7J39n44M07j23R7k98K33J5k11K29J26J63m79J48o5J77j71K53j00
3815B7M3J90r4k09M1L35k68m27K28M32j07P4j41k85J43m5l5k89N66k08k26L75
3837A20J6k6m6j99NN4M5j65l9K14L54n06j82N46k47j50q7K33K06n5J3m77K78J49
3861E4o6P2k65K74p0J27j49J36J68k39j72J61J71p9l89M72k31K72l19R9J14J04
3883B45j84k4J97k27K09j27K3J18j69J13l06K58J3J07l68J10%R7j75K64j87L16
$$ plain form
3905 303 82 -37 155 -57 -235 228 83 -258 166 -94 86 79 -377 -137 171 53 152 -99 26 -79 -80 -219
3927 -219 -255 -307 -48 13 60 8 74 -365 -2 132 89 -84 25 54 -203 107 -95 -198 192 -109 -105 47 92 27
3951 27 -62 -93 -35 104 -172 -127 -147 -478 32 131 -287 -238 -25 1 123 169 26 145 74 -278 -61 376 55 -148
3975 -148 -194 58 -102 -142 -215 56 -25 42 140 -129 -106 -42 45 26 166 39 478 171 36 190 -13 102 39 -108
3999 -108 -183 14 177 -272 177 -87 -316 412 117 -38 -97 -110 -206 1 136 -30 110 -62 6 109 -313 -22
4021 -22 178 203 -48 -6 -20 109 20 -206 38 72 235 -237 53 221 -110 -72 -87 -170 35 181 164 152 184 181 -138
4046 -138 228 -35 -7 185 -16 -91 209 89 -150 296 42 -272 0 81 250 47 103 -24 208 83 189
4067 189 -120 38 289 273 133 204 12 -71 145 -22 -209 -200 103 -243 -23 89 -1 -143 -152 12 213 -10 -180
$$ packed form
3905C03k21j19J92k12j78M63j45l41M24k60J80pm56K40L08j18R9k51J25j05jj39
3927b19l6n2K59O1M7n2O6m39L63J34m3j73J09K9k57L10k02j03L90l01MJ52M5o5
3951B7q9l1N8J39k76M5k0l31N10R9m18M9K13K6J22M6j43J19p1l52K17M37l21k03
3975a48m6K52j60m0p3K71q1O7R8k69K3O4Q7j9J40j27M39l07j35J54k03J15o3j47
3999a08p5J97J63m49M49k64k29P28k95j55n9j3r6K07J35j66J40j72O8J03m22K91
4021b2K00K5k51M2j4J29q9k26K44L4J63m72K90J68l31L8j5q3K05J46j7j2L2ll19
4046a38L66k63K8J92k01p5L00j20k39M46k54l14K72Q1J69k03N6j27K32j25J06
4067A89l09J58K51j6j40P1j92q3K16j67j87RL03l46K20J12r0j42rJ64K01k23j70
$$ plain form
4090 -180 129 -112 -33 290 20 -75 -159 -484 -269 -345 159 -145 -150 -182 250 63 82 124 -208 -64 21 113 -236 -116
4114 -116 146 234 -201 -167 -318 62 -9 -252 194 43 81 267 -273 -268 89 110 -47 12 205 -155 -172 62 -100
4137 -100 179 -81 -167 -63 -32 132 -244 198 -59 122 -12 -112 -97 -150 -29 -11 345 26 27 19 232 -31 39
4160 39 -66 29 -106 0 44 -103 4 -33 202 2 54 33 214 -62 59 70 31 90 -173 -152 90 -136 139
4183 139 -57 51 -25 -88 -27 73 98 -10 13 126 -49 -11 12 -124 -126 -197 -164 -45 81 231 -344 -61 -341 -183
4207 -183 -95 -89 111 48 -198 202 204 45 -120 9 66 -26 -7 -23 15 -202 5 63 -239 -226 -190 127 -92 135 230
4232 230 248 157 16 -12 -100 -31 -33 24 -51 176 -217 -54 58 -83 -156 107 -99 -92 -78 136 -268 166 205 183 -225
4257 -225 -16 199 -58 55 -160 63 143 -178 57 75 -62 70 44 -244 25 131 103 -25 85 -59 265
$$ packed form
4090a80L09k41P9L23k70r5q4l25K15p6N04l04nl2M32j87J9M2l32J44Q5R2l49J20
4114a16K62Q8m35L4j51L80p1k43M46j51L8J86n40NL57K1j57N9J93l60j7K34j62
4137a00K79k60q6J04L1J64l76M42k57J81j34j00J5n3J21J8L56l19JqK13k63P0
4160C9j05R5j35J06M4j47J07l7K35k00N2k1J81k76J21J1l9N9k63K1K42k26K75
4183A39j96J08p6o3O1J00K5j08K3J13j75L8K3j36kp1L3J19J26J50n75K83k80J58
4207a83Q8OK00o3k46M00Kj59j65J29N7r2J9j6L8k17K07N8l02J3L6L17k19K27R5
4232B30J8r1j41k8q8O9kN7p5K27l93J63J12j41p3K63k06PJ4K14m04M34L9k2m08
4257b25K09K15k57J13k15K23Q0l21K35J8j37J32k6k88K69J06k8j28J10j44L24
$$ plain form
4278 265 -208 45 273 28 -120 32 17 -100 223 340 32 377 229 235 176 -56 149 83 -184 -123 -24 -3 137
4301 137 9 -189 -122 132 33 46 -176 -47 17 225 149 -52 -227 267 136 27 39 -33 -116 -28 103 77 -24
4324 -24 130 -13 43 -50 -319 159 161 -103 -260 193 28 -318 -165 69 -17 -236 -96 192 -44 -145 193 -61
4346 -61 70 52 -225 -267 -97 -7 -62 -34 -219 -215 36 8 -52 -386 -114 46 -301 16 -197 -168 179 75 88 -232
4370 -232 129 -66 -113 287 5 -213 -256 -158 2 -87 92 -283 64 -32 -144 71 18 24 116 64 -150 -180 16 52
4394 52 -231 93 92 176 60 309 102 364 -65 -252 -129 -71 -32 46 90 -20 221 176 270 186 -414 -14 192 -143
4418 -143 169 215 -154 160 -107 -234 23 71 156 -70 -196 53 -127 -29 129 110 -94 -77 -160 52 -58 378
4440 378 -14 -90 -30 23 -99 -171 -81 -18 101 -203 -176 -48 109 138 -56 -245 0 -57 -9 65 131 -107 -40 -304
$$ packed form
4278B65m73K53K28k45j48J52j5j17L23J17l08L45j48On9k32K05o6k67O1R9K1J40
4301A37j28j98O7K54r9J3k22J29O4K08p6k01j75M94j31j09J2p2q3Q8J31k6j01
4324b4J54j43N6r3k69M78Kk64j57M53j65l46J53K34q6k19J40K88k36j01L38k54
4346f1J31j8k77m2J70R0n5K8j85MK51k8o0l34K72J60l47L17k13K9L47j04J3l20
4370b32L61j95m7M00k82k18m3R8J60q9J79l75L47r6j12K15n3OR2n2k14l0J96L6
4394E2k83L24jQ4j16K49k07K62m29j87J23N8L9P8M4j10K41m5R4q4o00M00K06l35
4418a43L12M6l69L14k67j27K57M8Q5k26j26K49j80R8J58j9k04J7q3K12j10M36
4440C78l92p6O0N3j22p2R0O3J19l04K7J28J57K9j94j89K45n7M8P4O6k38O7k64
$$ plain form
4464 -304 1 22 492 91 -224 -77 -213 22 -66 -88 -247 -52 -156 107 -122 19 -39 166 -8 -140 20
4485 20 1 -15 -58 -233 -238 -105 145 21 -254 215 -152 -98 158 -146 -290 192 -131 -179 65 -174 151 -128 -42
4508 -42 -37 7 -24 227 -310 -62 137 315 -65 57 276 -244 -4 -111 -14 -225 -66 -68 -155 237 175 31 -45 -157
4532 -157 -58 151 -83 192 -100 -47 120 41 -69 62 23 35 163 129 -22 9 3 157 66 136 74 66 -39 252 -27
4557 -27 53 114 105 -66 -12 -76 -214 -58 196 14 -97 -71 -52 211 -113 102 -163 -119 -195 116 243 -294 -169 -142
4581 -142 -71 -127 -273 -37 -242 -33 -291 -206 -65 152 -94 -155 -124 -9 -11 88 -360 -176 11 -181 176 172 -186
4604 -186 54 168 27 -26 -19 -156 8 131 65 -245 70 -65 -88 255 -293 237 -197 -145 -302 167 15 -76
4626 -76 89 4 16 -32 -74 -173 49 -107 54 -84 24 -49 27 57 -222 -86 -34 -114 -156 57 -99 -94 45 -81 100
$$ packed form
4464c04L05K1M70m01l15J47j36K35q8k2j59J95j04K63k29J41n8K05j74j32J60
4485B0j9j6m3j75nJ33K50j24k75M69l67N4K56l04j44M82l23m8K44k39L25k79Q6
4508d2NM4l1K51n37K48J99J78l80J22K19n20K40j07R7k11J59kq7L92o2j44p6j12
4532a57R9K09k34K75k92N3J67p9j10J31l9J2J28l4j51L1oJ54r1P0o2qj05K91k79
4557b7Q0O1rj71N4o4j38J56K54j82j11K6J9K63l24K15k65M4p6L11J27n37J25K7
4581a42P1n6j46K36k05K09k58Q5J41K17k46o1L1J15kR9m48J84J87j92L57ml58
4604a86K40J14j41n3Pj37J64J23o6l10L15j35k3L43n48N30m34N2j57M69j52r1
4626g6J65q5J2m8m2r9K22j56J61j38J08p3P6L0k79J36N2q0m2K13j56NJ39j26J81
$$ plain form
4651 100 286 66 -150 -53 259 -28 -47 -141 248 243 38 -106 292 7 -133 -85 -159 244 54 175 -269 -51
4673 -51 -26 179 60 -86 288 141 -103 -115 -177 -81 33 -1 -203 -53 258 -22 48 -33 -21 29 39 304 -260 89
4697 89 -161 144 -64 90 14 -201 -38 -231 -2 -61 -195 -71 20 -132 -82 -28 -22 78 27 -111 79 332 -6
4720 -6 210 4 -154 -232 -224 182 -12 -117 -349 108 63 -145 -168 49 154 -62 68 -317 -100 -121 -231 296 -91
4743 -91 -275 121 1 -227 -365 -123 161 1 -184 182 64 -115 10 -59 -29 -306 9 46 126 -119 128 -321
4765 -321 -271 -307 -297 -17 73 -94 -77 188 -11 -54 -4 -60 120 100 205 117 -273 384 -166 -18 208 3 -21 310
4789 310 427 -144 184 237 -144 -188 57 -238 22 -55 -4 -87 195 241 150 -251 22 62 180 5 128 215 213 -25
4813 -25 -61 186 60 95 -185 -164 -180 -219 -45 115 29 196 41 -6 314 25 173 58 -187 131 4 -485 -264
$$ packed form
4651A00J86k20k16R7L12k87j9r4L89nk05j44L98k85j40M8p4M03j90J21m44K18
4673e1K5K05j19j46L74j47k44j2o2R6J14l4k02J50L11k80P0q1J2N0J0K65n64L49
4697H9k50L05k08J54p6k15J63j93K29n9j34J24R1j52N0N4OJ00n1j38J90K53l38
4720fK16k06j58p8QM06j94j05k32M57m5k08k3K17J05k16J30l85K17k1j10N27l87
4743i1j84L96j20k28j38K42K84j60j85L66j18j79J25o9L0k77L15L7Q0k45K47m49
4765c21N0l6J0K80R0j67J7K65j99m3N0n6J80k0J05q8l90O57n50J48K26k05k4L31
4789C10J17n71L28N3l81m4K45k95K60p7N1q3K82M6r1m01K73M0J18j75J23Q7kk38
4813b5l6K47j26L5k80K1j6l9J74J60q6J67j55m7L20k89J48j15k45L18j27m89K21
$$ plain form
4836 -264 -173 -107 -29 -28 195 71 317 40 -276 -253 -70 147 165 84 -87 45 209 -307 -31 158 99 165 290
4859 290 19 170 300 154 -374 -20 -104 -194 -178 -437 240 -246 77 6 103 52 -93 2 -185 93 51 -69 27
4882 27 62 -20 41 161 -91 14 91 72 -17 -270 125 185 -122 -95 -229 22 -78 140 244 -3 -50 -72 -257 -108
4906 -108 -258 28 1 -152 -180 -82 162 108 -7 531 7 25 328 -170 180 205 341 113 167 68 -25 -153 126
4929 126 -2 -190 351 -117 -67 433 51 235 3 -68 69 -42 -286 148 5 -221 -10 -82 14 180 199 73
4951 73 109 1 -96 -330 21 139 46 115 -8 125 36 -31 -198 21 22 17 29 194 42 325 -172 -169 161 53 372
4976 372 -8 7 157 -141 -129 134 47 -105 96 27 19 -92 -351 -40 -86 186 -159 -96 60 -125 72 17 35
4999 35 99 -146 -80 -2 140 -46 -14 121 112 247 97 76 -149 25 -41 140 -259 -34 317 -107 -3 -112 188
$$ packed form
4836b64R1O6P8JK23j24K46k77l16K3J83K17J8q1j71J32J64n16K76J89n9O6J25
4859B90k71J51J30j46n28L54q4r0J6k59O77m86L23p1R7n1j45R5j87K78m2j20R6
4882B7L5q2O1J20k52J05P7j9q9k53L95O0l07K7j34K51j00K18J04k47m7k2j85J49
4906a08j50K86k7j53k8R8K44n4j15N38n24J8L03m98L50K5J36k28N4r9r3j28K79
4929A26j28j88N41m68N0N00l82J84k32p1J37j11k44M34j43k26K11p2R6J66J9j26
4951G3L6j08r7k34L51J18r3O9j23J33q9o7j67K19JnJ2J65j52K83m97LL30j08L19
4976C72l80J5J50k98J2K63q7j52K01o9qj11k59L11m6K72l45O3J56j85J97n5J8
4999C5O4k45O6P8J42j86L2J35rJ35j50k1k25J74o6J81l99K25L51m24J04j09L00
$$ plain form
5022 188 -181 -61 305 -122 69 213 -237 115 -29 -222 146 137 211 -137 -243 227 -2 -14 82 -32 -82 108
5044 108 -319 14 356 -225 64 -76 346 -53 -28 304 -18 56 -31 109 -24 255 30 -144 93 158 -140
5065 -140 31 161 -83 -19 -143 -63 161 40 67 -31 165 -6 37 -59 151 -96 -92 46 -257 244 148 -131 45
5088 45 15 99 -59 97 -64 -14 27 -155 -39 14 17 -255 -44 -89 -159 28 -98 -134 92 251 54 51 -79 -174 72
5113 72 100 87 28 128 119 -223 1 -12 -8 -110 -7 49 162 281 -91 -8 -4 12 -363 -14 84 312 -189 -174 -92 -114
5139 -114 -82 56 142 -87 37 -110 65 87 2 -129 -28 -3 55 142 -86 38 -258 -53 231 -71 -27 -78 -69 38
5163 38 222 254 -86 125 -105 -28 -131 19 -66 -315 238 25 45 170 -152 82 -301 -204 179 -129 -58 -18 56
5186 56 -109 -178 142 242 -123 215 -49 -71 -110 170 128 57 323 -33 216 -165 -114 158 3 -5 -107 108 -126
$$ packed form
5022A88l69J20L66m27J91J44m50L52j44j93L68rP4l48j06M70k29j2R6j14n0J90
5044A08m27L33L42n81K89j40M22l99K5L32l22P4q7J40j33K79k25j74K37O5k98
5065a40J71J30k44O4j24Q0K24j21K7r8J96j71M3r6K10k47MJ38l03N01r6k79J76
5088D5l0Q4j58J56j61N0M1j82J16N3Lk72K11m5p0J87j26l6K26J59j97lj30r5K46
5113G2K8j3n9J00rl42K24j3Mj02J03N6J13J19l72Q3MJ6l75L49R8K28n01J5Q2k2
5139a14L2J38Q6k29J24j47J75K2q5j31J01K5N8Q7k28J24k96K05K84l02M4n1RJ07
5163C8J84L2l40K11k30P7j03J50q5k49N53k13K0J25l22K34l83R7L83l08P1M0P4
5186E6j65o9L20J00l65L38k64k2l9K80m2p1K66l56K49l81N1K72j55qj02K15k34
$$ plain form
5209 -126 -162 11 26 110 127 -82 -51 11 -110 99 6 52 -80 88 -36 -374 -150 217 -415 -257 107 -336 164
5232 164 -58 -127 2 97 188 138 -296 -53 -237 -61 253 275 158 -107 106 -70 -307 87 -255 236 -132 -43
5254 -43 -7 47 -76 109 79 -139 -189 261 13 10 13 -67 -194 -95 -337 -35 34 -222 -105 131 214 167 -57 21 170
5279 170 -10 80 -137 -60 -298 175 17 2 -197 -112 -223 115 -117 257 25 -22 -44 4 53 120 250 178 -74
5302 -74 223 235 -83 125 -147 -69 -91 175 -61 -369 -153 188 -147 -7 91 78 162 109 -424 -88 380 -129 -148
5325 -148 167 449 167 -43 213 53 397 135 13 148 55 -87 -30 -270 -39 14 -260 -36 48 44 -132 -206
5347 -206 175 51 63 31 -80 -76 -17 35 -115 135 246 67 -61 -92 -367 -120 -116 16 -387 -298 159 -134 25
5370 25 -54 -146 -87 -223 126 34 363 -119 23 67 3 -207 -97 45 -25 -305 -262 -136 -45 250 122 114 -159 -126
$$ packed form
5209a26l6J73J5Q4J7k09L1O2j21K09r3M6j32J68j24l38K24L67o32J58L64m43N00
5232A64k22o9J29R5R1n0m34K43j84J76L14K2j17k65K13j76k37L94l42M91l68Q9
5254d3L6N4j23J85l0k18n0M50k48lLq0j27R9k42L02O9k56J17K36Q3m7k24P8J49
5279A70j80R0k17P7k38M73j58j5j99Q5j11L38k32L74k32m7k2M8M9O7J30p2k52
5302g4K97J2l18K08k72P8k2K66k36l08K16L41l35J40R8j3Q4n3n33L36M68n09j9
5325a48L15K82k82k10K56j60L44k62j22J35r3j42N7k40K31N3k74K24Q4mj76p4
5347b06L81j24J2l2j11MN9N2j50K50J11j79j28l1k75K47MJ32m03Q9M57k93J59
5370B5p9r2N9j36L49r2L29m82J42M4o4k10J10J42p0k80M3J26R1K95j28qk73L3
$$ plain form
5394 -126 11 253 13 19 -225 -128 -8 9 157 -36 176 97 -172 -49 -63 -138 137 -170 161 4 207 170 94
5417 94 151 -24 53 -207 -64 -235 125 -144 -26 -115 -64 -197 -176 53 -39 141 -110 -357 -116 48 26 -8 154
5440 154 -128 47 226 -39 280 184 16 49 -9 245 100 -44 -36 -84 135 133 -160 -60 36 -29 98 -177 54
5463 54 -4 212 20 -65 -51 227 -17 235 263 149 275 88 316 83 162 -231 -30 172 88 138 16 309 1
5486 1 65 -112 -6 194 -27 11 -64 162 68 124 39 25 56 24 44 -59 158 16 -112 -71 -238 -119 136 -11
5510 -11 227 198 179 -294 34 -319 -62 -177 142 -25 -55 3 -142 102 20 100 -240 -67 62 33 -16 38 -49 376
5534 376 -122 40 -57 98 51 -147 -74 -107 -122 167 44 182 42 -109 -94 -18 112 -9 13 -319 -142 86 212
5557 212 101 190 126 385 434 -63 -129 249 214 111 -147 139 157 62 81 154 -55 183 5 -9 -37 -128 114 4
$$ packed form
5394a26J37K42k40Ok44R7J20J7J48j93K12p9k69J23j4p5K75l07L31j57K03l7p6
5417I4N7j75P7k60J43j71L60k69J18q9N1j33K1K29r2J80k51k47K41J64k2l4J62
5440A54k82J75J79k65L19r6j68L3n8K54j45j44Qm8K19kk93J00R6o5J27k75K31
5463E4n8K16j92q5J4K78k44K52K8j14J26j87K28k33P9l93K01K02q4N0j22K93l08
5486AO4j77J06K00k21L8p5K26r4N6q5j4L1l2K0j03K17j42j28M1j67J19K55j47
5510a1K38k9j9m73L28l53K57j15L19j67l0N8j45K44q2Q0l40J73J29k9m9N4q7M25
5534C76m98J62r7J55m7j98P3l3j5K89j23J38j40j51J5P6J30j21K2l32J77K28J26
5557B12j11Q9o4K59M9m97o6L78l5j03k58K86J8r5J9P3k09K38j78j4k8r1K42j10
$$ plain form
5581 4 45 -78 110 66 52 45 28 197 -29 -106 -75 -24 141 -107 108 156 269 -91 -148 65 -76 82 98 98 118 116
5607 116 -24 -411 26 196 148 111 134 -122 24 86 26 -53 72 108 -314 -50 23 -82 75 -146 160 70 -107
5630 -107 -44 -227 -275 -68 -268 101 1 294 -34 -87 -24 58 114 -132 -23 -37 -234 -373 -8 -44 150 39 53
5653 53 94 -203 39 -81 -16 -93 98 135 -299 -3 -40 -294 -47 -188 74 94 77 -215 21 -33 61 -225 105
5676 105 366 34 -144 177 33 101 -71 -183 -94 241 95 -266 -31 -3 293 -116 -126 -94 27 164 376 -269
5698 -269 34 -64 199 187 -89 -26 157 28 -9 212 -188 -70 89 149 -35 32 -55 -189 -296 246 -52 220
5720 220 58 60 -73 331 102 265 -47 4 -150 -16 -58 -102 -212 -151 -73 -361 -27 -145 344 -62 -171 261
5742 261 -137 -95 129 310 -146 194 -210 -102 25 64 -22 -256 64 -155 57 -59 -77 -29 148 -207 154 56
$$ packed form
5581DM1j23J88m4j4pj7J69k26p7L1N1J65k48K15M8J13l60n7K13j41J58J6%K0k
5607A16j40l87M37J70m8l7K3k56J46O2o0p9J25L6m22K64P3j05J57k21L06r0j77
5630a07O3j83m8K07k00L69j00K93l28n3O3Q2N6k46J09j4j97j39L65l6J94j11J4
5653E3M1k97K42j20O5p7J91L7m34K96l7k54K47j41K62K0j7k92K36n4R4k86L30
5676A05K61l32j78L21j44O8j72j12Q9L35j46l61K35K8K96m09j0L2J21J37K12o45
5698b69L03r8K63j2k76O3J83j29l7K21m00J18J59O0j84O7q7j34j07N42k98K72
5720B20j62Kj33M04k29J63l12N1j54J34m2m4j10O1P8k88L34j18M89m06j09M32
5742B61l98M2K24J81m56L40m04J08J27L9q6k34L20k19K12j16j8M8J77l55L61r8
$$ plain form
5764 56 -88 -34 194 39 -16 -108 -373 122 262 62 120 -353 -35 176 20 -177 -235 134 185 -67 65 -4 241
5787 241 97 63 -159 116 30 45 215 -256 4 59 -244 -126 69 330 308 0 -148 -73 -88 125 -174 0
5809 0 -60 246 65 -56 194 31 32 -157 -172 -53 10 209 58 -298 372 41 146 -135 -423 -231 -159 181 -147
5832 -147 107 222 33 201 -146 3 -102 -45 53 158 -63 44 -36 90 81 -88 60 149 193 149 162 31 383
5855 383 90 -161 -85 -173 21 53 128 26 237 88 110 110 -66 65 41 -303 -56 -128 -105 -45 -201 112 -7 -212
5879 -212 -26 44 -101 -198 -55 81 294 -29 -49 -36 31 -121 140 54 -172 -287 -119 -128 57 32 -162 108 -340
5902 -340 -100 -359 -143 151 22 -150 111 64 -294 -225 169 161 -40 161 -225 -122 -152 -63 -392 242 -12 -83
5924 -83 166 58 -124 272 34 -99 -149 -162 161 -47 258 -140 229 295 100 65 -314 26 37 -139 45 -185
$$ packed form
5764E6j44N4K28j55n5r2k65M95J40k00N8m73L18K11j56j97n8L69N1k52J32o9K45
5787B41j44l4k22K75q6J5J70m71K60N5l03J18J95K61k2l08j48P5j5K13k99J74
5809@o0L06j81j21K50j63Jj89j5J19O3J99j51l56O70l31J05k81k88J92P2L40l28
5832a47K54J15j89J68l47J49j05N7R8J05k21J07q0J26rj69J48Q9M4m4J3j31L52
5855C83k93k51P6q8J94L2P5j02K11j49K2%j76J31k4l44K47p2K3O0j56L13j19k05
5879b12J86P0j45r7J43J36K13l23k0J3O7j52K61q6k26j15J68rJ85k5j94K70m48
5902c40K40k59K16K94j29j72K61m7l58O9L94qk01K01l86J03l0Q9l29O34k54p1
5924h3K49j08j82L96k38j33n0j3L23k08L05l98L69O6j95l5l79L40J1j76J84k30
$$ plain form
5946 -185 97 -5 -113 313 92 -6 -356 -175 80 101 -114 -419 -279 184 182 84 -186 54 51 -43 42 -37 89
5969 89 -18 -157 106 93 242 5 192 200 -28 -207 -92 224 -202 -157 -148 98 -312 216 -219 -59 41 28 106
5992 106 -158 -34 -52 264 -137 75 34 144 -118 -225 -50 -129 -44 232 210 169 28 -226 31 -93 353 -108
6014 -108 176 43 22 -70 -111 24 -192 158 -39 -46 -226 265 -126 -22 141 -21 57 -90 -208 -168 78 -142
6036 -142 -62 184 -395 107 -121 31 -14 -17 -67 63 -144 145 19 5 -38 70 -130 201 176 -228 64 -163 -63
6059 -63 -287 -23 -248 -129 -31 -210 22 152 289 61 131 -127 82 -222 88 211 -16 0 -127 -88 69 37
6081 37 -102 -172 174 123 37 79 98 98 5 102 21 -67 202 118 -108 72 18 -73 36 24 154 -96 -115 214 -86 -121
6107 -121 -12 182 8 59 -56 -143 -25 138 -14 188 228 -118 -233 79 -295 -101 -402 -174 -198 -54 -54 -149
$$ packed form
5946a85K82j02j08M26k21r8l50J81K55K1k15l05J40M63kr8k70K40lr4Q5p9J26
5969H9j07j39K63j3J49k37J87Qk28j79J15L16m26M5RK46m10N28m35J60J00j3P8
5992A06k64J24j8L16m01K12m1J10k62j07J75p9Q5K76k2m1j41k54K57j24M46m61
6014a08K84j33k1r2m1J35k16L50j97pj80M91l91J04J63j62P8j47j18M0K46k20
6036a42Q0K46n79N02k28J52m5ln0J30k07K89j26j4m3J08k00L31k5m04K92k27J00
6059f3k24K64k25J19R8j79K32J30J37k28P0k58K09l04L10J23k27J6j27L9J57l2
6081C7j39p0L46n1q6M2J9%r3R7q1q8K69q4k26J80n4r1J09j2J30k50j9L29l00l5
6107a21J09J94j74N1j15q7J18J63j52K02M0l46j15L12l74J94l01K28k4J44%r5
$$ plain form
6129 -149 146 6 -3 4 150 87 42 -98 195 -326 5 36 -188 -2 136 -105 -7 -222 -58 -175 -116 17 -182
6152 -182 -135 -250 -158 -69 -117 -4 -10 -14 -182 -81 209 -293 93 32 115 -214 -200 -37 94 -80 -128 57 -171 -194
6176 -194 -74 -19 -69 96 28 -144 -151 -61 -471 489 -142 -61 79 -50 -97 -372 124 -13 81 146 -253 -95 197
6199 197 -89 -225 -164 -132 -35 -31 81 -115 -270 -29 -98 211 -177 -31 163 -160 -201 -139 14 107 -49 156 131
6222 131 -58 -388 27 11 315 49 -143 -73 -22 -250 -33 146 163 67 315 141 77 150 96 -69 224 21 -126
6245 -126 -11 219 171 96 112 131 157 -136 57 -197 33 113 277 -48 32 136 -108 -91 -302 -279 29 -300 -286
6268 -286 -162 4 215 42 99 -250 -24 126 -150 128 -291 40 -183 318 -6 -79 -44 -63 -149 -240 76 238
6290 238 -145 -1 -121 -197 222 -266 56 -205 -63 -96 192 -223 -37 12 43 -148 -185 -54 137 -33 109 28
$$ packed form
6129a49K95j40rPJ46o3m5j40K93n21L31L1k24J86J38k41R8k15J64j17N9J33j99
6152a82M7j15R2Q9m8J13omj68J01K90n02L86o1Q3l29J4J63J31j74m8J85k28k3
6176a94J20N5n0J65o8j72pR0m10R60o31Q1J40j29m7k75M96j37R4O5l99J58K92
6199A97k86j36O1L2R7MJ12j96j55K41o9L09l88J46J94l23m1O2J53R3j56K05k5
6222A31j89l30M15j6L04k66j92P0N1k28K17J79J7r6K48j74o4P3n4j65K93k03j47
6245a26J15K30m8p5J6J9K6k93J93k54K30Q0J64l25Q0J04k44J7k11K3L08l29J4
6268b86J24J66K11j73N7l49K26J50k76K78m19L31k23N01l24p3L5j9q6r1L16J62
6290B38l83J44j20p6M19m88L22k61J42l3K88m15J86M9L1j91l7J31J91j70J42q1
$$ plain form
6312 28 55 47 -24 217 -5 -408 -168 -19 -174 90 70 -23 82 -321 -216 -11 113 6 -16 -259 -79 -46 -29
6335 -29 34 12 49 -93 140 -26 121 -31 199 -77 -27 -13 13 -50 7 142 81 246 -73 -286 91 -125 59
6358 59 -114 -60 83 -57 22 166 127 -158 96 313 330 -115 -57 99 -96 -14 254 108 99 25 197 315 86
6381 86 134 -142 -257 -264 -14 -154 -239 -375 -106 30 -62 54 22 -8 172 218 198 155 213 127 -339 -149 -122 -292 -326
6406 -326 -22 -166 98 57 135 9 -7 -23 -100 103 -232 -165 57 46 54 -160 28 -350 128 -84 -231 194 91
6429 91 16 59 77 87 108 51 209 -53 -43 -16 -229 81 22 184 -74 -140 105 -136 -262 -10 312 72 -134 -233
6453 -233 -287 29 143 -74 128 339 -166 -161 -11 -39 188 -177 107 -82 -231 130 19 127 99 -110 38 -194
6475 -194 84 -213 -48 269 -48 -26 20 -135 -18 -36 -408 -59 -40 -134 123 -33 70 117 129 -11 92 -24
$$ packed form
6312B8K7qp1K41k22m03K40J49j55K64k0r3J05m03J05K05J24j07k2k43J80L3J7
6335b9O3k2L7j42K33j66J47j52K30k76N0J4K6o3N7J35o1J65l19k13L77k16J84
6358E9j73N4J43j40P9J44l9k85K54K17J7m45N8J56j95Q2K68j46rp4J72J18k29
6381H6M8k76j15pK50j40q5j36K69J36r2J16l2l0J80M6k0m3N8q6m66J90K7j70l4
6406c26L04j44K64m1P8j26j6j6p7K03l35O7K22j1Qk14J88l78M78k12j47M25j03
6429I1p5M3J8J0K1n7J58k62J0K7k13L10n9J62k58o6K45k41j26K52L22k40k06r9
6453b33n4L16J14k17K02K11n05NJ50k8K27l65K84j89j49L61j11J08k8k09J48k32
6475a94K78k97J65L17l17K2M6j55J17j8l72L49J9r4K57j56J03M7J2j40J03j16
$$ plain form
6497 -24 58 -42 27 222 -253 18 49 114 -207 226 -106 247 317 215 -23 97 -303 -235 -117 -32 -124 -250 -24
6520 -24 58 50 -232 -56 -69 -122 89 -66 -29 -90 -198 142 -110 -182 -109 -210 194 -94 -198 -1 -27 26 -86 -87 15
6545 15 24 -32 64 -333 -65 -20 -206 15 31 -231 286 19 -97 -128 -147 107 -151 53 142 146 2 -14 -99 163 161
6570 161 -149 -125 82 61 -160 181 -242 -27 31 -115 -31 404 200 -285 47 162 87 23 -163 155 -45 -102
6592 -102 -22 -114 -56 -222 -134 -158 -190 4 148 6 205 -1 -243 180 19 -136 1 230 42 185 6 118
6614 118 137 -276 69 81 27 19 272 -159 -17 -141 129 -83 122 -159 23 118 24 128 195 -49 25 135 182
6637 182 296 -297 -287 -96 168 192 163 215 30 261 91 290 -106 -67 197 104 -140 66 -94 72 -43 -295
6659 -295 15 96 13 43 -105 -212 119 -31 90 149 -246 0 274 202 156 35 71 142 -187 -161 185 -69 -180
$$ packed form
6497b4Q2j00O9J95m75K71L1O5l21M33l32L53P0j02k38J20m00O8J18Q5r2j26K26
6520b4Q2qk82J76j3n3K11j55L7o1j08L40k52p2P3j01M04k88j04J97k6N3j12jJ02
6545A5Rn6R6l97K68M5j86K21J6k62N17k67j16l1j9K54k58K04Q9Mj44j6q5K62k
6570A61l10K4K07k1k21L41m23K15N8j46Q4M35k04m85L32J15p5o4j86L18k00n7
6592a02Q0r2N8j66Q8k4l2J94J44j42J99k06k42M23j61j55J37K29j88J43j79J12
6614A18J9m13L45J2n4qK53m31J42j24K70k12K05k81J82R5r4J04O7k44P4J10M7
6637A82J14n93J0J91K64K4k9N2j85K31j70J99l96L9K64r3k44K06j60J66j15k52
6659b95L10Q1q3L0j48j07L31j50J21N9l95K46K74p2m6j21L6P1l29K6L46k54j11
$$ plain form
6682 -180 76 -188 -215 283 -173 -216 30 -22 141 132 357 -221 69 -39 18 66 -133 -133 -59 10 37 -171 -210 145
6706 145 -3 81 -313 -156 -304 253 82 -201 267 -190 47 -160 174 88 -115 139 -245 60 218 109 -70
6727 -70 21 226 -7 -132 230 50 153 246 297 10 93 187 -154 -141 -183 198 -134 -87 490 82 163 -17 -28 115
6751 115 -88 -145 -106 -222 157 -66 55 -37 -269 -31 37 -112 342 -200 -398 245 -369 -49 -80 278 305 41
6773 41 28 204 21 -168 141 -59 -247 123 46 239 -45 72 225 71 -133 -65 118 -113 -217 -218 -3 56
6795 56 -207 7 -50 -102 -105 33 22 -104 132 -88 237 -73 -110 -201 42 100 138 81 -25 -42 38 5 119 -233 89
6820 89 213 -73 -13 -82 76 106 -117 -313 2 11 -157 -87 -2 79 -68 -239 -25 143 53 -7 -48 -49 -238 -40 57
6845 57 50 -66 -178 -249 81 42 -48 22 201 86 -25 61 -122 183 -123 -116 -12 113 -114 -274 33 125 69 4
$$ packed form
6682a80K56k64k7M98m56m3K46n2J63rK25n78K90j08N7M8j99%P4O9K7k08l9L55
6706A45j48Q4l94J57j48N57j71k83M68m57K37k07L34q6k03K54l84L05J58j09j79
6727g0R1K05k33j25L62j80J03R3N1k87Q3R4l41J3m2L81l32M7N77m08Q1j80j1J43
6751A15k03n7L9j16L79k23J21r2k32K38O8j49M54n42j98O43o14L20l1L58K7k64
6773D1j3J76j83j89L09k00j88L70p7J93k84J17J53j54k04O8J83k31j04jK15N9
6795E6k63K14n7n2lJ38j1j26K36k20L25l10l7r1K43N8L8n7j06j7Q0l3J14l52L22
6820H9J24k86O0o9J58L0k23j96L15Rj68P0Q5Q1j47j71K14J68r0o0m1jj89J98R7
6845E7pj16j12p1L30l9r0P0J79j15j11Q6j83L05l06PJ04J25k27j60L07R2n6o5
$$ plain form
6869 4 49 51 132 -270 87 -118 94 -100 8 142 -108 30 -412 -146 -99 -68 -140 -88 -117 63 17 86 -120 19
6893 19 74 -144 -54 72 17 -336 -170 -112 86 -62 165 177 19 -156 -59 -72 57 229 -108 35 98 171 -165
6916 -165 156 20 81 -25 151 134 -47 -14 65 -72 72 -137 -43 -32 -120 95 -81 -91 -350 -131 99 -136 -163
6939 -163 -66 -213 38 73 57 84 -163 -166 134 -216 175 85 9 -117 -251 -91 -135 -30 192 -15 -96 211 -65
6962 -65 -195 41 -121 -104 -115 -113 -49 -217 245 93 151 -148 -24 -76 -136 -42 15 -40 -119 -174 45 138 -69 87 -192
6987 -192 -61 -59 -85 36 -132 -147 -25 159 -121 204 64 79 -70 122 228 290 233 377 57 14 -209 -182 176
7010 176 -253 -105 -59 15 -66 122 -55 -142 51 211 70 38 3 -237 79 -93 -3 10 -119 -147 -121 -31 -340 -168
7034 -168 389 3 196 217 40 166 -120 4 -142 -79 -85 216 -67 158 212 -6 31 56 2 -250 -36 -213 -259
$$ packed form
6869DM5KQ1m02L57k05K12j94J08J34k50J38m42K66M7L1p2N2k9J80m6O9k06J39
6893A9N5k18R0J26n5l53J66N8J98j48K27J2j58j75R7j3J29J72l37J43O3P3l36
6916a65L21j36O1j06J76j7j81L3P9j37J44k09R4J1q8K15j76j0k59K19K30k35k7
6939a63R7j47K51L5j6K7k47lL00l50L91r0p6j26j34J60m4J05K22k07q1L07k76
6962f5j30K36j62J7j1KO4j68M62j52N8k99J24n2o0R4N7n5p9n5K19R3k07J56k79
6987a92J31Kk6J21j68j5J22J84k80L25j40J5j49J92J06O2n7J44l20m3k23K7L58
7010A76m29J48M6P4q1J88j77q7J93J60j41l2l5k40L16j72R0J3j29k8K6R0l09J72
7034a68N57l86J93K1j77J26k86J24j46O3oL01k83K25N4k18L7K5n4k52K14j77m6
$$ plain form
7057 -259 -81 -9 306 -145 44 -121 -214 -23 -289 72 248 117 73 103 -78 -290 -144 -238 -73 -6 -180 83
7079 83 135 132 -215 31 44 55 -20 -17 3 -28 278 30 40 65 -335 -32 -239 199 102 -75 176 -263 147 103 -119
7104 -119 50 -183 51 123 -86 91 -135 -7 97 -216 -108 137 -118 -11 -112 -279 -22 63 50 38 -243
7125 -243 -166 141 79 -34 127 13 39 134 -56 -32 276 -33 93 90 -23 2 116 7 33 241 -287 71 251
7148 251 -158 -66 -9 -239 130 60 198 87 125 192 -6 40 -28 216 159 168 34 -38 8 33 357 -110 -126 176 -141
7173 -141 -75 -256 316 -286 -201 29 15 -196 103 -26 4 16 -370 40 -20 -253 -33 269 -174 -4 186 201
7195 201 -394 60 235 -135 171 -115 69 -243 154 112 -48 12 155 -53 -82 -168 97 143 37 -29 21 -2 -129
7218 -129 172 -8 -129 40 -237 -87 -193 -159 -190 153 133 218 -46 85 -213 -33 -169 -59 39 20 -30 -151
$$ packed form
7057b59J78P2L15m51J89j65r3J91k66L61J76j31m4L0j81k12J46r4J65O7j74K63
7079H3N2ll47K46J3J1p5LK0l1L06k48J0K5m00L03k07M38r7j77K51m39M10m4k22
7104a19J69k33K34P2k09J77k26J28J04l13J08K45k55J07j01j67K57Q5j3j2k81
7125b43P7L07o2j13J61j14K6R5j90K4L08l09J26lj13K5J14j09K6K08n28L58J80
7148B51m09R2N7k30L69p0J38j11L8O7j98M6o8K44n7Rj34p2M6K5L24m67j6L02l17
7173a41O6j81N72o02Q5K30j4k11K99j29L0J2l86M10o0k33K20L02m43J70J90J5
7195B01n95M54J75l70L06k86J84l12L97m2j60O0J43k08k9q6K65M6j06o6N0k3j27
7218a29L01j80j21J69k77J50j06L4l1L43k0Q5k64J31k98J80j36J10R8j9n0j21
$$ plain form
7240 -151 39 11 18 -105 -222 -168 35 -321 -116 50 117 -28 216 -58 129 46 232 -47 31 -122 -17 103
7262 103 218 71 81 15 276 135 168 60 313 -130 -133 -104 88 177 -30 248 29 -102 11 205 51 -31 -21
7285 -21 -64 -42 61 183 -207 180 188 -180 446 90 -96 266 -236 -28 -42 370 126 219 153 -101 -11 -21 18 48
7309 48 500 -174 -294 -65 -58 -85 -218 94 123 70 26 262 -172 -105 90 31 114 -24 -168 -211 -43 116 -23 -62
7333 -62 -418 74 -144 -19 -272 -41 -269 116 -81 -80 146 -62 -192 6 -170 -25 158 -37 -2 189 -187
7354 -187 -216 -186 -37 96 -49 -229 -198 -167 171 -54 89 -73 -93 -31 -55 93 -93 -123 7 -163 68 88 97 37
7378 37 163 16 -6 102 137 148 -162 -209 264 94 -82 74 290 -189 130 -52 -164 -26 269 -2 64 -198
7400 -198 -206 -215 -83 60 -41 167 23 141 298 107 68 28 -92 -88 -86 178 9 203 132 180 164 59 -68 -11 -114
$$ packed form
7240a51J90k8Pj23j17N4K03l56K05J66O7j45K44k74J87q3J86k79P8j53J05J20
7262A03J15j47J0o6K61j41L3j08K53m43lK9J92Q9k07K78k19j31J13J94j54q2J0
7285b1m3K2J03J22l90L87Ql68O26l56j86L62n02K08j4M12k44R3o6k54R0j0L9L0
7309D8M52o74j20K29Pk7j33L12K9n3m4K36m34O7J95n9Q3j38j44m3J68J59j39l9
7333f2l56M92k18J25k53K31k28L85j97JK26k08j30J98j76J45J83j95L5J91l76
7354a87k9L0J49J33j45j80L1L1L38k25J43j62k0O2k4J48j86l0J30j70K31K0Ro0
7378C7J26j47k2J08L5J1l10m7M73j70j76J56K16m79L19j82j12J38K95k71O6k62
7400a98qrJ32J43j01K08j44J18J57j91l9m0j20MKK64j69J94p1M8j6j05j27N7j03
$$ plain form
7425 -114 -220 171 -110 110 257 206 -540 68 -40 169 1 -275 129 -236 241 35 172 -190 134 -108
7445 -108 -220 110 -164 120 -261 -93 86 -232 238 26 -279 -277 -164 44 -150 -44 -155 -1 -90 -56 120
7466 120 208 83 90 79 -65 201 -29 -212 30 75 250 164 11 -162 -158 91 65 -107 83 0 -70 -122 -83 163
7490 163 -4 289 -207 53 18 -256 450 -93 -39 210 -74 59 -54 -95 33 -58 -96 505 93 -291 -40 98
7512 98 323 340 -65 -165 89 41 -24 174 -22 60 -66 10 182 252 20 165 164 -66 140 -21 -130 -17 -380
7535 -380 24 -421 174 217 138 107 23 393 313 240 -40 -48 80 -11 -178 -69 -64 89 332 -116 25 -76 -134 141
7559 141 -18 71 71 282 2 46 -1 59 155 82 10 306 -37 -96 65 223 114 -259 5 -34 -149 117 -114 83
7583 83 -157 -109 -32 258 -192 -131 -276 -15 -271 352 -54 -263 151 -42 56 -46 22 177 -93 33 -80 -28
$$ packed form
7425a14j06L91k81K20J47n1p46O08j08K09j68k76M04l65M77k06J37l62L24k42
7445a08j12L30k74K84l81J68J79l18M70k12l05KJ13K08j94J06j11J54q9L4J76
7466A20Q8j25Pj1j44K66k30j83K42M5J75q6j53j73MK49k6j72J90q3p0n2L9K46
7490A63j67K93m96K60l5k74P06n43N4K49k84J33j13m1J28r1l8O01m12l84K51J38
7512I8K25J7m05j00K54m8o5J98j96Q2j26P6J72P0k32J45jk30K06j61j09J13l63
7535c80M04m45N95M3p9l1q4L70q0p3k80qJ28r1j67J09NJ53K43m48J41j01n8K75
7559A41j59Q9%K11k80M4m7O0R6p3p2K96l43n9J61J58j09l73K64l9j15K66k31J97
7583H3k40M8P7K90m50O1j45K61k56O23m06k09M14j93R8j02O8J55k70J26j13N2
$$ plain form
7605 -28 -49 -119 68 -257 -209 386 23 -28 -32 290 68 88 -124 -214 -90 51 49 -69 -168 -100 316 -99 251 137
7629 137 235 278 -184 172 349 -22 -1 194 94 -157 210 200 -303 58 -148 49 -195 165 237 -62 8 -117
7651 -117 354 246 15 32 94 23 359 -180 -147 -256 -138 -45 99 -155 61 -93 78 -165 14 216 -42 -205
7673 -205 -141 85 -35 218 83 198 79 -28 -100 -51 -139 -263 -311 -331 -30 -53 -57 12 94 -7 122 153 -153 -9
7697 -9 49 -82 146 -70 138 -128 -359 -213 -207 -10 -55 36 -96 -277 -53 13 22 42 -175 74 197 50 -193 89
7721 89 29 -157 -49 10 -216 -118 -110 25 -4 -186 254 -8 -254 -39 -199 10 -104 -1 95 -111 137 218 -338
7744 -338 23 -35 94 -49 -373 104 184 53 28 -27 -276 12 -127 146 -105 93 13 -7 209 -175 91 -169
7766 -169 -13 103 151 172 123 -21 -132 178 -216 68 -56 -29 62 80 -312 -40 -109 -156 -71 -175 149 -93 296
$$ packed form
7605b8k1p0J87l25M8N95l63n1mL22k22K0k12r0J24J41kj18r9O8M16m15L50j14
7629A37R8M3m62L56J77l71K1J95j00k51L67j0n03L61k06J97k44L60P2k99P0j25
7651a17M71j08k31J7O2p1L36n39L3j09J18R3J44k54K16j54J71k43J79K02k58j63
7673b05O4K26j20K53j35J15j19j07p2M9q8j24m8k0L01k3mO9Q2j01J29L1l06J44
7697iN8j31K28k16K08k66k31J46OJ97m5R1j32j81K24O6RK0k17K49J23j47k43K82
7721H9o0j86J08N9k26R8QJ35k9j82M40k62k46K15j60K09j14J03R6k06K48Q1n56
7744c38L61n8J29j43l24M77Q0j31k5n5k49K88j39K73k51J98q0k0K16l84K66k60
7766a69J56J16M8K1m9j44j11L10l94K84j24K7R1J8l92K72o9m7Q5j04L24k42L89
$$ plain form
7789 296 9 -131 -11 -302 189 215 27 -203 -8 181 -57 209 215 -64 -151 43 -186 -329 127 48 -285 -143
7811 -143 -49 -390 -191 30 -432 271 -136 179 -20 229 -20 122 -93 134 12 -192 -84 -262 3 102 -127
7832 -127 114 -292 -423 -402 -59 59 87 295 34 72 -5 -235 228 38 -15 -220 -76 203 -8 -313 85 84
7854 84 64 -167 77 -76 -135 161 -122 110 22 -108 28 -46 109 -290 54 -131 -192 10 -216 -122 -79 115 91
7877 91 -28 -259 63 -45 248 213 6 123 -16 2 -2 -142 -67 72 -18 78 446 -17 240 222 -60 276 11
7900 11 -95 -65 62 -4 -211 -14 202 119 -203 -50 -78 148 -29 -260 -59 132 298 -239 409 327 -151 -56
7922 -56 63 -125 -10 183 -153 249 -68 -19 240 -226 -306 -90 37 139 -172 73 -142 210 234 138 -170 295
7944 295 -86 13 -166 -461 73 38 -7 29 66 -125 -146 -251 105 -299 -209 19 -96 303 -13 -46 43 212 233
$$ packed form
7789B96k87j40J20k91M91K6j88k30J95J89k38K66Ok79q7J94k29j43M56p9l33J42
7811a43R4l41J99K21m62P03m07L15j99K49k49J42k15K27j22k04J08j78K65R9k29
7832a27K41m06j31K1L43J18K8K08k61L8p7k30M63j90n3k05J44K79k11l05L98j
7854H4k0k31K44j53n9K96k83K32q8j30J36p4J55l99L44j85o1K02k26R4M3J94k4
7877I1j19k31L22j08K93l5k07J17j39J8mj40P5J39r0R6L68m63K57j8k82L36k65
7900A1j06L0J27o6k07J97K16q3l22J53k8K26j77k31K01J91J66n37O48q2m78R5
7922e6J19j88J15J93l36M02l17M9K59m66q0K16J27J02l11K45k15L52K4r6l08M65
7944B95l81R9j79k95N34l5m5L6L7j91k1j05L56m04R0K28j15L99l16l3Q9J69K1
$$ plain form
7967 233 -126 -220 -554 -123 188 -186 -45 143 -147 277 -279 91 -108 -154 -186 58 -33 -299 220 92 -168
7988 -168 10 -65 -1 -180 -50 255 -51 35 -152 -259 167 106 -160 -14 -167 301 120 272 -125 13 -169
8009 -169 -1 8 75 -129 -166 -177 50 -79 -54 -180 -33 -66 162 -115 -172 -90 40 55 150 -167 -118 2 -64 34 -38
8034 -38 24 5 286 170 135 -26 342 -86 -166 -121 10 -144 -76 -166 -201 -116 -46 138 284 -41 -387 39 14 205
8058 205 -128 105 147 -69 81 -115 -120 47 -140 128 -15 -253 -112 -122 -176 67 10 14 258 -113 377 69 -49
8081 -49 -108 -13 -70 2 51 162 -59 -240 102 -258 -52 -59 149 24 -200 -139 -112 -69 115 61 -41 -5 339 -121
8105 -121 -85 407 -271 -23 -69 13 -124 -173 19 84 416 267 -45 154 125 75 -52 -33 236 14 -56 138 254
8128 254 -26 -2 -163 90 90 -187 332 269 -289 -209 93 94 -82 -24 -92 94 51 -103 173 129 -77 -227 -185 -128
$$ packed form
7967B33l59r4l34M31L11l74J41J88k90M24n56L70j99m6l2K44r1k66N19j28k60
7988a68J78p5O4j79J30L05l06Q6j87j07M26o1k66J46j53M68j81J52l97J38j82
8009a69J68RO7k04l7j1K27j29K5j26J47l3K28k77n7Q2J30J5R5l17M9J20o6R8p2
8034c8O2j9K81j16l5j61L68m28q0M5J31j54O8r0l5Q5P0J84J46l25l46M26k5J91
8058B05l33K33M2k16J50j96nJ67j87K68j43k38J41j0n4K43n7MK44l71M90l08j18
8081d9n9R5n7P2M9J11k21j81L42l60K06pK08j25k24O1K7M3J84n4j02L6L44m60
8105a21L6M92o78K48m6Q2j37m9J92O5L32j49l12J99k9n0j27J9K69k22p0J94J16
8128B54k80K4j61K53%k77N19o3n58Q0L02Jj76N8o8J86m3j54K76m4k06j50M2N7
$$ plain form
8152 -128 -3 13 -296 -18 -95 345 46 59 -173 -46 -126 140 53 -44 -48 -28 -70 19 59 -76 -290 157 233 236 163
8177 163 228 -140 -21 159 -34 110 45 -158 11 -8 -214 151 118 74
$$ packed form
8152a28J25J6l09K78p7M40k99J3k32J27q0K66q7r7mK0m2Q9M0j35k14M47P6Lp3
8177A63O5l68J19J80j93J44o5k03J69j9k06L65l3m4
8191G4
$$ Imaginary data points
##PAGE= N=2
##DATA TABLE= (X++(I..I)), XYDATA
$$ plain form
0 0 0 0 0 0 0 0 0 0 1 -8 8 -8 8 -16 16 -16 24 -24 32 -39 43 -48 57 -68 78 -88 101 -116 131 -148 164 -186
32 -186 209 -233 258 -290 322 -357 397 -439 487 -538 596 -658 730 -811 899 -1004 1121 -1262
50 -1262 1426 -1619 1863 -2171 2576 -3132 3954 -5295 7856 -14528 68453 143641 -13607 -85563
64 -85563 -33444 59021 40973 -22218 -41367 6793 32533 19054 -3441 539 1737 -2448 1404
77 1404 18114 11801 -17836 -34313 -7271 33468 41863 9282 -18761 -14176 6276 6842 -6120
90 -6120 -9068 1733 8613 7666 7527 9919 4790 -7541 -10562 3862 13118 -2168 -21076 -10988
104 -10988 17490 25540 4754 -12874 -7278 3436 -1961 -13462 -9223 5418 7618 -2149 -3294
117 -3294 6555 7364 -5976 -13841 -6847 1250 -1366 -8615 -5133 6595 8975 -1940 -8087 46 4883
$$ packed form
0@%%%%%%%%JrJ6j6J6k4L2l2M0m8N6p1Q2r1J05j25J46j66J89k17K47k79L12l50
32a86L95m42M91n48O12o79P54q36R26j025J134j254J388j541J710j903K125k383
50a262K688l045L482m034M747n708P086r249J3151k2384Q2981P5188j57248p1956
64h5563N2119R2465j8048o3191j9149M8160K5740j3479k2495L980J198m185L852
77A404J6710o313k9637j6477K7042M0739Q395l2581k8043M585K0452N66j2962
90f120k948J0801O880r47j39K392n129j2331l021J4424R256j5286j8908J0088
104a0988K8478Q050k0786j7628N596J0714n397j1501M239J4641K200r767j145
117c294R849Q09j3340p865O994Q097k616p249L482J1728K380j0915o147Q133M837
$$ plain form
132 4883 -7786 -21255 -10969 13168 16267 -6750 -20473 -1016 21732 9047 -23386 -26582 1998
145 1998 18459 1975 -17943 -9008 12689 14046 -5049 -14474 -5031 3132 -2702 -8533 -2557 4854
159 4854 3715 37 582 2450 -1232 -6454 -4986 1260 1377 -3941 -2594 6261 10233 1944 -6220 -4237
175 -4237 3601 3843 -3657 -6978 434 8729 6323 -413 564 5355 1925 -4819 -3963 4673 6272 -2150
191 -2150 -5366 4613 14022 7968 -6527 -8567 2934 9147 2164 -4533 -2822 3508 7216 6091 3588
206 3588 480 -3507 -3420 2549 7486 3120 -6371 -5932 6590 14337 6233 -8583 -10631 2398 11906
221 11906 4220 -8980 -8171 4330 11663 4673 -4457 -4023 638 2178 -777 -1572 66 -103 -1501
236 -1501 106 4399 3254 -2609 -5241 -1731 2058 460 -2596 -2963 -344 1476 252 -131 -88 -2006
$$ packed form
132D883j2669j3469J0286K4137L099k3017j3723J9457K2748j2685l2433l196K8580
145A998J6461j6484j9918Q935K1697J357j9095r425R443Q163n834n831N976P411
159D854j139l678N45J868l682n222J468O246J17n318J347Q855L972q289q164J983
175d237P838K42p500l321P412Q295k406o736R77M791l430o744Q56Q636J599q422
191b150l216R979R409o054j4495k040J1501O213o983o697J711O330L708j125k503
206C588l108l987Q7N969M937m366r491M39J2522P747q104j4816k048J3029R508
221A1906p686j3200Q09J2501P333o990r130M34M661J540k955p95J638j69j398
236a501J607M293j145n863k632L510L789j598l056l67K619J820j224l83M3j918
$$ plain form
252 -2006 -4580 -3021 775 1833 -2166 -5099 -2114 3609 3824 -2412 -7333 -3786 1994 1462 -3630 -4930
268 -4930 -690 2486 389 -2560 -2366 -37 -936 -3006 -2667 453 798 -1873 -2263 46 1482 -400
284 -400 -2515 -2127 -732 -258 -1188 -852 625 432 -1191 -972 1368 1511 -1771 -3408 -1012 2633 2302
301 2302 -1441 -2663 431 4222 2421 -2480 -2760 714 2980 1119 -1498 -858 1783 2872 1029 -261
317 -261 768 1008 218 359 1789 1266 102 321 2016 2738 1274 -891 -279 2101 2075 -175 -361 1278
335 1278 2641 1236 520 1142 1318 1491 540 -263 917 1877 869 -573 620 2663 2309 144 -1295
352 -1295 50 2058 1347 -666 -1062 1422 2053 844 -137 52 272 -403 -190 6 508 -513 -617 258
370 258 1452 596 -1563 -1667 59 597 -750 -1944 -930 304 358 -550 -936 -774 -20 -560 -1733 -1423
$$ packed form
252b006k574J559L796J058l999k933K985N723K15o236m921L547N780n32n092j300
268d930M240L176k097k949J94K329q99k070L39L120L45k671l90K309J436j882
284d00k115L88J395M74r30L36J477j93j623K19K340J43l282j637K396L645l31
301B302l743j222L094L791j801m901k80L474K266j861k617O40K641J089j843j290
317b61J029K40p90J41J430n23j164K19J695P22j464k165O12K380k6k250j86J639
335A278J363j405p16O22J76J73r51q03J180R60j008j442J193K043l54k165j439
352a295J345K008p11k013l96K484O31j209r81J89K20o75K13J96N02j021j04Q75
370B58J194q56k159j04J726N38j347j194J014J234N4r08l86J62P54n40j173L10
$$ plain form
388 -1423 -243 -421 -1458 -1560 -381 71 -578 -1622 -1681 -450 -279 -1729 -2217 -771 -169 -750 -1053 -575
406 -575 -560 -1112 -1761 -923 -368 -775 -1743 -1079 813 245 -1117 -1600 -822 121 -148 -839 -1073 -208 775 560
426 560 -466 -563 -220 141 -227 -312 -402 427 47 172 295 653 655 -344 -222 454 703 -112 138 751 1205 711
448 711 260 639 1005 816 174 65 1114 1240 653 529 1365 1529 1049 470 393 741 796 1078 496 754 1318
469 1318 847 816 1097 660 760 516 522 486 880 1131 279 479 1005 1180 277 26 449 385 229 -13 226 622
491 622 559 -73 84 634 292 -607 -571 -128 231 -219 36 46 -65 -289 -213 -343 -249 -540 -906 -762 -140 -334
513 -334 -323 -938 -861 -1028 -457 -20 -760 -1512 -959 -319 -538 -242 -1238 -1237 -1098 -547 35 -580 -1436 -1682 -844 493
535 493 102 -1596 -2192 -989 290 165 -846 -1684 -1295 -357 447 104 -996 -1433 -665 532 469 -524 -1598
$$ packed form
388a423J180j78j037j02J179M52o49j044n9J231J71j450m88J446O02n81l03M78
406e75J5n52o49Q38N55m07r68O64J892n68j362m83P78R43k69o91k34Q65R83k15
426E60j026r7L43L61l68q5r0Q29l80J25J23L58Kr99J22O76K49q15K50O13M54m94
448G11m51L79L66j89o42j09J049J26n87j24Q36J64m80n79p7L48N5K82n82K58N64
469A318m71l1K81m37J00k44Ol6L94K51q52K00N26J75r03k51M23o4j56k42K39L96
491F22o3o32J57N50l42q99L6M43L59m50K55J0j11k24P6j30R4k91l66J44O22j94
513c34J1o15P7j67N71M37p40p52N53O40k19K96r96JJ39N51N82o15q56k46Q38J337
535D93l91j698n96J203J279j25j011q38L89R38Q04l43j100m37P68J197o3r93j074
$$ plain form
554 -1598 -877 162 428 332 132 -516 -795 575 665 327 -280 -408 -218 623 1108 513 -95 -67 603 1319
574 1319 1149 50 -394 28 1471 1243 354 -16 606 1191 570 317 626 1326 787 13 306 1504 1758
593 1758 456 -459 66 982 2001 1134 -629 -533 856 2032 1250 95 -312 311 961 1539 915 5
611 5 -296 -269 1064 1905 720 -976 -1525 698 1663 974 -476 -1594 -459 1273 1752 90 -1731 -1376
629 -1376 247 1389 422 -1246 -1621 -240 606 471 -800 -1242 -606 -577 -147 -70 -367 -815 -1294 -984 97
648 97 278 -736 -1558 -955 -426 212 -595 -1769 -1588 -229 452 -564 -1529 -921 192 154 -1049 -1119 -329
667 -329 321 -247 -1483 -1225 453 1244 -625 -1868 -1521 692 828 -161 -1552 -1514 618 1204 141 -1009
685 -1009 -962 139 725 653 232 -567 -393 200 563 908 339 -733 -924 188 1723 1510 -330 -1198 -433
$$ packed form
554a598P21J039K66r6k00o48k79J370R0l38o07j28J90Q41M85n95o08K8O70P16
574A319j70j099m44M22J443k28q89l70O22N85o21k53L09P00n39p74K93J198K54
593A758j302r15N25R16J019q67j763R6J389J176p82j155m07O23O50N78o24r10
611El01K7J333Q41j185j696n49K223R65o89j450j118J135J732M79j662j821L55
629a376J623J142r67j668l75J381Q46j35j271m42O36K9M30P7k97m48m79L10J081
648I7J81j014q22O03N29O38q07j174J81J359O81j016r65O08J113l8j203p0P90
667c29O50n68j236K58J678P91j869j243L47K213J36r89j391L8K132N86j063j150
685a009M7J101N86p2m21p99J74N93L63L45n69j072j91J112J535k13j840q68P65
$$ plain form
704 -433 1533 2137 58 -1378 -618 1184 1853 648 -657 -676 917 1603 892 -5 73 370 819 710 794
723 794 656 608 72 225 954 1124 604 -490 12 807 1197 733 -434 -174 718 1175 407 -427 127 963
743 963 821 -302 -202 430 919 -28 -1004 -513 1195 1253 -521 -1314 -468 997 1461 -290 -1727 -1296 767
762 767 1398 212 -1482 -1613 -165 469 179 -825 -1238 -745 169 457 -70 -593 -1336 -816 214 287 -102
781 -102 -1440 -1283 -342 558 137 -860 -1792 -951 535 617 -633 -1485 -1203 -26 458 -107 -869 -868 -454 336
801 336 36 -431 -549 -442 -199 -47 188 175 -662 -644 -12 477 180 -477 -440 -98 579 14 -146 -538 -95
822 -95 495 2 -222 -119 262 67 223 -31 -71 292 763 254 -376 19 870 540 288 -509 -158 548 1060
843 1060 389 -343 -164 471 987 600 -50 -9 698 688 457 -199 371 185 390 437 426 265 47 275 351 581
$$ packed form
704d33J966O04k079j436P60J802O69j205j305j9J593O86p11q97P8K97M49j09Q4
723G94j38m8n36J53P29J70n20j094N02P95L90m64j167K60Q92M57p68q34N54Q36
743I63j42j123J00O32M89r47r76M91J708N8j774p93Q46J465M64j751j437M31K063
762G67O31j186j694j31J448O34k90j004m13M93R14K88n27n23p43N20J030P3l89
781a02j338J57R41R00m21r97r32Q41J486Q2j250q52K82J177M84n65p62JM14P90
801C36l00m67j18J07K43J52K35j3q37J8O32M89k97o57L7L42O77n65j60l92M43
822i5N90m93k24J03L81j95J56k54m0L63M71n09o30L95Q51l30k52p97L51P06N12
843A060o71p32J79O35N16l87o50M1P07j0k31o56N70j86K05M7j1j61k18K28P6K30
$$ plain form
865 581 583 210 -169 154 646 479 264 -178 -7 322 290 204 12 241 403 -117 -54 90 -74 -52 -68 8 -18
888 -18 -108 -533 -276 12 127 -446 -516 -239 -21 -336 -615 -373 -77 -241 -165 -361 -533 18 -75 -548 -553 -418 -671
911 -671 -235 -32 -586 -868 -285 164 53 -239 -765 -495 -210 273 -105 -890 -731 -307 39 -125 -687 -436
931 -436 -264 -177 -376 -407 -365 -9 -202 -479 -104 153 -339 -492 -143 84 -17 -68 -80 -70 11 -181 -129 57 -269
954 -269 202 399 437 262 159 -34 164 495 398 223 -66 103 469 888 195 185 114 600 705 165 -63 557
976 557 554 314 414 273 225 180 212 269 494 607 260 98 552 577 205 -16 362 410 523 248 118 168 -228
999 -228 358 454 244 84 57 -170 377 79 -79 -57 39 184 371 -279 -275 -335 172 128 -363 -473 -259 206 -132
1022 -132 -142 -52 -236 -149 146 35 20 77 -447 -346 -259 -410 -263 -212 -468 -165 -411 -742 -414 -231 -312 -856 -299
$$ packed form
865E81Kl73l79L23M92j67k15m42J71L29l2q6j92K29J62n20O3J44j64K2j6P6k6
888a8r0m25K57K88J15n73p0K77K18l15k79K42K96j64P6j96j72N51r3m73nJ35k53
911f71M36K03n54k82N83M49j11k92n26K70K85M83l78p85J59M24L46j64n62K51
931d36J72Q7j99l1M2L56j93k77L75K57m92j53L49K27j01n1j2J0Q1j92N2J86l26
954b69M71J97L8j75j03j93J98L31r7j75k89J69L66M19o93j0p1M86J05n40k28O20
976E57lk40J00j41m8m5L2N7K25J13l47j62M54K5l72k21L78M8J13k75j30N0l96
999b28N86R6k10j60k7k27N47k98j58K2R6J45J87o50Mo0N07m4m91j10K14M65l38
1022a32j0R0j84Q7K95j11j5N7n24J01Q7j51J47N1k56L03k46l31L28J83q1n44N57
$$ plain form
1045 -299 -576 -113 -57 -405 -534 -208 -199 -562 -400 -349 -244 -107 -568 -333 -53 -99 -51 -415 -229 -124 -121 -199 -191 -135
1069 -135 -229 -124 -189 -146 -91 -38 -18 151 -464 -145 156 35 65 96 59 269 -39 167 99 -117 419 145 290
1092 290 -244 48 568 406 459 241 57 354 302 223 -8 65 376 459 218 554 195 223 240 323 304 25 226
1115 226 352 569 295 176 152 10 315 205 349 54 399 255 99 5 40 169 35 380 220 160 21
1136 21 65 347 232 245 141 50 98 40 213 -3 -361 -384 -74 21 -52 -23 -490 -137 -141 -132 62 -135 -302 87 -66
1161 -66 -439 -140 -78 -387 -481 -258 -112 -441 -267 -246 -263 -297 -306 -412 -144 -55 -86 -346 -357 -226 -478 -200 -428 -406
1185 -406 -305 -171 -397 -183 77 -177 -12 -152 -151 -142 -29 -332 -329 -454 85 90 -126 7 -107 -190 33 77 159 201
1209 201 -98 331 42 -36 106 -15 205 317 201 163 -102 446 216 163 502 334 157 244 160 -60 222 381
$$ packed form
1045b99k77M63N6l48j29L26Rl63J62N1J05J37m61K35K80m6M8l64J86J05Lp8QN6
1069a35r4J05o5M3N5N3K0J69o15L19L01j21L0L1l7K10l08K06o8k16N36k74J45
1092B90n34K92N20j62N3k18j84K97n2p9k31P3L11Q3k41L36l59K8J7Q3j9k79K01
1115B26J26K17k74j19k4j42L05j10J44k95L45j44j56r4L5J29j34L45j60o0j39
1136B1M4K82j15J3j04r1M8n8J73k16l58k3L10R5p3K9m67L53mRJ94j97j67L89j53
1161f6l73K99O2l09r4K23J46l29J74K1j7l4rj06K68Q9l1k60j1J31k52K78k28K2
1185d06J01J34k26K14K60k54J65j40JRJ13l03Lj25N39Nk16J33j14q3K23M4Q2M2
1209B01k99M29k89p8J42j21K20J12j16l8k65N48k30n3L39j68j77Q7q4k20K82J59
$$ plain form
1231 381 237 158 93 -16 322 421 89 32 127 453 164 481 -59 -102 518 483 239 124 196 19 499 491 249
1254 249 -187 96 304 51 51 45 26 -168 48 110 30 -171 -103 -132 31 325 -223 -430 -280 157 154 131 4 -299
1278 -299 -51 431 -21 -410 -335 -19 -156 -468 -34 -27 -232 -446 -417 -184 -40 -177 -508 -468 20 -116 -326 -489
1300 -489 -368 -79 70 -296 -316 -241 -198 -127 -388 -334 81 -282 -193 -260 -367 -278 14 -489 -512 -423 -226 235 -300
1323 -300 -64 -261 233 511 -195 -179 121 67 140 235 -264 -186 -155 267 108 168 -38 338 204 34 351 187
1345 187 87 23 147 274 577 212 -595 -162 387 406 152 -64 -30 443 69 90 192 134 213 317 87 221
1367 221 122 460 92 126 46 391 97 -147 3 700 481 60 18 -170 36 362 -9 -165 189 -69 222
1388 222 -145 -101 -44 25 -85 86 -37 83 322 -20 -215 -433 132 15 42 -317 -213 93 100 65 -482 -370
$$ packed form
1231C81j44p9o5j09L38R9l32n7R5L26k89L17n40m3O20l5k44j15P2j77M80qk42
1254B49m36K83K08k53%oj9j94K16O2q0k01O8k9J63K94n48k07J50M37lk3j27l03
1278b99K48M82m52l89P5L16j37l12M34Pk05k14K9K33J44j37l31M0M88j36k10j63
1300d89J21K89J49l66k0P5M3P1k61N4M15l63Q9o7j07Q9K92n03k3Q9J97M61n35
1323c00K36j97M94K78p06J6L00n4P3R5m99P8L1M22j59O0k06L76j34j70L17j64
1345A87j00o4J24J27L03l65q07M33N49J9k54k16L4M73l74K1J02n8P9J04k30J34
1367B21r9L38l68L4q0L45k94k44J50O97k19m21m2j88K06L26l71j56L54k58K91
1388B22l67M4N7O9j10J71j23J20K39l42j95k18N65j17K7l59J04L06Pl5n47J12
$$ plain form
1410 -370 97 106 1 -290 -213 -74 81 4 -74 -197 -174 -59 -311 69 -88 -30 -450 -270 37 208 -17 -804
1432 -804 -519 480 -89 -276 -594 -339 -72 18 -472 -250 -42 -416 -6 -290 -88 60 -65 -132 -469 -263 -91
1453 -91 58 -96 -47 -36 -132 110 -431 57 -120 211 344 -61 -62 183 40 43 28 41 -112 -122 99 6 -6 61 -309
1478 -309 -39 -72 77 433 257 185 84 156 391 161 188 193 350 546 205 -84 165 295 549 199 239 10
1500 10 339 123 -55 474 338 -7 209 -113 367 342 -356 251 311 229 277 -42 -131 229 368 208 163 28
1522 28 250 230 85 -184 171 139 -66 47 -189 -152 -115 -20 64 191 197 -56 -554 -252 158 -369 -261 -230 -274 -86
1546 -86 -306 -109 -229 -363 -212 -4 -630 -22 -202 -251 -36 210 -299 -331 -263 -100 -220 -345 -179 -62 -84 117
1568 117 -326 -167 -82 -233 -170 -219 -286 -270 -84 137 -124 -227 -82 33 -208 -40 -70 -244 -62 -207 318 267
$$ packed form
1410c70M67Rj05k91P7J39J55p7p8j23K3J15k52L80j57N8m20J80L07J71k25p87
1432h04K85R99n69j87l18K55K67R0m90K22K08l74M10k84K02J48j25o7l37K06J72
1453i1J49j54M9J1r6K42n41M88j77L31J33m05jK45j43Lj5J3j53j0K21r3j2O7l70
1478c09K70l3J49L56j76p2j01P2K35k30K7NJ57J96l41k89K49J30K54l50M0k29
1500A0L29k16j78N29j36l45K16l22M80k5o98O07O0q2M8l19q9L60J39j60m5j35
1522B8K22k0j45k69L55l2k05J13k36L7L7R5Q4J27Ok53m98L02M10n27J08L1m4J88
1546h6k20J97j20j34J51K08o26O08j80m9K15K46n09l2O8J63j20j25J66J17k2K01
1568A17m43J59Q5j51O3m9o7J6J86K21k61j03J45J15k41J68l0j74J82j45N25n1
$$ plain form
1590 267 16 2 166 -16 -124 -199 -124 190 223 -11 30 120 -11 107 -237 215 139 380 -67 -85 -13 455 -65
1613 -65 86 -11 230 190 147 116 203 439 78 245 216 318 492 62 95 385 261 -149 265 -52 396 144 121
1636 121 279 174 35 201 340 286 247 -107 217 116 146 69 -120 23 76 127 -102 -166 248 177 175 234 18 272
1660 272 171 15 -106 -219 -166 -69 -489 -11 -58 -309 -141 -86 132 9 -133 -256 -102 197 -150 -328 -245 -310
1682 -310 -82 -106 -53 -307 -131 86 -238 -482 -247 -198 -83 -43 -199 -69 143 -170 -295 99 -177 84 -275
1703 -275 -307 94 -116 -169 -240 -146 -112 -322 -9 -194 -134 65 -220 100 55 20 -83 -224 5 242 32 292 -190
1726 -190 -79 266 94 42 116 166 103 159 84 119 -81 242 102 242 -104 55 245 -50 319 131 95 -103 44
1749 44 197 346 -141 34 54 32 71 -97 377 236 -104 385 319 257 59 51 399 193 -185 148 301 187 138
$$ packed form
1590B67k51j4J64j82j08p5P5L14L3k34M1R0j31J18l44M52p6K41m47j8P2M68n20
1613f5J51r7K41m0m3l1Q7K36l61J67k9J02J74m30L3K90j24m10M14l17M48k52k3
1636A21J58j05j39J66J39n4l9l54L24j01L0p7j89J43N3N1k29o4M14p1kN9k16K54
1660B72j01j56j21j13N3R7m20M78m7k51J68N5K18j23j42j23J54K99l47j78Q3o5
1682c10K28k4N3k54J76K17l24k44K35M9J15M0j56J30K12l13j25L94k76K61l59
1703b75l2M01k10n3p1R4L4k10L13j85O0J99k85L20m5l5j03j41K29K37k10K60m82
1726a90J11L45j72n2P4N0o3N6p5L5k00L23j40J40l46J59J90k95L69j88l6j98J47
1749D4J53J49m87J75K0k2L9j68M74j41l40M89o6o2j98qL48k06l78L33J53j14m9
$$ plain form
1772 138 92 157 102 -168 87 -22 385 76 -78 -116 -49 -145 -105 -146 -364 148 40 -96 -13 -201 -90 -57 67
1795 67 -54 121 -24 -2 -303 -75 -506 -8 107 -123 -135 -320 -180 86 -137 -263 73 -155 -393 -299 -232 -137
1817 -137 -243 -133 33 -169 -237 -101 -92 132 -214 -24 -273 89 -97 -155 -318 -140 29 -62 -174 -222 -98 88
1839 88 69 -46 -98 -311 -298 -33 -204 -282 22 -189 223 -65 100 -123 230 192 -39 107 -149 160 70 -146
1861 -146 74 -103 193 -1 72 272 604 213 144 272 515 60 329 64 131 228 -18 305 67 237 50
1882 50 83 262 204 217 188 17 -123 140 -141 397 -33 209 325 61 47 191 -4 206 274 -136 167 -194
1904 -194 -94 -174 31 172 -229 -172 -142 592 -288 -246 169 220 -109 -85 45 -57 -118 -105 -41 5 -101 124 -228
1927 -228 112 -85 -215 19 -347 -31 -67 -229 -97 -165 -10 101 11 210 107 -181 -246 -196 -174 -164 39 -87
$$ packed form
1772A38m6O5n5k70K55j09M07l09j54l8O7r6M0m1k18N12j08j36Q3j88J11L3J24
1795F7j21J75j45K2l01K28m31M98J15k30j2j85J40K66k23j26L36k28k38R4O7R5
1817a37j06J10J66k02o8J36RK24l46J90k49L62j86n8j63J78J69r1j12m8J24J86
1839H8j9j15n2k13J3K65j71p8L04k11M12k88J65k23L53l8k31J46k56L09r0k16
1861a46K20j77K96j94P3K00L32l91o9J28K43m55K69k65O7R7k46L23k38J70j87
1882E0L3J79n8J3k9j71j40K63k81N38m30K42J16k64j4J44j95K10O8m10L03l61
1904a94J00q0K05J41m01N7L0P34q80M2M15N1l29K4J30j02o1J3O4M6j06K25l52
1927b28L40j97j30K34l66L16l6j62J32o8J55J11r0J99j03k88o5N0K2J0K03j26
$$ plain form
1949 -87 -263 -123 -19 -319 -384 66 -78 -139 -148 -246 -202 -196 -129 -223 -313 140 -47 83 -247 -142 -34 126 -22 41
1973 41 86 95 -148 -202 -63 -156 13 -87 -52 164 -35 -298 15 21 37 54 -161 -99 272 114 179 -8 -155 304
1997 304 208 100 97 -22 -6 116 55 68 137 -38 329 223 189 -158 1 52 210 104 254 161 136 65 181 37
2021 37 -76 173 106 304 489 -22 320 -111 45 127 160 46 101 -194 282 174 -11 178 -104 40 -45 120
2043 120 191 -67 -223 -29 -262 2 107 -176 157 99 184 -68 -314 -45 11 38 -128 -25 -115 -123 -9 219 -71
2066 -71 14 -291 27 -159 -24 57 -348 -50 -6 -235 103 133 -202 -175 -221 -162 64 56 -31 327 -341 192 -220 -350
2090 -350 83 -64 -66 -90 156 23 39 -341 -142 -102 -6 27 -406 -132 -261 -61 105 261 -203 186 -259 -92
2112 -92 190 -267 -198 167 -2 -182 68 44 -68 71 -192 76 46 -241 84 -52 170 -50 -28 -78 58 141
$$ packed form
1949h7j76J40J04l00o5M50j44o1rr8M4OO7r4r0M53j87J30l30J05J08J60j48O3
1973D1M5Rk43n4J39r3J69j00L5K16j99k63L13OJ6J7k15O2L71j58O5j87j47M59
1997C04r6j08lj19J6J22o1J3O9j75L67j06l4l47J59N1J58j06J50r3k5p1J16j44
2021C7j13K49o7J98J85n11L42m31J56Q2L3j14N5k95M76j08j85J89k82J44q5J65
2043A20P1k58j56J94k33K64J05k83L33n8Q5k52k46K69N6K7j66J03r0qJ14K28k90
2066g1Q5l05L18j86J35Q1m05K98M4k29L38L0l35K7m6N9K26qq7L58o68N33m12j30
2090c50M33j47kk4K46j33J6l80J99M0R6L3m33K74j29K00J66J56m64L89m45J67
2112i2K82m57O9L65j69j80K50k4j12J39k63K68l0k87L25j36K22k20K2n0J36Q3
$$ plain form
2134 141 70 -36 -177 310 229 32 307 250 167 -85 262 78 -77 257 141 -205 269 145 -274 99 238
2155 238 -127 -75 174 144 179 115 -127 71 -40 197 -24 -20 -36 -198 -46 124 141 158 -440 56 89 73 -129 60
2179 60 18 -159 174 -193 -326 -71 -44 163 129 83 -65 187 -181 -366 -292 -340 201 -59 -300 -110 -93 39 205
2202 205 -105 -124 -16 -226 -58 -483 -44 -135 -221 -214 16 16 18 -176 50 -202 -78 -93 -336 -123 31 -213 -92
2225 -92 23 61 69 -214 -117 -144 188 -55 142 90 -36 346 -21 7 163 -8 22 -100 57 -144 -320 10 -102
2248 -102 229 -24 135 91 135 -258 -69 -345 -61 -2 -112 131 -69 18 -47 -200 4 253 -49 128 22 231
2270 231 101 249 -33 222 320 -113 -132 150 130 82 129 14 -177 -207 -229 35 121 79 120 36 227 216 -102 5
2294 5 190 46 225 -68 50 320 -10 55 -294 175 214 -105 137 -204 62 31 -132 -8 -135 -268 -410 56
$$ packed form
2134A41p1j06j41M87q1j97K75n7q3k52L47j84j55L34j16l46M74j24m19L73J39
2155B38l65N2K49l0L5o4k42J98j11K37k21Mj6j62J52J70J7J7n98M96L3j6k02J89
2179F0m2j77L33l67j33K55K7K07l4m6j48K52l68j85P4m8N41k60k41J90J7J32J66
2202B05l10j9J08k10J68m25M39r1q6PK30%Kj94K26k52J24j5k43K13J54k44J21
2225i2J15L8Qk83R7k7L32k43J97n2j26L82l67K8J56j71L0j22J57k01j76L30j12
2248a02L31k53J59m4M4l93J89k76K84N9j10K43k00Q7o5j53K04K49l02J77j06K09
2270B31j30J48k82K55R8m33j9K82k0m8M7j15j91l0k2K64Q6m2M1q4J91j1l18J07
2294EJ85j44J79k93J18K70l30O5l49M69L9l19K42l41K66l1j63J24j27j33j42M66
$$ plain form
2316 56 62 178 77 -135 109 -272 205 -92 -134 -118 -81 -210 -135 -197 42 -134 -129 -316 74 -35 -72 5 -262 130
2340 130 -182 53 -84 53 293 -130 -228 -109 -94 22 -226 -154 -35 -488 57 -121 80 -113 61 -236 -271
2361 -271 -125 -97 -29 67 120 185 147 127 -78 231 -35 -204 32 65 -183 108 217 -30 2 79 45 42 -73 100
2385 100 37 -120 58 39 94 -139 -102 130 12 86 124 196 -15 206 -150 48 203 184 154 -303 -77 69 232
2408 232 193 -193 -104 105 294 -46 364 32 87 -83 180 -10 133 50 -81 184 163 -122 170 -198 -153 200
2430 200 -346 211 163 -167 -40 113 -119 184 -306 -303 -128 -3 26 -50 78 -144 -53 29 -85 -124 164 119 -160
2453 -160 66 36 120 6 -168 74 293 -153 -15 285 -144 -53 3 -206 87 -361 -115 -115 49 -82 -61 33 -243
2476 -243 -54 47 69 -90 -61 133 242 53 -240 -125 113 -25 -95 -87 -25 -150 1 -114 -53 -21 -68 -177 100
$$ packed form
2316E6OJ16j01k12K44l81M77k97m2J6L7j29P5o2K39j76Nj87L90j09l7P7k67L92
2340A30l12K35j37J37K40m23r8J19J5J16k48P2J19m53N45j78K01j93J74k97l5
2361b71J46K8O8R6N3O5l8k0k05L09k66j69K36L3k48K91J09k47L2P7l4lj15J73
2385A00o3j57J78j9N5k33L7K32j18P4L8P2k11K21l56J98J55j9l0m57K26J46J63
2408B32l9l86Q9K09J89l40M10l32N5j70K63j90J43q3j31K65k1k85K92l68M5L53
2430B00n46N57m8l30J27J53k32L03m90LJ75J25K9p6J28k22R1Q2j14l9K88m5k79
2453a60K26l0Q4j14j74K42K19m46J38L00m29R1N6k09K93m48K46%J64j31K1R4k76
2476b43J89J01K2j59K9J94J09j89k93J15K38j38p0QO2j25J51j15O1L2m7j09K77
$$ plain form
2499 100 -69 207 41 77 -402 -117 33 185 161 10 260 74 164 193 -102 138 -139 124 124 111 -209 -65
2521 -65 -111 43 -42 50 69 360 -38 132 185 12 36 184 -10 -144 79 65 60 -64 -39 26 40 9 114 -298 72
2546 72 41 55 -96 -198 -28 158 -12 342 -144 73 309 127 301 2 77 101 -73 224 47 -100 62 7
2568 7 -173 -3 -123 -3 -53 106 48 188 93 -99 -191 -102 -221 50 -72 -87 -202 -20 55 -321 -11 -155 -41
2591 -41 167 169 -209 -364 132 -140 347 46 -223 7 -156 -113 -176 171 164 -269 -153 -34 -189 46 -309 41
2613 41 254 199 -11 12 -65 4 186 -41 -230 -127 -67 110 -90 87 5 -118 -3 -77 -80 -264 100 -7 197
2636 197 -98 215 42 382 -254 -144 -241 -179 -237 -54 120 5 71 3 122 -104 106 194 47 119 122 -203 -30
2659 -30 233 75 285 30 294 -52 -114 -17 -46 -19 185 25 -136 96 69 66 -247 -1 -45 2 -283 294 -115
$$ packed form
2499A00j69K76j66L6m79K85J50J52k4j51K50j86R0K9k95K40k77K63%j3l20J44
2521f5m6J54q5R2J9K91l98J70N3j73K4J48j94j34K23j4nj24K5O5J4l1J05m12L70
2546G2l1J4j51j02J70J86j70L54m86K17K36j82J74k99P5K4j74K97j77j47J62n5
2568Gj80J70j20J20n0J59n8J40r5j92r2Q9j19K71j22j5j15J82P5l76L10j44J14
2591d1K08Kl78j55M96k72M87l01k69K30j63M3o3L47pm33J16J19j55K35l55L50
2613D1K13n5k10K3p7O9J82k27j89J03O0J77k00J77q2j23J15p4lj84L64j07K04
2636A97k95L13j73L40o36J10r7O2n8J83J74j15O6o8J19k26K10Q8j47P2Ll25J73
2659c0K63j58K10k55K64l46o2R7k9K7K04j60j61K32k7ll13K46m4M7k85N77m09
$$ plain form
2682 -115 54 4 -208 -148 192 236 -144 258 115 42 -223 -222 45 -251 45 220 257 -178 -5 -17 -111 -87 -91 276
2706 276 -150 -37 83 -107 -130 -27 -8 -167 36 90 86 -114 -105 -206 73 40 130 -498 43 -218 -107 36 97
2729 97 108 140 152 -172 -59 -65 -25 -62 -129 -82 -139 -133 -261 -62 92 -121 -60 -155 -79 8 -155 -293 23 -75 -98 4
2755 4 -87 10 143 113 102 -6 1 47 -17 -64 -6 -183 294 57 -205 78 66 -18 37 -148 -78 201 139 -138 50 -248
2781 -248 -24 69 115 -1 117 -168 -49 215 -213 244 44 234 -170 14 -42 412 3 -116 -78 -160 -177 -241
2803 -241 105 245 251 177 31 38 24 -17 -45 -27 21 60 141 -9 204 -146 -96 38 -81 -49 167 -140 34 196 181
2828 181 141 -353 71 -467 245 76 -6 -50 -27 -150 111 -265 41 -118 -15 -57 136 215 -31 -79 -104 -37 -327
2851 -327 -59 -78 87 3 -134 -87 -119 -22 -78 100 -91 13 178 302 -56 -60 -75 1 -89 -152 25 -6 -94 -100 31
$$ packed form
2682a15J69n0k12O0L40M4l80M02j43p3k65JK67k96K96J75L7m35J73j2r4K4mL67
2706B76m26J13J20j90k3J03J9j59K03N4mk00Rj01K79l3R0o28N41k61J11J43O1
2729I7J1L2J2l24J13oM0l7o7M7n7Oj28J99J54k13O1r5P6Q7j63j38L16r8k3J02
2755Dr1R7J33l0j1j08PM6o4m7N8j77M77k37k62K83j2q4N5j85P0K79o2k77J88k98
2781b48K24R3M6j16J18k85J19K64m28M57k00J90m04J84n6M54m09j19L8q2j7o4
2803b41L46J40Op4j46Pj4m1k8J8M8L9Q1j50K13l50N0J34j19L2K16l07J74J62j5
2828A81m0m94M24n38P12j69q2m4K3j23K61l76L06j59J03m2J93P9k46m8k5O7k90
2851c27K68j9J65q4j37M7l2R7n6J78j91J04J65J24l58mj5P6r0o3J77l1q8oJ31
$$ plain form
2876 31 57 -14 -181 -82 -124 -30 -15 92 -25 10 -56 -50 272 104 157 131 11 160 251 -135 50 33 -6 164 110 -105
2902 -105 -21 -114 139 -226 275 40 -277 186 -255 -253 180 -39 -65 89 -57 25 293 -138 41 3 173 -1
2924 -1 368 95 62 -30 122 13 95 2 67 -48 103 -419 140 319 -30 -8 -234 -85 79 177 -236 117 -50
2947 -50 -33 -171 -15 303 -201 -165 35 335 321 -226 189 83 319 8 -126 -32 62 -186 -19 152 -73 -15
2969 -15 130 -284 -198 45 74 15 -46 -357 315 152 -86 201 279 -84 -108 -6 -8 -289 -276 -115 -218 -192 21 -162
2993 -162 111 -64 19 -210 55 240 45 -12 -150 76 -90 -105 73 13 -337 -34 187 90 -136 -146 -3 61
3015 61 100 -190 -122 -165 54 -298 -146 -104 106 159 -60 -101 -89 -7 -50 -104 -259 -61 -26 178 233 -52 142 -122
3039 -122 -97 56 86 151 110 12 -74 49 -100 0 -77 -117 -49 198 -35 -334 117 -40 102 -88 34 40 4 -134
$$ packed form
2876C1K6p1j67R9m2R4J5J07j17L5o6OL22j68N3k6j20J49R1l86J85j7l9J70n4k15
2902a05Q4r3K53l65N01k35l17M63m41KM33k19k6J54j46Q2K68m31J79l8J70j74
2924aL69k73l3r2J52j09Q2r3O5j15J51n22N59J79l49K2k26J49J64R8m13L53j67
2947e0J7j38J56L18n04L6K00L00j4n47M15j06K36l11j34R4R4k48J67J71k25N8
2969a5J45m14Q6K43K9n9o1l11O72j63k38K87P8l63k4J02kk81J3J61j03K6K13j83
2993a62K73j75Q3k29K65J85j95n7j38K26j66j5J78o0l50L03K21r7k26j0J43O4
3015F1L9k90O8m3K19l52J52M2K10N3k19m1J2Q2m3n4j55J98L5K04N5k85J94k64
3039a22K5J53L0O5m1r8q6J23j49J00p7m0O8K47k33k99M51j57J42j90J22Ol6j38
$$ plain form
3063 -134 81 89 127 161 -253 293 -111 -94 -185 197 -280 309 -111 -48 58 82 96 145 32 241 224 4 11 21 346
3088 346 227 177 175 -110 37 81 -139 -73 4 -63 -225 -100 -177 166 69 107 76 -296 0 24 11 -188 -191 133 -64
3113 -64 40 140 52 45 -74 145 71 10 26 24 181 45 -7 -76 148 -236 -12 -207 224 -39 -148 79 -154 -165
3137 -165 -218 -200 -79 -46 239 0 -25 -59 -122 -207 -125 -195 -105 101 211 3 141 99 147 -93 -44 -232 -361 53
3161 53 48 83 -26 64 -56 -117 89 -1 -75 24 -258 339 -185 297 180 -143 -90 79 -294 30 -202 -74 -353
3184 -353 -84 63 14 63 -53 -31 160 -33 -30 -12 -194 -215 222 169 146 43 135 107 56 29 -77 37 -122 210
3208 210 91 72 126 -76 -143 3 -130 -294 -53 214 -109 -152 -45 -22 -143 -182 -81 -71 31 -145 -144 -196 -174 -216
3232 -216 98 -158 -102 -60 -50 -171 171 -147 163 -427 218 -36 120 109 -50 292 29 174 117 -249 -23 132
$$ packed form
3063a34K15QL8L4m14N46m04J7r1L82m77N89m20O3J06K4J4M9j13K09j7k20PJ0L25
3088C46j19n0kk85J47M4k20O6P7o7j62J25p7L43r7L8l1l72K96K4j3j99lL24j97
3113f4J04J00q8pj19K19p4o1J6kJ57j36n2o9K24l84K24j95M31k63j09K27k33j1
3137a65n3J8J21L3K85k39k5l4o3q5Q2p0R0K06J10k08J38m2M8k40M9j88j29M14
3161E3nL5j09R0j20o1K06r0p4R9k82N97n24M82j17l23N3J69l73L24k32J28k79
3184c53K69J47m9M9j16K2J91j93LJ8j82k1M37n3k3j03R2k8n1k7j06J14j59L32
3208B10j19j9N4k02o7J46j33j64K41K67l23m3J07K3j21l9J01J0J02j76Jn2K2m2
3232b16L14k56N6M2J0j21L42l18L10n90O45k54J56j1j59L42k63J45n7l66K26J55
$$ plain form
3254 132 89 144 86 -120 176 37 -60 -113 -82 -182 -16 -380 110 37 4 183 113 -41 -228 -115 30 -114 153
3277 153 -55 26 29 -64 233 -190 -56 28 -182 -163 102 51 -192 -252 -179 -45 18 -76 48 -71 182 -71 -125 -38
3301 -38 41 -41 154 60 -64 -84 -164 -274 -94 -233 100 -188 3 157 -145 99 -57 82 116 97 11 18 -103 45
3325 45 4 253 102 8 118 -84 -289 -121 21 -44 -87 145 -90 19 -6 72 145 57 37 137 -52 -213 137
3348 137 113 88 -41 10 136 -180 229 -168 123 -297 389 67 -64 228 39 -127 -156 -48 -32 90 -56 162
3370 162 -35 101 6 -92 86 30 96 -88 -144 -26 -187 160 -6 -174 -42 -151 169 -32 32 50 79 65 -215
3393 -215 188 122 132 -147 200 62 -6 -114 -59 126 129 27 -208 -161 -93 -80 -132 -196 -122 52 206 31 -186 113
3417 113 48 -134 -175 -98 29 80 77 -164 195 129 -32 54 -251 347 -267 -2 146 21 -41 190 45 -5 -188
$$ packed form
3254A32m3N5n8k06K96j39r7n3L1j00J66l64M90p3l3J79p0j54j87J13J45j44K67
3277A53k08Q1Lr3K97m23J34Q4k10J9K65n1k43o0P3J34O3r4J24j19K53k53n4Q7
3301c8P9q2J95r4j24k0q0j10J80j39L33k88J91J54l02K44j56J39L4j9q6Pj21J48
3325D5m1K49j51r4J10k02k05J68J42o5m3K32k35J09k5P8P3q8k0J00j89j61L50
3348A37k4k5j29N1J26l16M09l97K91m20O86l22j31K92j89j66k9J08J6J22j46K18
3370A62j97J36r5r8J78n6O6j84n6J18j61L47j66j68J32j09L20k01O4J8K9j4k80
3393b15M03o6J0k79L47j38o8j08N5J85Lj02k35M7O8J3n2o4P4J74J54j75k17K99
3417A13o5j82m1P7J27N1lk41L59o6j61Q6l05N98o14K65J48j25o2K31j45n0j83
$$ plain form
3440 -188 161 -186 83 -195 -12 89 -105 145 65 144 -191 227 159 47 -50 -215 -85 253 -23 27 46 253
3462 253 91 135 29 37 -90 15 6 73 335 353 34 167 -152 4 -347 96 387 -398 9 156 103 -207 -64
3485 -64 -156 -38 -9 38 -90 187 -155 -37 -96 -41 145 -153 292 216 6 182 110 112 23 159 -149 2 145 8
3509 8 171 59 -76 -248 246 -58 -127 -105 -66 219 -95 -174 -280 73 -369 -59 -10 115 -16 142 73 316 46
3532 46 169 -178 -37 13 139 -43 70 239 -161 112 39 1 4 -15 -181 130 -17 27 28 -46 135 -18 0 144
3556 144 -201 -141 -338 -160 71 114 22 157 -227 -9 -94 174 13 -71 404 31 53 -226 -240 -181 10 -24 -54
3579 -54 90 14 -321 11 170 101 89 -88 288 -13 36 -34 169 -20 254 134 350 364 -63 136 204 -161 192
3602 192 -20 199 -31 -46 -91 182 -189 38 -353 7 54 -274 174 -269 121 -114 -5 147 229 27 29 -101
$$ packed form
3440a88L49l47K69k78J83J01j94K50q0P9l35M18o8j12r7j65J30L38k76N0J9K07
3462B53j62M4j06Qj27J05rO7K62J8l19J33l19J56l51M43K91p85M07J47n3l10J43
3485f4r2J18K9M7j28K77l42J18n9N5J86k98M45p6k10J76p2Kq9J36l08J51J43j37
3509HJ63j12j35j72M94l04o9K2L9K85l14p9j06L53m42L10M9J25j31J58o9K43k70
3532D6J23l47J41N0J26j82J13J69m00K73p3l8Lj9j66L11j47M4Jp4J81j53J8J44
3556A44l45O0j97J78K31M3r2J35l84K18q5K68j61q4M75l73K2k79j4N9J91l4l0
3579e4J44p6l35L32J59o9j2j77L76l01M9p0K03j89K74j20K16J4m27J99O8l65L53
3602A92k12K19k30j5m5K73l71K27l91L60M7l28M48m43L90k35J09J52Q2k02Kj30
$$ plain form
3624 -101 40 -1 50 140 104 -190 -236 98 -160 68 105 165 31 117 -112 -332 161 -154 122 -205 83 -66 -29
3647 -29 -199 -229 47 284 124 63 -9 -48 155 50 13 52 -90 -23 -31 -98 -37 -38 224 -28 -346 14 -23 -83 -196
3672 -196 35 -8 -190 -112 70 46 7 6 -204 132 129 98 -101 110 14 -125 -23 -90 -204 -219 -157 32 -73 -18 99
3697 99 -111 134 -95 148 18 -3 -79 375 -5 33 281 -52 -278 8 -33 123 253 142 -67 -22 -40 -196
3719 -196 69 -111 -13 30 125 277 -64 91 282 239 -117 99 -210 160 -188 16 1 -18 170 186 97 -101 42
3742 42 -267 171 72 -287 82 140 -145 66 53 -118 237 -189 -46 246 67 122 90 298 -6 -37 102 -199
3764 -199 21 -101 190 -293 49 111 119 129 109 23 263 -173 -115 0 -234 -86 19 -23 -257 -42 -316 -57 116
3787 116 -124 -85 -191 -93 75 -201 -46 186 -165 -169 -70 130 -53 -103 -148 -273 11 61 102 -162 9 -155 19
$$ packed form
3624a01J41m1N1R0l6k94m6L34k58K28L7O0j34Q6k29k20M93l15K76l27K88j49L7
3647b9j70l0K76K37j60o1p2l9K03j05l7L9j42O7qo7O1jK62k52l18L60l7o0j13
3672a96K31m3j82P8J82k4l9jk10L36ll1j99K11r6j39J02o7j14j5O2J89j05N5J17
3697I9k10K45k29K43j30k1p6M54l80L8K48l33k26K86m1J56J30j11k09M5j8j56
3719a96K65j80R8M3R5J52l41J55J91m3l56K16l09L70l48K04j5j9J88J6q9j98J43
3742D2l09M38r9l59L69N8k85K11j3j71L55m26J43K92j79N5l2K08l04l1J39l01
3764a99K20j22K91m83L42O2QJ0k0q6K40m36N8J15k34J48J05m2k34K15k74K59J73
3787A16k40L9j06R8J68k76J55K32l51mR9K00j83n0m5j25K84N0M1k64J71j64J74
$$ plain form
3810 19 -82 327 79 -168 30 185 195 -145 154 -98 -138 -157 83 -15 -18 -304 103 6 -90 -89 0 -9 -48 -14 -31 166
3836 166 -187 331 68 142 -149 -92 126 -135 -110 -146 283 -260 313 -188 -31 14 144 59 51 44 82 4 45 209
3860 209 81 110 -73 -24 -63 -52 26 -9 20 66 227 50 -37 136 112 -144 -329 -224 214 31 -242 302 -294
3883 -294 -87 -286 -48 151 -288 -337 183 31 348 -98 -305 171 36 -135 143 77 -228 -48 -184 -74 28
3904 28 -179 -157 -120 89 54 -101 72 -80 58 66 -69 -254 -183 -35 -164 64 98 46 45 16 110 -155 424 41
3928 41 219 81 -174 171 -125 135 -348 -87 120 -81 -158 151 25 -57 -186 -15 229 -69 -129 143 2
3949 2 -300 -108 -58 -135 -84 -170 38 -38 104 13 143 -134 39 372 -160 66 -241 23 176 273 46 57 34 -38
3973 -38 242 43 -220 -44 133 246 87 98 -206 -234 74 0 90 130 -123 86 -85 229 -6 -192 36 91
$$ packed form
3810A9j01M09k48k47J98J55J0l40K99k52m0j9K40r8lk86M07r7r6JQ9rl9L4j7J97
3836A66l53N18k63P4k91N7K18k61K5l6M29n43N73n01J57M5J30q5qpL8p8M1J64
3860B09j28K9j83M9l9J1P8l5K9M6J61j77q7J73k4k56j85J05M38j83k73N44n96
3883b94K07j99K38J99m39m9N20j52L17m46k07M76j35j71K78o6l05J80j36J10J02
3904B8k07K2L7K09l5j55J73j52J38Qj35j85P1J48j29K28L4n2jk9R4k65N79l83
3928D1J78j38k55L45k96K60m83K61K07k01p7L09j26q2j29J71K44k98o0K72j41
3949Bl02J92N0p7N1q6K08p6J42r1J30k77J73L33n32K26l07K64J53R7k27J1k3p2
3973c8K80j99k63J76J77J13j59J1l04k8L08p4R0M0k53K09j71L14k35j86K28N5
$$ plain form
3995 91 279 246 -66 63 -114 266 156 144 165 -58 41 -221 106 114 -24 170 3 -100 197 168 45 -77 177
4018 177 61 -58 130 -51 -198 23 16 114 -45 160 -186 124 149 -174 -44 150 -81 -215 -162 -58 -24 -196
4040 -196 -96 -23 -110 23 45 6 -152 12 97 -43 32 -91 -156 109 -100 0 -59 -1 217 -165 96 62 -155
4063 -155 -118 235 -94 -57 -54 147 245 -90 -35 -223 294 -85 -163 200 -5 -15 3 -96 136 14 -44 64 92 1
4087 1 111 -142 178 0 27 -140 -69 -317 -23 -277 48 160 60 136 47 -50 174 -305 83 -220 74 22 -1
4110 -1 -113 197 53 -15 3 -14 -152 127 453 125 148 77 44 103 35 -136 140 -6 -161 81 -6 0 310 -15
4134 -15 61 -64 147 234 -79 196 241 -97 -1 75 -254 -78 -65 -67 214 92 19 -6 189 320 46 36 -38 7 -134
4159 -134 59 -86 23 -277 -35 87 -151 43 1 239 -100 -59 27 -214 45 51 -151 -113 134 137 -157 122 -139
$$ packed form
3995I1J88l3l12J29j77L80j10j2K1k23R9k62L27Qj38J94j67j03K97k9j23j22K54
4018A77j16j19J88j81j47K21pR8j59K05l46L10K5l23J30J94k31j34N3J04L4j72
4040a96J00P3q7J33K2l9j58J64Q5j40P5j23o5K65k09J00n9N8K18l82K61l4k17
4063a55L7L53l29L7LK01R8l35N5j88N17l79p8L63k05j0J8r9K32j22n8J08K8r1
4087AJ10k53L20j78K7j67P1k48K94k54L25J12j00P6q9r7K24m79L88l03K94n2k3
4110aj12L10j44o8J8j7j38K79L26l28K3p1l3N9o8j71K76j46j55K42q7OL10l25
4134a5P6j25K11Q7l13K75M5l38R6P6l29J76J3kK81j22p3k5J95J31k74j0p4M5j41
4159a34J93j45J09l00K42J22k38J94m2K38l39M1Q6k41K59Ok02L8K47Lk94K79k61
$$ plain form
4182 -139 -28 140 -6 -69 -47 7 141 -70 90 121 -131 72 -163 -93 59 -275 68 191 -131 160 -21 -123
4204 -123 1 90 -6 -70 84 60 -12 -83 240 274 158 -141 223 58 46 -161 158 -150 -190 -116 -320 -171 252
4227 252 135 123 74 156 34 -101 147 130 11 159 158 -83 37 47 16 291 93 -57 131 4 -279 110 15
4250 15 -2 128 -263 69 -67 -88 296 246 80 235 142 425 285 270 8 -9 -145 27 57 -93 181 -213 65
4273 65 -117 -73 -220 -146 -69 110 171 -135 104 -122 -41 196 -71 327 -2 -186 325 363 79 9 -141 255 -132
4296 -132 64 -112 192 -146 264 111 232 202 -85 -227 -72 -95 -125 151 13 -9 -197 286 -375 289 183
4317 183 153 -21 12 162 146 58 -272 56 105 -107 -86 181 -306 122 -119 51 -151 -13 -149 -194 -220 80 30
4340 30 -70 244 -80 -159 186 -18 181 249 66 25 -171 28 -183 35 -107 -5 -34 137 -141 223 100 -102
$$ packed form
4182a39J11J68j46o3K2N4J34k11J60L1k52K03k35P0J52l34L43J23l22K91j81j02
4204a23J24Q9r6o4J54k4p2p1L23L4j16k99L64j65j2k07L19l08m0P4k04J49M23
4227B52j17j2m9Q2j22j35K48j7j19J48jk41J20J0l1K75j98j50J88j27k83L89r5
4250A5j7J30l91L32j36k1L84n0j66J55r3K83j40j5k62j7j36J72L0j50K74l94K78
4273F5j82M4j47P4P7J79O1l06K39k26Q1K37k67L98l29j84N11L8k84p0j50L96l87
4296a32J96j76L04l38M10j53J21l0k87j42J55k3l0K76j38k2j88M83o61O64j06
4317A83l0j74L3J50j6q8l30L28M9k12K1K67m87M28k41J70k02J38j36m5k6L00n0
4340C0j00L14l24p9L45k04J99O8j83m1j96J99k11K18j42J02k9J71k78L64j23k02
$$ plain form
4362 -102 374 127 203 95 322 -89 339 142 45 124 -115 -105 -9 200 321 170 127 14 -152 69 -140 254
4384 254 -5 -224 22 124 -16 73 -204 -22 84 -45 241 -126 67 -152 -215 -128 228 -121 -68 193 -95
4405 -95 335 -296 -15 51 236 196 330 -78 117 -96 -1 -122 -29 -20 -10 -237 141 -15 88 -133 121 76 60
4428 60 44 -93 205 -200 50 -286 70 -46 -231 -73 -5 -154 -122 -57 195 66 15 -205 233 -86 -26 -124 3
4451 3 114 -139 -279 61 81 10 -35 -287 87 133 -139 -29 14 135 18 -311 -49 2 82 -110 -448 -90 25
4474 25 205 286 93 -180 -71 -151 -44 78 -183 214 -93 -182 121 -5 235 165 103 -206 -37 -34 -95 -283 -188
4497 -188 46 -66 222 -162 -131 101 -267 179 -296 -123 -100 275 279 105 -15 -234 4 -122 -2 45 -165 -47
4519 -47 -103 30 -116 141 262 19 84 116 104 256 97 -100 -65 302 104 294 129 -75 -67 148 -69 -134 -123
$$ packed form
4362a02M76k47P6j08K27m11M28j97r7P9k39J0R6K09J21j51m3j13j66K21k09L94
4384B54k59k19K46J02j40Q9k77J82J06j29K86l67J93k19o3Q7L56l49N3K61k88
4405i5M30o31K81O6J85m0J34m08J95k13R5j21R3RJ0k27L78j56J03k21K54m5j6
4428F0j6j37K98m05K50l36L56j16j85J58O8j49L2O5K52j29n1k20M38l19O0r8J27
4451CJ11k53j40L40K0p1m5k52L74M6k72J10M3J21j17l29K62N1Q0j92l38L58J15
4474B5J80Q1j93k73J09q0J07J22k61L97l07q9L03j26K40p0o2l09J69Lo1j88R5
4497a88K34j12K88l84L1K32l68M46m75J73K3L75Mj74j20k19K38j26J20M7k10J18
4519d7n6J33j46K57J21k43O5L2j2J52j59j97L5L67j98J90j65k04QK15k17o5J1
$$ plain form
4542 -123 -34 138 -126 -30 240 2 71 -13 5 96 -29 144 239 43 184 192 -241 -58 210 -28 -370 42 8
4565 8 80 37 -118 72 -207 174 -194 126 -131 -107 -42 -133 19 161 115 -115 185 -351 113 65 -152 -20 -6
4588 -6 -175 -87 -176 -10 -69 -270 -8 44 189 -300 64 -38 124 -50 -194 -122 -169 68 -82 116 -50 35 -146
4611 -146 333 -196 -15 73 92 44 -122 -293 -229 -198 -44 -200 -22 318 15 46 290 -116 -146 140 -67 49
4633 49 -1 97 -118 -125 21 34 -54 -374 52 -180 -119 -67 88 151 181 -82 100 182 -46 200 -144 316 -67 116
4657 116 -17 56 34 237 -20 72 176 -146 109 266 134 -13 72 100 69 -49 -78 203 150 -109 -69 -62 -74 84
4681 84 -91 -18 -150 47 -306 -227 266 -55 -227 28 -118 -184 -221 113 14 -195 164 -446 132 -204 -150 -324
4703 -324 -172 -288 -234 -238 222 30 -84 -40 -341 -266 116 49 -149 -79 55 -293 -13 -220 116 -9 328 169
$$ packed form
4542a23Q9J72k64R6K70k38O9q4J8R1j25J73R5j96J41Qm33J83K68k38l42M12l4
4565HP2m3j55J90k79L81l68L20k57K4O5r1J52J42m6k30L00n36M64m8k17J32J4
4588fj69Q8q9J66n9k01K62N2J45m89L64j02J62j74j44P2m7K37j50J98j66Q5j81
4611a46M79n29J81Q8J9m8j66j71O4L1J54j56J78L40l03L1K44m06l0K86k07J16
4633D9n0R8k15pJ46J3q8l20M26k32O1N2J55O3L0k63J82Q2k28K46l44M60l83J83
4657A16j33P3k2K03k57R2J04l22K55J57j32j47Q5K8l1j18k9K81n3k59M0Pj2J58
4681H4j75P3j32J97l53P9M93l21j72K55j46o6l7L34r9k09L59o10N78l36N4j74
4703c24J52j16N4mM60j92j14M4l01P5L82o7j98P0J34l48K80k07L36j25L37j59
$$ plain form
4725 169 -4 -43 -58 67 -7 234 -181 65 -197 32 -214 74 78 13 56 -37 140 147 -70 15 -12 192 -27 -275
4749 -275 65 -212 149 138 78 -89 -52 -64 204 -102 -182 197 201 163 219 189 -31 399 -116 -145 -2 122 -97 178
4773 178 -47 67 -8 189 -212 -91 -36 76 63 561 -2 74 -254 -60 50 10 44 -173 55 -139 153 -293
4795 -293 212 -112 60 -18 -6 351 280 -159 -119 -197 -35 -64 -103 -13 -40 -100 41 170 30 -94 -158 254 -148 200
4819 200 152 159 -138 -28 75 18 46 39 -97 -321 -273 -56 -285 -131 8 -230 71 -84 -196 83 -175 -136 -99
4842 -99 70 6 -154 -154 110 -156 -244 134 -79 50 39 -32 -192 -52 -146 -283 90 52 -20 -191 -20 -60 76 192
4866 192 45 -70 -242 -182 123 216 -83 241 150 20 113 -54 32 220 484 -40 -26 -346 -216 -70 338 -173
4888 -173 -260 -123 124 -128 -85 155 -127 187 28 75 99 39 16 -58 96 -99 171 80 -55 -113 60 116 243
$$ packed form
4725A69j73l9j5J25p4K41m15K46k62K29k46K88Mo5M3r3J77Pk17Q5k7K04k19k48
4749b75L40k77L61j1o0j67L7j2K68l06q0L79Ml8N6l0k20M30n15k9J43J24k19K75
4773A78k25J14p5J97m01J21N5J12j3M98n63P6l28J94J10m0L4k17K28j94K92m46
4795b93N05l24J72p8J2L57p1m39M0p8J62k9l9R0k7o0J41J29j40j24o4M12m02L48
4819B00m8Pk97J10J03n7K8pj36k24M8K17k29J54J39k38L01j55j12K79k58L9L7
4842i9J69o4j60%K64k66q8L78k13J29j1p1j60J40r4j37L73l8p2j71J71m0J36J16
4866A92j47j15j72O0L05R3k99L24r1j30R3j67Q6J88K64n24J4l20J30J46M08n11
4888a73q7J37K47k52M3K40k82L14j59M7K4o0k3p4J54j95K70r1j35n8J73N6J27
$$ plain form
4911 243 113 -52 -23 267 330 -165 -30 -54 -284 -105 105 -107 -22 -182 296 -208 -225 -116 -212 -51 348 174
4933 174 -31 -99 -203 -87 61 278 102 146 315 77 -94 350 124 -215 164 14 -92 -68 -428 -280 91
4954 91 -150 78 0 -83 -105 19 8 36 -34 -113 -166 -197 -78 133 238 -276 6 149 -117 209 82 -124 178
4977 178 12 20 -43 -208 114 -3 100 -89 151 206 16 63 21 85 111 -85 -75 215 173 82 213 46 211 260
5001 260 -86 -249 191 -125 -37 -19 154 145 -9 40 -245 -55 146 -194 -50 -70 -115 -19 -242 275 56 117 76
5024 76 -66 -79 72 -102 -206 -99 175 150 38 -45 161 -19 -234 -77 74 -114 106 204 -94 43 15 -16
5046 -16 185 -98 239 -82 -115 -177 8 101 214 -23 271 -83 56 221 -42 32 -30 -210 159 344 0 -44
5068 -44 -172 -250 101 302 -97 72 -8 -132 -214 173 -20 -144 -9 7 -200 -90 103 -39 -102 -272 -113 -94
$$ packed form
4911B43j30j65K9K90O3m95J35k4k30J79K10k12Q5j60M78n04j7J09r6J61L99j74
4933A74k05o8j04J16J48K17j76M4J69k38j71M44k26l39L79j50j06K4l60J48L71
4954I1k41K28p8q3k2J24j1K8p0p9n3l1J19K11J05n14K82J43k66L26j27k06L02
4977A78j66Qo3j65L22j17J03j89K40N5j90M7m2O4K6j96J0K90m2r1J31j67J65M9
5001B60l46j63M40l16Q8J8J73rj54M9k85J90K01l40J44k0m5R6k23N17k19O1m1
5024G6j42j3J51j74j04J07K74k5j12q3K06j80k15J57J51j88K20R8k98J37k8l1
5046a6K01k83L37l21l3o2J85R3J13k37K94l54J39J65k63P4o2j80L69J85l44m4
5068d4j28p8L51K01l99J69q0j24q2L87j93j24J35J6k07J10J93j42o3j70J59J9
$$ plain form
5090 -94 35 29 -70 -283 274 -11 -35 -366 199 -188 -12 -145 13 90 55 -130 62 526 -95 -51 -71 -209 37
5113 37 -39 -332 -271 -195 46 -48 168 -38 73 -125 -193 -70 -32 94 179 35 -143 45 184 -62 234 -79 25
5136 25 -38 -28 157 -123 357 -187 -103 99 244 -109 -86 -47 104 -146 -156 48 36 128 286 204 -38 -242 -103
5159 -103 283 -61 63 -340 -121 -137 283 161 -104 112 -142 17 108 7 42 26 179 103 -105 -6 -360 79
5181 79 138 72 103 38 93 173 -133 -126 -30 84 262 -311 499 140 61 222 -206 154 -14 -170 -263 -53 -27 -27 31
5206 31 -35 135 -190 -87 -292 -336 32 -281 -247 31 111 67 -18 -262 6 -85 125 -104 -33 23 -57 264 -147 -60
5230 -60 -52 9 -317 -124 -195 -82 -159 64 -71 -227 31 165 131 -120 267 -111 -140 19 -206 -101 -11 -12 59 -121
5254 -121 -42 -19 177 141 -7 -88 -66 33 -106 -64 106 140 123 10 -165 -200 101 120 -13 95 -325 31 -274 269
$$ packed form
5090i4J29or9k13N57k85k4l31N65l87J76j33J58P7l5j85J92M64o21M4k0j38K46
5113C7p6k93O1P6K41r4K16k06J11j98o8J23L8J26Q5j44j78J88J39k46K96l13J04
5136B5o3J0J85k80M80n44Q4K02J45l53K3L9J51k50j0K04j2R2J58q2k42k04J39
5159a03L86l44J24m03K19j6M20j22k65K16k54J59R1j01L5j6J53p6k08R9l54M39
5181G9N9o6L1o5N5Q0l06PR6J14J78n73Q10l59p9J61m28L60j68j56r3K10K6%N8
5206C1o6J70l25J03k05m4L68l13L4K78Q0m4q5k44K68r1K10k29P1N6q0L21m11Q7
5230f0QO1l26J93p1J13p7K23j35j56K58J34l4k51L87l78k9J59k25J05R0jP1j80
5254a21P9K3J96l6j48q1K2R9j39M2J70L4j7j13j75l5L01J9j33J08m20L56l05N43
$$ plain form
5278 269 205 -99 45 -58 -109 -119 1 249 127 -16 261 166 -70 -71 207 234 -55 86 -87 -45 160 106 76
5301 76 -76 -32 -99 138 0 -178 -5 -50 219 94 -132 83 77 312 -80 -305 224 -70 -23 77 -69 55
5323 55 14 161 254 -36 -7 259 26 -105 -116 -192 -90 -90 205 166 102 -82 -66 -352 -273 -27 172 146 283 -271
5347 -271 26 -226 46 -230 -75 -234 -69 14 69 -104 199 -205 3 3 68 215 84 16 155 -122 87 -125
5369 -125 12 -103 -247 183 28 177 -206 16 124 22 -163 241 73 120 -41 -100 16 171 180 -14 46 -36
5391 -36 267 -85 -69 -243 289 -279 40 -177 -72 56 53 -19 -218 -58 4 46 143 -30 -6 -198 19 -83 -258
5414 -258 197 -221 22 232 326 76 -57 41 102 160 316 -20 48 3 112 97 -21 168 30 126 108 -233 54
5437 54 -133 -188 17 49 44 -17 402 -59 -21 -5 51 44 -90 -442 -287 56 -65 144 -99 182 68 -1 -17 91
$$ packed form
5278B69o4l04J44j03n1j0J20K48j22j43K77r5k36jK78K7k89J41j73M2K05n4l0
5301G6j52M4o7K37j38j78J73m5K69j25k26K15oK35l92k25N29k94M7J00j46J24
5323E5m1J47R3k90K9K66k33j31j1p6J02%K95l9o4j84J6k86P9K46J99k6J37n54
5347b71K97k52K72k76J55j59J65Q3N5j73L03m04K08%O5J47j31o8J39k77K09k12
5369a25J37j15j44M30j55J49l83K22J08j02j85M04j68M7j61n9J16J55Rj94O0q2
5391c6L03l52J6j74N32n68L19k17J05J28lp2j99J60O2M2R7j73K4j92K17j02j75
5414b58M55m18K43K10R4k50j33R8O1N8J56l36O8m5J09j5j18J89j38R6j8l41K87
5437E4j87n5K05L2no1M19m61L8J6N6pj34l52J55L43j21K09k43K81j14o9j6J08
$$ plain form
5461 91 -41 95 68 269 -99 46 -19 6 125 -109 -121 290 144 -116 -270 69 71 -11 133 78 -125 -48 179
5484 179 20 150 31 -68 64 -2 -102 94 158 56 -279 -132 188 13 -47 59 19 22 61 -147 322 34 -563
5507 -563 -147 183 63 60 230 -128 21 -352 73 157 -41 -302 218 180 52 366 -195 96 28 92 35 -97
5529 -97 13 244 -7 -91 170 257 8 163 -74 -199 -138 -280 -5 -91 172 250 136 -51 -47 125 73 -117 -43
5552 -43 75 172 -65 -90 -63 76 -21 231 -24 -162 45 -317 9 -7 34 -97 169 63 77 67 -19 -1 67 39
5576 39 -33 -203 -58 207 150 10 31 -19 22 99 -24 96 131 190 101 29 120 -68 -190 -141 244 64 254 -158
5600 -158 -204 72 156 -143 247 55 -1 50 -134 195 44 -64 -97 -302 -172 74 -76 -104 8 88 138 32 84
5623 84 232 -210 -306 -117 363 -266 9 -167 -264 -15 -103 -56 -84 -41 -44 128 -215 -69 213 7 184 279 -43
$$ packed form
5461I1j32J36k7K01l68J45o5K5J19k34j2M11j46k60j54L39Kq2J44n5k03P7K27
5484A79j59J30j19r9J32o6j00J96O4j02l35J47L20j75o0J06m0LL9k08M69k88n97
5507e63M16L30j20lJ70l58J49l73M25Q4j98k61N20l8j28L14n61K91o8O4n7j32
5529i7J10K31k51q4K61Q7k49J55k37j25O1j42K75q6K63P8j14j87MJ72n2j90P4
5552d3J18R7k37k5K7J39r7K52k55j38K07l62L26j6M1j31K66j06J4j0q6J8O8k8
5576C9p2j70J45K65n7j40K1n0M1P7j23J20L5N9q9p2R1j88j22M9L85j80J90m12
5600a58m6K76Q4k99L90j92n6N1j84L29j51j08l3k05J30K46j50k8J12Q0N0j06N2
5623H4J48m42r6J89M80o29K75j76r7K49q8M7k8M3lJ72l43J46K82k06J77R5l22
$$ plain form
5646 -43 119 -88 61 333 110 76 116 15 125 198 -117 85 115 -72 230 105 64 -124 325 18 107 -78
5668 -78 113 199 72 -132 -128 -189 -148 -54 -142 130 46 305 90 -18 300 40 153 -214 84 219 267 209 129 97
5692 97 11 -251 -192 89 108 273 419 97 -191 19 21 197 -26 116 93 -95 193 -194 -232 57 39 75 171 162
5716 162 -61 -86 -223 -85 -67 -7 13 -310 -58 -85 90 -331 -34 -187 -14 -27 -56 82 -47 -102 87 -133 -120
5739 -120 15 66 3 129 -193 33 255 -34 152 -277 231 15 -190 219 -63 96 285 215 -96 -196 55
5760 55 111 83 -44 343 131 -69 -34 -102 387 90 -236 214 111 140 -61 -133 -67 -43 -58 68 15 123 131 92 -45
5785 -45 -125 86 0 -203 -25 -264 -112 28 167 -173 -20 -187 69 55 -152 327 16 -34 -10 80 122 -146 105
5808 105 39 -122 -44 -195 372 160 11 421 4 3 14 254 206 240 145 -59 -7 200 -46 -114 53 -44 -217 42
$$ packed form
5646d3J62k07J49K72k23l4M0j01J10P3l15K02L0j87L02j25m1j88M49l07Q9j85
5668g8J91Q6j27k04Mo1M1R4q8K72q4K59k15j08L18k60J13l67K98J35M8n8q0l2
5692I7q6k62N9K81J9J65J46l22k88K10KJ76k23J42k3j88K88l87l8K89j8L6R6r
5716A62k23k5j37J38J8O0K0l23K52k7J75m21K97j53J73j3k9J38j29n5J89k20J3
5739a20J35N1o3J26l22K26K22k89J86m29N08k16k05M09k82J59J89p0l11j00K51
5760E5N6k8j27L87k12k00L5o8M89k97l26M50j03K9k01p2O6K4j5J26n3J08Ql9j37
5785d5q0K11q6k03J78k39J52J40J39l40J53j67K56j4k07M79l11n0K4R0M2k68K51
5808A05o6j61P8j51N67k12j49M10m17jJ1K40m8L4r5k04N2K07k46o8J67r7j73K59
$$ plain form
5832 42 79 159 -315 -133 -39 168 -300 90 154 22 144 60 11 -18 17 204 129 186 -211 -35 3 -224 61 63 176
5857 176 -240 79 178 -66 194 8 -74 -166 60 72 -60 -92 -18 77 -154 237 -61 48 146 -125 11 229 -97
5880 -97 138 -45 55 163 359 -11 -237 -20 65 52 44 -189 -21 116 -177 27 -1 -15 20 47 63 95 51 36
5904 36 -240 -64 433 -404 -74 10 -235 -136 -147 209 -338 -87 219 37 -264 134 56 -126 -18 172 -145 147
5926 147 -59 -134 205 -86 -108 -48 31 182 171 175 103 -72 -130 149 104 191 1 36 133 -124 224 -16 -31 9 11 165
5952 165 73 109 223 -200 -381 243 51 -153 -185 9 -121 -12 -107 -202 393 -14 -29 -237 -150 146 -327 -126
5974 -126 38 -112 -118 386 5 -115 -407 1 -143 -253 10 306 -101 -12 -62 -4 4 -120 -161 -294 -223 117 -447
5997 -447 112 -5 -395 -171 -139 -68 -147 68 38 10 2 -141 68 -20 61 106 -3 -46 132 96 -248 32 176 -176
$$ packed form
5832D2L7Q0m74J82R4K07m68L90O4j32J22q4m9k9L5J87p5N7l97J76L8k27K85KJ13
5857A76m16L19R9k44K60j86q2r2K26J2j32l2P4R5k31L91k98J09R8k71J36K18l26
5880i7K35j83J00J08J96l70k26K17Q5j3qk33J68J37k93K04k8j4L5K7J6L2m4j5
5904C6k76J76M97q37L30Q4k45R9j1L56n47K51L06j82l01L98p8j82J08J90l17K92
5926A47k06p5L39k91k2O0P9J51j1Mp2j75n8K79m5Q7j90L5R7k57L48k40j5M0KJ54
5952A65r2L6J14m23j81O24j92k04l2J94j30J09r5r5N95m07j5k08Q7K96m73K01
5974a26J64j50oN04l81j20k92M08j44j10K63K96m07Q9n0N8Qj24m1j33P1L40n64
5997d47N59j17l90K24L2P1p9K15l0k8qj43K09q8Q1M5j09m3J78l6l44K80J44l52
$$ plain form
6021 -176 157 -50 -61 42 -259 -212 86 38 85 -6 -136 14 -60 -12 33 -90 -194 -8 12 91 -223 -28 129
6044 129 -68 -180 87 98 -71 -48 -183 9 81 -362 229 83 -16 -71 341 -20 240 259 -209 142 90 -86
6066 -86 -32 0 -1 -398 92 -53 151 131 -60 93 3 60 -231 88 -51 7 5 -213 -71 314 82 231 -249 147
6090 147 -84 -4 31 19 348 46 -34 -84 -168 34 299 144 -240 187 4 -109 6 256 40 -193 136 33
6112 33 212 -151 207 178 80 178 172 149 53 25 159 272 240 215 66 9 -287 -106 -84 -79 -102 -75 -79 -101 -45 32 -78
6139 -78 4 -132 119 -491 -304 96 63 -83 154 202 485 42 149 -124 -204 -192 -28 -88 152 85 -3 5 -136 -59
6163 -59 146 236 132 -209 82 182 294 46 114 -226 -50 154 -97 127 49 113 -192 117 72 124 54 -144 -161
6186 -161 -21 174 -69 87 176 -126 82 -47 243 -125 -202 179 -331 -23 -10 64 6 307 -39 -114 -157 -240 -41
$$ packed form
6021a76L33k07j1J03l01M7K98m8M7r1j30J50p4M8M5j23j04J86K0P9l14J95J57
6044A29j97j12K67J1j69K3j35J92P2m43N91j46r9n5M12l61K60J9m68L51n2j76
6066h6N4L2jl97M90j45K04k0j91J53r0N7k91L19j39N8kk18J42L85k32J49m80L96
6090A47k31Q0L5j2L29l02q0n0q4K02K65j55l84M27j83j13J15K50k16k33L29j03
6112C3J79l63L58k9r8R8ok3r6k8J34J13l2k5j49n7k96J81K2Nk3K7mk2N6P7j10
6139g8Q2j36K51o10J87M00l3j46K37M8K83m43J07k73q0J2J64o0K40o7q8Qj41P7
6163e9K05R0j04l41K91J00J12k48O8l40J76K04k51K24p8O4l05L09m5N2p0j98j7
6186a61J40J95k43J56Q9l02K08j29K90l68p7L81n10L08J3P4n8L01l46p5m3q3J99
$$ plain form
6209 -41 168 241 -135 -123 150 -336 353 -17 18 -58 -113 134 81 237 -37 -21 79 75 -148 -163 -217 -54 65 103
6233 103 -182 -90 0 -281 30 132 -183 -180 -6 -43 -89 22 36 95 127 -85 -124 272 -85 118 -219 -136 -54 -23
6257 -23 -64 -55 34 129 15 54 45 -190 -137 167 -140 89 345 -319 -40 -282 -212 -112 18 -201 -51 -101 186 212
6281 212 -145 36 -152 140 -105 -259 -133 67 132 77 -148 150 -69 41 17 100 -6 112 -169 -69 -100 223
6303 223 -129 -151 47 -41 0 65 19 60 -37 -4 -38 189 -20 -29 228 77 -98 11 131 -244 -171 72 123 289
$$ packed form
6209d1K09P3l76J2K73m86O89l70L5p6n5K47n3J56k74J6J00mk23j5n4J63J19L8
6233A03k85R2R0k81L11J02l15LJ74l7m6J11J4N9L2k12l9L96l57K03l37Q3Q2L1
6257b3m1RQ9R5j14L9rk35N3L04l07K29K56o64K79k42P0J00J30k19J50n0K87K6
6281B12l57J81j88K92k45j54J26K00O5n5k25K98k19J10k4Q3j06J18k81J00l1L23
6303B23l52k2J98q8M1O5m6M1r7L3l4K27k09rK57j51j75J09J20l75P3K43N1J66
$$ [...]
8191A9
##END NTUPLES=NMR FID
##END=
