##TITLE=1H_Pr 4432-1
 CDCl3, 8 sc, 
 6.2.2020
##JCAMPDX= 6.0         $$ Bruker NMR JCAMP-DX V2.0
##DATA TYPE= NMR FID
##DATA CLASS= NTUPLES
##ORIGIN= UXNMR, Bruker Analytische Messtechnik GmbH
##OWNER= root
$$ XWIN-NMR		Version 3.5
$$ Thu Feb  6 14:23:58 2020 Russian Standard Time (UT+4h)  she@DPX200
##.OBSERVE FREQUENCY= 200.1315
##.OBSERVE NUCLEUS= ^1H
##.DELAY= (6, 6)
##.ACQUISITION MODE= SIMULTANEOUS
##.ACQUISITION SCHEME= undefined
##.AVERAGES= 8
##.DIGITISER RES= 18
##SPECTROMETER/DATA SYSTEM= spect
##.PULSE SEQUENCE= zg30
##.SOLVENT NAME= CDCl3
##.SHIFT REFERENCE= (INTERNAL, CDCl3, 0, 15.7039)
##AUDIT TRAIL= $$ (NUMBER, WHEN, WHO, WHERE, WHAT)
$$ ##TITLE= Audit trail, XWIN-NMR		Version 3.5
$$ ##JCAMPDX= 5.01
$$ ##ORIGIN= Bruker BioSpin GmbH
$$ ##OWNER= she
$$ F:/spectra/data/she/nmr/H-F/1/audita.txt
$$ ##AUDIT TRAIL=  $$ (NUMBER, WHEN, WHO, WHERE, WHAT)
(   1,<2020-02-06 14:22:55.51 +0400>,<she>,<DPX200>,
      <created by zg, POWCHK disabled, PULCHK disabled
       configuration hash MD5:
       00 E9 B6 7A A2 85 ED C7 34 08 36 98 17 FE 4E 26
       data hash MD5: 16K
       FF 13 EC 89 F0 EE 40 6E 93 6D 81 B2 81 53 25 99>)
$$ ##END=
$$ 
$$ hash MD5
$$ EE C2 33 B1 F5 50 87 59 94 32 63 C2 C0 90 3D CC
##$RELAX= 
##$RELAX= 
##$RELAX= 
##$RELAX= 
##$RELAX= 
##$RELAX= 
$$ Bruker specific parameters
$$ --------------------------
##$DU= <F:/spectra>
##$EXPNO= 1
##$NAME= <H-F>
##$PROCNO= 1
##$TYPE= <nmr>
##$USER= <she>
##$AMP= (0..31)
100 100 100 100 100 100 100 100 100 100 100 100 100 100 100 100 100 100 
100 100 100 100 100 100 100 100 100 100 100 100 100 100 
##$AQSEQ= 0
##$AQ_mod= 1
##$AUNM= <au_zg>
##$AUTOPOS= <>
##$BF1= 200.13
##$BF2= 200.13
##$BF3= 200.13
##$BF4= 200.13
##$BF5= 200.13
##$BF6= 200.13
##$BF7= 200.13
##$BF8= 200.13
##$BYTORDA= 1
##$CFDGTYP= 0
##$CFRGTYP= 5
##$CHEMSTR= <none>
##$CNST= (0..31)
1 1 145 1 1 1 1 1 1 1 1 1 1 1 1 1 1 1 1 1 1 1 1 1 1 1 1 1 1 1 1 1 
##$CPDPRG= <>
##$CPDPRG1= <>
##$CPDPRG2= <>
##$CPDPRG3= <>
##$CPDPRG4= <mlev>
##$CPDPRG5= <mlev>
##$CPDPRG6= <mlev>
##$CPDPRG7= <mlev>
##$CPDPRG8= <mlev>
##$CPDPRGB= <>
##$CPDPRGT= <>
##$D= (0..31)
0 1.2 0 0 0 0 0 0 0 0.06 0 0.03 0 0 0 0 0.0002 0 0 0 0 0 0 0 0 0 0 0 0 
0 0 0 
##$DATE= 1580984574
##$DBL= (0..7)
120 120 120 120 120 120 120 120 
##$DBP= (0..7)
150 150 150 150 150 150 150 150 
##$DBP07= 0
##$DBPNAM0= <>
##$DBPNAM1= <>
##$DBPNAM2= <>
##$DBPNAM3= <>
##$DBPNAM4= <>
##$DBPNAM5= <>
##$DBPNAM6= <>
##$DBPNAM7= <>
##$DBPOAL= (0..7)
0.5 0.5 0.5 0.5 0.5 0.5 0.5 0.5 
##$DBPOFFS= (0..7)
0 0 0 0 0 0 0 0 
##$DE= 6
##$DECBNUC= <off>
##$DECIM= 24
##$DECNUC= <off>
##$DECSTAT= 4
##$DIGMOD= 1
##$DIGTYP= 9
##$DL= (0..7)
0 120 120 120 120 120 120 120 
##$DP= (0..7)
150 150 150 150 150 150 150 150 
##$DP07= 0
##$DPNAME0= <>
##$DPNAME1= <>
##$DPNAME2= <>
##$DPNAME3= <>
##$DPNAME4= <>
##$DPNAME5= <>
##$DPNAME6= <>
##$DPNAME7= <>
##$DPOAL= (0..7)
0.5 0.5 0.5 0.5 0.5 0.5 0.5 0.5 
##$DPOFFS= (0..7)
0 0 0 0 0 0 0 0 
##$DQDMODE= 0
##$DR= 18
##$DS= 0
##$DSLIST= <SSSSSSSSSSSSSSS>
$$ [...]
##$SUBNAM2= <"">
##$SUBNAM3= <"">
##$SUBNAM4= <"">
##$SUBNAM5= <"">
##$SUBNAM6= <"">
##$SUBNAM7= <"">
##$SUBNAM8= <"">
##$SUBNAM9= <"">
##$SW= 24.9337058887773
##$SWIBOX= (0..15)
0 0 2 0 0 0 0 0 0 0 0 0 0 0 0 0 
##$SW_h= 4990.01996007984
##$TD= 16384
##$TD0= 1
##$TE= 0
##$TE2= 300
##$TE3= 300
##$TEG= 300
##$TL= (0..7)
0 120 120 120 120 120 120 120 
##$TP= (0..7)
150 150 150 150 150 150 150 150 
##$TP07= 0
##$TPNAME0= <>
##$TPNAME1= <>
##$TPNAME2= <>
##$TPNAME3= <>
##$TPNAME4= <>
##$TPNAME5= <>
##$TPNAME6= <>
##$TPNAME7= <>
##$TPOAL= (0..7)
0.5 0.5 0.5 0.5 0.5 0.5 0.5 0.5 
##$TPOFFS= (0..7)
0 0 0 0 0 0 0 0 
##$TUNHIN= 0
##$TUNHOUT= 0
##$TUNXOUT= 0
##$USERA1= <user>
##$USERA2= <user>
##$USERA3= <user>
##$USERA4= <user>
##$USERA5= <user>
##$V9= 5
##$VALIST= <valist>
##$VCLIST= <CCCCCCCCCCCCCCC>
##$VD= 0
##$VDLIST= <DDDDDDDDDDDDDDD>
##$VPLIST= <PPPPPPPPPPPPPPP>
##$VTLIST= <TTTTTTTTTTTTTTT>
##$WBST= 1024
##$WBSW= 4
##$XGAIN= (0..3)
0 0 0 0 
##$XL= 0
##$YL= 0
##$YMAX_a= 130259
##$YMIN_a= -112403
##$ZGOPTNS= <>
##$ZL1= 120
##$ZL2= 120
##$ZL3= 120
##$ZL4= 120
##$ABSF1= 10
##$ABSF2= 0
##$ABSG= 5
##$ABSL= 3
##$ALPHA= 0
##$AQORDER= 0
##$ASSFAC= 0
##$ASSFACI= 0
##$ASSFACX= 0
##$ASSWID= 0
##$AUNMP= <proc_1d>
##$AZFE= 0.1
##$AZFW= 0.1
##$BCFW= 1
##$BC_mod= 2
##$BYTORDP= 1
##$COROFFS= 0
##$CY= 11.3945322036743
##$DATMOD= 1
##$DC= 2
##$DFILT= <>
##$DTYPP= 0
##$F1P= 16.9975609425685
##$F2P= -3.02152046262296
##$FCOR= 0.5
##$FTSIZE= 0
##$FT_mod= 4
##$GAMMA= 1
##$GB= 0.15
##$INTBC= 1
##$INTSCL= 1
##$ISEN= 128
##$LB= 0.24
##$LEV0= 0
##$LPBIN= 0
##$MAXI= 10000
##$MC2= 0
##$MEAN= 0
##$ME_mod= 0
##$MI= 1.114404
##$NCOEF= 0
##$NC_proc= 0
##$NLEV= 6
##$NOISF1= 3.799351
##$NOISF2= 2.8
##$NSP= 1
##$NTH_PI= 0
##$NZP= 0
##$OFFSET= 15.70392
##$PC= 1
##$PHC0= -9795.725
##$PHC1= 28.40081
##$PH_mod= 1
##$PKNL= yes
##$PPARMOD= 0
##$PSCAL= 0
##$PSIGN= 0
##$REVERSE= no
##$SF= 200.130013532006
##$SI= 16384
##$SIGF1= 3
##$SIGF2= 2
##$SINO= 400
##$SIOLD= 16384
##$SREGLST= <1H.CDCl3>
##$SSB= 0
##$STSI= 0
##$STSR= 0
##$SW_p= 3612.71676300578
##$SYMM= 0
##$S_DEV= 0
##$TDeff= 0
##$TDoff= 0
##$TI= <>
##$TILT= no
##$TM1= 0
##$TM2= 0
##$TOPLEV= 0
##$USERP1= <user>
##$USERP2= <user>
##$USERP3= <user>
##$USERP4= <user>
##$USERP5= <user>
##$WDW= 1
##$XDIM= 8192
##$YMAX_p= 0
##$YMIN_p= 0
$$ End of Bruker specific parameters
$$ ---------------------------------
##NTUPLES= NMR FID
##VAR_NAME=  TIME,          FID/REAL,        FID/IMAG
##SYMBOL=    X,             R,               I
##VAR_TYPE=  INDEPENDENT,   DEPENDENT,       DEPENDENT
##VAR_FORM=  AFFN,          ASDF,            ASDF
##VAR_DIM=   8192,          8192,            8192
##UNITS=     SECONDS,       ARBITRARY UNITS, ARBITRARY UNITS
##FACTOR=    0.0002004,     1,               1
##FIRST=     0,             0,               0
##LAST=      1.6414764,     0,               0
##MIN=       0,             -112403,         0
##MAX=       1.6414764,     130259,          0
$$ Real data points
##PAGE= N=1
##DATA TABLE= (X++(R..R)), XYDATA
0@%%%%%%%%%%mJ2j6J6j6K3l1L2l9M7n4O3p3Q6r9J12j28J48j68J90k13K40k71L03
34A60l37L76m21M68n19N76o38P06p82Q65r57J061j177J308j458J630j830K068
52A099k355K709l158L749m571N798p849J2124l8307Q8987P1549j27809j02704
65a00738L8918J16300J0408q0941m5386N6250N2895k2986n5511M64L5025J3651
77A8349j4375J800J0394j6240l5215O647N5756L2724m4765o2985N977O2354K7033
90D7454l6634l8284J3869L4849J543k9966j3274J9762K0948j752j2683r261p975
103a1404j395J7522K3722j920l0906k3423J4295L1308Q057j9199j4927M854Q122
116D706j859k228L036N09k978L789O006q965j8725K04L0538K3089k3726m5105
$$ plain form
0 0 0 0 0 0 0 0 0 0 0 0 -4 8 -8 8 -8 15 -16 16 -23 24 -30 33 -40 46 -53 59 -69 79 -89 101 -112 128 -143 160
34 160 -177 199 -222 246 -273 303 -335 371 -411 454 -503 558 -619 689 -769 861 -969 1099
52 1099 -1256 1453 -1705 2044 -2527 3271 -4578 7546 -30761 58226 129775 1966 -100738
65 -100738 -61820 54480 64888 -16053 -61439 -5189 47706 24720 -30791 -30327 4698 18349
77 18349 3974 5774 16168 -72 -35287 -28640 27116 59840 15075 -47910 -41933 20421 47454
90 47454 10820 -27464 -13595 21254 22797 -7169 -20443 -681 20267 18515 5832 -3429 -11404
103 -11404 -12799 4723 28445 26525 -4381 -27804 -13509 17799 25856 6657 -8270 -3416 4706
116 4706 2847 619 3655 4164 1186 4975 10981 2016 -16709 -16505 14033 37122 13396 -31709
130c1709j893M6484K6124l1305l6741J5587L9329n826m5044j0082M9600L3342
142D7866m0002n4566J5043O0194J0128n2784k9008M1499M3916k7150n8435J897
154d1402O1970K8622m5658m7914J6193M6103N981l1534j3367K0814J3257j7884
166d819j6282J5137K0228r319j9731M784J8851m298k2905j093K9886J6195k6118
179E16l3423R590L8392R569k8929j9526J7081K0987r398k0987K320K3233P609
192A7034j8955j5732Q579J5795j70q701KM503j306o735k46P391O427k410o339
207h63k415L44P95L790O050j357q081l329N980M397m484l599P155Q183p320j6775
223a1529J22K1682J1561j7600k0257Q986K4203o33k5024r394K4083K2640j6388
$$ plain form
130 -31709 -33602 12882 39006 7701 -29040 -13453 25876 20050 -24994 -35076 14524 47866
142 47866 7864 -46702 -31659 28535 38663 -14121 -43129 -1630 42286 15136 -43299 -41402
154 -41402 20568 49190 3532 -44382 -28189 17914 23895 -7639 -21006 -192 13065 -4819
166 -4819 -21101 -5964 14264 4945 -14786 -10002 8849 4551 -18354 -19447 10439 26634 516
179 516 -32907 -23317 15075 24644 -4285 -23811 -6730 14257 4859 -16128 -13808 9425 17034
192 17034 -1921 -17653 -9074 6721 6551 -2150 -2148 2355 1049 -5686 -5932 1459 7886 5476 -863
207 -863 -3278 -2934 -2139 1651 7701 6344 -1737 -5066 914 5311 827 -2772 4383 12566 5246 -11529
223 -11529 -11407 10275 21836 4236 -16021 -7035 17168 16535 -8489 -17883 6200 28840 12452
236A2452l3324m62L3694J7082k1384k4524N847K1422L232j4888o561J0712P200
249A0498q305p106N455N216o317m184J0182Q730j1685j9506L756K6333J1971k2753
263B285k5994R682K9120M482k5075j4184J6852J9967q025k2474k943J9896J1260
276A4849j2236j3785M743R856k761p570M169R631j819j3590n569J1667J2679n403
290D861j4038k062J1114N858o528q043J424Q840M181o288p872l76N838O556R64
305D429n159q095j169R152O930m048q151j494P207M234n009o464L275Q242L37
320D217p382l144M064L216j086n46K754n27m787l307N683Q248k064j0020j628
335f309Q580M468o268o349N194Q888j865j0725l248J0386P275o323q819L634Q944
$$ plain form
236 12452 -20872 -21334 12360 29442 8058 -16466 -10619 10803 14035 -853 -7414 3298 10498
249 10498 2193 -4913 542 5758 -559 -4743 5439 14169 2484 -17022 -13266 13067 25038 2285
263 2285 -23709 -14027 15093 19575 -5500 -19684 -2832 17135 9110 -13364 -16307 3589 14849
276 14849 2613 -11172 -6429 3427 666 -6904 -2735 6896 5077 -8513 -14082 -2415 10264 4861
290 4861 -9177 -11239 -125 5733 -795 -8838 -7414 1426 5607 -681 -8553 -8929 -3091 3465 4429
305 4429 -730 -8825 -9994 -842 6088 2040 -6111 -7605 -398 3836 -1173 -7637 -4362 3880 4217
320 4217 -3165 -6309 -2245 971 -115 -661 2093 1566 -3221 -6528 -845 7403 5339 -4681 -6309
335 -6309 2271 6739 471 -5878 -684 8204 6339 -4386 -7634 2752 10027 3704 -5115 -1481 7463
350G463k314r885l15J1993N996j0603j2516N589J5620J288j4823o437J1553J0306
364A2915p287j3066R61J4013O619j1311j1204M295J1671J116q403l611N307L246
378E261l104m091J488M966J38n087j420L459R79k839r36L011K297k649n183l83
394d093N661L586l510n093N69L513O77j640j285K03J506P56k118k246P50K580
410a84J658j671k804j010J908K405j230j987J189J702j703k850Q27L729J765l151
426a407m075J334M868M54n109j604N234L414m034o188J071P394L368n845o321
441g446K758P503k89o765j527O170L798m478o033K000O584K381o444l562M548
456h02M061k678m273J905M864N62n129l036M040N164j853n248J2N322J365m159
$$ plain form
350 7463 5149 -4736 -5051 6942 12938 2335 -10181 -4592 11028 12316 -2507 -8944 2609 12915
364 12915 5628 -7438 -6477 7536 14155 2844 -8360 -4065 7606 8722 319 -3292 2015 5261
378 5261 2157 -1934 -446 4520 4658 -429 -1849 1610 2589 -250 -1186 1825 4122 1473 -3710 -4093
394 -4093 1568 5154 1644 -3449 -2880 633 1310 -330 -1615 -1412 94 850 -1268 -3514 -2764 -184
410 -184 1474 -197 -3001 -4011 -2103 302 -928 -2915 -1726 -24 -1727 -4577 -3750 -21 1744 -1407
426 -1407 -5482 -4148 720 1174 -3935 -5539 -305 3109 -925 -7113 -6042 1352 4720 -1125 -7446
441 -7446 -4688 2815 2526 -4239 -5766 404 4202 -276 -6309 -4309 2275 4656 -1788 -5350 -802
456 -802 3259 581 -3692 -1787 3077 3639 -1490 -4526 -486 4678 2825 -2423 -2411 2911 4276 117
472A17l265K863N582k98n957k646M299N051k133m496J66L237J101k343j308J460
488A430K524r42l019K28K899L81k680p81K016K241j273l934j127M019M993k912
504D063o240j176N119M737k200n753j956M847M328k750n827k15M920K688k030
519B555m192j625L409L064j136k446p91M30l71O21J437J52j884k228Q66L393R74
536B228l615l408K087N471K56n871k983K805N411M84n089l899K754M458m77k747
552b135r97J356P39n98o54M24J424m24k320J63K843O91l062j480J879L223J1l563
570b480k645K399M119L51l405k278J776K125P18n85j289n02P22L79M32R52m87
587C02k162n96L407J761r14m078j277L442N372r13o265l497M160O801P52n791
$$ plain form
472 117 -3148 -285 5297 4999 -958 -3604 695 5746 3613 -883 -717 2520 3621 1278 -30 1430
488 1430 3954 3012 -7 221 3120 3501 821 40 2056 4297 3024 -910 -2037 1982 6975 4063
504 4063 -2177 -3353 1766 6503 4303 -1450 -3406 1441 5769 3019 -2808 -3023 1897 4585 2555
519 2555 -1637 -3262 147 3211 2075 -371 -1162 -732 -1103 -482 955 1107 -777 -3005 -2139 1254 2228
536 2228 -1387 -4795 -2708 2763 3019 -2852 -5835 -3030 2381 2865 -2224 -6123 -3369 1089 612 -2135
552 -2135 -3132 -1776 -1037 -1635 -2289 -1865 -441 -865 -3185 -3022 -179 512 -2550 -4030 -2151 1072 1083 -2480
570 -2480 -5125 -2726 1393 1744 -1661 -3939 -2163 -38 680 95 -1194 -1696 -974 -595 -163 789 302
587 302 -1860 -2456 951 2712 1798 -2280 -3557 -115 5257 4344 -1921 -5418 -1258 5543 6295 504
603E04n933K299P336L675n395o677L73O506M711k803p016k325N575O056o96n698
619D92m152J803N796L128l139n880j379M081M712M67n129n130K229O462K950n064
635B247n713l1N818M826k661o725k867M722O240p28n528l843K001N157J847l598
651A164m369N0L633K150n70l159k074K173K838M69k787k548Q36J576J744k86k366
668a526j385J036J488Q75l20k020j292J238K344m50k002p69J284J185r53r95K55
685b007J513k94j832l05K324K031k987l365J129N045K250m422o072J643Q263K401
701E315o179o615J781Q246L055n242o741J049O655L682l971m797n26L350L767
716B829L27k953l597K35L782L164qm594l912K677O278K086n361n667R64O805M175
$$ plain form
603 504 -5429 -3130 4206 7881 2486 -4191 -3818 2688 7399 4596 -2420 -4745 830 6886 6190 492
619 492 -3660 -1857 3939 7067 3928 -1952 -3331 750 5462 5929 800 -4330 -2101 4361 7311 2247
635 2247 -3466 -3497 2321 7147 4486 -2239 -5106 -384 5856 5128 -400 -4243 -2242 2915 4762 1164
651 1164 -3205 -3155 478 2628 2058 -1101 -3175 -1002 1836 2305 -482 -3030 -2194 -618 1126 840 -1526
668 -1526 -2911 -1875 -387 488 168 -1852 -3144 -1906 438 -12 -2014 -2783 -1499 -314 -1267 -2262 -2007
685 -2007 -494 -788 -2620 -2925 -601 1430 -1557 -4922 -3793 1252 3502 -920 -6992 -5349 2914 5315
701 5315 -864 -7479 -5698 2548 5603 361 -6380 -5331 1324 5006 1035 -3762 -4288 -938 2829
716 2829 3156 203 -3394 -3159 623 3787 3779 -815 -4727 -2050 4228 6314 953 -4714 -3750 3055 7230
733G230l818p305n94O287N029k128o560k703L729O451R33n636m719J794N746K109
749E845l175m347m85M238K732j370l226j443J175K350J439j298k899r62J557L552
765C683M69l140l843J170N060J602m256l868J324M690J083m031l218K178M436
780C339o40m805q11M098J964l199l200J258M509N03n042l221L942M792j109n928
796c550j015L590L639o62m422j863K239L268m04j952j454o42J431K337K16k552
812a796k084O20L107K027j670l785j166L580L426q75m280j957K019L985J195l202
828h56l871O69M278K740k015m056k080L931M787j016n007k466L013M305R23l770
844d91l531J524L275J950j664k551p98J194K578J527j852l207l00L100L578j009
$$ plain form
733 7230 3412 -3893 -4487 1800 6829 4701 -1859 -4562 -833 5618 6551 915 -3804 -2010 3736 5845
749 5845 2670 -1677 -2162 2076 4808 3438 212 -1231 -56 2294 3733 2435 -464 -1426 131 3683
765 3683 4152 1012 -2831 -1661 3399 5001 745 -3123 -1799 2891 3974 -57 -3275 -1097 3339
780 3339 2699 -2106 -2917 1181 3145 -54 -3254 -1996 2513 3016 -2026 -5247 -1305 3487 2378 -3550
796 -3550 -4565 -975 2664 2002 -2420 -4283 -2044 1224 820 -1132 -2586 -3228 -1797 540 756 -1796
812 -1796 -3880 -3260 -153 1874 204 -3581 -4747 -1167 2259 1384 -2896 -4853 -2834 1151 2346 -856
828 -856 -4727 -4058 220 2960 945 -3111 -5191 -1260 3527 2511 -2496 -4962 -1949 2356 3279 -491
844 -491 -4022 -2498 777 2727 1063 -1488 -2286 -1092 1486 3013 1161 -2046 -2346 754 4332 3323
860C323n097k034M068M993j048n707k490M179N008j122m835k298L695L785j109
875C311l708k69K177J200r72j044k74Q31M09p28n1R43n49q72J09J129N52j088
893A106n43l95P43P16m8j176m02R65N51m49j28r10r7Q06M49q18q82J15M20P55
913G78m67j037K29N59N5o88k64P59m17n30J89L13K22o52n77L14J265J2j514n82
933b033J226N20p44p84N4J328J68q84j102R81Q73m79j314N99J464Mj405r34J447
952a015J233q87j508r4K036J055k120j177J290J414J08j608j019J304J832p3k316
969a545m34K069Q83r14j057k76J308R70m59j539M17J328l7n56k61K73N2N47J67
988I36m95j7K43j36L21K07l23m33K4Q20J70n27k56M0J98O83O6n14n32P54J56o8
$$ plain form
860 3323 -1774 -3808 260 5253 4205 -1502 -3992 187 5195 4073 -762 -3060 635 4420 3311
875 3311 -397 -666 1511 2711 1739 695 421 1252 1661 933 882 1825 1276 404 513 1642 2194 1106
893 1106 563 168 911 1627 1579 403 1 966 1517 1068 940 30 -67 739 1188 370 -512 -397 23 778
913 778 311 -726 -497 62 117 -571 -835 -76 -493 -1023 -834 -521 -299 -951 -1528 -1214 51 63 -1451 -2033
933 -2033 -807 -287 -1031 -1815 -1761 -433 -265 -1149 -2251 -1270 -397 -876 -2190 -1591 -127 -123 -1528 -2462 -1015
952 -1015 218 -669 -2177 -2271 -235 820 -1300 -2477 -1187 227 335 -1273 -2292 -988 844 771 -1545
969 -1545 -1979 90 973 59 -998 -1274 34 1004 545 -994 -577 751 714 158 -103 170 222 769 936
988 936 441 424 667 531 852 1059 736 303 327 1147 1317 790 534 574 772 1455 1521 1007 475 1229 1385 1317
1010A317k57m74N26M87l16o13P3Q99o02n18L07L46K24k87j114L07J251J93j615
1029A34q20P54J556k93j381l87R41Q40k09j756m54J875L40j189o37m2J043R0q90
1048d85m63P47Q10r78q80P36N52n73p27KN90M64k23j136p7J240M93j229n74L24
1068a387O98L63n07j022M94Q80n4j064p6M36K06N1K24m5p51N43N79l07K46m40
1088i33m55O28O04J7r64l20N40R91R5r56l87L75J121Q9j077n75R23N82O03o39
1108B62j251L01J353O44r29q20K32J032R1l71o85M44Q34Rn82n21O30M30n35K73
1128H41j56N33l58k98m62J537j37r94n95J220P59r62k75m36Q09P47m71j055MJ257
1148A508k00o64N3K19j3j20j28j93Q20n20q49N4R89M83j314q56J081M62k88q9
$$ plain form
1010 1317 1060 586 1112 1599 1283 670 743 1642 1040 522 829 1175 1399 1112 -2 305 1556 1749 134
1029 134 -686 68 1624 1331 -50 -437 504 1344 1135 -621 -1075 800 1140 -49 -686 -728 315 405 -485
1048 -485 -948 -201 609 -369 -1249 -513 39 -534 -1261 -1259 -669 -205 -428 -1564 -1641 -401 92 -1137 -1711 -1387
1068 -1387 -689 -326 -833 -1855 -1361 -481 -535 -1599 -1675 -1239 -1033 -982 -758 -803 -1554 -1011 -432 -739 -493 -933
1088 -933 -1388 -760 -156 -139 -1103 -1423 -883 108 203 -753 -1140 -765 356 445 -632 -1207 -284 298 901 262
1108 262 -989 -688 665 1309 380 -440 -208 824 915 544 -141 303 1137 1146 564 43 673 1103 568 841
1128 841 685 1218 860 562 100 1637 1500 506 -89 1131 1890 928 653 217 1026 1773 1302 247 251 1508
1148 1508 1308 644 697 916 903 783 655 462 1282 762 -87 -33 956 1439 125 -731 350 812 524 435
1168D35j054M02O51k83l85J28J97k73k54KN14m03j69J1J87K82k81j127K82J362
1188B24l59l95q34K42K07O60pq97k42K00J085n17l34m36j75Q36Q36q65p74k18
1208a763Q55P69k34q25k65P74L78O0q18K90Rk97L06N98J3o93j01J00J307J88j384
1229g33j097J776J247p80j495OJ329P46j063n11O55Q82m61j198M61J542q1j524
1247b99m40J404J522q79k150r2K328J102j499j858M03K153K51j455o43P88J057
1264A693l83p87R3P49m79q40M46J571n88j644m08J239J591k10k309q65J582K056
1282B507n69k434k82J191J479j85j223j382N48J318M94r23j052j28P27J061k63
1299H84j266n09N13J218k22r48o14M68J72L17J97J68j143j058J213J615J32k339
$$ plain form
1168 435 -619 -217 434 151 -234 -106 91 -182 -436 -434 80 -323 -492 -481 -294 -12 -293 -1420 -1138 224
1188 224 -135 -530 -1364 -1122 -915 -255 -262 -1159 -1401 -1201 -116 -633 -967 -1403 -1578 -742 94 -771 -1545 -1763
1208 -1763 -908 -139 -373 -1198 -1463 -689 -311 -251 -1069 -779 -770 -1067 -761 -163 -150 -843 -944 -844 463 651 -733
1229 -733 -1830 -54 1193 413 -1082 -1076 253 999 -64 -575 80 962 501 -697 -236 1306 1225 -299
1247 -299 -739 665 2187 1308 -842 -934 1394 2496 997 -861 -458 1695 1946 491 -152 636 1693
1264 1693 1310 523 616 1365 886 46 492 2063 1475 -169 -577 662 2253 2043 -266 -1131 451 2507
1282 2507 1938 -496 -778 413 1892 1707 484 -898 -350 968 1462 539 -513 -641 86 1147 884
1299 884 -382 -891 -378 840 618 -330 -944 -476 -304 13 210 378 -765 -1823 -610 1005 1137 -1202
1317a202j534J652K649m22l035j350K349K690j233k977l70K794J044j312k204
1332b461P48K091j90k090m78K501J005k343j638J798K292q58k548l79K592J896
1348A938j831k934J034K965K73k499j088J790J441p25j555J68J833K14k110p57
1364a843K351J459j461k133P23K623L38j727k218J388K266J72j853j082R05J468
1380A376K99p69r40m20J214O23l9q85o11K61J470K66j263o44N70P81p1m59m2N4
1400G71j95l79R08O51p21j769J3K346J063j972k659R94L144R64l377k372J853
1417g37L386M9l517j676K706K481k247j882M12K019L49j842q30J627J309j877
1433b70j458J420J901p56k652n76K714J565j966k514Q83K893j32k431j066K043
$$ plain form
1317 -1202 -2736 -1084 1565 1143 -1892 -3242 -893 1797 564 -2413 -2783 11 1055 -257 -2461
1332 -2461 -1713 378 188 -1902 -2380 121 1126 -1217 -2855 -1057 1235 377 -2171 -2550 42 1938
1348 1938 107 -2827 -1793 1172 1445 -1054 -2142 -352 1089 364 -1191 -1023 810 1024 -1086 -1843
1364 -1843 508 1967 506 -1627 -904 1719 2057 330 -1888 -500 1766 1938 85 -997 -92 1376
1380 1376 1675 906 -34 -454 760 1383 1344 459 -152 109 1579 1845 582 -62 508 1289 1218 759 717 771
1400 771 576 197 1105 1756 1035 -734 -721 1625 2688 716 -1943 -949 2195 3159 -218 -2590 -737
1417 -737 2649 2698 -819 -2495 211 2692 445 -1437 -1025 994 1343 -499 -1329 298 1607 -270
1433 -270 -1728 -308 1593 837 -1815 -2391 323 1888 -78 -2592 -1709 1184 1052 -1379 -2445 -402
1449d02J558j039k141M81J811P1j650r48J557J453j091j747O49J734k71r74p12
1466a661Q70R64p51n91J70J174l49p66K96O39k57j104N96P02J57n38p32N82R96
1485C97n58m48j45R97l40m13M46K34J95o54j02R40M17j219j062Q57K084J28k846
1504a092m79K116J591j047k268J83K212P96j590j647J560J735r25j555N28J130
1520A248j9j306n46J631R53j326j657J192K196q23k281q7J986R43j169j698M73
1537b90J944K47j912p80J749P75j043j437P79J006n9j403l26J280J138j638j061
1554a031J023J297o61j668N90R99N37j471p98J096J184j055j275L24J478j41j161
1571g33m52J040M67p12p16M29Q40n54r51J55J195J00j326kJ072L79j014r31O66
$$ plain form
1449 -402 1156 117 -2024 -1543 268 339 -1311 -2259 -702 751 -340 -2087 -1438 296 25 -949 -1661
1466 -1661 -791 173 -578 -1169 -999 175 -174 -940 -644 -5 -262 -1366 -770 -68 89 -449 -1181 -599 397
1485 397 -161 -609 -754 243 -97 -510 -64 170 365 -289 -391 549 966 -253 -1315 -458 1626 1754 -1092
1504 -1092 -1571 545 2136 1089 -1179 -996 1216 2012 422 -1225 335 2070 1145 -410 118 1248
1520 1248 1229 -77 -623 1008 1961 635 -1022 170 2366 1543 -738 -825 1161 2104 935 -763 -290
1537 -290 1654 1901 -11 -791 958 1733 690 -747 32 1038 979 -424 -750 530 1668 30 -1031
1554 -1031 -8 1289 628 -1040 -450 549 1086 -385 -1183 -87 1097 42 -1233 -909 569 428 -733
1571 -733 -1185 -145 322 -390 -1106 -677 163 -391 -1342 -1187 8 108 -1218 -1220 -148 231 -783 -1714 -1048
1590a048J202j60j203m39J430N36j107j088R48J084l11j146K09J067L41q75q25
1607a385J167P55p19j018L38J611j89j394l52J019J055n81j367N93J196J66j820
1624i25l0J565J73o46q67K63J641m21j267j62J815N32j387r98R87J169l83j392
1642c33l19J556O71j219o42O77J071l95j251m7J512L00j235o24R18P97o16q36
1660a5J15J042P6j394O3P28P85r48n18K51M51J71p94m20J199L59j018q53R35P49
1680I64n55r68K20P15L62j168j53O54N40m70r20K83J009j56j134K8Q46J00n57
1699c60q17N38J326p39j118K20J400P0j477j42O62Q25q98o26L06R71m00q21j62
1718a242J030P43j250p89M83J300m77p94k11Q51N44o61q07O68P42j86q50L43L61
$$ plain form
1590 -1048 154 -6 -1209 -1648 -218 318 -789 -1877 -929 155 -156 -1302 -1093 -26 315 -560 -1385
1607 -1385 -218 537 -182 -1200 -862 749 560 -834 -1186 -167 888 307 -1060 -467 729 895 -925
1624 -925 -955 610 783 137 -730 -467 1174 753 -514 -676 1139 1671 284 -714 273 1442 1059 -333
1642 -333 -652 904 1575 356 -286 391 1462 1067 -184 -231 1281 1581 346 -278 640 1437 821 -15
1660 -15 100 1142 1218 -176 -113 615 1400 452 -66 185 636 807 13 -407 792 1151 133 -720 215 964
1680 964 409 -559 -339 376 738 -430 -583 71 611 141 -779 -496 513 357 -777 -749 97 197 -360
1699 -360 -1177 -639 687 -52 -1170 -950 450 520 -957 -1099 -437 388 -510 -1136 -830 141 -259 -1080 -1242
1718 -1242 -212 531 -719 -1508 -1025 275 -202 -996 -1207 -356 188 -473 -1280 -612 130 -56 -906 -563 -202
1737b02L37n70q34N13R17k03j101O14Q37M1r98p1P99N45m92m69p2R89N32j260
1757a48n00J108N22p14l69L03L48J05r25J89N22L56m39n58K75R91k32r14%P13
1777F33M06p97l08O52N10l99j69l78O08J23l94l91N42J33j49n60L28L49p5n19
1797A45o8P25l0q24J60L38K06l54m87J76N19J27r81j48P30N82p00n17J25M95j4
1818B05o22l15Q84N08j083r7L11M29j10r01K7N28O02o44l99J61O02n2m77j32L83
1839a92J47l87o77N19O76j74r93L78L88K81n75m59M29Q10m10p50L0N40j09%k66
1860g94L04O2K15j44m97N11J91m29K83Q4J46J00l88R2J78r6p5jM76J58k67l03
1882a94M48k3l9j45j47N52j54k01J96m0K76m42j46O02J94p0n78j3K97K58l47l2
$$ plain form
1737 -202 135 -435 -1269 -756 161 -42 -1143 -529 308 349 -649 -720 79 624 132 -337 -409 580 1112 -148
1757 -148 -648 460 982 268 -101 202 550 655 -270 -81 441 797 358 -200 75 1066 834 -80 -80 633
1777 633 1039 242 -66 586 1096 697 528 150 758 881 487 96 638 771 622 62 390 739 664 145
1797 145 77 802 772 -52 108 446 652 298 -189 -13 506 633 -348 -496 234 816 116 -401 -276 219 205
1818 205 -417 -732 152 660 -423 -520 -209 220 110 -791 -764 -236 366 -278 -677 -516 86 34 -443 -575 -192
1839 -192 -45 -432 -1109 -590 86 -88 -1081 -703 -315 -34 -609 -1068 -639 171 -239 -989 -959 -419 -528 -528 -794
1860 -794 -490 -428 -213 -357 -854 -343 -152 -581 -298 -214 -68 32 -356 -264 -86 -182 -257 -258 218 376 109 -194
1882 -194 254 231 192 47 -100 452 298 97 293 253 529 87 -59 543 737 667 89 76 373 631 284 252
1904B52J39J57N0m26J63J41R3l04J60L43M1o92m7J83K99K68k92m02O73j33p8m69
1926A19k6L44J86J6l70KL31J06n30m03L62J16j5P2j73P6J98l23j74MN49l03j16
1949D8k91j2J32K69l98j36K64l6j69k15O9K90q3L63p90j44N45L81m34j04J17j83
1971e17K19o7j34j97Q0N77o11k5J76K23k73k12J92K11J41j07p21K38P07k92j29
1992e21k83O83o6k0N4l97M44O5j65m34K43N55k95j24j01j8L85Mj51j7L78o9l05
2015a55p3L85N53k11m68lM41K06r9m75j56N95J18k86k58K90K85m14r9j6K46M45
2037H51l17l88N63K16m35j41q1J68K63j01o36J96N79m7l77m8j40J8L37l00J5Q1
2059B76O14l62l20j49J33M6j18QKl6L06k68k44L9M01j19l75L43r7j24J25l84r0
$$ plain form
1904 252 391 548 598 172 335 476 569 265 425 768 809 117 70 253 552 820 528 126 799 666 588 119
1926 119 93 437 623 639 269 271 602 708 178 -225 137 253 238 310 137 213 411 88 -86 -82 467 164 48
1949 48 -243 -255 -123 146 -252 -388 -124 -160 -329 -544 -475 -185 -268 95 -695 -839 -294 87 -347 -451 -334 -517
1971 -517 -298 -365 -499 -696 -616 -39 -650 -675 -499 -276 -549 -761 -569 -358 -217 -324 -1045 -807 -100 -392 -521
1992 -521 -804 -121 -187 -207 -153 -550 -106 -41 -206 -640 -397 158 -137 -261 -362 -380 5 9 -142 -159 219 150 -155
2015 -155 -228 157 710 499 31 28 469 675 576 101 -55 540 658 372 114 404 689 275 176 160 406 851
2037 851 534 146 709 925 490 349 268 436 699 598 -38 158 737 690 313 265 125 143 480 180 195 276
2059 276 890 528 208 59 192 238 120 128 130 94 400 132 -112 -73 328 209 -166 177 80 -44 81 -303 -393
2082c93M26j7m82l27M15L7J84j47k87L26K17j89n07J93N5M65l64m73J95M60J99
2103a4m81m41M24O64o35k07Q0O04J41q66J20J00M09Kj13o41O96K69o22M6q2O71
2125A24j4l20j73j19N88l0n60j26O51k4l12L58k7J6K75n62L2M79J62n04j78L35
2147G1k5Q1k22L21J8L66l66n3N4J3N6J92n8l66L17r7n1J28r6K84j19l4j34M6J61
2172D87m8Q7l88Q0O60k97n33J4M89j03j17j65k24N13%m89N9L23J63j83q5j99K73
2195C17Nj26k44k05M58n1l39j36P33j71m65j09K09L7J47l34n84M39P12o24j18
2216d49J70l5K60k22j49j84R15k46m82l24M40K42l60n6K9K54J6j19k09J08J80
2237b21l72l6L12j37K41J04k3k88L63k33QJ60j4L5l43K77R9j14j18K11J67j86
$$ plain form
2082 -393 33 16 -466 -793 -378 -341 -157 -304 -591 -265 -48 -237 -744 -551 -496 -31 -395 -868 -673 -213 -14
2103 -14 -495 -936 -512 152 -483 -690 -610 -6 135 -731 -611 -511 -102 -100 -213 -854 -158 111 -511 -465 -547 124
2125 124 110 -210 -383 -502 86 56 -504 -630 21 -3 -315 43 16 32 307 -255 -223 256 418 -86 -264 71
2147 71 46 127 -95 226 244 610 244 191 245 258 314 506 448 82 399 302 251 379 283 567 448 414 280 326 487
2172 487 439 526 138 218 878 581 48 62 551 448 331 166 -58 455 455 -34 25 348 511 328 243 44 317
2195 317 322 196 -48 -253 205 154 -185 -321 412 241 -224 -333 -124 -87 60 -274 -858 -419 293 -331 -449
2216 -449 -279 -314 -54 -276 -425 -609 306 60 -422 -746 -306 -64 -424 -480 -451 -197 -181 -300 -509 -401 -221
2237 -221 -593 -629 -317 -454 -213 -109 -132 -420 -57 -290 -282 -122 -136 -101 -444 -167 -68 -182 -300 -89 78 -108
2259a08j17k52M73q7j00l19O83j45j31j64K74K41j80J64n39L37M77n02O3K52n9
2280B61j5j62j59L24J09k01k0M08P2k36kk70K41L22k67l13K59L02M2n55K29lL59
2303G25k91o02M03L75p5J1l54L58j19k88j18Q5M82m84K70k77K68J7k71k69M01
2324B47J92k90j0k31K85l3m8N8k69K94l05L4K13j07k32J15n6n6m2j68J82l1J45
2347a13l15p9N6N32m97l5j63M53k52J18l00J83L11j46m55j01P19j30j78mN5k6
2369c67K72j70k24M10k73j55K5K58Q9k51q8J99Q5J85p2l48J39N14o5n71J01J29
2391a78J46k13O5J26m3L60j56j76J07L24o82J68N45j11j65Q2K9N1N9Q2k67P3l25
2414i9K54lL4L16m05K06Ol4j81L65J48l63P5K88n39OM46m6l94L9L12j66jq4L16
$$ plain form
2259 -108 -225 -477 -4 -91 -191 -510 173 28 -103 -267 7 248 68 232 -307 30 507 5 68 320 261
2280 261 246 84 -75 249 358 157 137 545 617 381 379 109 350 672 405 92 351 653 695 140 369 366 725
2303 725 434 -168 235 610 535 546 192 550 431 143 25 110 592 108 378 101 369 386 115 -154 247
2324 247 439 149 139 -92 193 160 112 170 -99 195 -110 -76 137 30 -202 -87 -143 -199 -241 -409 -227 -258 -113
2347 -113 -428 -507 -451 81 -416 -451 -614 -161 -413 -295 -595 -412 -101 -247 -702 -803 -84 -214 -392 -396 -341 -367
2369 -367 -95 -265 -489 -79 -352 -507 -482 -224 -135 -386 -474 -275 -190 -5 -77 -425 -286 228 163 -408 -307 -178
2391 -178 -32 -245 -180 -54 -97 263 107 -69 38 362 -320 -152 393 282 117 199 228 279 338 420 153 226 -99
2414 -99 155 152 186 502 97 303 309 275 94 459 607 244 319 607 68 74 520 474 80 119 431 265 264 180 496
2439D96l91J48k59M47j91J43r7k0J18P8n14O7l3j35K48J78m86j2N97o09J0J55
2461f2r4n4O6K48k59L01J32k84k64o8O14m62J45j43P7k65K45j45NM3J6j26K37
2484i7k02o8J92l31m7M01l18J53Nj89L02rj34m1J54j37J5k14K91K8N0J6p6l02
2508e58K10n3O88o46j33M33J1j87Pk4Q3J36K7j22Q8J05K12k24l10N79k60O4j56
2531c0J65P5J91l35p9K31P9o8k16q9K38O6N0k11M0K7J32Q1j61l2k51M08k48q8
2555b5J74K59J6j13k54J21K20j52k70L66J5L7l76L09l9K17J53m32m4J85j43n8
2577A66l24M07Kp0j49Q9J85j40R5j46r4J03l8J06k40j4K04r7L7l54J18j84K34
2600a04j31j45L99j24j83m5J52j39P6J14k15K5M51k79J57n26Q1K03J5k76K51r
$$ plain form
2439 496 105 253 -6 441 250 393 296 276 394 472 -42 25 -8 -143 105 283 -203 -215 382 -227 -217 -62
2461 -62 -156 -210 -144 104 -155 146 278 -6 -270 -338 276 -186 -41 -184 -107 -372 -127 -272 -267 -224 -208 -334 -97
2484 -97 -299 -367 -175 -506 -553 -152 -470 -317 -312 -501 -199 -208 -342 -383 -229 -366 -351 -565 -274 -246 -196 -180 -256 -558
2508 -558 -348 -401 287 -359 -492 -59 -48 -235 -228 -252 -169 -33 -6 -128 -40 65 277 53 -257 322 62 126 -30
2531 -30 135 210 401 66 -13 218 297 229 13 -76 162 228 278 67 107 134 266 347 186 154 -97 311 63 -25
2555 -25 149 408 424 311 57 178 398 246 -24 342 357 394 18 327 288 505 658 226 182 367 224 166
2577 166 -158 249 251 181 32 121 306 166 261 115 21 124 86 192 -48 -62 142 45 82 -272 -154 -338 -104
2600 -104 -235 -380 19 -105 -288 -333 -181 -320 -244 -130 -345 -320 131 -148 9 -517 -436 -233 -218 -494 -243 -252
2622b52M20o31J29K10j08J01j2l54K82P4m3m55K36M76j14j28j53q9K96K02l68
2643b81R5K62P8l36M3o0p9K63j66JJ48K25m42K64m6K44r3J26l2k74L35p6j0k13
2667b4K64J9j11pr7j3mk8J93P7j35J34k32Q0K50j79J90j12L2l03J14K89M8k24
2691B21L05K01m09k02J3K13J11j30m28L30K55k45k99M8K14j88J13l3j80K00j7
2712I3K2j72J04R8r9K24n17j28O50j37k81k97K80L10m19P3J08L6K70m07j42J18
2734b13K80j77j57P0l6J58j73k96J32K28K31l94M2J4J05K70l95J38J7j83j2k27
2756e78Q5M55k30k4J49j50L55m35P2j0M9J47k07O5K80l2l36J41J18j12P9K00j01
2779b0l88K12L27j50j04J70j74K70j11J94k37K00J43l11j01O7J03K70l56j3O4
$$ plain form
2622 -252 168 -463 -334 -124 -232 -131 -143 -497 -215 -141 -184 -639 -403 73 -41 -169 -322 -411 -115 87 -281
2643 -281 -186 76 154 -182 -139 -199 -278 -15 -181 -180 -32 193 -249 15 -31 213 120 246 214 -60 275 199 189 -24
2667 -24 240 259 148 141 44 31 27 -1 192 269 134 268 36 116 366 187 377 265 297 -6 108 397 445 221
2691 221 526 727 318 116 129 342 453 323 -105 225 480 235 -64 -16 198 10 123 90 -90 110 93
2712 93 115 -57 47 145 46 270 -247 -375 275 138 -143 -440 -160 150 -269 -196 -88 -52 218 -189 -331 -213
2734 -213 67 -110 -267 -197 -233 -75 -248 -544 -412 -184 47 -347 -305 -291 -186 84 -311 -173 -156 -339 -351 -578
2756 -578 -493 -38 -268 -292 -143 -293 62 -373 -301 -311 -262 -115 -322 -257 23 -9 -345 -204 -86 -198 -119 81 -20
2779 -20 -408 -196 131 -19 -123 47 -127 143 32 226 -11 189 332 21 -80 -13 90 360 4 -9 55
2800E5K00j44k09J64K56K56j13l90K53p3K0k68P2K09R0j85M7j60M31k53l11L25
2822B72J14l0k44L19k99K01Qj57M5R0k94J89k08L07K73m33j75n9J97r0k04J55
2844b3p0N8k6J13j57K94l35Q7J25l39L40K3k51L7R8k94K35R5n0j50J44j34J00
2867h0R7l44j68M04J63o7k83O1K89n3j56p3L37j33j20n04J38M61J88l29j57K42
2889h7k3l96K23k10K05J69l22m0L32K77k61m7J73J91J25o71O0L74l0M2j54k17
2911b87O8M36K8m53M98k9j16j65n2L91q9m07O2L46k9j95L33q1J13l64m7J31l7
2934E5Q1K56k62K65k6k40J71J0N8l57K31P4J51j25k53m8M01k43J38m16L12J81
2956D14m07K59l2M60l65j94l89L20J38j89J62k30L74P8j90j98K60pj74p8j05O2
$$ plain form
2800 55 255 111 -98 66 322 578 465 75 328 255 275 7 79 288 378 193 240 80 511 258 -53 272
2822 272 386 356 112 431 132 333 341 184 229 319 25 214 6 313 586 153 -22 -81 116 26 -178 -23
2844 -23 -93 -35 -61 52 -105 189 -146 -59 66 -273 67 90 -161 -124 -26 -320 -85 10 -40 -190 -46 -180 -80
2867 -80 17 -327 -495 -91 72 5 -278 -217 72 19 -137 -210 127 -6 -126 -630 -492 -31 157 -172 -329 -87
2889 -87 -110 -506 -283 -493 -288 -119 -441 -481 -149 128 -133 -180 -7 184 309 -362 -302 72 42 84 -70 -287
2911 -287 -219 217 245 -208 290 261 145 -20 -72 319 230 -177 -115 231 202 7 340 259 372 8 -39 92 55
2934 55 136 392 130 395 369 129 300 310 368 11 242 316 467 342 89 41 442 199 337 -79 233 414
2956 414 7 266 234 694 329 135 -254 66 204 15 177 -53 321 399 209 11 271 264 90 12 -93 -31
2978c1J62k73l15K44M41l17m24N10j45L29l42l01K91J96p6j93kL21j31l80J64
2999b72J30k6j17l33N09nQ3l25J07K65q8k80K57n0L20m01jo6O1J18k0j32K19M7
3023@l09J68J91J09Jk61m9J85k10J55k12J73q0l4Q5O4L16o5k83J4l2J29Q3o9q7
3048a8Q8K80k53l74O34p0j53k43J13M08J50m97kJ40K68j51m09L42L34k27r3p3
3070A94J91l7k76k18M24K81k89j97n8L22j05l13L70l4K41j36l72J46L0J59k74
3091D9J14L17k47k10l2K61k56L61l61j1K43m08J74j47J72J15l55J93k09L48k13
3112a02J46m32R9K79k57r6J75O3k39j77M97J74k33j04%m4R6j00k22K76k19L26
3134i4l21OJ76J40O9k39J05N1j23j1M7O4r7J44l17k02M07L31k26k19J18kP6l28
$$ plain form
2978 -31 131 -142 -457 -213 228 -89 -513 -3 -148 181 -161 -462 -171 25 -51 -244 -246 75 -56 -436 -272
2999 -272 -142 -168 -285 -618 -109 -114 -31 -356 -249 16 -72 -352 -95 -145 175 -226 -227 -293 -232 -114 -134 -266 -47 0
3023 0 -309 -141 50 159 160 -101 -150 35 -175 -20 -232 -59 -139 -173 -88 -24 292 227 -56 -42 -74 55 138 69 -18
3048 -18 70 350 97 -277 357 287 134 -109 4 412 562 65 63 203 471 320 -89 253 587 360 267 194
3070 194 385 348 72 -146 278 559 270 73 15 337 232 -81 289 255 496 360 -12 134 164 323 49
3091 49 163 480 233 23 -9 252 -4 357 -4 -15 228 -180 -6 -153 19 134 -221 -28 -237 111 -102
3112 -102 44 -388 -289 -10 -267 -363 -188 -125 -364 -541 -44 130 -103 -207 -207 -251 -155 -255 -477 -201 -420 -94
3134 -94 -415 -409 -233 -93 -24 -263 -158 -107 -230 -241 -194 -130 -227 -83 -400 -602 -195 136 -90 -309 -191 -193 -117 -445
3158d45O76P6l23j55J19j40K80j65m3j56N70l86KJ35K8m0r8k84O58n9k37k22L60
3181A51J4M0l93M62nJ42m50q4M42k33P7l28K94M62l11k90q8K65M50k34k30j02
3203E1K80k04Q0l19L58J59l57J45N8J21k81j0J4KN36m34r4QK03P3k14Q4Rj15n6
3228I7k98M53m14J98j11J54N1k17Qn0J7J22j86q6J86J38k72k35L98K17j91J04
3250H3m50K98P4k29k46J31L86r9m21M4P6l9L10J9o6J58l25K39j12k7J70k31m6
3273c03K99J67j90m69K99O9l21J12M77N1k73J19l29K21pP7k52m9J10L55l39Q7
3295h9r0L57l44J24l69L18K18K9k99R4J23n9Q8l44K93k4J74k65J63K35k9j68k39
3318a03K63J00j50O8J94l41pN5N4J26J32l73pJ72L83p96K22K58k17j3K8K72j90
$$ plain form
3158 -445 231 307 -16 -171 -52 -192 88 -77 -120 -276 294 -92 -90 45 73 33 -65 -349 309 250 13 -209 151
3181 151 165 205 -188 274 269 411 -39 -123 319 86 163 -165 129 591 280 -10 -98 167 617 383 153 51
3203 51 331 127 207 -112 246 405 48 193 251 372 91 81 95 97 633 199 105 113 316 389 175 259 268 153 97
3228 97 -201 252 -162 36 -75 79 130 -87 -79 -129 -112 10 -176 -262 -76 62 -210 -445 -47 170 -21 83
3250 83 -367 -69 5 -224 -470 -339 47 -52 -473 -429 -353 -392 -82 -63 -129 29 -296 -57 -169 -196 -26 -257 -303
3273 -303 -4 163 -27 -496 -197 -128 -449 -337 140 191 -82 37 -292 -71 -78 -1 -253 -302 -192 163 -176 -89
3295 -89 -179 178 -166 -42 -411 -93 125 154 -145 -51 72 13 101 -243 50 26 200 -65 98 333 304 136 -103
3318 -103 160 260 110 178 372 31 24 79 133 259 391 18 11 183 566 -230 -8 250 33 20 48 320 130
3341A30q6K3R4q8M13n43J61L26l01j14j18kK42j84k36L70L0p3K31m23J75k20L03
3364A10k91K13oq1P0j74m8J56O0p9m67K49L54j30M7k44j07J41J82k44R2K6J05
3387f6j57K63k47O5j84L25J2k1n5j49p7J81k02p3L5K99j48l1J24P7j74K37k10
3410a76k09J23M3K73k36L48j68k77Q0K54J39l08p7K4J68J3l84K77r1K60M6k34
3432a12L75l03R2K2k12P5K03j32Q1K71l49K67m64M27q9qJ85k49J85r2j36K20k70
3455a3N09l65K0K54j06k12K5N9j97K45M5l10K67j47P8j21j20K57j2M7r2M59k43
3478C27j92O6j89K53k11j3nJ32l99J48N7J12m25K69P6K73l04K2J96j4l36J21l5
3501g1p5L78k90N9j34R2J39%j39k95L45j29j86J46j0J67q5l60L18J88o05M27K35
$$ plain form
3341 130 44 67 161 73 486 -57 104 430 129 15 -103 -105 137 -47 -283 87 117 44 275 -148 27 -193 110
3364 110 -181 32 26 -55 15 -159 -207 -51 9 -70 -537 -288 66 -64 -17 -261 -368 -227 -45 -289 -197 -171 -66
3387 -66 -223 40 -207 -142 -326 -1 11 -10 -65 -214 -291 -110 -312 -385 -350 -51 -199 -230 -106 -29 -203 34 -176
3410 -176 -385 -262 -219 54 -182 166 -2 -279 -199 55 194 -114 -191 -167 1 14 -370 -93 -184 76 122 -112
3432 -112 263 -40 52 74 -138 -63 140 8 89 360 11 278 -186 241 152 144 329 80 265 173 37 257 -13
3455 -13 496 131 151 405 299 87 112 171 -26 219 264 -46 221 74 152 31 -89 168 156 203 111 570 327
3478 327 135 201 12 265 54 41 36 168 -231 -83 -26 86 -339 -70 6 279 -25 -3 193 179 -157 -36 -71
3501 -71 -146 232 -58 1 -133 -41 98 98 -41 -336 9 -120 -306 -160 -170 -3 -88 -448 -130 58 -547 -120 115
3524A15N5m25Q9n4k2K06m4M5l0j38j41J89J94j16R3j22r5M67l97K31k24J31Jk38
3548b30K1L08j76j0O2n2j4j67J71J71k13k1J33J13O6m39K71o5J85r5k57L01L47
3571D10j03k86k1K10n1K7R5j67l5M2q9K85n3k33K72j72j66J7L68J1n34J21K87
3594B35l18k71P37k97o0N8j1J58l23N18k94j4K60m58R4J54O1k34q4R2R8j25R9
3617G5K19o44L52o0j1J06q8R6K70p1j92Rq0j13P1K5k3j22J20J29j40J05j36J93
3641I0k69j64L41N9j42j57k09J64%J98o4j30%r7J85K59r5J8j11N4j74K69j80P2
3665h3k36K93K79n68J32Q6rj93M56k26q8l7K10QN3j87K17k22J67J39j21L7J24
3688B31l54N0Q5q9K86m40R9K17M2J30k15j98M16J22l17J14j31J45l0Pq4j28K79
$$ plain form
3524 115 170 -255 -166 -220 -242 -36 -80 -35 -65 -203 -344 -155 39 -77 16 -106 -201 266 -131 100 -124 7 8 -230
3548 -230 -209 99 -77 -87 -25 -77 -91 -258 -87 84 -129 -150 -17 96 162 -277 -6 -71 114 19 -238 63 410
3571 410 307 21 0 210 159 186 281 114 79 121 32 317 264 31 303 131 -35 -18 350 361 -173 -52 235
3594 235 -83 -354 383 86 26 84 73 231 -92 426 132 118 378 -80 14 168 229 -5 -89 3 101 -24 75
3617 75 294 -350 2 -58 -69 37 -51 45 315 244 52 61 -19 -132 -61 -36 -59 -181 -61 68 -72 33 -103 90
3641 90 -179 -343 -2 57 -85 -242 -451 -287 -287 -89 -153 -283 -283 -380 -195 64 -31 -13 -124 -70 -244 25 -155 -83
3665 -83 -319 -26 253 -315 -183 -97 -106 -299 157 -69 -157 -194 16 24 77 -110 107 -115 52 191 70 107 231
3688 231 -123 -73 12 -77 209 -231 -132 85 127 257 42 -156 260 382 65 179 48 193 163 170 86 -42 237
3711B37Q0L8j95m03L93L3m4l59M28n6l8K44j93O2m6K4k00M25j46k00Q3k31L07
3734B43n66L24LJ15j50j21Q2J83j72J95n2j69O6K52j31qK48m96m2J25j77L76j
3757A27M0j06q0m3k18RP0P0j67L03J50m65K2Q6J01O1j18j17j76K76K4O9k4k83
3781c89L73k64Q5M2P6jq9q0k14M75r7r9J52r8R1j17Q2O1Nlj5j52q7L9J31j19L00
3808H8k63J84j09R4K2l5j27J6P8J30Q2j19k33J01L02N1j13K1J48j44j00k57L43
3831A60q9J89j82k29K53K46N6l30O9J85l16k2P2L49j11Q1l37P6j03J2m0J06K48
3854C43k04N3m1p6L4k23N14k73k37L02Kk0Q1n08J95K41j38J71k45k69O93n12K16
3877I9j17J42j59N7j81N54n02K26j34p3R9r6k3m9j4k31N22k52p8Q7m2j63J51J1
$$ plain form
3711 237 317 355 160 -243 150 183 139 -220 208 152 114 358 165 227 181 205 5 430 284 84 167 -64 243
3734 243 -323 1 4 119 -31 -152 -70 113 -59 136 84 -85 -19 233 102 94 342 -154 -196 -71 -248 128 127
3757 127 167 61 -19 -62 -280 -271 -201 -131 -298 5 155 -310 -288 -202 -101 -40 -158 -275 -451 -175 -151 -82 -106 -389
3781 -389 -16 -280 -195 -153 -77 -78 -167 -247 -461 14 -83 -182 -30 -128 -37 -154 -72 -11 -6 -9 -24 -176 -263 -224 -93 -212 88
3808 88 -175 9 -100 -6 16 -19 -146 -130 -52 78 160 41 -192 -91 211 262 149 170 318 174 74 -183 160
3831 160 71 260 78 -151 102 348 404 74 143 328 12 -10 62 411 300 381 44 120 17 29 -11 95 343
3854 343 139 192 151 75 109 -114 400 127 -110 192 194 174 255 -253 -58 183 45 216 -29 -298 395 -117 99
3877 99 -18 124 -35 22 -159 395 -107 119 -15 -88 11 -85 -108 -157 -171 -402 120 -132 -210 -123 -165 -328 -177 -166
3901a66J85Pk73J18J86l84J46R2j11Q6L5k56j3K16P2L1j80k27Q3N97l04k20J7
3924b63P4j8J64o4J28l02K24J2L02o2l16O7o3J56k85J43P9J12j14P5j87J13N2
3947B7n5J55R2Lj74j72j12N25p2J4M5n8j0j91K27K3Q4k04m9K2o6j54K92j65K07
3972B34Lj58m1Q2K2KL8j75j60M95j16n96L82j8k31L21k20J16m1Q3O7j55L38k84
3996a2k50J24M8K44K6k21l1J65Q5l02J25j83N1M3J52K9l25J49l9j66J96J05J42
4019A55n6j73J47p3j65k6J78Q8Ok91K05q3J29J40k48K17k23q1j19M89m31J68j56
4042b03M69m79kJ71J2l2j99j54M01R0j46L32l84J68J99m13P8qo3P1k8o7K27MK10
4067B54j45Q6M4j62q8J67j06J45l32J48J6J25o7k69j2%K52k04k6K04J8j46l0J84
$$ plain form
3901 -166 19 26 -247 -129 57 -327 -181 -89 -200 -114 -79 -335 -348 -132 -60 -29 -209 -436 -353 244 -60 -280 -263
3924 -263 -189 -207 -43 -107 21 -281 -57 -45 257 195 -121 -54 -117 39 -246 -103 -24 88 -26 49 -138 -25 27
3947 27 -28 127 219 222 48 -124 -236 289 217 231 276 218 208 17 244 267 351 147 98 120 54 -100 192 27 234
3972 234 237 79 38 120 142 144 182 7 -153 342 226 -370 12 -6 -237 84 -136 -20 -61 22 89 -66 272 -12
3996 -12 -262 -138 -90 154 180 -41 -72 93 178 -124 1 -182 -131 -88 64 93 -232 -83 -122 -288 -92 13 155
4019 155 99 -74 73 0 -165 -191 -13 75 81 -210 -5 -88 41 181 -67 150 -73 -154 -273 216 -215 -47 -203
4042 -203 266 -213 -215 -44 -32 -64 -263 -417 -16 74 -72 260 -124 44 243 -170 -92 -100 -163 -92 -120 -187 40 44 254
4067 254 109 195 239 77 -11 156 50 195 -137 11 27 152 85 -184 -196 -196 56 -148 -174 30 48 -98 -128 56
4091E6j72M31k47j16p5K39K11k27r4P7K54l61j38M68l15J58L5k05m3m3R4J84j18
4114E3l7KJ78%l50J81Nr2K05j66J24j03o3M03m47K09k41r1N94n44J64k06K37o0
4138d5R0P4m0m9j45n0J4J25q4K50m75L71k51J18J09m0n7j24J8L21j28J05j41K0
4162a4P3J19j29j21k43J92K76l02J99j68n6K40k48L31J3q8j20M2j46J94J57j94
4184GJ49k25r1K01m13L62J06q6J12j30K11k76J48J13j80L2j3o3j09L12m42K97
4206B2l74O43j82k44J76J55j4k39J90k33q3L23k2J93k24k9l3Kk30J59j20L89l63
4229a38J89J95n8k52L9q4K74p1j06K45l24J66r9J71k33J75j11J32j61K2j93L8
4251a84J62M2L2j83J46Nm6j43N76n63N39j67k32j25Q6L3R1m7k71J64j20J62J70
$$ plain form
4091 56 -116 315 68 -48 -123 116 327 100 6 83 337 -24 -162 306 -9 149 184 -21 -64 -107 -13 171 53
4114 53 16 18 196 196 -154 27 32 -60 145 -21 103 0 -63 340 -107 102 -139 -230 364 -180 -16 -222 15 -45
4138 -45 45 119 79 30 -115 -165 -151 -26 -110 140 -335 36 -215 -97 12 -28 -85 -209 -191 130 2 107 -34 -14
4162 -14 59 178 49 -72 -315 -123 153 -149 50 -118 -174 66 -182 149 162 74 -46 -4 -150 44 201 7
4184 7 156 -69 -160 41 -372 -10 96 10 122 -8 203 -73 75 188 8 40 27 -36 -145 167 -275 22
4206 22 -352 291 109 -135 41 196 182 -57 133 -100 -183 140 118 311 87 58 25 27 -203 -44 -164 225 -138
4229 -138 51 246 188 -64 -25 -109 165 94 -12 233 -91 75 -24 147 -86 89 -22 110 -51 -29 -222 -184
4251 -184 -22 20 52 -131 15 20 -26 -169 407 -156 383 216 -16 -141 -55 -22 69 22 -249 -85 -205 -43 127
4274A27j79L54k39k03J92J44l71j74J22J21N0j30N2k3L7J32j39K6J37K3k84L29
4296A04j06j68N03n08l5N33l82k79K37j94J84r2K96m03L83k08o8K68m0m0r1J07
4318Ak6ko0J21O4j78j34J77m3R1n6J3o2R7j80O6K51j40%M9J82k99k94L97k69J41
4344i3J09K6L64l05K0j35J14j75L79j22l11M43l50K99l65R5oL23k40j93L01q6
4366I2O2j87J12J9L28l22J7k66OK37l21K60N1j76M9l5K16K6Jj47O6J24k91QN7
4391a4J21m6m82N06j51Q4k11P9o6L24k95k03K60mq1L33k26L50m98L24k59L64j26
4414H3j93o2j12J11L46p6j59j35M14j0J3l39l8L67N7n2k30j87P7L20k97rK82l30
4438a59J08k40j9P6K27j10L0J41j4k54o4N04n63L31J43L7j89J43l37N48j59j49
$$ plain form
4274 127 -52 302 63 -140 52 196 -175 -349 -227 -106 -56 -186 -134 -157 -120 12 -127 -101 36 59 -225 104
4296 104 -2 -170 333 -175 -210 323 -59 -338 -101 -295 -111 -203 93 -310 73 -135 -203 65 25 -15 -106 1
4318 1 -25 -27 -87 34 98 -80 -214 -37 -80 11 -45 -32 -94 3 -177 -111 140 0 0 49 231 -68 -362 35 -234 -93
4344 -93 16 42 406 101 121 -14 100 -75 304 182 -129 314 -36 263 -102 -7 -13 310 70 -123 178 92
4366 92 154 -33 79 98 426 104 121 -145 -139 98 -223 37 88 -88 -39 -74 142 168 169 22 88 212 -79 -71 -14
4391 -14 107 61 -421 85 -66 18 -193 -114 -180 144 -151 -354 -94 -98 -179 154 -72 278 -220 104 -155 209 83
4414 83 -110 -172 -284 -173 173 97 -62 -197 217 207 220 -119 -157 210 267 215 -15 -202 -125 195 -102 -111 171 -159
4438 -159 -51 -291 -310 -234 -7 -117 -87 54 40 -214 -278 226 -337 -6 137 174 -15 128 -209 339 180 31
4460C1l4n7j57K20L05n33J96M2o1K2N45m29Q9j9p4r9J33r4j06L87j56R3j94j55
4484a05L00L2j12j85L04k91J24k66r9M96l55L76o4k2K64j02K6j97r6l0J38K12
4506C48l30o0n3k6J30Rq2n0L4J74L24l45P3m21K63J71l22j71M76M7j08j83J60
4529E8j45K15j74j78N3M39k54k53L70j20P2k53L82k97J31k37K72j70M4O3O7Kk40
4552a53J30r0k9J7J12M5J02j66q3J69j78j02L28k81J27NJ98n80M03Nm6L22j95
4575F0P1Q3j67J02k49O5M5j27R2p0j75M03j9j31J52M9n0m02K22J90L3kJ2J64l75
4600b4k33L36K14k83J04R3K3k77J79K2j68K39q1j36l7R0K2m9J5K45o63L02J44
4623G7L04l05k22J22k8J6K26k30M4k5J50j37L78n32j70M96j22K8j94M19m18o7
$$ plain form
4460 31 -3 -60 -217 3 308 -225 -29 13 -48 -26 519 90 179 160 86 -13 120 26 -80 307 151 244 50 -105
4484 -105 195 227 115 -70 234 -57 67 -199 -298 198 -157 219 155 133 397 295 321 124 28 -2 136 348
4506 348 18 -42 -95 -121 9 18 -64 -114 -80 94 418 73 146 -275 -12 159 -163 -334 142 189 81 -102 58
4529 58 -87 128 -46 -224 -171 268 14 -239 131 11 83 -170 212 -85 46 -191 81 -89 -45 18 85 87 -153
4552 -153 -23 -113 -142 -125 -13 32 134 -32 -115 54 -124 -226 102 -179 -52 -47 151 -429 -26 -21 -67 255 60
4575 60 131 214 47 149 -100 -35 10 -117 -25 -95 -270 133 114 -17 135 184 134 -268 -46 144 177 175 187 351 -24
4600 -24 -257 79 293 10 114 207 230 -47 132 154 -14 225 144 8 -29 61 83 34 49 294 -369 -67 77
4623 77 381 76 -146 -24 -52 -36 190 -40 4 -21 129 -8 370 -162 -332 164 42 70 -124 295 -123 -190
4645a90K39k33K85P9m14K32j51j4J25j09l7L62j22J2j35j11m2J26Q2K43k40%J69
4668A56m95L50K10j42j4k41o3L21k22k46M14L7k61J14j14L18K9l52J79k20J67
4689g5O5J0N8j66N6j75N26m33m9J38K30k37j9N08n48j37o2J54j9M50n01L13n2
4712C5j99J11K35lk59K04q7Q4l75L38k49N7J56k57L93l59K06O9P0m3L9j16K73
4735C23m54J01J36q8N0m07M55m6J1m3N04m47J76r7k92K90N1j40j85Q4K36j07l63
4758b52L5J97J12k1q0o8J18k14K03J22K85m90Q8J96m22K16k13J90R6j76P1j50
4780a57Q2K27j19ok6j73P0J91Qk80k2K86m15L52N0J4r3k19R9J49lM6j08J12j49
4805h4L0kJ85l89K48N8j85N0J64j65K01J0l11K63qK59l08m2J80j11nJ67l21n8
$$ plain form
4645 -190 49 -184 101 180 -234 -2 -153 -167 -42 -151 -188 174 52 64 -71 -182 -224 -98 -16 227 -13 -13 156
4668 156 -339 11 221 79 65 -176 -239 82 -140 -386 28 65 -196 -82 -196 122 151 -201 -22 -242 -75
4689 -75 -10 0 58 -108 -52 -227 299 -134 -183 -45 185 -52 -71 437 -111 -248 -310 -156 -175 275 -226 87 35
4712 35 -164 -53 182 179 -80 124 37 121 -254 84 -165 -108 48 -209 184 -175 31 100 170 127 166 50 323
4735 323 -131 -30 106 18 68 -339 116 70 81 38 542 95 271 174 -118 172 223 83 -102 -18 218 111 -252
4758 -252 -217 -20 92 71 -9 -77 41 -173 30 152 437 -53 35 231 -191 25 -188 2 98 -78 -7 -157
4780 -157 -75 152 33 27 1 -172 -102 89 97 -183 -205 81 -334 18 68 82 -11 -230 -131 18 15 61 -47 65 -84
4805 -84 -54 -56 129 -260 -12 46 -139 -89 75 -90 111 121 -190 73 65 324 16 -26 154 43 38 205 -116 -174
4829a74J24J41j57L0k40L55r4j70M3J67q8O6k5K5J32k12k16K59k8K9J17l0j65
4852a11K53j67qPJ92j95PM3Rp5J71m79J28J95j87L19k97K76l11M18j57R8j79J30
4876H0j63L00l55Q0K20k73K55o1q5l8p9L86n9n86K69J54k52J81k0J41r2K96k22
4899G7n4j28L5K02j23nj54K91K0j3j81q0M3m8J27j03j50K22K13l26m1L08j70J04
4923F6O7j27j50j28N48m52M39k61o4L07m19N22m48K3j1k24M60j18k49R7J52J27
4945A57k8j03j18K35m04L61j38j16O7o4J55K55k73J7j46m4L27k55J9l40L93J5
4967b8K19j29O6J97k57J71k92L01k82R3J08k02m1o6J26J48j44J31k47J34L6r6
4989e4K82p8j01J5k19J12m7J65J0P3j40K5k42K30j69K69l3J32j69J28l5k19j1
$$ plain form
4829 -174 -50 91 -66 -36 -276 79 -15 -185 -142 25 -63 3 -22 3 135 -77 -293 -34 -62 -33 84 54 -111
4852 -111 142 -25 -33 -26 166 -29 -22 21 30 -45 126 -353 -225 -30 -217 102 -195 81 -230 188 31 129 -50 80
4876 80 -83 217 -138 -58 162 -111 144 83 -2 -40 -119 267 208 -378 -109 45 -207 -26 -46 95 3 299 77
4899 77 23 -105 -70 132 9 4 -150 141 161 148 -33 -113 -70 -118 9 -94 -244 -22 191 -135 -176 132 -38 66
4923 66 133 6 -144 -272 276 -176 263 2 -62 245 -174 348 -100 -77 -88 -312 148 30 -219 -122 30 157
4945 157 129 26 -92 143 -261 100 -38 -154 -87 -151 4 259 -14 3 -143 -187 140 -115 -96 -436 -43 -28
4967 -28 191 62 128 325 68 239 -53 248 -34 59 167 -35 -76 -142 -16 132 -12 119 -128 6 42 -54
4989 -54 228 150 49 64 -155 -43 -90 75 85 158 18 43 -199 31 -138 131 98 230 61 189 154 -65 -76
5012g6n2j0P1L52k16L5r8M2K1k02J41N2k12J89j56j52N79n41L89O2j1m55N64k18
5036I8J15k89J60q9JK14l14J8j86M53rj67k71J74K87j18p5K30k3l85J79M3p4k39
5060b67J58K9jP2K2P7j47K2J05J04j92K0k32K97Q2n4K9j75J78N2k68J79m27M39
5084A02j59K28l61KJ00J59K02j76j98L86n94M92k86K91k29J17O3l54K40o3NJ04
5106G1j56j15K09J28k35Q1j24O6J62J5J98k15k75J91L8j80Q5K28K7j9k8J43r4
5129B01j87L16l53J91l36O5N9r1J21j24O1L05j06R3n3j52Q7Q3j65J21k45M6J47
5152H4J27k95Q9q4PK54l37j12J91j64K60K0mJ47J12j71m0j91J79N4n07J3O09l06
5176f5L9kr3L47l21m1R5Jj14J2J04l7K11k24L03j50j49O1k00r6K99P0m8k38N7
$$ plain form
5012 -76 -128 -138 -67 285 69 104 6 48 69 -133 8 60 -152 37 -119 -271 308 -233 156 218 207 -248 316 98
5036 98 213 -76 84 -5 -4 210 -104 -86 -272 181 172 5 -266 -92 195 77 2 232 209 -176 3 46 -28 -267
5060 -267 -109 -80 -81 -9 13 90 -57 -35 70 174 -18 2 -230 67 149 95 124 -51 127 179 -89 90 -337 102
5084 102 -57 171 -190 -188 -88 71 273 97 -101 285 -309 183 -103 188 -41 76 139 -215 25 -38 -33 71
5106 71 -85 -200 9 137 -98 -17 -141 -75 87 102 300 85 -190 1 39 -141 -56 172 199 180 152 295 201
5129 201 14 330 -23 168 -168 -103 -44 -135 -14 -138 -77 228 122 215 162 10 97 180 15 136 -109 -63 84
5152 84 211 -84 5 -79 -72 182 -155 -267 -76 -240 20 40 36 183 295 124 84 -107 72 126 -381 -368 241 -65
5176 -65 -26 -28 -121 226 -95 -136 -41 -40 -154 -142 -38 -75 136 -88 215 65 -84 -23 -223 -319 -20 50 2 -236 -179
5201a79J36R2j78J98j29N2N5j42J26J20p7N8QJ08j51l77J89Q9l42M40J37k44o5
5224g6O9j69L84k65O8k16L03j18j85K03l06M13m44O06n75K03N5L72l11lj20K10
5246I8j73j36J01L3j06K13M6j22J09k46N3Q0K79l43J13p4L68r7j23l53N73k37
5268E6J63m8r2j50L38k50K2M54r34P20l77J61L11l07j39r4J88j6K69k51P0r9K3
5291A8k4l31K81P1P6M4l45K31J20l29J27L37n31K98%J40k54L6J53q4o3P7J76j34
5315I0j7k86L11J10k41k04P3K1J3J91j0P6k52J23k94L99j54K72n53K56L80m64
5337a60j06L71k81K44K07ok43j57J6r0M15p0j23l7K90k08k01l3J13l38J61J81
5359e5l7R6J05o8j94J92J86o94L93J02K9M5PK09k02j02J50j54K69j82k61K65r7
$$ plain form
5201 -179 -43 49 -129 69 -60 -8 47 -95 31 151 74 132 140 248 97 -280 -91 -2 -344 96 233 -11 -76
5224 -76 -7 -176 208 -57 11 -205 98 -20 -205 -2 -308 105 -339 267 -308 -105 -50 322 11 8 -112 98
5246 98 -75 -211 -110 -77 -183 30 76 -46 63 -183 -130 -50 229 -114 -1 -75 293 196 73 -280 293 56
5268 56 219 171 79 -71 267 17 39 493 -441 279 -98 63 374 67 -72 -166 22 6 275 24 94 -5 18
5291 18 -6 -337 -56 15 91 135 -210 21 141 -188 -61 276 -255 43 43 183 -71 -35 118 34 -29 48 224 90
5315 90 73 -213 98 208 -33 -237 -164 -143 -130 61 51 127 -125 -2 -296 103 -51 221 -332 -76 304 -160
5337 -160 -266 105 -176 68 275 269 26 -131 -115 -205 210 140 17 -20 270 62 -139 -172 -59 -397 -236 -55
5359 -55 -92 4 109 41 -153 39 225 -469 -76 26 55 100 107 316 114 12 162 8 277 95 -166 99 2
5382BK8j01L61L2p1j00j52k08K76m4q8J66k62J41J97l82K52m8k1K13P5n6N4j80
5406H4j12K52l70J40K04k82J2K58q3j91J8L0j69m4L9L48j83J8j01j6K10q6J72
5429A48k36N2J4j09R9Q4r8K59j39K38k00k17J21j29J95j72j0j26J40J62l29J75
5451g8k47K64l2J24J01l00K29j46J2K27k78J82k76nK43l2K7qj56M0J32m4k47J56
5475a12Ok3N5N8rn9j88J68n6M22j51j32K72l33N0L0l6k47M39j29n0j87R2P3J30
5500H3M95o25J76q9J7p3j42j14J98K35j62J61m6l4K9r9k45l3M09J8j74Q7J8J74
5524B64k13j45N7j83m3O0M82k44o0J06j38Q0J57Rj68J22r2J36j90q3k7M5k0n4
5548a42K40q9K27k70J55K28l85J99p6q0J24p1K54l73r1K36m0R5l1o5k58J81J30
$$ plain form
5382 2 30 -71 290 322 251 151 -1 -209 67 23 -65 101 -161 -20 177 -205 47 -1 -22 191 266 210 264 84
5406 84 -28 224 -146 -6 198 -84 -72 186 103 -88 -70 -40 -209 -253 -214 134 -49 -31 -132 -148 62 -24 148
5429 148 -88 -36 -22 -131 -32 52 -46 213 74 312 112 -105 16 -113 82 -90 -100 -226 -86 76 -253 -78
5451 -78 -325 -61 -93 31 132 -168 61 -85 -73 154 -124 58 -218 -223 20 -12 15 7 -149 -109 23 -21 -268 -112
5475 -112 -106 -129 -74 -16 -25 -84 -272 -104 -160 262 111 -21 251 -82 -32 -2 -38 -285 154 25 -25 -212 -120 -47 83
5500 83 578 -47 129 40 57 -16 -158 -272 -74 161 -1 160 114 80 109 10 -235 -268 141 159 -15 72 90 264
5524 264 51 -94 -37 -220 -263 -203 279 35 -25 81 -57 23 180 189 21 143 51 187 -3 -86 -113 -68 -88 -142
5548 -142 98 9 236 -34 121 349 -36 163 87 7 131 60 314 -59 -150 86 46 141 110 45 -213 -32 98
5571I8r9J11k21j45N65l78K60l60J21j69j0j18K78k8N2m9Q3J69l0M8o2k67O1L26
5595B36j82O1j96J79q7P1k76L30j7j29Q4k32l2J48P3O2j67p8K02j23J81q6J42
5618A64l63J36k54N68k77j02L5J87k20n2J48M11k76n29L98J37J50k14j21K8N5
5639IM0J78l93L83M7j48M4P9j54N9k46K30j98L4o1J60j05K48j97O2k47J61k28
5662b43L74Mr8K4l36L22K9J23j48j11K04j08M44n99p2J53Qk3K36q5N4l9m44M00
5686F9j85M54m55L42k36J27k07J50nj81J32Jj36K41p6J9K0K7k70PK5J03k85M30
5710A11m19L65J84j69j78J75k91L67O8j95R6j65o0Q7N1N4K15l92K03p7k80K10
5732d0J05J3J6l12K18J0l17N6N18k84j59nm7M1N07m47L99n5k11k2K7J94nj85J62
$$ plain form
5571 98 -1 110 -111 -256 309 -69 191 -169 -48 -217 -227 -345 -67 -95 -43 -92 -9 160 130 178 116 -151 -90 236
5595 236 54 115 -81 98 11 82 -194 136 119 -10 74 -158 -190 -42 31 93 -74 -152 50 -73 108 22 164
5618 164 -199 -63 -317 251 -26 -128 -93 94 -126 -178 -30 381 105 -424 -26 111 261 47 -74 -46 9
5639 9 49 227 -166 217 264 116 160 239 85 144 -102 128 -70 -36 -97 63 -42 206 9 71 -176 -15 -243
5662 -243 131 135 37 61 -275 47 76 199 51 -60 144 36 480 -119 -191 -38 -30 -53 183 98 152 113 -331 69
5686 69 -116 338 -117 225 -11 116 -91 59 54 -127 5 6 -130 111 35 54 74 101 -169 -162 -137 -34 -319 111
5710 111 -308 57 241 72 -106 69 -222 145 213 18 114 -51 -111 -24 27 81 296 -96 107 30 -250 -40
5732 -40 65 78 94 -218 0 10 -307 -251 267 -17 -176 -181 -228 -187 320 -127 272 217 6 -16 11 205 200 15 177
5757A77j7j05k19k3J69j47Q5J56o8l24M29k09J67o5k88J33N49n14O7j83J28K16
5779A14k14J1J74q8K8k93L43l8P2q1j31L14j53j41p2J16k8j0K54j39q0j03K03
5802E8J37k84p8J44K70k26K6K64l28rK19j15J9j80l8k4p4n1M02j24J42q8k4j00
5826f2J0J70j12Q4J92l31p9L46q1j89j10JL12p7o6p5j22J88J35L8l5m29L78O4
5850A50N0k93K7n1J56n0K01o14N80j45m3J60l78K45n6L69k30r5k5J96j0k22K06
5873A28j5j41L33m20J01o4K2j68J70L5j37J18p5J60q9n8K9n7J62P0k59m7K06l2
5897b8L7q6r9J10j06K80j90J35k84L22m8J9%K9NL5o4M3K4J03n93M47k13J52QJ79
5923B17k64j20M04j90p1j28K45Q7j57pK0o1J08M1j79r7j23j30N51R6k77R2j37
$$ plain form
5757 177 160 55 -164 -187 -18 -165 -80 76 8 -316 113 -96 71 6 -282 -149 400 -114 -47 -230 -102 114
5779 114 -100 -89 85 -3 25 -268 75 37 109 28 -103 211 58 -83 -155 -39 -67 -77 177 38 -42 -145 58
5802 58 195 -89 -167 -23 247 21 47 311 -17 -26 193 78 97 -83 -121 -145 -219 -270 132 8 150 62 38 -62
5826 -62 -52 118 6 90 282 -49 -128 218 137 -52 -162 -161 151 74 8 -67 -189 -1 134 172 137 -292 86 150
5850 150 200 -93 -66 -117 39 -11 190 -424 156 11 -32 128 -250 -5 -61 308 78 -17 -42 154 144 -78 128
5873 128 113 -28 305 -115 -14 -78 -56 -224 -54 -19 -156 -38 -113 47 -42 -100 -71 -128 34 104 -155 -202 4 -28
5897 -28 9 -77 -176 -66 -172 108 -82 53 -231 91 43 62 62 91 96 131 67 110 134 237 -356 91 -122 30 38 217
5923 217 -47 -167 237 47 -24 -152 93 180 23 16 36 -25 83 124 -55 -152 -275 -405 146 242 -35 57 -80
5946h0L13k07l8o4M6K30m29N56m21J51j16j70Q1M92k93k73O0L42m40K74R8r7j01
5969h6Kl9L39j30j63Q9m3M4k69n2M07j78K27Ll84L43l56J76M6P1l31L80j33nP5
5994C3M6l6j36r6K28n8J05l10J50L16l24j61M9L05k63L82j78n8J84l14L0jK37
6017A30j60m6J4M0L39k43r3l90L45r7M65j97l37J88P4M8N8k93j87M43k08M25m18
6040a00J59j44j51J17J3K37k06K03M6k68L11j73l8qK01j49r9J48o3j93J27M5J3
6063B8j15K25k50J04j0MP1J03J41o05M46l35L4J24L6J86m1k6k03%O3Q9J42l97
6087a86J38L02j92j22P2J6r4j44k1K05K97o13L29pJ28j55J52k39J9J81l10O9J55
6110b0r1J07P7r9K47m62L14j19K39j29M5m09J86N7j03K82k16n1L71l92N8m8J36
$$ plain form
5946 -80 233 26 -12 -76 -30 200 -229 327 -94 57 -59 -229 -148 344 51 -222 -162 180 -260 14 112 15 -86
5969 -86 -84 -123 216 86 -77 12 -31 13 -256 -308 99 -79 148 151 -233 110 -246 -70 -24 47 -284 96 -37 -42 33
5994 33 79 43 -93 -189 39 -19 86 -224 -74 242 -82 -243 -194 111 -152 230 52 -6 178 -136 -106 -107 130
6017 130 -30 -76 -62 -22 317 74 -19 -409 -64 -161 304 107 -230 -42 32 80 138 -155 -342 101 -107 318 -100
6040 -100 59 -85 -236 -119 -106 131 -75 128 174 -94 217 44 6 -2 199 50 -49 99 36 -157 -30 15 28
6063 28 -87 138 -112 -8 -18 -14 57 160 301 -304 142 -193 -159 -35 1 187 146 120 -83 -83 -20 69 211 -186
6087 -186 -48 254 62 -60 12 28 -66 -210 -231 -26 271 -342 -13 -20 108 -47 105 -134 -115 66 -244 -175 -20
6110 -20 -111 -4 73 -26 221 -241 73 -46 193 64 109 -300 -114 -57 -160 122 -94 -145 226 -166 -108 -156 -20
6133b0M7j84r3J16j40L75L2k19J16l0K6M9k98L01l15KK60L7k1O9j12l2o6Q3q6
6158a03L7M1m2J7o2KR1m2K44m09K76J16r4j41J77r4j14R8j91J5R3L38k78J61l51
6183b15N8K33l8K5m9j62k05J09M31l6nl00M72m62KmJ59J05j10J6KK72l37J54k26
6208a11J98N1n9J83j51k23k4J42l7K12j52n5o0L11l06rj77M82j65o0J7j71J85
6231B1n0J96j78K46m74J78k09J95lp0R2M2j38J04J68k06J57k2k8q6l8q8J98K99
6255C06k28j91J80j80j70J68J04m2q9M1j50J75J60m7L8j62O3J26k99O4K52k12
6277i3m2o3M41m50j3L61Q8j90k42R0J54q9j12M26m77L03m5l81M25J47l27K87j13
6300H5j43J47K11m06J70k6J40k98J5J25o6J93k67J33J17q6k88L21N8m6Kj6j30
$$ plain form
6133 -20 27 -157 -250 -134 -274 101 133 -86 30 0 26 75 -223 78 -237 -235 25 62 41 110 -2 -34 -100 -17 -103
6158 -103 -66 -25 -67 -50 -112 -110 -19 -61 183 -226 50 166 72 -69 108 14 -100 -2 -193 -178 -85 253 -25 136 -215
6183 -215 -157 76 38 63 14 -148 -353 -244 187 151 146 -154 318 -144 -142 -146 13 118 8 24 26 298 -39 115 -111
6208 -111 87 138 79 262 111 -112 -136 6 -31 181 29 -26 -86 225 -81 -90 -267 215 50 -10 7 -164 21
6231 21 -29 167 -11 235 -239 -61 -270 -75 -78 -148 -56 -14 -152 -48 120 -86 71 49 21 -65 -103 -191 7 306
6255 306 78 -113 67 -113 -283 -115 -11 -53 -142 -101 -251 -76 84 37 75 -87 -24 102 -197 -133 119 -93
6277 -93 -135 -198 243 -207 -220 141 229 39 -203 -113 41 -48 -160 266 -211 92 47 -334 91 238 -89 198 85
6300 85 -58 89 300 -106 64 38 178 -120 -105 20 -46 147 -120 13 130 44 -244 77 135 89 91 75 -55
6323e5J38k31J75Q4o8n5J10l66K37J58j86R6n0j38L15k34J31j95J14k42K78O0
6345G6K86n44J41m4K03k7k23K18j09L25j22m38J11L28l20K19k0J84o4K1k11j31
6367a41K23l36N60m55J49l06R1K80k77M63k17J42J15k62j06o4m3M0K7j80J86Q
6389a03P6o4K6o3J05L2l40M26n7j77Q3n4L8J21O5n0j17K8J83k70R0j12J5K57j25
6414A3J3j82r6J33J49M2J38k76R4q8p5J9K23j57LJ21JK0j95k0J70q8k17k3Q4M24
6440B30p4p3j90j85M74k18p6K20j81K24j79K63m41L03j25J78P7l56J10J08k35
6461a46J44L5j53R7N7j56K76k06K06K8l9m13K21J60k42J47n3r1O0K49n27M41J06
6484B01j24J55k08J15M4j80J27j47J14q9M54k86j53j31Jr4j7Q3M68l40K26k76
$$ plain form
6323 -55 83 -148 27 111 43 -12 98 -268 -31 127 -59 37 -13 -151 164 -70 61 -134 -20 -262 16 76
6345 76 362 -182 -41 -85 118 91 -132 86 -23 302 180 -258 -147 181 -139 80 60 244 180 201 -10 -141
6367 -141 82 -254 306 -149 0 -306 -215 65 -212 251 34 176 291 29 -77 -141 -184 -144 -117 -297 -111 -103
6389 -103 -27 -91 -65 -128 -23 9 -331 95 38 -139 -56 -110 -72 49 114 64 -53 -25 158 -112 -22 -134 -119 138 13
6414 13 26 -156 -252 -119 30 72 210 -66 28 -60 -135 -116 107 -50 -47 74 75 95 -100 -120 50 -38 -255 -278 -194 230
6440 230 156 83 -107 -292 182 -36 -112 108 -73 151 -28 235 -206 97 -28 150 227 -129 -19 89 -146
6461 -146 -2 33 -120 -23 34 -122 154 -52 154 182 143 -270 -49 111 -131 16 -37 -128 -68 181 -346 95 201
6484 201 77 232 24 139 183 3 130 -17 97 8 462 176 23 -108 -107 -201 -218 -135 333 -7 219 -57
6506e7L20j97j46p9K22k30p3K16k81M44j95J06J62m57J71J86k32J36K09l03R8
6527B0L2j11J49m57M44p8J7L8q2j00J09k00J57J80k2j58j6l2q7K63k48L11K4m4
6551A09r2n7Nk96J95K2J77K6m42L45J51l73N41j05J02l41j03O7j08J15q3L8J78
6574G1n7J12p1j14J1l7K6K07P9k6j50q3J59k24O3k71K08J90j2l6Mj70L54p7q8
6599F8j53N8K62L8j58m5n2r3R3J72j97j02J4K76l67J54k6p5J98j92p1K09K12j61
6623F2J80l29L5j73L50j46M3J40p9k00J51l0m9P8j83k4N5K41l1q7k1J31k13K93
6647A94l8k12J45j50j54M88k04j46J26rJ46k40J73r6J10O2j59j2PK22j39j01M5
6670E8l9j81K40j53k6M36l98K15k64P5Q2J64j69J0k1K28o10M47j80Q2J07q4j47
$$ plain form
6506 -57 263 66 -80 -159 63 -167 -240 -24 -305 139 -56 50 212 -245 -74 112 -120 16 225 -78 20
6527 20 52 -59 90 -367 77 -1 16 54 -28 -128 -19 -219 -62 118 96 -62 -78 -110 -197 66 -182 129 153 109
6551 109 17 -40 -35 -331 -136 -114 63 89 -353 -8 143 -230 311 206 308 -33 -136 -69 -177 -62 -145 -107 71
6574 71 14 126 55 -59 -48 -85 -59 148 227 201 51 -32 127 -97 -34 -305 -97 93 81 45 49 -121 233 156 68
6599 68 -85 -27 235 273 115 70 18 -75 18 190 -7 -109 -95 181 -186 -32 -58 -133 65 -127 -198 11 223 62
6623 62 242 -87 -52 -225 125 -21 22 162 83 -117 34 4 -45 33 -150 -174 -119 122 91 4 -17 114 -99 194
6647 194 156 -56 89 -61 -215 273 69 -77 49 40 186 -54 119 23 133 195 36 24 31 253 114 13 58
6670 58 19 -162 78 -75 -101 335 -63 152 -112 -37 45 209 40 50 29 257 -353 94 -86 -4 103 19 -128
6693a28Q1k1N4q3J51Q7r8j42K61k15O2J50j79o8P1K04J3k60M7J56m18K99k15L65
6717A74k66J45k5L2k16L1K21J28l39n8K30M2p4j86L05o3m78K51M47l79J52q6n
6740a7j39J22j2K41k08J20m0n6k69L63j17k08Q0L6R5k82M48n9j48m6j18J29J52
6763F7k01J01o1K87k02k18K46p0j94J72k9O5k9mL87k0l39m4p5J16K6J77l2K27
6787C53l9m56J34J29k44K11J5k86J86j24L0R0J31m4j99K57l5l03R6J56l30K02
6809g0P4m56N07M0k30K43j22k51J5J43J6J89k66K18p1j07K97j17L38p4j81p4l70
6832c09J49m2L44j11K61m64qN9L07l24K53k21R4l0j23N8K25j93J94r2l14K58j7
6855d6j97P0M56k54P8o9j03J38r9J94j90J60j43m5K69j56K69l88K80m6k23J90
$$ plain form
6693 -128 -47 -68 -14 -97 54 141 43 -99 162 -53 9 159 -20 -88 -17 187 200 -60 -13 143 -275 24 -191 174
6717 174 -92 53 28 60 -156 -125 96 224 -115 -173 57 99 25 -161 144 81 -397 -146 301 -78 74 -12 -17
6740 -17 -156 -34 -46 195 -13 107 67 11 -258 105 -12 -220 -140 -104 -9 -291 157 98 -50 -96 -214 -85 67
6763 67 -134 -33 -94 193 -9 -227 19 -51 -245 -73 -102 -37 -66 -70 317 297 -42 -86 -161 -45 -19 158 126 353
6787 353 314 -142 -8 121 -123 88 103 -183 3 -121 -91 -1 130 86 -113 144 109 -194 -98 58 -272 -70
6809 -70 4 -452 55 95 -135 108 -14 -265 -250 -107 -91 98 -168 50 -21 -128 169 52 390 316 135 61 -309
6832 -309 -160 -202 142 31 292 -172 -180 -121 186 -138 115 -106 -12 -42 -165 -107 118 -75 119 27 -287 -29 -46
6855 -46 -243 -173 283 29 107 38 -65 73 -26 168 -22 138 -5 -50 219 63 332 -56 224 178 -45 145
6877A45j98J50k24q5M09j16k60j69L65J12j5o2R3j15Q8k6o6J51j21q3l6L06n60
6900c17K33j11L07j97m5L68l01K2J46j85p1J40q8K79j69j1k63J80J43o5J69p1
6922I3J07l33K62N9j67j57K59r1k0j01K5L26k90n1M1k73J42K22nJ02l84O4R3j33
6946b10L00l22K25N4oq4K9moJ23l13Q1J32K13j62j04j00J82K23l79L32j99l22
6969c17L38m07N72j90O6O8k64K38k79j45J57K34J66k84J22n5J12Nj36j42k60N61
6991A60j58J5J82j78N4M2K65l28K1n5k32L53j44q2K22j96J69k87J25j32J93l40
7013c31O02k18R0k80K34L0L4k04l11L52j12J81kJ66k36K58m11M59l84L67k32j43
7035i1L99k73M6k44J61Mj86N15j55k87Q8j35p7J25O2J4R4o9K9R3Ro5j27k6J73
$$ plain form
6877 145 -53 97 -127 -212 197 81 -179 -348 17 129 114 52 145 30 118 92 26 177 56 -27 -63 243 -317
6900 -317 -84 -195 112 -85 -130 238 -63 -41 105 -80 -151 -11 -99 180 11 0 -263 -83 60 -5 164 93
6922 93 200 -133 129 188 21 -136 123 32 12 -89 -64 262 -28 -79 -38 -311 -169 53 48 150 -234 -170 -77 -210
6946 -210 90 -232 -7 47 41 -43 -14 -18 -24 99 -214 -133 -1 212 50 -54 -154 28 251 -128 204 5 -317
6969 -317 21 -386 186 -4 62 130 -134 104 -175 -320 -163 71 237 -47 75 20 132 137 1 -141 -401 160
6991 160 2 17 199 21 75 117 382 54 75 20 -212 141 -3 -85 137 -59 110 -177 -52 -184 9 -331
7013 -331 271 53 143 -137 97 127 161 -43 -354 -2 -114 67 65 231 -5 253 -158 301 -83 284 52 -91
7035 -91 308 35 81 -163 -2 2 -184 331 176 -111 -23 -158 -235 -110 -48 -34 60 -9 20 113 122 57 -70 -96 77
7060G7o0j59M5L44j34J52m10K96m8L5j73K56j11J80k48j70Q0j00K9N9R8o3M1P2
7084H8J75m49L7M71m91P0j55L08o7O3l07J68J29K90l95J58q3K48m51j57P10m03
7106d3j61K76K1K31k19m40K90k12R1J11K00r0q2L3p4K40q8rl62N89m44r6L35j87
7130i0K97l42J37r3K6k53K58J82%J19m6k61R6k47O3J82j97QL16k8l37M55m18j04
7154b77M95l14M6K04j08j87J88R0j24J09l7k4k0k04Nk03K72K57N1m18k3J04K51
7177A33q6O8k60J98j25n2J24J08r9m56M15K68j69n46M98j3qJ98l8j78k20K93K12
7200B65n27K98j0j97J02J10K03l43k6K22J19Nj84o1J44j71K61k50rj7K15j54j32
7223a37J15K23l32J14J53j80L02Kl16Np7J13K03o9J4l4k37J65j25J01K16n15J90
$$ plain form
7060 77 17 -142 -97 247 113 265 -145 151 103 138 -35 221 110 290 42 -128 -48 -148 -119 -60 38 -25 16 88
7084 88 263 -186 -149 322 -169 -99 -254 54 -13 50 -257 -89 40 330 -65 93 10 258 -193 -350 360 -43
7106 -43 -204 72 93 324 105 -335 -45 -257 -166 -55 145 55 -27 6 -68 172 84 75 -287 302 -142 -238 97 -90
7130 -90 207 -135 2 -91 -65 -318 -60 122 122 241 195 -66 30 -217 -154 28 -169 -161 155 127 -210 245 -173 -277
7154 -277 218 -96 -50 154 46 -141 47 137 13 122 85 61 41 -163 -158 -361 -89 168 219 -199 -222 -118 133
7177 133 47 115 -145 53 -72 -124 0 108 9 -447 -32 236 67 -479 19 6 -2 196 158 -20 -240 53 265
7200 265 -262 36 26 -171 -69 41 244 -99 -125 97 216 221 37 -24 120 -51 210 -40 -49 -66 149 -5 -137
7223 -137 -22 201 -131 -17 136 -44 258 260 -56 -51 -128 -15 188 119 133 99 -138 27 -98 3 219 -296 -106
7246a06L48m12K42j2J36j51J24k83j1J38j01j03K33j63m4KL37j65j44K64j80R1
7268D0j6j34K03k7j5j74K12j02J44j45J52l59N12k85l2L4j52J97r4p4K91q8j09
7291b1j24L52k39N1k63Q2O11l79K6m9k75J44J81k11L32k37J01k61j63L96j49K74
7313A79k1R9k2r8j74J41k70M4J58l53M22L0j7J6l6j55j46J15J83j51mM2r4n4K69
7338A03k28K68j56n4Q3J29o4r2r7J01L63l49Ok36K82j31K26j98J14l06J57J70
7360I1r5j94pJ74r9J23L13k96k03L70o6k37q0M64k79J33N4n1M0N6j39K7p5J83
7384B07l24L06k71K39j65m0N8J67k46r3M62m05K40j49j49J52J00k4J20r5j15J09
7406H4n11L89L57k65j10j37J87N2R3P0n43L74K41k91Q6N7m1j38R7kj11P8QK12
$$ plain form
7246 -106 242 -170 72 60 196 45 169 -114 -125 13 -88 -191 42 -121 -165 -163 174 9 -135 129 -51 40
7268 40 24 -110 93 66 51 -123 89 -13 131 -14 138 -221 291 6 -26 8 -144 53 -41 -115 176 88 -21
7291 -21 -145 207 -32 19 -244 -162 449 70 96 47 -228 -84 97 -114 218 -19 82 -179 -342 54 -95 179
7313 179 158 257 235 137 -37 104 -166 -122 36 -317 105 135 118 134 98 -57 -203 -88 95 -56 -60 -18 -112 -166 103
7338 103 -125 143 -13 -67 16 145 81 -11 -108 -7 356 7 13 -223 59 -72 154 -44 70 -236 -79 91
7360 91 -4 -198 -205 -31 -130 -7 306 10 -193 177 111 -126 -206 258 -21 112 166 115 155 211 72 99 24 207
7384 207 -117 189 -82 157 -8 -48 10 177 -69 -162 300 -105 135 -14 -163 -11 89 65 185 90 -25 84
7406 84 -427 -38 319 54 -56 -193 -6 46 139 209 -334 40 281 -10 76 133 92 -46 51 49 -62 16 24 236
7430B36k68L1l76N28K7l94L02k23L09j75j17N8J85O5m2j40n6j65N1J44O1M5m1
7453D5J62m6k04J56j95N0K76m06K0q4K74M3j84L28L8l58L49j38j79J54l09J5J21
7476g2p3K49k91M6J80j29kK84o7j07K69l40Q7J9J37q8j18n5K39l63L36k34j06
7499a99L64m8k98K41r2j24J47j59M38R5j41l15k8J61R6K8j44j60P1K52j74j51
7521a40j14K31J65j29J27J23l20J97q4j35Q3k6l22K90j73L45Ok19J42j17q2K26
7543G4K31k62n46N46j44j71L8K37j04n5K27J92j10l94J62J65j18p4J8R9p7qM95
7566D21m91j08J56N5j01R6o5m3M65n18Q6j01L88l86P2K87k72J00j19N6m9J40j28
7589e9J17k03J50L07k87K24J11m53jj35K12J0R2K21l63j67J37k3J38K5j39j1j
$$ plain form
7430 236 -32 -1 -377 151 178 -216 86 -137 172 -3 -120 -62 123 188 146 6 -50 -215 -164 -20 41 86 45
7453 45 207 161 -43 113 -82 -32 244 -162 -142 -226 48 91 -93 235 273 -85 264 126 -53 101 -208 -193 -72
7476 -72 -145 104 -187 -141 39 -90 -92 192 125 18 287 -53 34 53 190 102 -16 -71 168 -195 141 -93 -199
7499 -199 165 117 -181 60 -32 -156 -9 -168 270 365 224 -91 -119 42 138 166 22 -138 -67 185 11 -140
7521 -140 -254 -23 142 13 140 263 -57 140 56 -79 4 -22 -344 -54 -227 118 124 -95 47 -70 -152 74
7543 74 305 43 -503 43 -101 -272 -234 3 -101 -156 71 263 153 -241 -79 86 -32 -106 -88 11 -66 -74 421
7566 421 -70 -178 -22 33 -68 28 -37 -80 385 -133 -47 -148 240 -146 -74 213 -59 41 -78 -22 -71 69 -59
7589 -59 58 -145 5 312 25 249 360 -93 -94 -229 -17 -7 85 306 -57 -224 -87 -110 28 53 -86 -97 -98
7612i8j1j6P1K48l8j33j18Q7k7J2J30o8J50k41Q3J05k11K37j53K64k90O8r0n9
7636i8j83M7K07j80o9K31L96ml89n3K63n6K1m15N22l50q5R8KJ23k67N34l16m4
7660f5j4j48J56J45rj27r4O1O8J6qJ19j9k56L46k88j80K13J15j21J54k61J34n1
7684a14j23J02j06M03j45J06rk29O4R1k9m6L0o1L13k07N5N9k96M71j97Pl36L70
7708A73k50j38J89L18j72P6r0O2n7q1j47L11j3q4j05q7l8J35K42l30N4Q8%j67
7732a11K18j92K3K3J23l03K72O7J6l35L40Q4Q9m55N1J8K01j71JJ39L4R2l29J5
7756i0j4K81k60j2L65P1l53Ln6O3J22j11j7R2k42J10M1l3pL3j40K95n48L60K39
7781A92o7L91o29J24k5O0Rr6j26K53j0PJ12l01J59M0l31K45J86j19j56J52J7n3
$$ plain form
7612 -98 -109 -125 -54 194 156 23 -95 -8 -35 -23 107 39 189 -52 31 136 -75 162 9 273 -17 51 -39 -98
7636 -98 -281 -234 -27 -207 -276 -45 351 347 -42 -95 168 112 133 -282 240 -110 -195 -97 -95 28 -239 295 -21 -65
7660 -65 -79 -227 -71 74 65 -62 -156 -95 -27 -11 -19 100 81 -175 171 -117 -297 -84 31 -90 64 -197 -63 -114
7684 -114 -237 -135 -241 162 17 123 114 -115 -51 40 11 -35 -5 -66 247 40 95 154 -142 329 132 139 -197 173
7708 173 -77 -215 -26 292 120 196 106 168 111 30 -117 194 181 97 -8 -95 -133 2 244 -86 -32 56 56 -111
7732 -111 107 -85 -62 -39 84 -219 53 120 136 -199 141 225 314 -141 -90 -72 129 -42 -41 98 132 224 -105 -90
7756 -90 -104 177 -83 -95 270 341 -12 -9 -65 -2 120 9 -8 84 -158 -48 -7 -40 -47 -14 -154 141 -407 -47 192
7781 192 125 516 -113 11 -14 46 55 -41 -167 86 76 83 195 -106 53 93 -238 7 193 74 -82 70 87 34
7805C4mj86J59j74P5K93r7l39L89k89j61M57j21j26pM8L23k26k16o2L43J90p2
7828B31n15J63K04j06J26O9j51KL6R6m11K2K92m1K24l28j4j74K97J5J56k39R9
7851E3M9m56M42l14J26L98k58o6J45J02k58J48j96K08k73J69J81nj73j5Q0j70
7873h3k9K8K75l12j16K64J5q2K42R6l04m5K67m64J86J85n8j6k24M06j42J73p2
7896A90l36K05q9k26L85r1m8L61j64m11J22N3n3R0M4j30J57q0J82o6j98R4OR4
7920I1k59J15J45l46K73J4j12J95k49R2K18l50J26M05m6m45K03Q2k9J0k41M09
7942C01l00J44j77k69J31K16j86J78qk64N09l15J95j15r0J94l73m2K09O9j77K20
7964E0l7J57j77o8Q8l55K33J67k08J74J00K42k31j56M30k01l23J43r5O3lJ26k23
$$ plain form
7805 34 30 -156 3 -171 -96 197 100 -239 150 -139 -300 157 36 -90 -97 -49 274 48 -168 -230 113 303 231
7828 231 -284 -121 83 -23 103 172 21 23 59 155 -256 -234 58 17 241 -87 -101 -275 22 37 193 -46 53
7851 53 102 -354 88 -226 -100 298 40 -26 119 221 -37 111 -85 123 -150 19 200 195 22 7 87 -83
7873 -83 -112 -84 191 -121 -237 27 42 -40 202 298 -6 -51 216 -248 -62 123 65 49 -175 231 89 262 190
7896 190 -146 59 -30 -256 129 38 -10 351 187 -224 -102 -49 -102 -12 32 -98 59 -21 161 95 -103 -9 -3 91
7920 91 -168 -53 92 -254 19 33 -79 116 -133 -41 177 -173 -47 358 312 -133 70 152 123 133 -108 301
7942 301 1 145 -32 -301 -170 46 -140 38 30 -234 275 -40 155 40 -50 144 -229 -271 -62 7 -170 50
7964 50 13 170 -7 -75 13 -342 -109 58 -150 24 124 366 135 -21 409 208 -115 28 -67 -4 -7 119 -104
7987a04P4J34J08k34o4J10J58k73l9K84r2kK0Ol7J44n3k6l33J43J65J60l90J89
8011D8O8rK13n96L50M3k48K10k62J39L6L6o9J54J11J30l35o7K74j57Qm04K85j98
8035b40K63k3k38J39R2p1j16J00O1j76K84j63J74J6k40K6M9k37L2K64L9O7L1Q1
8059B14q9k27M8l31M03k0k27L33no2j26p9K49k42j50K24j77J10m3K02r0N9QJ48
8083A30q5q4j66K08r1j87m3L51p8j4l7k70N48j71k51K36K62l11n9L98k30k03L10
8106A63J20j41j02O2k9J5J58j98j53l9K29j75K20k72J76J41j26J02k60l5J03M73
8128D32l06j22k3K94k75nj56J07K09l88M10k26l6q7J14q5n3J90K0J46k47j03N17
8151C27k54j04k5J32j91J71o6L56k25k57L85j86l0o7L3j27K3K1n9J40k7o0k6K85
$$ plain form
7987 -104 -30 104 212 -22 -86 24 182 -91 -130 154 62 60 80 86 49 193 140 114 -219 -76 89 249 -141 48
8011 48 116 107 320 -276 74 117 -131 79 -183 -44 -8 28 -41 113 224 354 19 -48 226 69 77 -327 -42 -240
8035 -240 23 0 -238 -99 -7 -78 -194 -94 -33 -209 75 -88 86 102 -138 -112 -63 -300 -268 -4 35 102 133 214
8059 214 125 -102 -54 -385 18 -2 -229 104 99 37 -89 -168 81 -161 -311 -87 -264 -154 -197 5 -85 -26 -18 130
8083 130 45 -39 -205 3 -88 -275 -318 33 -45 -59 -96 -366 182 11 -240 -4 258 -53 -112 286 56 -147 163
8106 163 283 142 40 102 73 88 246 48 -105 -144 85 -90 130 -142 34 175 49 151 -109 -144 -41 432
8128 432 126 4 -19 275 0 -5 -161 -54 155 -233 177 -49 -85 -172 -58 -143 -196 -6 14 160 -87 -190 327
8151 327 73 -31 -56 76 -115 56 -10 346 121 -136 249 63 33 -34 -1 -128 -105 -84 -143 -3 -30 -90 -116 169
8175A69Q1l34L6j44M14k56P4J07j45j41K73J37j27n9j48R0
$$ plain form
8175 169 250 -84 -48 -192 222 -34 40 147 2 -139 134 271 144 85 -63 27
8191B7
$$ Imaginary data points
##PAGE= N=2
##DATA TABLE= (X++(I..I)), XYDATA
0@%%%%%%%%%qJ6j6J6j6K4l2L6m4N3o1P2q6R9j14J31j49J71j94K19k50K82l17L55
33A87l97M44m97N52o10O79p54Q34r24J023j132J255j391J545j721J921k153K428
51A289k754L151l649M295n167O421q391J1947k0384P4631O8870j64291p8371P3898
65c8505J22789j6106r5325l5110P1978M7394l7252n8432J2938M5765J1200k5235
77F099p233P224r795k1524J6625M7049J2081n5602n0539K6261O7314J2651n0744
90a33l5801K4327L6499n199l2776p549K5948J8170j1285j9309n888K817N962J5693
104A1476J2817j2815l0765j1358K4926K9994k322k6993j4200J1221J2250k606
116A625m543K850Q21l378J126K884o848j1398O434K6034J0432l0278l5929J2137
$$ plain form
0 0 0 0 0 0 0 0 0 0 0 -8 8 -8 8 -8 16 -16 20 -24 29 -32 40 -46 53 -61 70 -79 92 -102 117 -133 149 -168 187
33 187 -210 234 -263 289 -321 358 -396 438 -486 537 -595 660 -731 814 -907 1014 -1139 1289
51 1289 -1465 1686 -1963 2332 -2835 3586 -4805 7142 -13242 61389 130259 -34032 -112403 -38505
65 -38505 84284 68178 -27147 -62257 9721 57115 19863 -38569 -25631 20134 31334 6099
77 6099 -1134 6090 -3705 -25229 -8604 38445 50526 -5076 -55615 -29354 37960 50611 -133
90 -133 -35934 -11607 24892 19693 -13083 -20632 5316 23486 12201 -7108 -12996 -10179 -4217 11476
104 11476 24293 11478 -19287 -30645 -5719 24275 21953 -5040 -19240 -8019 4231 1625
116 1625 -2918 -68 753 -2625 -1499 1385 -5463 -16861 -10427 15607 26039 -4239 -40168 -28031
130b8031M8555J5370l9846l2839K2520L7561j0092m1747q77M8226K0931m6693
142f962m5403K8582N9543j498n7722j9971M7313L6121l4491n1984J6196O2191
154C1915J3785n6300m0422L1108M9919k922l9402j1156K4977J3334j8575j3704
166a7443J6915J9069j2335k0510O421J8786m144j9935K939K6863P564k9571k5557
179c0938J9557L8211M16l4893j5895K2739K1069j2652k0551O181K2333K427k1844
192c840j2548J4232J7183l332j2800q58N877q71n218J356P865L171n209p327m84
207b803L479K439K486K611l682p908r64P264M515n219l612N388M843p999j2523
222a1685M605K0367N682k0849j6993J3219K2809m589k4934m064K5034J5329k1533
$$ plain form
130 -28031 20524 35894 -3952 -36791 -14271 23290 13198 -28549 -29426 18800 39731 -6962
142 -6962 -52365 -23783 35760 34262 -23460 -43431 3882 40003 5512 -46472 -30276 31915
154 31915 45700 -10600 -51022 -19914 30005 27083 -12319 -23475 1502 14836 -3739 -17443
166 -17443 -528 18541 6206 -14304 -7883 10903 6759 -13176 -10237 16626 24190 -5381 -30938
179 -30938 -11381 26830 27246 -7647 -23542 -803 20266 7614 -12937 -6756 15577 18004 -3840
192 -3840 -16388 -2156 15027 11695 -1105 -1963 3914 3043 -2175 -819 7046 10217 5008 -2319 -2803
207 -2803 676 3115 5601 8212 4530 -3378 -4342 2922 7437 2218 -1394 3994 8837 838 -11685
222 -11685 -7080 13287 18969 -1880 -18873 -5654 17155 12566 -12368 -16432 8602 23931 2398
235B398k9184R194L4920R192k8428k2854J3209K3980o06j7783n977J2521O820
248G402r364p588O532O607n818m090P783N777j1798j4116Q746K4175L960k6096
262g888k0160J6658K9147k039k7965r971K1255J7304j2428k2107K555K2266P612
275A4239j6292j3330Q195J1991l307p869L784P859l694j1333j850J3818R729q823
289C117j4490J759J3145M099q329p075M132Q816J257p536o659L106P950M323k862
304D753o664n199K838R412M543o854p982J199P809L238o043n153M313P579j575
319F214q272j925O453L221k198k061J657o73l549j164O144N808m412r468P8R577
335E430L424p941n165O163O973l677j0261k96J0591N939q641q693N005Q749l312
$$ plain form
235 2398 -26786 -17592 17328 26520 -1908 -24762 -11553 12427 11821 -5962 -11939 582 7402
248 7402 -1962 -9550 -3018 3589 -2229 -6319 1464 7241 -4557 -18673 -9927 14248 18208 -7888
262 -7888 -28048 -11390 17757 15718 -12247 -22218 -963 16341 3913 -18194 -15639 6627 14239
275 14239 -2053 -15383 -7188 4803 1496 -6373 -2589 5270 1576 -9757 -11607 2211 11940 3117
289 3117 -11373 -9614 3531 7630 -699 -7774 -3642 5174 6431 -1105 -7764 -4658 3292 7615 4753
304 4753 -1911 -7110 -4272 5140 9683 2829 -5153 -3954 3855 7093 1050 -4103 210 7789 6214
319 6214 -2058 -3983 2470 5691 3493 1432 3089 2416 -1133 -2297 3847 9655 5243 -4225 -4147 5430
335 5430 8854 913 -4252 1911 8884 5207 -5054 -5350 5241 11180 2539 -6154 -1149 7600 4288
350D288r273J240J1005K689j1943r515Q948J4430k318j5923l903J3199Q302r794
364A432j1926M109J4253K271j3066r376P707J2000j408j0185k636O081L486l669
378i27m019K379M789p87n451r73M253J398l601p09K907K053l870l624J518N653
394I89J823m675m466J719M457N28k594j129J162J240l1j711j220J589K709K60
410F50k222k182J20K824J962j603j790R05J754j480k283J595L654N64l677k906
426d115K663M584k26n272q89N512K664n058m810K840P217J331o642n299M765P118
442F383j419p320o55O533K673n309m929L509P024k68o703k896N278M341l437m237
458a432J935M529m61n090j765M685M435l175n489R62N151J073n052k374L732M379
$$ plain form
350 4288 -4985 -3745 7260 9949 -1994 -11509 -2561 11869 9551 -6372 -10275 2924 11226 1432
364 1432 -10494 -6385 7868 10139 -2927 -12303 -4596 7404 5996 -4189 -6825 -744 2742 -927
378 -927 -4946 -2567 2222 1435 -4016 -4989 -736 662 -2939 -3648 -741 1312 -2558 -6182 -4664 989
394 989 2812 -1863 -6329 -4610 -153 375 -2219 -3348 -2186 -946 -977 -2688 -3908 -2319 390 650
410 650 -1572 -3754 -3634 -810 1152 -451 -2241 -1336 418 -1062 -3345 -1750 1904 2468 -1209 -4115
426 -4115 -1452 3132 2906 -2366 -3255 2257 4921 -137 -4947 -2107 5110 6441 -201 -5500 -735 6383
442 6383 4964 -2356 -3011 3522 6195 886 -4043 -534 6490 6222 -481 -3377 1901 6242 2805 -1432
458 -1432 503 5032 4571 -519 -2284 2401 6836 3661 -1828 -866 4285 5358 306 -2068 1664 6043
474F043k224n423j509N240M091l735m849J084L869k2k258j206J752J917j770k781
490a781K59K915M14k863o62J974J875j992l354P6M230K907l802n735O56N965K850
507C932l675n378k08N571L427m388n653J435N724J931l821l927L35L994K367k154
523d88k647l39J607J26K42R93j70k132r47J601K446N89l700k593L337M983j565
540A343n466j916M639N000j334n626k186L903M750j634l613n10K485J082j082
555a65p32P53J213o66j987J227K300o4k343j667L269K345r37l899q82K994L587
572D346p79m228j355K777K486n89o87j313J17O57Q06K81n2r11j575M74K886R93
590D334k586l201M34L865L463k664o360j066N604N567k095o940l339M348O730
$$ plain form
474 6043 3819 -1604 -3113 2127 6218 2483 -2366 -1282 2587 2565 307 -899 853 2770 1000 -1781
490 -1781 -1522 1393 1807 -1056 -1718 256 2131 139 -3215 -3139 1091 3998 196 -5539 -4883 1082 3932
507 3932 257 -5121 -5329 242 3669 -719 -6372 -4937 787 2718 -1103 -5030 -4695 -701 1666 -488
523 -488 -3135 -3474 -1867 -1741 -1499 -506 -676 -2808 -3755 -2154 292 881 -2819 -5412 -2075 2908 1343
540 1343 -4123 -6039 -1400 3600 2266 -3360 -5546 -1643 3107 1473 -2140 -2650 -165 917 -165
555 -165 -897 -144 1069 403 -1584 -357 1943 1879 -464 -2131 1138 3483 2546 -1353 -2235 759 4346
572 4346 3567 -661 -2016 761 3247 2658 1971 658 775 1432 2238 2519 2467 1556 -19 455 3341 4334
590 4334 1748 -1453 -1019 2846 6309 3645 -2715 -3781 1823 7390 5295 -1645 -4984 -636 6094
605F094P41o750n605L012P240K258n033o513K08O662M452l383o673j672M007N485
621D530L12n007n100J253M972M158k615n543k566L251O131O15o452m632K714O117
637B138K493m633o105k85O786M129k939o205k084M765M398L47n105l633K229M076
653C72J240k570k799o37L181K533r04l115j140J699J965O16j263j947n01J962
669a308J451M37j390j322l64J684K136j218k251K88J427J003r38o37K93J407k40
686D58j475j11K509J340l280k380K345M618L54n679l911L827P784J31q029m638
702f137M599P823P59p063n432L411P350J436n444m407J184M871K311j529m037
717c05k087K144L981J363k014m444j885L957N550o82o365l616L341O473J465n353
$$ plain form
605 6094 6835 85 -5520 -2508 4732 6990 1957 -4556 -4348 2314 6766 3383 -3290 -4962 -955 4530
621 4530 4842 -165 -5265 -4012 960 5118 2503 -3040 -5606 -2355 3776 4391 -2061 -6693 -3979 2138
637 2138 4631 -2 -6107 -6392 394 4523 1584 -4621 -6705 -1940 2458 2805 -2300 -5933 -3704 372
653 372 1612 -958 -3757 -4394 -1213 1320 416 -2699 -3839 -2140 -175 441 -822 -2769 -3270 -1308
669 -1308 143 580 -810 -2132 -2496 -812 1324 106 -2145 -1857 -430 573 -365 -1002 -709 698 458
686 458 -1017 -1128 1381 2721 -559 -2939 -594 4024 4378 -1301 -5212 -1385 6399 6530 -1499 -6137
702 -6137 -1538 6285 7044 -19 -5451 -2040 5310 6746 1302 -3105 -1921 2950 5261 3732 -305
717 -305 -2392 -248 3733 5096 3082 -1362 -3247 710 6260 5578 -787 -4403 -1062 5411 6876 1523
733A523o665J781P441L378n227o168o15N831M979j866o651k705M005N385K47n023
749c50l525J174M578J860k874l404l00K349K014K8j846k439j36K475K404p05l487
766b184k527K233M622Q60n385k891K844M744n99m444k296L331L795j413m610j71
782d091M244J828l941k756K551M096o45n019j636M725M126k774n577P7M997K893
798C098k498m130o08L433K628j078k463o17N77J614J492q56j986j607K109K753
814A861O05k433l158P49M114K270k584l859l13L484L101n45l666k990K486M314
830C436J108l330l466l6M262L545k260n268j279M754L511r81m362k365K718L522
846C509O63l065k228N10J890K224k73k379k403Q79L345K049k204m803m10M846
$$ plain form
733 1523 -5142 -3361 4080 7458 2231 -3937 -4552 1279 6258 4392 -2259 -4964 -959 4426 4673 -350
749 -350 -3875 -2701 1877 3737 863 -2541 -2841 -492 1522 1550 -296 -2735 -2871 -396 2008 1303 -2184
766 -2184 -4711 -2478 2144 3004 -2381 -5272 -2428 2316 1717 -2727 -5023 -1692 2103 690 -3920 -4091
782 -4091 153 1981 -1960 -4716 -2165 1931 1286 -3733 -5369 -644 3482 708 -4869 -4792 205 3098
798 3098 600 -3530 -4138 -705 1923 845 -1618 -2235 -1658 -44 1448 592 -1394 -3001 -892 1861
814 1861 2466 33 -3125 -2376 1738 4008 1424 -2435 -2748 736 3837 3292 -374 -3364 -878 3436
830 3436 4544 1214 -2252 -2288 1974 5519 3259 -2009 -3288 1466 4977 3996 -366 -2731 -13 3509
846 3509 4172 1107 -1121 -611 1279 3503 3230 851 -1552 -673 2672 4721 2517 -2286 -2696 2150
862B150L624k722n722q65N231L926k823n450n42M152L469k683l850L96L214O32
878B137j533j785M18J339L16r63l96N31K9j066P5J420k63r69n12K33M04O55n44
897d74j181O5R36L79l95m93p31N03P83L98j190o61O14N92K83o07m40j84P22M28
917f53m16l84P69k62m33R8P07j22o30k77N09R42j41j054m83J789N27j257q67M86
937a152J175M84j071l53O57J271q74j376J106J015p5j471pJ229J011p27j649K65
955e42K069O08k124j084J966J389n18j917k73J511J714j041k218J02K177M49j506
972G62p46M47J244O73j280j048L25J580Jj056n6j77M42Q21o83n31l57M63J93j
992A016J0m15l07M38L35k86l06o4k23K83L70q7j032k0O82M08n01m97k33M85M31
$$ plain form
862 2150 5774 3052 -2670 -3535 1696 5622 2799 -2651 -3193 959 4428 1745 -2105 -1709 1505 2137
878 2137 604 -1181 -763 576 892 -71 -467 64 93 -973 -898 522 259 -710 -1222 -989 -585 70 -474
897 -474 -1655 -1590 -654 -275 -670 -1163 -1894 -1391 -608 -210 -1400 -2061 -1447 -855 -572 -1179 -1619 -1803 -1081 -653
917 -653 -1069 -1453 -684 -946 -1379 -1281 -574 -696 -1326 -1603 -1094 -152 -293 -1347 -1830 -41 486 -771 -1638 -1152
937 -1152 23 507 -564 -917 -260 1011 137 -1239 -133 882 807 -664 -671 558 1569 842 -807 -542
955 -542 1527 2135 11 -1073 893 2282 1764 -153 -426 1085 2799 1758 -460 -358 1819 2268 762
972 762 16 463 1707 2380 1100 52 377 1957 1958 902 846 669 1111 1932 1249 718 361 824 1017 1016
992 1016 1026 611 304 742 1077 791 485 421 198 481 851 764 -268 -288 394 802 301 -196 -429 56 487
1013D87n04p58QP39l65n01L42L14J27q68j87K90R07o0j324l51J144P15n55j226
1033a626RQ03J159q32j587K69J612K82j322q52N97J053On38m00K83Q14n68p16
1052a554L84Q53m56q29L76Q04M09q43m47K96J027M43j256m25L46J240j86q69j04
1071g91M17Q07O8p36k76O84j2J61K0q9k01O4M29M9m9q9m36M69O52j0r73j80Q95
1094H73N71M4j080l29O44J042k56q48o15Q98O57N1j011o64O42J084J41j256n45
1113D3P17R13j98q49o34O99O02l5q14n11R55L07m74m76J47K90k92j54%N58q5j077
1135c68j04J030O29j095o01j37P92M10o65r44K38J310k2j382r9O84J49l49j42
1154f66k0L20k89o14K35M92M10j104l23P61O46k20n95n55N30Q11k53q31j88Q29
$$ plain form
1013 487 -17 -775 -767 -28 -393 -894 -552 -238 -111 -979 -1166 -876 31 -29 -1353 -1704 -560 155 -400 -1626
1033 -1626 -1617 -814 345 -487 -2074 -1805 -193 89 -1233 -2085 -1488 -435 -429 -967 -1367 -1084 -270 -838 -1554
1052 -1554 -1170 -317 -773 -1602 -1226 -422 -13 -856 -1303 -1007 20 463 -793 -1218 -872 368 182 -687 -791
1071 -791 -374 433 501 -235 -511 173 161 322 342 253 52 116 545 594 545 456 20 489 1141 1131 158 -22 873
1094 873 1444 1488 408 79 723 1765 1509 661 46 944 1601 1652 641 -23 619 1703 1844 588 43
1113 43 760 1673 1475 626 -8 691 1293 1258 444 -67 888 1195 721 245 392 682 390 236 236 794 709 -368
1135 -368 -472 558 1187 92 -509 -646 146 556 -109 -1053 -815 495 473 -909 -1008 -324 -175 -524 -666
1154 -666 -686 -366 -655 -1269 -1034 -542 -132 -1236 -1559 -798 -152 -372 -967 -1522 -992 -181 -434 -1265 -1453 -624
1174f24p3j20K4K16k99n51L76O56j15Nj129O01Q42K41j008m33P96J82Q58p44o70
1195i69O2J81Q31N4m44m34P2J024O73n61j128M28P29M51o52l30l53Q74N74n18
1215E64n19N66K3j90K3O61l83m40l42P36Q53j56j319p70J940J251j303j498L43
1234D0J374J69j075o53P14J271o51j099J79J386j06j698p5J441Q26j321j102l53
1252g33K392P82k016j908J424K131m74k139m83J281Q10n31o74J81N56p05p35Q15
1270b6Q73n16j837J31J679J015r73k199k94K282J437j526k095P8J839J026p66
1287A28j628n54J358J041j12j266q27M31J085J048o77j607k72J047J097n27j112
1304a347ppP44K17k52Om98m37P11J418k25k485n0K017J821j137k542p23K920K314
$$ plain form
1174 -624 -697 -817 -793 -577 -876 -1427 -1051 -395 -510 -505 -1634 -1033 -191 50 -958 -1391 -595 -413 445 -299 -969
1195 -969 -907 -726 105 159 -285 -719 -647 377 1050 489 -639 -211 518 969 317 -13 -366 508 1082 564
1215 564 45 611 634 444 467 1128 745 305 -37 699 1552 1396 77 -693 1247 2498 1195 -303 40
1234 40 1414 1583 508 -145 569 1840 1189 90 269 1655 1549 -149 -224 1217 2043 722 -380 -733
1252 -733 1659 2441 425 -1483 -59 2072 1598 -541 -1024 257 1067 536 -138 43 599 -106 -841 -26
1270 -26 847 331 -1506 -1375 304 1319 346 -1853 -2147 135 1572 46 -2049 -1971 -132 894 128
1287 128 -1500 -2054 -696 345 233 -1033 -1860 -1429 -344 704 27 -1580 -1852 -805 292 -235 -1347
1304 -1347 -1354 -1361 -617 -400 -652 -646 -1144 -1581 -870 548 323 -2162 -2212 -195 1626 489 -2053 -2776 144 2458
1324B458k204l054L71L673L94j868k022J636J913l61k279M91K161Q13k492j145
1340a515K080K102j654k320K9K970J051k560k031J677K989n55k764n55K062J379
1356B385j208j661N98J816j48j908k14J835R46j906j351J066J976K47k372j422
1372a321J578K426o35k544l47J447J125l93q26o60L7J121L93o67r72j81N67J017
1390A165M2j172o86O48N78j15m30q5o9l52j83Q75M78q29j397J63K408P94k952
1409a119k116K139K769k44k859j795K219L229j013l826m00L033J854k383k214
1424b726J208K066o0k223m60K023J029j936j570J696K082q41k638Q0K756P81k242
1441i75j914J308L056m19l060l63K491J147j386j689P54J810N3j850o34J970O99
$$ plain form
1324 2458 254 -2800 -2429 1244 1638 -230 -2252 -616 1297 936 -1343 -852 1309 2122 -370 -1515
1340 -1515 565 2667 1013 -1307 -1278 1692 2743 183 -1848 -171 2818 2263 -501 -1056 1006 2385
1356 2385 1177 -484 114 1930 1782 -126 -340 1495 2441 535 -816 250 2226 2473 101 -1321
1372 -1321 257 2683 2048 -496 -843 604 1729 1336 510 -150 -113 1008 1401 734 -238 -419 148 1165
1390 1165 1207 35 -651 -3 575 460 30 -55 -124 -476 -659 216 694 -135 -1532 -1369 1039 1833 -1119
1409 -1119 -3235 -1096 1673 1429 -1430 -3225 -1006 2223 1210 -2616 -3016 17 1871 -512 -2726
1424 -2726 -1518 548 488 -1735 -2195 -172 857 -1079 -2649 -953 1129 288 -2350 -2270 486 1267 -975
1441 -975 -2889 -1581 1475 1056 -2004 -2367 124 1271 -115 -1804 -1050 760 813 -1037 -1671 299 998
1458I98q75j706J021J548k98j069l10Q55O13l57r85N10O96j73q04L86R27n03k44
1477B30j28R37k7p42l54M60Q58m72p90L67P16k87l11Q0M65m08o18L09J265J25
1497A675j176j039Q64K115p05k495k55K129J422j652j711L28K084N07k485q44
1513a238J482J631j208j636N58J427n6j415l68J449O62j317j459J069J852o74
1529G59k319M8K154P48j903j189O73K089m05k150m07J906R54j502r32N08J279
1546C11m10j648L32J370M76j449q85J146J278j001j206O21J383k45j296m58J196
1563d85Q33n75j379P06J563p23j240J44P62O71r61o13P60P50k58o32j41R61L7
1582A80q57j50R93N85p05j141J088O19k37j075k24J319P01j259o60P07J150n66
$$ plain form
1458 998 123 -1583 -562 986 688 -381 -691 164 777 420 -565 -55 641 468 -336 50 977 474 230
1477 230 102 1039 1012 270 -84 376 1234 762 -28 339 1055 768 457 537 1002 594 -24 285 1550 1675
1497 1675 499 -540 324 2439 1734 -761 -1016 1113 2535 883 -828 -500 1584 2091 -394 -1238
1513 -1238 244 1875 667 -969 -411 1016 960 -455 -823 626 1288 -29 -1488 -419 1433 759
1529 759 -1560 -1512 642 1390 -513 -1702 -1029 1060 655 -1495 -1902 4 958 -544 -1476 -968 311
1546 311 -99 -1747 -1415 -45 431 -1018 -1903 -757 521 -480 -1686 -1065 318 73 -1223 -1681 -485
1563 -485 348 -227 -1606 -900 663 -60 -1300 -1156 -394 277 -684 -1297 -537 213 -45 -677 -818 143 180
1582 180 -677 -827 166 751 46 -1095 -7 612 375 -700 -924 395 1096 -163 -823 -116 1034 468
1600D68j078L40R31J29r39j29O41J243j176r07Q39J069l90j093k54J458M41o91
1618I02j303O23J313k85j455j8J267N77j260p92J048J208p79j336J54J296L99
1635A559j419j000J424J127j017j080%J464M4r10p58N34J286r85j039P58J022
1652A010k70p15j017J204R53j004j228L92J260q5r64o04J050N01q82m91L03Q01
1670B14n34m86l08R60J94p16o68J032P65p99j025M64P76o7o97l32O78O89n88r67
1690a415O68R67m36j004L85P67p3l89q18O27R59l99q32J17P89M18j173j35N91
1709c86O10j86o38L86N40L67j369j30J277L47j007o44Q76Q91m30r46J10N97R57
1728A222r97j023P33J066j6j230K28J029K7j047J37L76N54l67o18J43J135l02
$$ plain form
1600 468 -610 -270 661 790 -149 -278 363 1606 430 -477 362 1431 1041 -52 -306 1152 1593 902
1618 902 -401 222 1535 1250 -205 -223 1044 1621 361 -431 617 1825 1046 -290 -136 1160 1559
1635 1559 140 -860 564 1691 674 -406 -406 1058 1102 192 -566 -32 1254 269 -770 -12 1010
1652 1010 740 25 -992 212 1165 161 -1067 -675 585 500 -464 -1068 -18 483 -399 -890 -587 214
1670 214 -320 -806 -1114 -154 40 -676 -1344 -312 453 -346 -1371 -907 -131 -198 -895 -1227 -549 140 -448 -1415
1690 -1415 -747 220 -216 -1220 -835 -68 -141 -530 -1348 -721 238 -161 -993 -876 -87 331 -842 -977 -386
1709 -386 224 38 -600 -214 326 693 -676 -806 471 818 -189 -833 43 934 504 -442 -332 265 1222
1728 1222 225 -798 -65 1001 985 -245 -17 1012 1039 -8 129 505 1059 692 74 217 1352 1050
1746A050p51k58Q36N00p33n82J59P91R1j156J42L84Q24r99l90K90Q46k85o22j09
1766B8J002L9o27p33L92Q53j74j084K41O04L14l35q21N81M0J85r26J15J011j5
1786F90r54l36O79J94m27l32N9O51j93o27p4N96K40o60m65O23M12n49m14L48K75
1807b64l8o36k02R11K74m11o10N32M59l43o66K35L91K21n61l05K95O67l16m15
1827g82j14Q06Mm10l82K57N10k09r6j20P49J91p92l20P02Q46r01p68L14O73R6
1848B54m82K8p9R64l92o57o0P58J47l27r1J63L15o6m52K33N62k64p7j38L0K40
1870F09k28m1J12K47l9o9m59L09L41l56k4J43q4j27Q3J60k34%R0j85J77N6k97
1893A84J3O29l00j51m40L64M35k69M9n57K26K50j37k13r8M58n21M7J60N9l1J01
$$ plain form
1746 1050 299 41 877 1377 644 62 221 1012 1103 -53 89 473 1297 298 -92 198 1044 759 137 28
1766 28 1030 1069 442 -291 101 954 780 -304 -63 541 855 520 -301 280 320 505 -421 -306 705 690
1786 690 -264 -600 79 273 -154 -486 -427 224 31 -596 -670 -74 166 -494 -959 -336 76 -473 -887 -539 -264
1807 -264 -302 -938 -1140 -229 45 -366 -976 -444 15 -328 -994 -759 -368 -147 -708 -1013 -718 -51 -367 -782
1827 -782 -896 -90 -86 -496 -878 -621 -111 -320 -416 -536 213 404 -388 -708 -6 840 -61 -829 -515 158 254
1848 254 -228 -200 -279 685 293 -364 -424 334 481 154 63 226 541 475 23 256 818 554 477 339 369 609
1870 609 381 340 452 699 660 591 132 441 782 426 402 545 461 334 417 577 343 343 433 248 425 481 184
1893 184 197 826 526 375 -65 299 734 465 514 -43 183 433 296 83 -15 443 -78 -31 129 188 157 258
1915B58n37j40N69j88k52j11n4O43m46k18L83J25j83j26Rl60k5K02j22JK55j58
1937d75m4j89J05J09J3j38rJ89N5l04j99K20J49K03J28m86J25J44L64j57n91J79
1959f09L08J92J20m47l0L42K49n37J76R8J23J2L30m04j34J57J8k54J1J96J32k86
1981b37K41K27n3M48o49P4K19K28k25k47n8M43J89k34k63J1L92J53m86K0K61J67
2003F21n1k77n8N36p3k94k66O6N51j21k73o0K53j94J60j78l0L7K11J65p80J22
2025F7N48M4n28j33J72L80l37k59k60Q09j95j29m10J82L99On62p4M20K27l55n11
2047d99P6O33k72l77j79J34L46Q6k33j89Q9J47J16k95J50q6J64l74o4J13q5L88
2069b11k37k15L06J34k0l11j8L83k33J52l28q7N55N8k12n53M01N52m09l64MK18
$$ plain form
1915 258 -279 -419 150 -38 -290 -401 -455 188 -258 -476 -93 32 -151 -277 -268 -628 -653 -451 -573 -572 -317 -475
1937 -475 -519 -708 -603 -494 -481 -619 -628 -439 -384 -688 -887 -667 -518 -315 -187 -673 -548 -404 -40 -197 -788 -609
1959 -609 -301 -109 11 -436 -466 -124 125 -412 -236 -138 -15 -3 327 -77 -211 -54 -36 -290 -279 -83 49 -237
1981 -237 4 231 178 626 -23 51 270 498 273 26 -32 411 600 366 103 114 506 659 173 193 454 621
2003 621 570 293 235 771 698 404 138 204 755 634 361 301 554 360 520 342 312 349 560 725 -55 67
2025 67 615 659 131 -2 170 550 213 -46 -306 503 308 179 -231 -49 350 356 -206 -280 140 367 12 -499
2047 -499 -423 210 -62 -439 -618 -484 -138 -52 -285 -474 -385 -238 -122 -417 -267 -353 -189 -563 -627 -514 -599 -211
2069 -211 -448 -663 -357 -223 -243 -554 -572 -189 -422 -270 -598 -685 -130 -72 -284 -837 -436 116 -293 -657 -653 -435
2091d35M62k59j99l72Q27P8j81m20J24M68R1m25l97O05L02k56k11K34M44k66j60
2112E4l41L21N66l9p68Q9O82K2l58k49M98O0R4n86OR6L68J88o87K46N49m04j69
2135B38k38L03K53Lj00l81L92K12l80j32j4M85j92j02l06M85j12Pk17J12J61r6
2157C81j23m5j18j45J40Q4k09L42PJ45k82J11k49j40J13o6JK33o3l9l43J42J20
2180cO2n3n42K79j10N86k11m81o7O13n21k0JL99m1j36l30J08K85j15l72J93R6
2203c80K60m06O6J96L96j82l25m10O05J74m75j35J12N07j16l59K8N48j07l50J15
2224b38j58Q08m63k92j22M31J70j38n8j81M15L8j60k24J26P4j16J10J72K27n5
2245C66k37K90m92M49j73Q8k65M34k41o5L73m14N9J9K42K77m09L3R3N8J38k24
$$ plain form
2091 -435 27 -232 -431 -803 24 102 -79 -499 -375 93 184 -241 -638 -33 269 13 -198 36 480 214 54
2112 54 -287 34 600 561 -207 -118 564 586 228 -21 477 537 631 45 51 147 515 703 16 262 811 407 238
2135 238 0 303 556 559 459 78 470 682 302 170 156 641 449 347 41 526 414 421 204 316 477 381
2157 381 258 213 95 -50 90 174 -35 307 314 459 177 288 39 -101 12 -54 -53 180 117 78 -265 -123 -3
2180 -3 59 6 -536 -257 -367 219 8 -473 -540 73 -448 -468 -467 -68 -109 -245 -575 -467 -182 -297 -669 -476 -380
2203 -380 -120 -526 -460 -264 132 -50 -375 -785 -180 -6 -481 -616 -504 3 -113 -472 -444 104 -3 -353 -238
2224 -238 -396 412 -51 -343 -465 -34 136 -2 -60 -241 174 212 52 -172 -46 28 -88 22 194 421 366
2245 366 129 419 -73 376 203 291 26 460 219 154 527 113 172 191 433 710 301 334 427 485 623 399
2267C99Q2j20J72j93J10m7j1j14N46m41P4J79j33l00L9K65J5k13k09J83L49l82
2289B50k81K83n4K19m70l73O99K56l78k01k29L10J08J85m34k83M33j64m21K34
2309c11J72J50l62M1J92K16m68j16L2L14j88O3j95L32J26l69j61n0M51j62k80
2330e73J26Q7K38m36J9K46N7k93j07N66k67J81j55K26k53j02J11K74l57J49J56
2351a07l25L22M1p8K04m02M59k10m0j29j28M22q8l35L55K73J21R3j83l26K38J60
2373C37p8l02J49L65q5l61J63J87L7k06o1K42r6J79j96j14L06R2o67M13J19m8
2395C75R4k54O4N1J24j08l76K72J91j77J00Q2l35R7K02l6l41N58l05j89L25k18
2417A96m4Nn4n1m8m5L72l11J51l14K17J82k09j71OJ3q4P6j10M79m23L82j27l58
$$ plain form
2267 399 481 361 533 340 450 403 392 278 824 383 457 636 503 203 242 507 522 309 100 283 632 250
2289 250 -31 252 198 417 -53 -426 273 529 151 -50 -279 31 139 324 -110 -393 40 -124 -545 -311
2309 -311 -139 11 -351 -310 -118 98 -370 -486 -454 -140 -328 -265 -460 -128 -2 -371 -532 -582 -131 -293 -573
2330 -573 -447 -360 -122 -558 -539 -293 -236 -529 -636 -70 -337 -156 -311 -85 -338 -440 -329 -55 -412 -263 -107
2351 -107 -432 -110 -69 -147 57 -345 114 -96 -136 -265 -393 29 -59 -394 -39 234 355 448 265 -61 177 337
2373 337 259 -43 106 471 386 25 188 375 412 206 145 387 291 470 274 160 466 558 -109 304 423 375
2395 375 469 215 279 330 454 346 -30 242 433 256 356 438 103 200 402 366 25 583 278 89 414 196
2417 196 152 157 103 52 4 -41 331 20 171 -143 74 256 47 -124 -118 -105 -189 -113 -223 256 -167 215 88 -270
2441b70j01J42j02k7k48J0M74k32J89k49K03J23k48r7K43j13L5j54j5M35l44k62
2463f08K96k08Q5K70k51J16K3J30k75k81M88nQ1j80j76M10r4K8l22N41k37K21
2485E2j95k7Q1k34L22J25j97j71L79O9j19n6n8J64k06L26j72J74M4l7l15K35J04
2508B88k45P3Op1L39j73R2O8r0j95J24J9j39J34J76K28l58l27K98K30l06J11p5
2531B07M13m61L0j67J32Q2N32o68L0L9K46qm05L15l0o6j96o6J68L32l07N2l38
2554a34N5K31j87j4j71M41l4m27L66m5K35m31q4O0J93k60K31l07l26N12K6k04
2576b74J95r6J67k04M4l28M19j63JJ93l42N13k70q7j44J62J8j22J48m47K09lM6
2599c65P0j0J8J61K23n95J46K83o4M7l23J61K41K7o1o3J76j97J28j94k24M82j07
$$ plain form
2441 -270 -371 -229 -331 -358 -606 -596 -122 -354 -165 -414 -211 -88 -336 -433 -190 -303 -268 -422 -437 -2 -346 -608
2463 -608 -312 -520 -435 -165 -416 -300 -277 -147 -422 -703 -215 -220 -139 -319 -495 -85 -179 -151 -473 68 -169 52
2485 52 -143 -170 -89 -323 -1 124 -73 -244 135 204 85 29 -29 135 -71 255 83 257 301 264 -51 184 288
2508 288 43 116 122 51 390 217 309 377 287 92 216 235 96 230 406 634 276 -51 247 477 171 282 207
2531 207 620 159 189 22 154 236 768 100 130 169 415 407 2 317 287 221 25 -41 127 459 152 204 -134
2554 -134 -79 152 -35 -49 -220 221 187 -240 126 81 316 -115 -199 -139 54 -206 25 -282 -608 -96 -70 -274
2576 -274 -79 -175 -8 -212 -168 -496 -77 -240 -239 -46 -388 125 -145 -232 -376 -214 -196 -318 -170 -617 -408 -411 -365
2599 -365 -295 -305 -287 -126 97 -498 -352 -69 -133 -86 -409 -248 -7 20 -41 -104 72 -125 3 -191 -415 67 -40
2622d0j51J31j35L44N0j52j04K65j9O3m24K32M79j99P7o26M77Q8k0j77j37L10
2644C32j22M5R5J0J80k99j85p7R8o5M32k99q7N26q2m64K15l8L13k02j91j5M56
2667E76l69Kk31j7L81r4o7k83L08J43k01j09l12J34L25j34j03j78M25j29qj26
2689f7Jj21K29q1k03J82o8N08m53Ol27M65m88%J08J02P0j58J79r8k05N62m65J62
2713a60o6PK56l72r7J56P7K21m24m8L63L5j05k83K22j56K46j34o3J90L6J57m18
2736c60J67J89k61K11l89L83j06L27k56J5J39KOm37L24p2K34j03j14n4J18K45
2758B08k25M11k76p5n9N7Q4J37K07j64j94r7K93J5j15J90M5l35L35j54n3J22q5
2781B72J32J59O7l95k99K95J33k90J20L6R9l32J95J37J36o30K00K12K32l44n0
$$ plain form
2622 -40 -191 -60 -195 149 199 47 -57 208 189 252 -172 60 539 340 417 -209 268 356 336 159 22 332
2644 332 210 255 350 360 540 241 56 -21 77 12 444 145 58 584 502 38 253 215 528 326 135 120 576
2667 576 207 209 -22 -39 342 248 181 -102 206 349 148 39 -273 -139 186 52 -51 -229 196 67 59 -67
2689 -67 -66 -187 42 -39 -242 -60 -128 380 -73 -67 -394 71 -417 -417 -309 -207 -137 -295 -116 -214 -419 143 -322 -160
2713 -160 -226 -219 37 -335 -432 -276 -199 22 -402 -450 -87 -52 -157 -440 -218 -374 -128 -262 -325 -135 -99 58 -360
2736 -360 -193 -4 -265 -54 -443 -60 -166 161 -95 -80 59 61 67 -370 -46 -118 116 13 -101 -155 -37 208
2758 208 -17 394 118 43 -16 41 125 262 469 305 111 14 307 322 207 397 442 107 442 288 235 357 272
2781 272 404 563 630 235 -64 231 364 74 194 230 329 -3 192 329 465 -165 35 247 479 135 85
2802H5j84M73Kl16p3oR4k29l79O64R4k05j38j77M70J66l65j71N5J65k21j6K57
2825D5q3N6q8l06K70O4k38j78N6K85K5M4l71J39K89J54m71k10J01M85k64j08J21
2848a83j73K02m30M82O5k32m2J7o8L72p0k43J83J62k10m6l6LJ26J55k85J52K85
2871A86k8m89O8M74l4q9j93K04j28J53k32Q1M9O4p5o4K46J58n21J30r9N11o9k67
2895C6k61M19J36l39R3J85K05m52rJ97q9M7k26P6L19L3j26l05K65O4J95k31j18
2918A14L9J06L7j05K70j1l27j25j1L63l09K10L6j51K71k91j45k37M31J3n05L87
2940F0q3L36m34k43J50K81k54K14J64k53Km1RM08ol64Q4k76L19J72l56k85k17
2963f13M25j44R4k45O19j93l08j27J82K18L2l39R9K71L0o36L62Q6K66j41l62K22
$$ plain form
2802 85 -99 374 376 60 -13 -19 75 -154 -533 131 225 20 -118 -295 175 341 -24 -195 -140 25 -196 -212 45
2825 45 -38 18 -70 -376 -106 -42 -280 -458 -402 -117 -92 -48 -419 -280 9 163 -308 -518 -417 68 -196 -304 -183
2848 -183 -356 -154 -584 -102 -37 -269 -311 -294 -362 10 -60 -303 -120 42 -168 -214 -250 -247 -121 34 -251 -99 186
2871 186 158 -331 -263 211 177 88 -105 99 -29 124 -108 -27 22 86 11 -53 193 351 -170 -40 -139 372 303 36
2895 36 -225 194 330 -9 84 269 474 22 13 210 121 168 -58 18 337 370 244 -61 204 268 463 232 114
2918 114 153 259 296 191 461 450 123 -2 -13 350 41 251 287 136 407 116 -29 -266 165 178 -327 60
2940 60 -23 313 -121 -364 -214 67 -187 27 191 -62 -60 -101 -92 316 310 -54 30 -246 73 245 -111 -396 -613
2963 -613 -188 -332 -238 -483 136 -57 -365 -492 -310 -92 -60 -399 -300 -29 1 -635 -273 -187 79 -62 -424 -202
2985b02q3L17l85q5R7J54j44m5R1Q0L97n48K84J00O0k94m1J20K30R0o61K33L98
3008A63j57L8k29J92P9J5R4m0J66l16J54l83M38r5k5J60L1j14l07L99p4N05p27
3031c3K17Nn5J60m28J73K59J45Jm47j45L49J94k01j2M3Oj8j61k90M87l3l99P5
3055a08q2K86J68l12j10K13J76j83l62M98q3k81J53J22j6K67o69K77m8N48m20
3076C4j02m7K44J79l68J87l96L3j83L56r3O8k98j46K73K63K2k3j60J21R2J4n29
3099d59n7M36r0L4j15K0K31l43J60K23k50l0j82R8J48K99l49j7K25L41l17k88
3121b82K10P2k91K45j88l0K94N6n08J32O60k97j12k13M41O8k92p5j15J90J55o2
3143E8J00K51k38j20k00J02L61j76L00n35N3L86k30j28l7J06j39Q8J01J41J57
$$ plain form
2985 -202 -285 32 -353 -438 -341 -187 -331 -376 -285 -205 192 -356 -72 28 88 -206 -247 -127 103 193 -468 -235 163
3008 163 6 44 -185 7 86 101 195 155 321 5 159 -224 214 119 94 254 285 171 -136 263 189 694 -33
3031 -33 184 189 134 294 -134 39 298 443 444 -3 -148 201 395 194 182 225 231 213 52 -238 249 216 -183 -108
3055 -108 -190 96 264 -48 -158 55 231 48 -314 184 101 -180 -27 95 79 346 -323 -46 -94 454 34
3076 34 -68 -115 129 308 -60 127 -269 -236 -419 -63 -156 -88 -386 -532 -259 4 26 3 -157 -36 56 70 -459
3099 -459 -516 -80 -170 -136 -251 -231 0 -343 -183 40 -210 -240 -422 -324 -176 123 -226 -243 -18 323 6 -282
3121 -282 -72 0 -291 -46 -234 -264 30 86 -422 -290 370 73 -39 -252 189 257 -35 -110 -225 -35 120 58
3143 58 158 409 171 51 -149 -47 314 138 438 -97 -44 342 112 -16 -53 53 -86 2 103 244 401
3164D01k48l3K20R3L9k56j79K49L2l28P9K17j09K0k91J59L0j24k4p1M83j76j72
3187A1o0J46K05m26J11J59J13M9l86k98N21J32l37K7K6L16m65MM7J40Lo6j04q2
3211b14L54m11J24k26K87k32K12j3j36J20O07p19k44P2L20m64N47q3j09N6N1j22
3233b23r7J71%o5J63j64J51q9j01j17P5L07J75k71k1j41J85P7J85k05l79K36P1
3256g7j0m26M95P2j34J70j33Q4L0J83k39j44J86P3Q2k24K34l2j38l1P7k5pP4l0
3281A10J1k7k03qK38N0K04j12m44J87K32k7k46j92K82K62j11m8j29m2MN5Q5J91
3305C22j1m64K5M76q0k75j58N29n01M56p6l18R6J67l0j94J47K12m61jL61k99J28
3328E1K27n6j86j9j73K67j11j42R1j17J98Mm87K70J78k00Q1k6m9J71m6k97J84
$$ plain form
3164 401 153 120 340 433 472 216 37 286 318 -10 69 286 177 197 -94 65 95 -29 -53 -124 359 183 11
3187 11 -49 97 302 -124 -13 146 259 308 -78 -376 145 277 -60 -33 -7 309 -156 -152 -105 35 38 -28 -132 -214
3211 -214 140 -271 -147 -373 -86 -318 -106 -119 -255 -135 472 -247 -491 -419 -99 -563 -16 -99 -208 -152 -101 -223
3233 -223 -320 -149 -149 -214 -51 -215 -64 -153 -254 -371 -296 11 186 -85 -106 -247 -62 15 200 -5 -384 -148 -77
3256 -77 -87 -513 -18 54 -80 90 -43 41 71 254 15 -129 57 130 212 -12 222 190 52 21 98 73 66 140 110
3281 110 121 94 -109 -117 121 171 375 263 -181 6 238 211 -35 -227 55 317 206 158 29 -13 -9 46 131 322
3305 322 311 -153 -128 348 268 -7 -165 364 -137 319 243 -75 21 188 158 -36 111 323 -138 -139 222 -77 51
3328 51 278 222 36 17 -156 111 0 -142 -51 -168 30 34 -453 -183 -5 -205 -124 -150 -199 -28 -74 -371 -187
$$ [...]
8191a11
##END NTUPLES=NMR FID
##END=
