##TITLE=1H_Pr 4419
 CDCl3, 8 sc, 
 7.07.2021
##JCAMPDX= 6.0         $$ Bruker NMR JCAMP-DX V2.0
##DATA TYPE= NMR FID
##DATA CLASS= NTUPLES
##ORIGIN= UXNMR, Bruker Analytische Messtechnik GmbH
##OWNER= root
$$ XWIN-NMR		Version 3.5
$$ Wed Jul  7 12:47:57 2021 Russian Standard Time (UT+4h)  she@DPX200
##.OBSERVE FREQUENCY= 200.131506
##.OBSERVE NUCLEUS= ^1H
##.DELAY= (6, 6)
##.ACQUISITION MODE= SIMULTANEOUS
##.ACQUISITION SCHEME= undefined
##.AVERAGES= 8
##.DIGITISER RES= 18
##SPECTROMETER/DATA SYSTEM= spect
##.PULSE SEQUENCE= zg30
##.SOLVENT NAME= DMSO
##.SHIFT REFERENCE= (INTERNAL, DMSO, 0, 15.7039)
##AUDIT TRAIL= $$ (NUMBER, WHEN, WHO, WHERE, WHAT)
$$ ##TITLE= Audit trail, XWIN-NMR		Version 3.5
$$ ##JCAMPDX= 5.01
$$ ##ORIGIN= Bruker BioSpin GmbH
$$ ##OWNER= she
$$ F:/spectra/data/she/nmr/H-F/1/audita.txt
$$ ##AUDIT TRAIL=  $$ (NUMBER, WHEN, WHO, WHERE, WHAT)
(   1,<2021-07-07 12:46:33.48 +0400>,<she>,<DPX200>,
      <created by zg, POWCHK disabled, PULCHK disabled
       configuration hash MD5:
       00 E9 B6 7A A2 85 ED C7 34 08 36 98 17 FE 4E 26
       data hash MD5: 16K
       CE D5 F5 5E B2 ED 7F 3D EE 0F 1A 1A 72 1B 47 DB>)
$$ ##END=
$$ 
$$ hash MD5
$$ C0 BB 2E 4D FC DF 92 36 EC 0A 91 43 F5 59 7A C0
##$RELAX= 
##$RELAX= 
##$RELAX= 
##$RELAX= 
##$RELAX= 
##$RELAX= 
$$ Bruker specific parameters
$$ --------------------------
##$DU= <F:/spectra>
##$EXPNO= 1
##$NAME= <H-F>
##$PROCNO= 1
##$TYPE= <nmr>
##$USER= <she>
##$AMP= (0..31)
100 100 100 100 100 100 100 100 100 100 100 100 100 100 100 100 100 100 
100 100 100 100 100 100 100 100 100 100 100 100 100 100 
##$AQSEQ= 0
##$AQ_mod= 1
##$AUNM= <au_zg>
##$AUTOPOS= <>
##$BF1= 200.13
##$BF2= 200.13
##$BF3= 200.13
##$BF4= 200.13
##$BF5= 200.13
##$BF6= 200.13
##$BF7= 200.13
##$BF8= 200.13
##$BYTORDA= 1
##$CFDGTYP= 0
##$CFRGTYP= 5
##$CHEMSTR= <none>
##$CNST= (0..31)
1 1 145 1 1 1 1 1 1 1 1 1 1 1 1 1 1 1 1 1 1 1 1 1 1 1 1 1 1 1 1 1 
##$CPDPRG= <>
##$CPDPRG1= <>
##$CPDPRG2= <>
##$CPDPRG3= <>
##$CPDPRG4= <mlev>
##$CPDPRG5= <mlev>
##$CPDPRG6= <mlev>
##$CPDPRG7= <mlev>
##$CPDPRG8= <mlev>
##$CPDPRGB= <>
##$CPDPRGT= <>
##$D= (0..31)
0 1.2 0 0 0 0 0 0 0 0.06 0 0.03 0 0 0 0 0.0002 0 0 0 0 0 0 0 0 0 0 0 0 
0 0 0 
##$DATE= 1625647593
##$DBL= (0..7)
120 120 120 120 120 120 120 120 
##$DBP= (0..7)
150 150 150 150 150 150 150 150 
##$DBP07= 0
##$DBPNAM0= <>
##$DBPNAM1= <>
##$DBPNAM2= <>
##$DBPNAM3= <>
##$DBPNAM4= <>
##$DBPNAM5= <>
##$DBPNAM6= <>
##$DBPNAM7= <>
##$DBPOAL= (0..7)
0.5 0.5 0.5 0.5 0.5 0.5 0.5 0.5 
##$DBPOFFS= (0..7)
0 0 0 0 0 0 0 0 
##$DE= 6
##$DECBNUC= <off>
##$DECIM= 32
##$DECNUC= <off>
##$DECSTAT= 4
##$DIGMOD= 1
##$DIGTYP= 9
##$DL= (0..7)
0 120 120 120 120 120 120 120 
##$DP= (0..7)
150 150 150 150 150 150 150 150 
##$DP07= 0
##$DPNAME0= <>
##$DPNAME1= <>
##$DPNAME2= <>
##$DPNAME3= <>
##$DPNAME4= <>
##$DPNAME5= <>
##$DPNAME6= <>
##$DPNAME7= <>
##$DPOAL= (0..7)
0.5 0.5 0.5 0.5 0.5 0.5 0.5 0.5 
##$DPOFFS= (0..7)
0 0 0 0 0 0 0 0 
##$DQDMODE= 0
##$DR= 18
##$DS= 0
##$DSLIST= <SSSSSSSSSSSSSSS>
$$ [...]
##$SUBNAM2= <"">
##$SUBNAM3= <"">
##$SUBNAM4= <"">
##$SUBNAM5= <"">
##$SUBNAM6= <"">
##$SUBNAM7= <"">
##$SUBNAM8= <"">
##$SUBNAM9= <"">
##$SW= 20.0188882624521
##$SWIBOX= (0..15)
0 0 2 0 0 0 0 0 0 0 0 0 0 0 0 0 
##$SW_h= 4006.41025641026
##$TD= 16384
##$TD0= 1
##$TE= 0
##$TE2= 300
##$TE3= 300
##$TEG= 300
##$TL= (0..7)
0 120 120 120 120 120 120 120 
##$TP= (0..7)
150 150 150 150 150 150 150 150 
##$TP07= 0
##$TPNAME0= <>
##$TPNAME1= <>
##$TPNAME2= <>
##$TPNAME3= <>
##$TPNAME4= <>
##$TPNAME5= <>
##$TPNAME6= <>
##$TPNAME7= <>
##$TPOAL= (0..7)
0.5 0.5 0.5 0.5 0.5 0.5 0.5 0.5 
##$TPOFFS= (0..7)
0 0 0 0 0 0 0 0 
##$TUNHIN= 0
##$TUNHOUT= 0
##$TUNXOUT= 0
##$USERA1= <user>
##$USERA2= <user>
##$USERA3= <user>
##$USERA4= <user>
##$USERA5= <user>
##$V9= 5
##$VALIST= <valist>
##$VCLIST= <CCCCCCCCCCCCCCC>
##$VD= 0
##$VDLIST= <DDDDDDDDDDDDDDD>
##$VPLIST= <PPPPPPPPPPPPPPP>
##$VTLIST= <TTTTTTTTTTTTTTT>
##$WBST= 1024
##$WBSW= 4
##$XGAIN= (0..3)
0 0 0 0 
##$XL= 0
##$YL= 0
##$YMAX_a= 178507
##$YMIN_a= -204991
##$ZGOPTNS= <>
##$ZL1= 120
##$ZL2= 120
##$ZL3= 120
##$ZL4= 120
##$ABSF1= 10
##$ABSF2= 0
##$ABSG= 5
##$ABSL= 3
##$ALPHA= 0
##$AQORDER= 0
##$ASSFAC= 0
##$ASSFACI= 0
##$ASSFACX= 0
##$ASSWID= 0
##$AUNMP= <proc_1d>
##$AZFE= 0.1
##$AZFW= 0.1
##$BCFW= 1
##$BC_mod= 2
##$BYTORDP= 1
##$COROFFS= 0
##$CY= 11.3945322036743
##$DATMOD= 1
##$DC= 2
##$DFILT= <>
##$DTYPP= 0
##$F1P= 15.9154993809931
##$F2P= -4.1035820241983
##$FCOR= 0.5
##$FTSIZE= 0
##$FT_mod= 4
##$GAMMA= 1
##$GB= 0.15
##$INTBC= 1
##$INTSCL= 1
##$ISEN= 128
##$LB= 0.24
##$LEV0= 0
##$LPBIN= 0
##$MAXI= 10000
##$MC2= 0
##$MEAN= 0
##$ME_mod= 0
##$MI= 1.114404
##$NCOEF= 0
##$NC_proc= 0
##$NLEV= 6
##$NOISF1= 3.799351
##$NOISF2= 2.8
##$NSP= 1
##$NTH_PI= 0
##$NZP= 0
##$OFFSET= 15.70392
##$PC= 1
##$PHC0= -12270.71
##$PHC1= 8.201002
##$PH_mod= 1
##$PKNL= yes
##$PPARMOD= 0
##$PSCAL= 0
##$PSIGN= 0
##$REVERSE= no
##$SF= 200.130013532006
##$SI= 16384
##$SIGF1= 3
##$SIGF2= 2
##$SINO= 400
##$SIOLD= 16384
##$SREGLST= <1H.CDCl3>
##$SSB= 0
##$STSI= 0
##$STSR= 0
##$SW_p= 3612.71676300578
##$SYMM= 0
##$S_DEV= 0
##$TDeff= 0
##$TDoff= 0
##$TI= <>
##$TILT= no
##$TM1= 0
##$TM2= 0
##$TOPLEV= 0
##$USERP1= <user>
##$USERP2= <user>
##$USERP3= <user>
##$USERP4= <user>
##$USERP5= <user>
##$WDW= 1
##$XDIM= 8192
##$YMAX_p= 0
##$YMIN_p= 0
$$ End of Bruker specific parameters
$$ ---------------------------------
##NTUPLES= NMR FID
##VAR_NAME=  TIME,          FID/REAL,        FID/IMAG
##SYMBOL=    X,             R,               I
##VAR_TYPE=  INDEPENDENT,   DEPENDENT,       DEPENDENT
##VAR_FORM=  AFFN,          ASDF,            ASDF
##VAR_DIM=   8192,          8192,            8192
##UNITS=     SECONDS,       ARBITRARY UNITS, ARBITRARY UNITS
##FACTOR=    0.0002496,     1,               1
##FIRST=     0,             0,               0
##LAST=      2.0444736,     0,               0
##MIN=       0,             -204991,         0
##MAX=       2.0444736,     178507,          0
$$ Real data points
##PAGE= N=1
##DATA TABLE= (X++(R..R)), XYDATA
$$ [...]
$$ plain form
2217 -170 391 -1208 -553 1225 -1034 -641 972 -1020 -1153 914 -393 -922 470 -198 -1256 -117 628
2234 628 -1204 -39 1172 -1174 -670 811 -715 -733 1201 -489 -1096 436 -324 -1061 567 852 -1261
2251 -1261 -57 730 -936 -43 1487 -740 -374 1424 -328 -1062 1323 505 -657 1193 852 -664
2267 -664 400 1304 -546 323 1793 -491 -554 1465 -309 -402 1852 253 -759 1054 804 -747 980
2284 980 1521 -710 241 1457 -923 -139 1775 -528 -512 1496 -63 -772 977 599 -604 769 1170
2301 1170 -1069 483 1344 -481 153 2014 -826 -611 1916 -94 -496 1527 601 -820 970 990 -883
2318 -883 992 1669 -827 61 1297 -1003 -159 1938 -422 -763 1359 -359 -1276 1013 531 -1079 159
2335 159 934 -1225 -243 1343 -1161 -380 1345 -1245 -1393 621 -821 -1325 713 -507 -1702 -117
$$ packed form
2217a70N61j599O55J778k259L93J613j992j33K067j307n29J392o68j058J139P45
2234F28j832J165J211k346N04J481j526j8J934j690o07J532p60p37J628K85k113
2251a261J204P87j666Q93J530k227L66J798j752p34K385q18j162J850l41j516
2267f64J064R04j850Q69J470k284o3K019j774r3K254j599j012J813k50j551J727
2284I80N41k231R51J216k380P84J914k303J6K008j559p09J749l78j203J373M01
2301A170k239J552Q61j825O34J861k840K15K527k010m02K023r26j421J790K0j873
2318h83J875O77k496Q88J236k300Q44K097k360l41K122j718r17K289m82j610J238
2335A59P75k159R82J586k504P81J725k590j48K014j442n04K038j220j195J585
$$ plain form
2351 -117 120 -1724 -99 833 -1893 -1022 1058 -1479 -1337 919 -965 -1386 611 -715 -1795 454
2367 454 227 -1670 -169 577 -1618 -600 1570 -1173 -569 1479 -866 -1239 1287 32 -959 1112
2383 1112 661 -1454 258 940 -1059 172 1614 -1117 -179 1497 -618 -738 1539 -248 -1317 1071
2399 1071 -54 -1165 902 777 -1102 -38 991 -1601 -18 1400 -1004 -674 1378 -709 -1059 1203
2415 1203 276 -1120 1060 510 -1296 623 1362 -920 409 1886 -807 -228 1751 -460 -455 1626 326
2432 326 -933 1150 787 -520 724 1632 -963 189 1507 -1209 66 1822 -407 -554 1352 -229
2448 -229 -883 1165 351 -983 563 731 -1356 -174 872 -1303 -213 1141 -932 -732 1061 -768
2464 -768 -963 951 -215 -1471 461 661 -1343 165 860 -1341 -26 1321 -1003 -328 1493 -588
$$ packed form
2351a17K37j844J625R32k726Q71K080k537J42K256j884m21J997j326j080K249
2367D54k27j897J501P46k195J018K170k743O04K048k345l73K526j255r91K071
2383A112m51k115J712O82j999J231J442k731R38J676k115j20K277j787j069K388
2399A071j125j111K067j25j879J064J029k592J583J418k404L30K052k087l50K262
2415A203r27j396K180n50j806J919P39k282J329J477k693N79J979k211NK081j300
2432C26j259K083l63j307J244R08k595J152J318k716J275J756k229j47J906j581
2448b29o54K048q14j334J546J68k087J182J046k175J090J354k073K00J793j829
2464g68j95J914j166j256J932K00k004J508O95k201J315J347k324O75J821k081
$$ plain form
2480 -588 -366 967 -180 -763 1065 731 -927 635 1291 -1007 364 1744 -708 39 1847 -555
2496 -555 -82 1284 -163 -230 1249 539 -926 618 793 -876 153 1191 -983 -214 825 -890 -469
2513 -469 1204 -329 -917 634 -477 -1162 382 476 -1261 -287 455 -1512 -454 545 -1009 -398 710
2530 710 -821 -909 539 -217 -834 504 247 -1218 88 528 -938 221 864 -756 -121 985 -415
2547 -415 -56 1207 -78 -468 500 110 -853 466 804 -679 119 393 -826 -3 704 -687 -50 923
2565 923 -435 -648 276 -178 -465 175 516 -841 -312 407 -698 -116 278 -968 -277 275 -719 -453 447
2584 447 -55 -457 231 175 -705 405 724 -516 261 349 -384 49 984 133 16 693 213 47 690 550
2604 550 132 531 727 -171 336 838 -281 212 752 -180 -277 250 -3 13 315 48 27 -217 75 -633 17
$$ packed form
2480e88K22J333j147n83J828l34j658J562O56k298J371J380k452P47J808k402
2496e55M73J366j447o7J479p10j465J544J75j669J029J038k174P69J039j715M21
2513d69J673j533n88J551j111o85J544R4j737R74P42j967J058R99j554O11J108
2530G10j531q8J448p56o17J338k57j465J306M40j466J159O43j620O35J106j400
2547d15L59J263j285l90R68l90r63J319L38j483P98K74j219Q23P07j391O37R73
2565I23j358k13R24m54k87O40L41j357N29P19j105N82L94j246O91N52r94K66R00
2584D47n02m02O88n6q80J110L19j240P77Q8p33M33R35q51j17O77m80j66O43j40
2604E50m18L99J96q98N07N02j119M93N40r32r7N27k53J6L02k67k1k44K92p08O50
$$ plain form
2625 17 26 -844 -185 1 -934 -271 -10 -321 -272 -122 -323 -414 -219 43 -356 11 211 -389 -95 43 -212 64
2647 64 244 -99 231 68 94 264 269 409 327 161 325 277 899 568 223 352 536 179 462 521 358 454 -22
2670 -22 252 338 -125 197 186 90 112 -87 -193 -179 -160 -3 -241 -360 -194 -488 -11 -303 -577 68 -315 -379 -214
2693 -214 -424 -195 23 -348 91 -318 -209 196 -324 241 155 -492 102 289 31 141 208 21 138 140 428
2714 428 -79 465 383 -94 379 204 -310 66 333 -32 100 124 -150 -14 81 -12 -383 14 -79 -819 -232 93
2736 93 -812 -314 211 -551 -306 -180 -630 -567 -131 -502 -766 -124 26 -990 -83 230 -568 -30 302 -420
2756 -420 148 580 -77 114 489 -3 10 601 739 -188 478 772 -181 478 957 -119 572 1033 50 304
2776 304 943 59 -112 645 316 -295 533 521 -605 599 661 -648 411 108 -901 -236 389 -500 -571
$$ packed form
2625A7Rq70O59J86r35O63K61l11M9J50k01r1J95K62l99L67K00o00K94J38k55K76
2647F4J80l43L30j63K6J70NJ40q2j66J64m8O22l31l45J29J84l57K83N9j63R6m76
2670b2K74Q6m63L22j1r6K2j99j06J4J9J57k38j19J66k94M77k92k74O45l83o4J65
2693b14k10K29K18l71M39m09J09M05n20N65q6o47N94J87k58J10O7j87J17KK88
2714D28n07N44q2m77M73j75n14L76K67l65J32K4k74J36R5r3l71L97r3p40N87L25
2736I3r05M98N25p62K45J26m50O3M36l71k64O42J50j016R07L13p98N38L32p22
2756d20N68M32o57J91L75m92J3N91J38r27O66K94r53O59M79j076O91M61r83K54
2776C04O39q84j71P57l29o11Q28j2j126J204O2j309J059l03j009O65O25q89p1
$$ plain form
2795 -571 -160 -432 -776 180 -166 -1139 160 -34 -1212 -386 119 -941 -421 205 -976 -565 382 -165 -546
2814 -546 573 265 -777 725 481 -739 334 784 -626 180 798 -448 61 1146 -179 -162 844
2831 844 180 -473 604 402 -951 613 745 -920 -5 770 -513 -429 566 -427 -631 657 -244 -834
2849 -834 480 105 -1275 375 246 -1361 -9 378 -1115 -114 580 -566 -418 665 -373 -711 865
2866 865 39 -987 721 682 -1062 615 539 -957 361 809 -447 13 1046 -116 -167 1147 391 -717
2884 -717 773 566 -799 791 814 -838 242 772 -571 -195 1013 -491 -417 844 -184 -975 554
2901 554 87 -1450 658 347 -1033 239 505 -1343 -149 915 -880 -561 593 -340 -878 817 100
2918 100 -1350 516 415 -1079 451 733 -704 484 1255 -770 -134 1224 -209 -219 1312 417 -616
$$ packed form
2795e71M11k72l44R56l46r73J299j94j178Q26N05j060N20O26j181M11R47n47l81
2814e46J119l08j042J502k44j220J073M50j410Q06O18j246N09J085j325J7J006
2831H44o64o53J077k02j353J564J32j665R15P75j283Q4R95r93k04J288r01n90
2849h34J314l75j380J650j29j607J352L87j493J001O94j146J48J083j038l38J576
2866H65q26j026J708l9j744J677p6j496J318M48j256M60J033j162n1J314p56j108
2884g17J490k07j365J590K3j652J080N30j343L76J208j504P4J261j028p91J529
2901E54m67j537K108l11j380J272K66j848J194J064j795L19J154r33n38J695p17
2918A00j450J866j01j494J530K82j437J188P71k025O36J358j433j0J531q95j033
$$ plain form
2935 -616 955 628 -656 920 1094 -686 500 965 -504 93 1021 -249 -385 904 -224 -763 383
2952 383 244 -1064 574 466 -1320 69 758 -1180 -279 651 -756 -654 592 -431 -984 608 -94
2969 -94 -1311 567 262 -1542 288 685 -1146 -176 611 -603 -254 928 -393 -708 975 -462 -1038
2986 -1038 635 478 -902 622 587 -943 217 733 -479 -70 828 -563 -419 841 -65 -883 629
3003 629 234 -978 638 6 -998 505 588 -1189 -186 813 -652 -683 810 -208 -746 550 -160
3020 -160 -1119 898 469 -1229 -22 431 -1342 -177 565 -703 -168 844 -207 -584 1059 294 -535
3037 -535 1111 573 -532 652 524 -498 666 860 -458 -68 1274 105 -251 1211 285 -603 892
3054 892 510 -747 680 682 -672 543 542 -649 -15 601 -304 -375 276 -427 -878 809 -246 -823 811
$$ packed form
2935f16J571l27j284J576J74j780J186M65j469N97R28j270j36J289j128n39J146
2952C83j39j308J638j08j786J389O89j938R01R30j407J02J246j023n53J592p02
2969i4j217J878l05j804J830L97j831R70P87j214L49J182j321l15J683j437n76
2986a038J673j57j380J524l5j530J160N16j212M09Q98j391J44J260r06q18J512
3003F29l95j212J616o32j004J503Q3j777J003R99j465l1J493j018n38J296p10
3020a60r59K017m29j698J207M53j773J165P42j268N35J012j051l77J643p65q29
3037e35J646n38j105J184j28j022J164J94j318L90J342j169l56J462r26q88J495
3054H92l82j257J427Kj354J215jj191O34O16r05p1O51p03m51J687j055n77J634
$$ plain form
3073 811 12 -1153 151 467 -904 267 469 -902 -275 476 -401 -917 500 -29 -924 665 -51 -578
3091 -578 544 166 -503 218 750 -338 -37 609 -109 -303 817 -7 -331 967 561 -475 711 155
3109 155 -457 485 597 -425 46 535 -386 -602 628 56 -713 771 -135 -959 292 169 -848 -42
3127 -42 150 -504 -133 311 -701 -205 193 -309 -553 314 -196 -813 326 -128 -594 358 104 -482 27 317
3147 317 -252 -268 367 -96 -406 806 244 -246 537 -300 -658 443 -77 -488 340 197 -487 -164 347 -268
3167 -268 -140 352 32 -144 519 -44 -326 294 201 -386 64 177 -574 -91 -77 -209 -228 232 -39 -503 -183
3188 -183 -138 -558 282 295 -442 -51 114 -140 -19 323 9 78 101 199 -191 621 -75 -57 259 109 -115 616
3210 616 174 -27 366 573 236 159 440 495 148 695 301 52 746 222 20 217 210 73 255 111 -1
$$ packed form
3073H11p99j165J304L16j371J171K02j371O27P51q77n16J417n29q95J589p16n27
3091e78J122l78o69P21N32j088L01O46p18j94J120q24l24J298m06j036J186n56
3109A55o12R42J12j022M71M89r21k16J230n72p69J484r06q24J251j23j017Q06
3127d2J92o54L71M44j012M96L98n02k44Q67n10o17J139m54m66R52k54n86N09K90
3147C17n69j6O35m63l10J212n62m90P83q37l58J101n20m11Q28j43o84L23N11o15
3167b68J28M92l20j76O63n63k82O20r3n87M50J13p51M83J4j32j9M60k71m64L20
3188a83M5m20Q40J3p37L91J65k54J21L42l14O9K3R8l90Q12o96J8L16j50k24P31
3210F16m42k01L93K07l37p7K81N5l47N47l94k49O94n24k02J97pj37J82j44j12
$$ plain form
3231 -1 -34 193 290 -161 139 -152 -157 -118 -69 -356 29 13 -293 -253 -276 -113 -63 -114 -327 -380 -157 -147 -515 232 -361
3256 -361 -272 -259 -134 -179 -34 -226 -88 -45 -209 59 -339 -151 -175 -66 56 -162 -13 145 -150 -303 -290 -214
3278 -214 40 -228 -240 24 -243 -179 108 -278 -44 44 -164 -254 -76 4 -104 -180 78 -339 -434 219 -64 -340
3300 -340 328 67 -148 140 -120 -5 -61 -73 -14 -129 267 -273 -142 261 -142 -77 478 67 43 484 -134 -50
3322 -50 89 214 -272 297 332 42 224 320 -125 107 337 107 -194 714 -214 -373 310 -197 -299 184 203
3343 203 -161 -251 470 -106 -242 498 -161 -418 247 -350 -337 165 -167 -325 76 -178 -343 -113 394 -265 -655
3364 -655 696 -337 -732 337 -370 -539 376 -18 -201 249 154 -294 -171 250 -239 -142 667 -285 -127 670
3384 670 -45 -317 923 -91 -235 506 290 -383 280 664 -629 -221 623 11 -307 856 -386 -311 719
$$ packed form
3231al3K27R7m51L00k91nL9M9k87L85j6l06M0k3J63N0n1k13n3K23J0l68P47n93
3256c61Q9J3J25m5J45j92J38M3j64K68l98J88k4J09J22k18J49J58k95j53J3P6
3278b14K54k68j2K64k67O4K87l86K34Q8k08r0J78Q0j08p6K58m17r5O53k83k76
3300c40O68k61k15K88k60J15n6j2N9j15L96n40J31M03m03O5N55m11k4M41o18Q4
3322e0J39J25m86N69L5k90J82R6m45K32K30k30l01R08r28j59O83n07j02M83J9
3343B03l64r0P21n76j36P40o59k57O65n97J3N02l32j58M01k54j65K30N07o59l90
3364f55J351j033l95J069p07j69R15l94j83M50r5m48J23M21m89R7Q09r52J58P97
3384F70p15k72J240j014j44P41k16o73O63L84j293M08Q44o12l18J163j242P5J030
$$ plain form
3403 719 -248 -459 231 113 -475 219 332 -381 -257 419 -276 -176 707 -406 -580 629 -229 -542 544
3422 544 110 -870 145 37 -433 -154 607 -619 -305 432 -754 -308 792 -411 -799 647 -137 -592
3440 -592 363 262 -580 -49 329 -348 -73 511 -615 -481 905 -247 -220 628 -102 -536 466 192 -564
3459 -564 114 268 -682 88 944 -526 -403 654 -110 -413 755 -276 -505 515 60 -529 244 402
3477 402 -430 -137 821 -569 -179 1009 -530 -318 859 -283 -496 541 301 -613 246 356 -602 251
3495 251 812 -418 100 711 -272 -61 870 -459 -518 818 -106 -546 582 191 -509 188 375 -779 -426
3514 -426 514 -705 -753 781 -661 -774 555 -500 -599 672 -221 -596 177 229 -396 -72 591 -483 -491
3533 -491 327 -952 -774 787 -326 -328 519 -233 -578 587 116 -739 157 434 -508 72 884 -407 -271
$$ packed form
3403G19r67k11O90j18n88O94J13p13J24O76o95J00Q83j113j74J209q58l13J086
3422E44m34r80J015j08m70K79P61j226L14P37j186M46J100j203l88J446p84m55
3440e92R55j01q42N31L78o77K75N84j126J34J386j152K7Q48p30m34J002k74p56
3459e64O78J54r50P70Q56j470J23J057p64l03J168j031k29J020m55n89P73J58
3477D02q32K93R58j390L90J188j539K12J177j142k13J037k40r14Q59J10r58Q53
3495B51N61j230N18O11r83K11R31j329n9J336r24m40J128l91p00O97J87j154L53
3514d26R40j219m8J534j442j13J329j055r9J271q93l75P73N2o25L24O63j074q
3533d91Q18j279J78J561j113kQ47p52l45J165m71q55Q96K77r42N80Q12j291J36
$$ plain form
3552 -271 523 -418 -530 480 -26 -403 520 252 -604 143 448 -600 75 687 -777 64 782 -362 -570
3571 -570 684 -544 -221 326 301 -521 348 513 -812 235 598 -214 -62 851 -488 -257 820 -391
3589 -391 -261 820 42 -398 412 373 -839 164 449 -598 48 648 -686 -323 638 -135 -355 786
3607 786 -170 -222 372 38 -593 71 492 -503 -195 829 -808 -227 811 -396 -145 548 -332 -469 156
3626 156 265 -514 294 192 -763 34 552 -661 25 983 -489 -205 737 -570 -322 605 -98 -379 317
3645 317 348 -398 212 533 -296 96 443 -539 -282 512 -125 -234 727 -211 -320 334 114 -291 238 181 -548
3666 -548 144 651 -573 1 686 -473 -246 524 -147 -257 549 -140 -627 424 247 -405 -29 625 -368
3685 -368 96 521 -689 -249 252 -457 -145 342 -466 -684 123 -96 -491 -114 102 -712 32 74 -611 -368
$$ packed form
3552b71P94r41j12J010n06l77R23k68q56P47L05j048O75O12j464Q41P18j144k08
3571e70J254j228L23N47k5q22Q69J65j325J047L63q12J52R13j339K31J077j211
3589c91J30J081p78m40Q10l9j212J003K85j047O46O00j334L63R61p73k20J141
3607G86r56n2N94l34o31O64M21r95L08J024j637N81J038j207K51O93q80j37O25
3626A56J09p79Q08j02r55P97N18j213O86R58j472K84R42j307K48R27p03k81O96
3645C17L1p46O10L21q29L92L47r82K57P94o37j09R61r38j09O54k20m05N29n7p29
3666e48O92N07j224N74O85j159K27P70o71j10Q06o89m87J051j77o52L76O54r93
3685c68M64M25j210M40N01p09L12M87q08k18Q07k19l95L77K16q14P44M2o85K43
$$ plain form
3705 -368 250 -441 -319 77 -521 -306 278 -45 -499 13 200 -634 -40 275 -433 22 593 -98 99 360
3725 360 -301 -10 605 253 -329 270 528 -133 414 435 -294 138 522 -498 -117 514 -98 22 331 202
3745 202 -82 407 223 -241 81 182 -235 108 280 -34 398 255 -232 68 124 105 146 353 213 -297 -101
3766 -101 208 -567 135 602 -283 76 473 -215 127 59 -128 183 -50 -6 -99 -44 41 -138 180 420 -411 -108
3788 -108 -154 -257 -176 -96 -173 -121 -71 -90 -186 -222 141 -341 -231 -127 -227 -264 116 -241 128 -341 -252 -319 -159 -152 -159
3813 -159 -51 -192 -345 -222 -25 -212 -140 98 -139 -78 -66 180 -287 -130 98 -62 -125 -67 165 -17 -107 -74
3835 -74 -212 60 -76 197 -21 75 182 -50 58 276 -124 81 -108 -185 390 402 19 208 7 129 102 -264
3857 -264 164 59 96 345 -231 85 126 -482 283 255 111 167 159 65 166 17 97 -278 210 63 -147 43 152
$$ packed form
3705c68O18o91J22L96n98K15N84l23m54N12J87q34N94L15p08M55N71o91J97K61
3725C60o61K91O15l52n82N99K58o61N47K1p29M32L84j020L81O31o12J20L09j29
3745B02k84M89j84m64L22J01m17L43J72l14M32j43m87L00N6j9M1K07j40n10J96
3766a01L09p75P02M67q85L59L97o88L42o8j87L11k33M4r3N5Q5j79L18K40q31L03
3788a08m6j03Q1Q0p7N2N0j9r6l6L63m82J10J04j00l7L80l57L69m69Q9o7J60Pp
3813a59J08j41j53J23J97j87P2K38k37O1J2K46m67J57K28j60o3N8K32j82r0L3
3835g4j38K72j36K73k18R6J07k32J08K18m00K05j89p7N75J2l83J89k01J22k7l66
3857b64M28j05L7K49n76L16M1o08P65k8j44N6qr4J01j49Q0l75M88j47k10J90J09
$$ plain form
3880 152 -152 45 314 -266 326 233 -264 124 45 -93 -212 249 387 -297 268 137 -141 -190 -35 -81 223
3901 223 392 -233 35 214 247 -107 304 -6 -136 38 265 -358 306 328 -225 327 5 -263 -34 169 133
3922 133 -120 151 -97 -380 -60 329 -540 -2 416 -345 141 171 -164 -53 274 -194 -292 299 93 -315 265
3943 265 372 -428 279 159 -130 198 293 -256 136 318 -122 4 284 -177 -376 333 369 -398 219 406 -424
3964 -424 365 174 -724 -84 458 -302 -277 281 -229 -465 40 -31 -573 -27 -40 -701 192 197 -648 0 241 -422
3986 -422 16 271 -160 -371 520 -278 -570 196 248 -529 421 303 -442 345 284 -264 460 292 -373 -128 595
4007 595 -76 -360 467 135 -250 375 653 -331 422 437 -273 62 516 -278 -28 255 26 -425 726 182
4027 182 -439 576 -33 -530 112 362 -623 87 314 -387 9 281 52 -359 365 -181 -429 199 366 -652
$$ packed form
3880A52l04J97K69n80N92r3m97L88p9j38j19M61J38o84N65j31k78m9J55m6L04
3901B23J69o25K68J79L3l54M11l10j30J74K27o23O64K2n53N52l22k68K29K03l6
3922A33k53K71k48k83L20L89q69N38M18p61M86L0l35J11L27m68r8N91k06m08N80
3943B65J07q00P07j20k89L28R5n49L92J82m40J26K80m61j99P09L6p67O17J87q30
3964d24P89j91q98O40N42p60K5N58n10k36N05p1n42N46j3o61Q93Nq45O48K41o63
3986d22M38K55m31k11Q91p98k92P66N2p77R50j18p45P87o1n48P24j68o65K45P23
4007E95o71k84Q27l32l85O25K78r84P53J5p10L35M54p94K50K83k29m51J151n44
4027A82o21J015o09m97O42K50r85P10K27p01L96K72k29m11P24n46k48O28J67j018
$$ plain form
4047 -652 434 49 -918 241 296 -435 -49 395 -101 -144 477 -249 -340 557 -136 -701 644 -1 -690 89
4067 89 37 -355 204 186 -384 48 282 -333 -632 608 -65 -635 243 -215 -668 -30 171 -681 263 76 -627
4088 -627 -82 174 -306 -117 315 -244 -596 460 -24 -741 255 15 -677 143 333 -667 387 449 -219
4107 -219 -41 486 48 -143 432 92 -712 486 355 -633 42 525 -482 403 441 -171 145 517 -269 -270
4127 -270 777 189 -604 599 420 -623 412 89 -517 336 483 -729 95 410 -305 -101 460 -80
4145 -80 -287 460 -69 -350 363 -50 -517 128 295 -216 -101 368 -266 -335 628 -123 -631 666 -107 -251
4165 -251 618 72 -606 125 77 -492 86 673 -382 8 452 134 -402 191 29 -515 338 -18 -564 301
4185 301 390 -490 380 430 -422 -36 235 -301 -92 306 -63 -569 305 -178 -485 159 -6 -235 94 -88 -666
$$ packed form
4047f52J086l85r67J159N5p31L86M44m96m3O21p26r1Q97o93n65J345o45o89P79
4067H9n2l92N59j8n70M32K34o15k99J240o73n70Q78m58m53O38K01q52R44j87p03
4088f27N45K56m80J89M32n59l52J056m84p17R96k40o92Q20J90j000J054O2o68
4107b19J78N27m38j91N75l40q04J198j31r88O75M83j007Q85L8o12L16L72p86j
4127b70J047n88p93J203j79j043J035l23o06Q53J47j212Q24L15p15K04N61n40
4145h0k07P47n29k81P13m13m67O45J67n11J15M69o34o9R63p51n08J297p73j44
4165b51Q69n46o78P31m8n69N78N87j055L90M44l18n36N93j62n44Q53l56n46Q65
4185C01Q9q80Q70N0q52L86K71n36K09L98l69n06Q74m83l07O44j65k29L29j82n78
$$ plain form
4206 -666 -26 398 -161 63 475 60 -412 342 -258 -576 553 38 -607 325 -79 -231 17 -29 -349 -134
4226 -134 215 -99 -417 434 -273 -362 317 105 -249 291 6 -449 -6 48 -396 -40 170 -184 -65 611 -247
4247 -247 -327 434 -53 -697 513 -176 -463 318 36 -359 -101 300 -351 -273 313 -463 -348 126 -59 -399
4267 -399 403 -236 -426 349 243 -225 -90 287 -114 16 248 -117 -10 312 -193 -18 588 266 -159 303
4287 303 203 -199 332 15 -132 128 362 -47 -67 547 -37 -36 333 -90 -87 154 151 5 27 -32 -132 -13 160
4310 160 107 -17 38 169 -165 208 -286 -294 312 105 -545 201 -131 -344 24 228 -168 67 105 4 -175 382
4332 382 13 -251 345 -308 -271 -37 -28 -239 214 39 -158 111 131 -116 55 5 -69 -217 420 78 -234 413
4354 413 0 -112 26 -103 -237 150 -32 -236 -202 -10 -97 -270 97 39 -119 224 -6 198 197 -154 -82 59
$$ packed form
4206f66O40M24n59K24M12m15m72P54o00l18J129n15o45R32m04j52K48m6l20K15
4226a34L49l14l18Q51p07q9O79k12l54N40k85m55M43N4m44L56K10l54J19O76q58
4247b47q0P61m87o44J210o89k87P81k82l95K58M01o51P8N86p76J15M74j85l40
4267c99Q02o39j90P75j06m68J35L77m01J30K32l65J07L22n05J75O06l22m25M62
4287C03j00m02N31l17j47K60K34m09k0O14n84JL69m23LK41lj46K2n9j00J19J73
4310A60n3j24N5J31l34L73m94qO06k07o50P46l32k13L68K04l96K35L8j01j79N57
4332C82l69k64N96o53L7K34Rk11M53j75j97K69K0k47J71n0p4j48O37l42l12O47
4354D13m13j12J38j29j34L87j82k04L4J92q7j73L67n8j58L43k30K04jl51P2J41
$$ plain form
4376 59 101 62 -21 225 167 -252 264 5 -86 538 26 104 -35 255 16 133 194 -220 81 54 257 95 326
4399 326 227 237 100 -41 130 26 58 -71 -130 50 -8 -77 93 139 -331 5 -29 -142 177 -210 -117 -47 -203
4422 -203 128 -94 -201 -60 -94 -117 166 -80 69 -162 -343 -106 -189 -201 -45 -5 -126 28 -146 74 -326 -105
4444 -105 32 -140 -51 47 144 -43 -74 167 25 -53 138 37 -110 22 9 -99 170 -92 -100 248 22 -2 8
4467 8 105 -270 -21 112 -60 -125 184 -203 -92 297 -325 -230 309 -54 -36 91 38 -115 -46 210 -261 18 -5
4490 -5 -183 -28 151 -111 214 471 -89 -196 -167 104 66 149 64 -70 -103 206 -297 -436 348 -173 -19 311
4512 311 -310 -319 533 -55 -275 -9 144 -120 207 293 -73 96 -88 -174 -120 317 -319 -96 277 -185 -135 90
4534 90 -164 -275 333 47 -356 -41 199 -126 -109 313 -342 -202 352 -40 -45 -185 131 13 186 195 -134 220
$$ packed form
4376E9M2l9q3K46n8m19N16k59r1O24n12P8j39K90k39J17O1m14L01k7K03j62K31
4399C26r9J0j37j41J71j04L2j29n9J80n8o9J70M6m70L36l4j13L19l87R3P0j56
4422b03L31k22j07J41l4k3K83k46J49k31j81K37q3j2J56M0j21J54j74K20m00K21
4444a05J37j72Q9R8R7j87l1K41j42p8J91j01j47J32j3j08K69k62qL48k26k4J0
4467HR7l75K49J33j72o5L09l87J11L89o22R5N39l63J8J27n3j53O9K56m71K79k3
4490ej78J55J79k62L25K57n60j07K9K71l8Q3q5j34l3L09n03j39P84n21J54L30
4512C11o21rQ52n88k20K66J53k64L27Q6l66J69j84q6N4M37o36K23L73m62N0K25
4534I0k54j11O08k86m03L15K40l25J7M22o55J40N54l92nj40L16j18J73Rl29L54
$$ plain form
4556 220 183 -368 -82 350 -510 15 545 -479 -158 664 144 -117 425 -26 61 168 287 -339 -153 364
4576 364 -223 -113 182 -129 -397 198 -235 -42 66 -56 -237 333 182 -139 -91 -186 -293 -100 419 -134 14
4597 14 180 -186 -168 4 165 -175 153 25 -480 22 248 -296 -166 425 -471 -216 463 -311 -179 125 -69
4618 -69 -326 75 135 -323 -45 76 -302 12 512 -461 308 527 -103 -28 410 68 -37 241 83 -332 14
4639 14 400 -96 -9 492 -200 -51 540 -39 -210 420 107 -89 447 207 -126 233 182 -116 -260 291 -248
4660 -248 309 316 -443 -43 682 -117 -180 409 -293 -206 104 80 -150 180 349 -227 83 446 -445 71 437 -224
4682 -224 -231 322 -160 -259 301 -62 -403 69 187 -272 101 474 -273 -94 548 -424 153 296 -201 -132 438
4703 438 -60 -740 181 -40 -320 71 469 -529 41 272 -218 -135 349 -214 -256 118 -18 -262 443 50 -237
$$ packed form
4556B20l7n51K86M32q60N25N30j024L21Q22n20k61N42m51Q7J07J19o26J86N17
4576C64n87J10K95l11k68N95m33J93J08j22j81N70j51l21M8r5j07J93N19n53J48
4597A4J66l66J8J72J61l40L28j28n05N02K26n44J30N91q96K55O79p74J32L04j94
4618f9k57M01O0m58K78J21l78L14N00r73P69K19o30P5M38l42j05K78j58m15L46
4639A4L86m96Q7N01o92J49N91n79j71O30l13j96N36k40l33L59n1k98j44N51n39
4660b48N57Pp59M00P25p99o3N89p02Q7L10k4k30L30J69n76L10L63q91N16L66o61
4682b24pN53m82r9N60l63l41M72J18m59L73L73p47J79O42r72N77J43m97O9N70
4703D38m98o80R21k21k80L91L98r98N70K31m90Q3M84n63m2L74j36k44P05l93k87
$$ plain form
4724 -237 391 284 -366 18 164 -8 -145 293 -285 -83 457 112 -338 412 -15 -53 126 446 -363 41
4744 41 369 -75 107 200 -110 169 243 -11 -151 410 89 -91 254 385 6 105 72 -686 74 242 -392 -1
4766 -1 472 -217 75 390 59 -6 280 174 -245 190 237 -491 206 126 -246 -100 105 -189 -116 -8 25 -295
4788 -295 203 -131 -558 -103 -11 -310 -149 327 -531 -145 282 -375 -151 205 0 -126 143 220 -333 125 351
4809 351 -259 159 167 -384 34 65 -342 281 244 7 -253 251 71 -37 -36 141 -401 293 644 65 -37 306
4831 306 -384 58 195 -148 -44 77 -60 -71 3 -10 10 192 43 -419 106 44 -303 -93 260 -325 5 60
4853 60 -214 39 33 120 -110 238 -63 -166 -90 252 -474 -91 -75 -343 145 62 34 -143 -36 -113 -458 4 -7
4876 -7 -265 30 144 -402 -142 336 -349 142 -53 -332 30 5 -316 -213 -106 40 -130 253 253 -358 -102 310
$$ packed form
4724b37O28j07o50L84J46j72j37M38n78K02N40l45m50P50m27l8J79L20q09M04
4744D1L28m44J82R3l10K79P4k54j40N61l21j80L45J31l79R9l3p58P60J68o34L91
4766aM73o89K92L15l31o5K86j06m19M35M7p28O97q0l72J46K05k94P3J08L3l20
4788b95M98l34m27M55R2k99J61M76q58L86M27o57K24L56k05j26K69P7n53M58K26
4809C51o10M18Qn51M18L1m07O23l7k37k60N04j80j08JJ77n42O94L51n79j02L43
4831C06o90M42J37l43J04J21j37j1P4j3K0J82j49m62N25o2l47K10L53n85L30N5
4853F0k74K53oQ7k30L48l01j03P6L42p26L83J6k68M88q3k8j77J07p7l45M62j1
4876gk58K95J14n46K60M78o85M91j95k79L62k5l21J03J07J46j70L83%o11K56M12
$$ plain form
4898 310 -122 95 63 0 97 411 51 126 155 325 -39 300 223 -91 400 111 105 -47 11 6 206 11 -23 -133
4922 -133 67 198 106 -38 154 -117 -91 291 -221 -47 397 -210 -84 -110 221 187 -32 -149 147 201 319 44
4944 44 51 24 -109 -245 328 -423 46 300 -222 98 -130 273 -30 -1 -157 -163 -188 97 -252 -80 176 -244 68
4967 68 136 -236 -118 146 -221 167 -47 -253 -103 179 -313 84 26 157 -314 250 55 -298 -42 -86 49
4988 49 54 -107 253 60 -16 17 137 110 210 -73 -35 105 229 376 -88 -61 148 -152 -5 247 -336 -122 -61
5011 -61 146 72 -54 125 59 365 67 -164 125 126 81 224 -123 -33 209 -96 155 285 161 -315 69 115 149
5034 149 88 39 111 -12 91 40 17 -63 -64 -212 17 -58 -14 -114 -36 -21 -123 225 -36 -183 -108 130 11 84 146
5059 146 -145 57 0 -169 224 155 -299 189 106 -238 -167 71 304 -378 150 18 -124 371 77 -118 71
$$ packed form
4898C10m32K17l2o3R7L14l60P5K9J70l64L39p7l14M91k89oj52N8nK00j95l4j10
4922a33K00J31r2j44J92k71K6L82n12J74M44o07J26k6L31l4k19j17K96N4J18k75
4944D4Pk7j33j36N73p51M69K54n22L20k28M03l03K9j56ok5K85l49J72K56m20L12
4967F8O8l72J18K64l67L88k14k06J50K82m92L97n8J31m71N64j95l53K56m4J35
4988D9Nj61L60j93p6L3J20k7J00k83L8J40J24J47m64K7K09l00J47K52n83K14O1
5011f1K07p4j26J79o6L06k98k31K89Jm5J43l47R0K42l05K51J30j24m76L84M6L4
5034A49o1m9P2j23J03n1k3q0jj48K29p5M4j00P8J5j02L48k61j47P5K38j19P3O2
5059A46k91K02n7j69L93o9m54M88q3l44P1K38K33o82N28j32j42M95k94j95J89
$$ plain form
5080 71 220 25 -89 244 -34 -151 122 20 153 408 48 -166 84 144 -89 195 192 -172 149 173 -3 116
5102 116 77 41 -119 273 303 -259 236 -36 -188 423 -59 -86 131 -54 -37 -207 23 -182 -60 250 37 -180
5124 -180 587 -43 -384 226 -122 -105 -176 120 -149 -296 -42 -253 -122 190 -63 -370 163 -22 -246 -4 -103
5145 -103 -425 -107 127 -226 100 -124 22 -155 344 -18 -297 399 170 -219 256 236 -225 211 84 -28
5165 -28 200 -31 121 -22 186 -106 -270 356 39 -193 385 -60 -132 69 209 -123 194 307 -58 250 574
5186 574 -29 88 349 293 44 319 57 -302 260 -31 -79 77 205 -135 4 356 89 -9 276 -135 -93
5207 -93 409 103 -231 204 50 -23 -161 40 -22 -226 96 -162 -190 288 6 -60 356 -112 -130 370 -244 -228
5229 -228 135 -102 -274 -43 553 4 -171 168 -132 -301 176 -139 -185 14 -129 -527 147 -308 -135 141
$$ packed form
5080G1J49j95j14L33k78j17K73j02J33K55l60k14K50O0k33K84ll64L21K4j76J19
5102A16l9l6j60L92L0n62M95k72j52O11m82k7K17j85J7j70K30k05J22L10k13k17
5124a80P67o30l41O10l48J7p1K96k69j47K54k11J31L12k53l07N33j85k24K42r9
5145a03l22L18K34l53L26k24J46j77M99l62k79O96k29l89M75k0m61M36j27j12
5165b8K28k31J52j43K08k92j64O26l17k32N78m45p2K01J40l32L17J13l65L08L24
5186E74o03J17K61n6k49K75k62l59N62k91m8J56J28l40J39L52k67r8K85m11M2
5207i3N02l06l34M35j54p3j38K01o2k04L22k58k8M78k82o6M16m68j8N00o14J6
5229b28L63k37j72K31N96n49j75L39l00j69M77l15m6J99j43l98O74m55J73K76
$$ plain form
5249 141 135 -221 -83 410 -155 79 171 111 -440 249 -78 -181 149 63 -95 184 444 -201 -271 494 -47 -37
5271 -37 142 -80 -347 123 343 -342 151 154 -252 13 -12 -367 181 213 -211 32 439 145 -246 183 13 -245
5293 -245 266 91 -34 31 102 -294 -128 -10 -196 -148 158 -196 -184 244 -326 -229 420 310 -199 235 77 -510
5315 -510 95 151 -124 -215 46 -121 -8 186 -122 -228 350 207 -198 294 -6 -339 40 -37 -118 169 444
5336 444 -84 -142 22 -196 25 282 -136 -353 141 259 65 248 -315 -275 488 239 -148 281 293 266 -193
5357 -193 508 -112 -296 610 12 197 246 -164 4 108 254 -51 80 -52 25 205 266 155 -276 98 -295
5378 -295 -52 246 100 2 223 -35 -144 196 92 63 -243 160 -83 -171 306 -296 -221 149 -150 -138 109 -79
5400 -79 -250 -22 117 -120 109 277 74 -131 147 85 -332 -12 164 -118 302 -58 -33 -18 -93 -54 -17 158
$$ packed form
5249A41ol56J38M93n65K34R2o0n51O89l27j03L30q6j58K79K60o45p0P65n41J0
5271c7J79k22k67M70K20o85M93Lm06K65k5l55N48L2m24K43M07k94l91M29j70k58
5293b45N11j75j25O5P1l96J66J18j86M8L06l54J2M28n70R7O49j10n09M34j58n87
5315e10O05N6k75r1K61j67J13J94l08j06N78j43m05M92l00l33L79p7q1K87K75
5336D44n28n8J64k18K21K57m18k17M94J18j94J83n63M0P63k49l87M29J2k7m59
5357a93P01o20j84R06n98J85M9m10J68J04J46l05J31j32P7J80O1j11m31L74l93
5378b95K43K98j46r8K21k58j09L40j04k9l06M03k43q8M77o02P5L70k99J2K47j88
5400g9j71K28J39k37K29J68k03k05K78o2m17L20J76k82M20l60K5J5p5L9L7J75
$$ plain form
5422 158 117 -58 199 -11 -153 307 -448 44 203 -119 -134 36 136 -17 304 -33 -74 -28 201 -110 -188 267
5444 267 -100 -32 190 108 -100 97 260 -104 -11 -115 -282 24 154 -131 -82 192 15 -82 299 33 -225 -82
5466 -82 -22 -58 -299 91 -271 -187 158 -230 -80 265 -41 112 42 -222 -230 243 -107 263 177 -329 -287 -361 52
5489 52 -94 -86 -142 -145 -361 -32 -181 39 178 -439 71 -37 -46 -70 -64 115 23 -82 -26 -46 29 96 85 -6 7 63 -3
5516 -3 0 -94 181 143 -118 231 190 157 -39 -46 34 57 67 134 -345 -103 -103 -71 -9 -56 126 208 -65 289 110 -195 151
5543 151 198 -114 187 306 -14 240 51 309 236 -141 -136 -229 42 -5 -71 -2 -84 70 117 -114 -3 274 21
5566 21 -26 0 -231 -144 81 -114 -77 -362 -70 -73 -351 -55 -30 -161 53 44 -48 -87 -78 -16 0 -323 55 122 -12 21
5592 21 -30 130 -61 -156 -74 -107 101 -161 120 128 60 -281 -161 -84 -34 55 78 -95 110 40 56 -180 -44 25 -287
$$ packed form
5422A58m1j75K57k10j42M60p55M92J59l22j5J70J00j53L21l37m1M6K29l11p8M55
5444B67l67O8K22q2k08J97J63l64R3j04j67L06J30k85M9K74j77r7L81k66k58J43
5466h2O0l6k41L90l62Q4L45l88J50L45l06J53p0k64qM73l50L70q6n06M2p4M13
5489E2j46Qn6lk16L29j49K20J39o17N10j08rk4OJ79r2j05N6k0P5O7j1r1J3N6o6
5516cLr4K75l8k61L49m1l3j96pQ0K3J0O7m79K42%L2O2m7J82Q2k73L54j79l05L46
5543A51M7l12L01J19l20K54j89K58p3l77Nr3K71m7o6O9q2J54M7k31J11K77k53
5566B1m7K6k31Q7K25j95L7k85K92lk78K96K5j31K14rr2l9RO2J6l23L78O7j34L3
5592B1n1J60j91r5Q2l3K08k62K81Qo8l41J20P7N0Q9K3j73K05p0J6k36J36O9l12
$$ plain form
5617 -287 304 -127 -209 -45 -91 -131 154 -123 94 -76 241 342 125 -106 -76 38 292 -82 167 -94 24
5638 24 -90 48 -185 -39 110 -100 25 -162 144 18 214 202 -176 -312 -63 15 102 385 90 127 19 -215
5660 -215 -131 -102 -29 -12 -61 45 -70 -66 26 -254 -205 97 11 231 196 -326 130 -228 149 -252 -39 28 -316 176
5684 176 262 -51 -250 201 22 -284 41 -222 -12 27 -202 -85 -65 11 74 135 137 -228 132 -8 -103 4 113
5707 113 -1 155 81 -136 -156 191 37 -219 -28 123 -66 -2 -142 -62 -184 285 -257 -66 103 -22 -66 200
5729 200 188 -246 -270 160 -126 226 363 -70 102 493 -45 -42 203 -403 -237 -141 105 -18 -53 105 7 -2 294
5752 294 -151 53 -184 -157 21 365 -257 195 188 -79 -83 24 30 -273 13 -30 -155 -61 277 -230 127 208 -344
5775 -344 -91 14 -298 59 -81 161 -43 8 33 9 165 158 -82 -62 182 -163 -43 -133 -212 -74 208 -79 138
$$ packed form
5617b87N91m31q2J64m6m0K85k77K17j70L17J01k17k31L0J14K54l74K49k61J18
5638B4j14J38k33J46J49k10J25j87L06j26J96j2l78j36K49P8Q7K83k95L7j08k34
5660b15Q4K9P3J7m9J06j15MR2k80M9L02q6K20l5n22M56l58L77m01K13O7l44M92
5684A76Q6l13j99M51j79l06L25k63K10L9k29J17K0P6O3O1Kl65L60j40r5J07J09
5707A13j14J56p4k17k0L47j54k56J91J51j89O4j40Q0j22M69n42J91J69j25m4K66
5729B00j2m34k4M30k86L52J37m33J72L91n38LK45o06J66R6K46j23l5J58r8rK96
5752B94m45K04k37K7J78L44o22M52pk67mJ07Ol03K86m3j25R4L38n07L57Q1n52
5775c44K53J05l12L57j40K42k04N1K5k4J56pk40K0K44l45J20r0p9J38K82k87K17
$$ plain form
5798 138 78 -175 -201 -57 22 -328 159 99 -47 -27 188 -404 -3 381 57 -47 0 175 -175 102 168 -254
5820 -254 191 304 -44 78 218 146 105 222 -261 8 161 -557 -214 120 4 -78 136 -395 -137 14 -132
5841 -132 -198 -232 -15 13 -17 377 -182 -127 -106 -145 -198 58 173 -208 161 215 -210 135 -160 -169 5 286 -41 -159
5865 -159 17 -59 -120 -335 -34 -293 -36 166 -215 -125 56 -301 -16 66 69 12 48 -35 48 127 167 -160 138 -10
5889 -10 163 160 250 139 -63 214 -198 84 32 -425 -120 214 -4 213 46 413 -30 153 426 -149 -51 102
5911 102 -257 -45 341 110 -96 186 0 -101 -7 226 -421 395 260 52 306 48 81 26 -82 12 143
5932 143 -96 98 -281 261 392 -114 67 -26 -235 62 169 -54 -45 11 -191 87 40 191 31 -35 -31 136 114
5955 114 162 -160 -110 57 -302 87 -251 -84 -117 -106 31 147 -255 -147 253 38 90 -110 136 -28 -24 74 79
$$ packed form
5798A38o0k53k6J44P9l50M87o0j46K0K15n92M01L84l24j04M7J75l50K77O6m22
5820b54M45J13l48J22J40p2m1J17m83K69J53p18L43L34j16q2K14n31K58J51j46
5841a32o6l4K17K8l0L94n59N5K1l9n3K56J15l81L69N4m25L45k95rJ74K81l27j18
5865a59J76p6o1k15L01k59K57K02l81R0J81l57K85Q2Ln7L6q3Q3P9M0l27K98j48
5889a0J73lR0j11k02K77m12K82n2m57L05L34k18K17j67L67m43J83K73n75R8J53
5911A02l59K12L86k31k06K82j86j01R4K33o47Q16j35k08K54k58L3n5j08R4J31
5932A43k39J94l79N42J31n06J81r3k09K97J07k23RN6k02K78m7J51j60o6MJ67k2
5955A14M8l22N0J67l59L89l38J67l3J1J37J16m02J08M00k15N2k00K46j64MR8N
$$ plain form
5978 79 121 -52 236 -197 -93 -8 211 -40 59 200 4 -66 -207 -30 73 185 -104 99 131 -191 -23 122
6000 122 165 -178 161 164 -96 207 94 -251 280 -210 -160 -32 7 -86 -239 256 125 -320 -55 -26 28 -130 152
6023 152 -164 18 -106 -52 -341 99 -16 57 -38 -221 -66 107 -183 -271 67 -123 -78 107 104 30 -39 -11 -253
6046 -253 12 -155 29 -78 52 98 -117 -2 -14 -36 80 36 29 59 200 -42 -34 76 174 215 -161 -47 119 131
6070 131 98 162 -133 -90 -33 44 -159 -47 106 -101 -69 11 -80 2 -82 -145 106 67 -222 22 -131 158 32 164
6094 164 206 171 8 78 -114 111 -65 118 13 269 -181 209 -79 -53 58 82 -132 320 -125 -21 85 187
6116 187 96 -122 74 -227 7 22 249 68 -31 -176 5 -72 -179 -255 -85 -177 273 -23 -206 -20 -131 33
6138 33 -82 40 -96 -231 -127 237 42 258 -94 89 49 -116 299 64 -131 71 70 29 127 65 -139 348
$$ packed form
5978G9M2j73K88m33J04Q5K19k51R9J41j96p0j41J77J03J12k89K03L2l22J68J45
6000A22M3l43L39Lk60L03j13l45N31m90N0J28L9r3j53M95j31m45K65K9N4j58K82
6023A52l16J82j24N4k89M40j15P3r5j83J55J73k90q8L38j90M5J85lp4o9K8k42
6046b53K65j67J84j07J30M6k15J15j2k2J16m4pL0J41k42QJ10R8M1l76J14J66J2
6070A31l3O4k95M3N7P7k03J12J53k07L2Q0r1Q2q4o3K51l9k89K44j53K89j26J32
6094A64M2l5j63P0j92K25j76J83j05K56m50L90k88K6J11K4k14M52m45J04J06J02
6116A87r1k18J96l01K34J5K27j81r9j45J81p7j07p6J70r2M50k96j83J86j11J64
6138C3j15J22j36j35J04L64j95K16l52J83m0j65M15k35j95K02jm1R8o2k04M87
$$ plain form
6160 348 -164 105 156 76 58 -18 276 -34 158 -16 -94 -13 98 302 278 124 188 145 -147 57 355 91 284
6183 284 -149 144 75 62 -75 97 -119 34 117 74 -26 -89 45 201 143 -15 -26 -27 34 -73 283 -2 -174
6206 -174 53 -60 -24 -76 87 38 219 -12 93 -27 -16 -12 -204 22 331 -180 -231 284 79 -80 81 -38
6228 -38 -48 -128 -61 122 151 92 -75 -51 0 -61 15 28 17 -55 200 -47 -130 -22 -182 -137 -242 -100 17 -160 182
6253 182 174 -257 70 -74 -137 117 -169 -239 -33 17 14 -163 38 126 42 98 144 129 207 96 191 -116 -53 -104 -30 38
6279 38 185 -210 298 58 -10 66 -150 -11 51 -117 -247 135 -40 137 10 138 -207 -223 -45 -16 -99 206
6301 206 -202 -119 -6 -73 -54 159 -10 312 -202 161 73 -358 31 71 -220 -104 85 -61 125 92 -153 -172
6323 -172 42 -170 60 43 -105 -204 207 -156 -100 209 102 -267 260 -154 -58 122 89 5 259 -61 -91 -137 -8
$$ packed form
6160C48n12K69N1q0j8p6K94l10J92j74p8Q1J11K04k4j54O4m3k92K04K98k64J93
6183B84m33K93o9j3j37J72k16J53Q3m3j00o3J34J56n8j58j1jO1j07L56k85j72
6206a74K27j13L6n2J63m9J81k31J05j20J1Mj92K26L09n11n1N15k05j59J61j19
6228c8j0q0O7J83K9n9j67K4N1o1P6J3j1p2K55k47q3J08j60M5j05J42J17j77L42
6253A82qm31L27j44o3K54k86p0K06N0lj77K01Q8q4N6M6j5P8j11R5l07O3n1P4O8
6279C8J47l95N08k40o8P6k16J39O2j68j30L82j75J77j27J28l45j6J78K9q3L05
6301B06m08Q3J13o7J9K13j69L22n14L63q8m31L89M0k91J16J89j46J86l3k45j9
6323a72K14k12K30j7j48r9M11l63N6L09j07l69N27m14R6J80l3q4K54l20l0m6J29
$$ plain form
6346 -8 -171 41 117 -109 -107 178 18 -250 199 -129 -164 171 239 -14 -65 -72 -62 -128 -68 -156 50 258 170 -185 364
6371 364 238 -158 403 162 -247 147 -72 -146 -111 145 -156 106 18 -296 -192 -122 126 -170 -110 197 5 -402
6393 -402 133 142 -205 214 -55 32 224 54 -16 107 107 30 186 -88 -173 -26 1 -220 96 -22 15 82 -20 -327
6417 -327 -90 -301 -125 -262 -41 326 -192 -57 -55 -35 -70 202 291 -24 162 60 168 209 414 151 90 -9 146
6440 146 235 -299 341 2 235 102 158 100 -131 62 439 -275 -195 -44 27 -19 288 199 49 50 -13 44 -43 -75
6464 -75 -44 -168 -3 -193 233 -53 44 -180 -242 -61 -161 277 -16 111 -245 -164 -208 77 143 86 -35 -18 -27 -34
6488 -34 -37 24 7 14 110 -101 -47 136 71 -82 219 297 -49 79 -3 -222 126 188 -43 -143 -31 84 198 -139
6512 -139 -80 -77 -139 -100 7 -148 23 -37 49 -122 166 111 187 42 46 112 -142 -84 150 119 4 -8 237 -244 264
$$ packed form
6346hj63K12P6k26KK85j60k68M49l28l5L35O8k53n1pJ0o6O0q8K06K08q8l55N49
6371C64j26l96N61k41m09L94k19p4L5K56l01K62q8l14J04P0K48k96O0L07j92m07
6393d02N35Rl47M19k69Q7J92j70p0J23%p7J56k74q5J47K7k21L16j18L7O7j02l07
6417c27K37k11J76j37K21L67n18J35KK0l5K72Q9l15J86j02J08M1K05k63o1r9J55
6440A46Q9n34O40l39K33j33N6n8k31J93L77p14Q0J51P1m6L07q9j50Jo3N7q7l2
6464g5L1j24J65j90M26k86R7k24o2J81j00M38k93J27l56Q1m4K85O6n7j21J7rp
6488c4lO1j7PR6k11N4J83o5j53L01P8l46J28q2k19L48O2k31j00J12J15J14l37
6512a39N9Lo2L9J07j55J71o0Q6j71K88n5P6j45MO6k54N8K34l1j15j2K45m81N08
$$ plain form
6537 264 211 -45 -250 12 108 -18 51 150 -43 1 209 162 78 8 158 73 197 195 23 -84 -109 -56 115 -86
6561 -86 -184 6 -127 124 181 22 -141 -8 25 133 73 -367 55 -310 -96 -151 25 -168 6 130 14 -335
6583 -335 -115 111 -8 -176 270 -273 -153 77 -1 1 143 -56 124 -99 40 213 117 -68 71 -100 108
6604 108 -144 -93 33 31 -25 -28 40 74 -38 35 201 -97 198 53 -142 105 21 -31 16 -176 -99 -35 -215 -238 -214
6629 -214 -113 17 376 -145 -136 60 20 -60 -176 13 38 -33 105 75 -188 140 44 -88 -66 -73 -13 126 335 67
6653 67 -124 221 109 -240 -15 -49 73 -27 160 76 -229 -197 -176 -284 137 16 66 79 -199 67 -15 -146 367
6676 367 68 -250 381 -37 368 -64 -202 39 -263 172 -163 272 -109 47 186 81 146 -403 13 -201
6696 -201 -257 -138 72 103 74 -82 -22 240 14 234 32 7 154 -114 22 24 -134 37 118 -24 9 69 -301
$$ packed form
6537B64n3k56k05K62R6j26O9R9j93M4K08m7q4p0J50q5J24kj72j07k5N3J71k01
6561h6r8J90j33K51N7j59j63J33L3J08o0m40M22l65K14n5J76j93J74J24j16l49
6583c35K20K26j19j68M46n43J20K30p8KJ42j99J80k23J39J73r6j85J39j71K08
6604A08k52N1J26kn6lO8L4j12P3J66k98K95j45j95K47q4n2M7j92P7O4j80k3K4
6629b14J01J30L59n21RJ96m0q0j16J89K5p1J38l0k63L28r6j32K2pO0J39K09k68
6653F7j91L45j12l49K25l4J22j00J87q4l05L2K1j08M21j21N0J3k78K66q2j31N13
6676C67k99l18O31m18M05m32j38K41l02M35l35M35l81J56J39j05O5n49M16k14
6696b01n6J19K10L1k9j56O0K62k26K20k02k5J47k68J36Kj58J71Q1j42L3O0l70
$$ plain form
6719 -301 -43 -145 -37 -87 -143 97 -285 223 164 58 4 -244 -8 37 -103 -117 102 -300 35 155 -68 64
6741 64 -250 94 -98 -18 -60 -88 32 -26 -177 -154 -28 -53 5 60 -128 -142 -52 44 237 80 186 -58 261 -222
6765 -222 -154 80 122 49 -216 59 -219 331 -322 25 -153 -75 119 139 -101 -32 1 -235 112 134 -6 137 182
6788 182 100 -67 -112 -57 -14 -44 -14 8 -28 -64 20 291 -198 45 -14 71 306 135 110 -71 -4 175 -41 -143 291
6813 291 204 -4 189 42 71 5 102 -87 -70 112 25 116 59 -108 -79 241 -34 -208 -49 -19 -148 3 -102
6836 -102 -28 61 -17 -35 -150 -168 -22 465 379 -52 166 -33 -57 25 41 -131 -47 -54 98 -33 125 102 30 7 -99
6861 -99 -40 -133 -35 -2 -182 131 -149 -40 217 -299 11 -169 -71 32 49 63 196 105 141 -119 398 101 98 82
6885 82 136 185 29 83 19 114 395 58 92 179 64 43 -127 30 -152 238 356 -79 145 -55 -54 212 30 -48
$$ packed form
6719c01K58j02J08n0n6K40l82N08n9j06n4k48K36M5j40j4K19m02L35J20k23J32
6741F4l14L44j92Q0m2k8J20n8j51K3J26k5N8N5j88j4R0R6J93j57J06k44L19m83
6765b22O8K34M2p3k65K75k78N50o53L47j78P8J94K0k40O9L3k36L47K2j40J43M5
6788A82q2j67m5N5M3l0L0K2l6l6Q4K71m89K43n9Q5K35j71k5j81O7J79k16j02M34
6813B91q7k08J93j47K9o6R7j89J7J82q7R1n7j67K9L20k75j74J59L0j29J51j05
6836a02P4Q9p8j8j15j8J46M87q6m31K18j99k4Q2J6j72Q4pJ52j31J58k3p2k3j06
6861i9N9r3R8L3j80L13k80J09K57n16L10j80R8J03J7J4J33r1L6k60N17k97lj6
6885H2N4M9j56N4o4R5K81l37L4Q7j15k1j70J57j82L90J18m35K24k00JK66j82p8
$$ plain form
6909 -48 -272 49 -256 -132 16 -5 -155 -40 214 -160 93 -161 269 18 -33 27 84 -183 -10 -245 -66 82
6931 82 9 -61 -108 -118 -95 255 27 23 -107 28 -93 97 42 51 39 109 -2 -46 -89 -7 48 28 112 63 64 -87 -82 216
6959 216 90 201 137 -5 27 38 6 -143 47 -191 -77 -134 203 102 100 189 -48 -29 17 -57 100 126 351 -118
6983 -118 66 4 -175 424 -111 -318 62 -91 156 205 99 -23 -39 205 258 -161 164 194 15 57 83 -171
7005 -171 78 84 158 43 4 76 113 -37 48 -14 110 -129 -244 -93 161 -253 -53 288 -145 132 191 96 83 -133
7029 -133 -119 -174 41 141 -149 -272 -171 -23 162 -181 -110 82 -84 45 -2 -4 81 54 -246 193 -4 -16 187
7052 187 -190 -24 -80 -90 158 9 156 326 226 -64 -110 -218 -24 -47 -185 0 58 -8 35 48 -6 61 -78
7075 -78 -83 -148 197 85 66 211 -68 -108 -193 -54 32 32 -61 -123 -34 -21 -38 32 -29 208 117 87 212 78 -38 -111 -117
$$ packed form
6909d8k24L21l05J24J48k1j50J15K54l74K53k54M30k51n1O0N7k67J73k35J79J48
6931H2p3p0m7j0K3L50k28mj30J35j21J90n5Rj2P0j11m4m3Q2N5k0Q4m9Jj51NK98
6959B16j26J11o4j42L2J1l2j49J90k38J14n7L37j01kQ9k37J9M6p4J57K6K25m69
6983a18J84o2j79N99n35k07L80j53K47M9j06j22j6K44N3m19L25L0j79M2K6k54
7005a71K49OP4j15l9P2L7j50Q5o2J24k39j15J51K54m14K00L41m33K77N9r5j3k16
7029a33J4n5K15J00k90j23J01J48J85l43P1J92j66J29m7kQ5k7l00M39j97j2K03
7052A87l77J66n6j0K48j49J47J70j00k90m6j08J94k3j38J85N8o6M3J3n4O7j39
7075g8no5L45j12j9J45k79m0q5J39Q6%r3o2Q9J3j7P0o1K37r1l0J25j34j16p3o
$$ plain form
7102 -117 -282 27 -95 -75 -206 -195 -177 181 81 223 -129 -370 52 150 105 48 -194 25 -64 -30 235 89 19
7125 19 -103 181 127 131 -48 -162 226 -12 -24 162 -105 265 223 5 -37 -18 -37 -56 45 28 -197 -279 -160 54
7149 54 -176 45 26 140 -73 95 104 63 -211 161 8 60 78 -107 248 -155 70 130 76 63 299 -288 160
7172 160 -50 -9 -151 197 90 -59 271 152 -11 -111 120 -123 -93 68 210 158 -61 56 115 195 -21 -29
7194 -29 43 201 11 -84 77 -252 87 -158 -171 82 112 41 -112 66 201 -16 -87 155 18 83 -156 326 -33
7217 -33 -81 -83 -8 123 -191 82 -34 73 2 -78 -36 147 -155 -185 -64 -85 266 128 -275 -161 -185 27 -253 -128
7241 -128 -36 194 34 -252 33 146 -99 -69 -64 -49 -187 18 198 108 205 85 104 223 198 -37 -159 -32 -61
7264 -61 121 28 -15 -158 104 101 8 143 133 156 -116 -72 265 -92 71 188 -91 -2 -68 88 243 -179 -68 212
$$ packed form
7102a17j65L09j22K0j31J1J8L58j00J42l52k41M22R8m5n7k42K19q9L4K65j46p0
7125A9j22K84n4Mj79j14L88k38j2J86k67L70m2k18m2J9j9j9J01j7k25q2J19K14
7149E4k30K21j9J14k13J68Rm1k74L72j53N2J8j85L55m03K25O0n4j3K36n87M48
7172A60k10M1j42L48j07j49L30j19j63j00K31k43L0J61J42n2k19J17N9Q0k16q
7194b9P2J58j90r5J61l29L39k45j3K53L0p1j53J78J35k17p1K42j37O5k39M82l59
7217c3m8kP5J31l14K73j16J07p1q0M2J83l02l0J21k1L51j38m03J14k4K12k80J25
7241a28R2K30j60k86K85J13k45L0NJ5j38K05J80r0R7j20J9J19k5k35j22J27k9
7264f1J82r3m3j43K62lr3J35j0K3k72M4L37l57J63J17k79Q9o6J56J55m22J11K80
$$ plain form
7288 212 -127 228 -113 110 99 -11 -103 48 10 -120 -283 27 -156 50 -153 -6 -7 151 91 -100 22 69
7310 69 -36 70 -206 182 217 -301 -98 -178 98 38 -186 117 -171 -306 -190 140 -155 -134 -247 42 -230 -301
7332 -301 180 -58 -98 -31 -191 -125 -144 191 -67 -53 -50 -34 -288 -97 -145 -153 248 -138 133 136 -177 36 -1 -220 -40
7357 -40 -147 -73 17 -158 -135 270 -114 -91 145 -32 -1 -41 139 -31 -124 -96 -79 -86 -320 256 -22 -92 -225 -46
7381 -46 -85 -21 90 -89 29 123 -164 22 -294 -283 103 40 -244 185 -224 79 70 -128 113 -97 -252 19 104
7404 104 -5 201 -52 292 -39 -285 264 -40 106 -165 -23 133 133 19 124 -162 -170 -38 -108 285 90 140
7426 140 245 -202 62 20 158 -37 -78 -78 -216 -263 -68 108 -227 -91 -63 40 -219 -126 58 39 -285 69 119
7449 119 -32 223 105 -1 -65 5 19 369 206 56 110 -9 -342 7 116 195 7 -24 57 154 65 89 -24
$$ packed form
7288B12l39L55l41K23j1j10r2J51l8j30j63L10j83K06k03J47jJ58o0j91J22M7
7310F9j05J06k76L88L5n18K03q0K76o0k24L03k88j35J16L30k95K1j13K89k72p1
7332c01M81k38m0O7j60O6j9L35k58J4LJ6k54J91m8qM01l86K71Ll13K13l7k19J80
7357d0j07P4R0j75K3M05l84K3K36j77L1m0J80j70r3K8J7pk34N76k78p0j33J79
7381d6l9O4J11j79J18R4k87J86l16J1L86o3k84M29m09L03rj98K41k10j55K71Q5
7404A04j09K06k53L44l31k46N49l04J46k71J42J56%j14J05k86qJ32p0L93j95N0
7426A40J05m47K64m2J38j95m1%j38m7J95J76l35J36K8J03k59R3J84j9l24L54N0
7449A19j51K55j18j06o4P0J4L50j63j50N4j19l33L49J09P9j88l1Q1R7q9K4j13
$$ plain form
7472 -24 -29 175 290 285 186 -128 -191 35 57 -154 -84 259 -41 52 -80 -88 -79 -32 -193 -67 87 -202 -404 193 11
7497 11 39 -117 -177 -282 -194 -192 169 -43 -141 30 -146 129 -98 88 -184 1 81 8 131 3 115 96 -148
7520 -148 69 183 47 -58 334 92 -210 123 -153 -35 96 -125 57 96 -150 256 -61 -162 -203 -163 65
7541 65 63 185 17 7 -260 134 129 -347 51 -124 62 -251 317 5 -56 -188 -131 61 -60 309 29 -17 165
7564 165 -91 75 142 25 -185 -275 147 40 -321 113 -232 33 209 -35 70 49 85 16 239 -135 -29 -25
7586 -25 -43 104 -22 10 -26 94 272 -298 45 58 -186 266 15 -7 -10 96 -35 -91 187 38 -125 -149 116
7609 116 227 104 358 174 -90 53 -50 179 161 -65 -117 -98 -227 -51 160 -1 -176 -6 -180 -175 -44 -56
7631 -56 -25 63 -156 61 54 98 156 -161 13 -255 -3 193 -178 -387 56 -86 109 -99 -180 -36 -138 49 24
$$ packed form
7472b4nK04J15nr9l14o3K26K2k11P0L43l00R3j32qRM7j61J26J54k89k02N97j82
7497A1K8j56o0j05Q8KL61k12r8J71j76K75k27J86k72J85Q0p3J23j28J12j9k44
7520a48K17J14j36j05L92k42l02L33k76J18J31k21J82L9k46M06l17j01m1M0K28
7541F5kJ22j68j0k67L94nm76L98j75J86l13N68l12o1j32N7J92j21L69k80m6J82
7564A65k56J66O7j17k10r0M22j07l61M34l45K65J76k44J05k1L6o9K23l74J06M
7586b5j8J47j26L2l6J20J78n70L43J3k44M52k51k2lJ06j31n6K78j49j63k4K65
7609A16J11j23K54j84k64J43j03K29j8k26n2J9j29J76K11j61j75J70j74NJ31j2
7631e6L1Q8k19K17pM4N8l17J74k68K52J96l71k09M43j42J95k08q1J44j02J87k5
$$ plain form
7654 24 97 -14 -181 -50 18 91 -133 45 -245 -39 263 -15 -93 -160 -235 -1 -157 99 -82 -15 -78 -351 -204
7677 -204 57 -40 -110 216 -5 -128 -59 196 -81 173 3 100 81 132 76 123 81 -86 105 -45 -67 202 17
7700 17 -74 74 -70 58 -11 2 186 77 89 271 73 -120 143 -16 82 130 -138 -173 84 45 -153 77 89
7723 89 208 62 -132 197 -196 32 -198 -21 -77 59 -33 -95 -255 38 -19 155 77 52 38 -179 -253 -226 -42
7746 -42 -206 218 375 89 7 118 27 -275 -190 -39 -63 -83 -16 61 74 -4 235 42 -98 -274 334 -132 -171 107
7770 107 70 -5 -21 94 261 -127 65 144 285 219 -65 -66 -104 66 -265 -33 182 7 -25 16 227 -88 -65 -215
7794 -215 -313 154 -64 -142 -51 77 114 301 160 -292 -27 215 -109 -5 114 -221 -129 -340 12 -118 -190 98
7816 98 17 -60 -59 94 65 -58 -213 -21 -18 -75 4 60 -22 1 28 139 -143 30 39 -44 20 52 -36 127 -41 -43 169
$$ packed form
7654B4P3j11j67J31O8P3k24J78k90K06L02k78p8o7p5K34j56K56j81O7o3k73J47
7677b04K61r7p0L26k21j23O9K55k77K54j70R7j9N1n6M7m2j67J91j50k2K69j85
7700A7r1J48j44J28o9J3J84j09J2J82j98j93K63j59R8M8k68l5K57l9j98K30J2
7723H9J19j46j94L29l93K28k30J77n6J36r2o2j60K93n7J74p8k5j4k17p4K7J84
7746d2j64M24J57k86q2J11r1l02Q5J51k4k0O7P7J3p8K39j93j40j76O08m66l9K78
7770A07l7p5j6J15J67l88J92P9J41o6k84jl8J70l31K32K15j75l2M1K11l15K3j50
7794b15r8M67k18p8R1J28L7J87j41m52K65K42l24J04J19l35R2k11L52j30p2K88
7816I8q1p7JJ53k9j23j55J92Ln7P9N6q2K3K7J11k82J73Rq3O4L2q8J63j68kK12
$$ plain form
7843 169 155 -89 -96 134 45 -39 148 180 -159 17 54 45 -221 -118 -274 -70 73 -21 -143 6 -336 -69 36
7866 36 226 106 115 -140 -132 -229 239 -52 245 -29 2 240 21 137 -72 181 -258 43 -70 333 -255 -68
7888 -68 -71 104 124 15 183 274 89 -116 -119 26 278 -62 321 -63 -94 14 -202 -28 -106 -125 320 -61 13 -279
7912 -279 66 -76 -215 -24 187 -37 -3 -37 68 -24 -303 -128 196 -47 -422 275 138 4 86 -219 36
7933 36 -3 -87 -20 343 -15 -142 -86 -326 110 118 185 -91 -236 144 -327 -50 -86 -47 68 66 199 -63 -196 52
7957 52 -178 -192 5 186 -86 -19 142 -234 149 -170 -135 -96 -184 -16 -258 272 110 -158 95 47 171 96 -130
7980 -130 143 115 27 2 152 -264 -43 202 78 -29 40 172 -39 -35 383 -26 107 115 -19 -174 -86 -166 287
8003 287 11 -133 67 74 -158 -20 -153 142 -36 -60 36 -64 -20 57 70 -226 59 127 33 115 -163 -29 170
$$ packed form
7843A69j4k44pK30q9q4J87L2l39J76L7rk66J03j56K04J43r4j22J49l42K67J05
7866C6J90j20Rk55Qr7M68k91K97k74L1K38k19J16k09K53m39L01j13M03n88J87
7888f8lJ75K0j09J68R1j85k05lJ45K52l40L83l84l1J08k16J74p8j9M45l81P4k92
7912b79L45j42j39J91K11k24L4l4J05r2k79J75L24k43l75O97j37j34Q2l05K55
7933C6l9q4O7L63l58j27N6k40M36QO7k76j45L80m71K77l6L9J15kJ33k62j33K48
7957E2k30j4J97J81k72O7J61l76L83l19L5L9q8J68k42N30j62k68K53m8J24p5k26
7980a30K73k8q8k5J50m16K21K45j24j07O9J32k11MM18m09J33Qj34j55Q8q0M53
8003B87k76j44K00Pk32J38j33K95j78k4R6j00M4P7J3k96K85O8r4Q2k78J34J99
$$ plain form
8026 170 51 -19 -228 132 -316 193 -166 -53 121 38 65 115 -80 78 -177 -147 317 -191 -51 193 11 -178
8048 -178 199 -315 65 63 83 20 -64 -285 -41 -114 169 -199 36 121 86 -27 119 75 -177 205 -105 93 71
8071 71 124 70 103 33 -89 3 266 -18 -145 -91 -134 105 135 126 -302 38 123 -188 -104 -40 -70 76 125 -207 136
8096 136 149 -45 150 219 -245 94 379 63 -71 6 -253 33 111 39 -89 224 -82 -5 67 30 -104 27 -189
8119 -189 -172 -169 82 382 123 -28 -45 -91 -7 -55 -139 87 111 39 -179 106 35 -90 259 45 -25 -84 160 4
8143 4 14 -1 69 128 373 -113 -89 36 56 118 -54 12 -209 -331 150 -110 179 132 84 -104 120 -218 -24 26
8167 26 28 -92 29 79 -112 -100 115 -132 216 -71 -98 -52 163 133 25 4 225 111 -254 65 -116 105 123
8190 123 -131
$$ packed form
8026A70j19p0k09L60m48N09l59J13J74q3K7N0j95J58k55L0M64n08J40K44j82j89
8048a78L77n14L80kK0o3q4k21K44p3K83l68K35Q5l5j13J46m4k52L82l10J98k2
8071G1N3n4L3p0j22R2K63k84j27N4m3K39L0rm28L40Q5l11Q4O4l0J46M9l32L43
8096A36J3j94J95O9m64L39K85l16j34P7k59K86P8p2j28L13l06P7P2l7j34J31k16
8119a89J7LK51L00k59j51j7m6Q4m8q4K26K4p2k18K85p1j25L49k14p0n9K44j56
8143DJ0j5P0N9K45m86K4J25K0O2j72O6k21j22M81k60K89m7m8j88K24l38J94N0
8167B6Kj20J21N0j91J2K15k47L48k87k7M6K15l0j08k1K21j14l65L19j81K21J8
8190A23k54
8191a31
$$ Imaginary data points
##PAGE= N=2
##DATA TABLE= (X++(I..I)), XYDATA
$$ plain form
0 0 0 0 0 0 0 0 0 0 0 0 0 0 0 0 8 -8 8 -8 8 -8 16 -16 22 -24 25 -32 39 -40 48 -56 64 -72 81 -92 104 -116
36 -116 131 -146 164 -183 203 -224 249 -276 304 -337 372 -407 450 -495 546 -602 664 -732 811
55 811 -899 1001 -1116 1255 -1416 1613 -1860 2176 -2594 3182 -4063 5530 -8398 16075 -79130
70 -79130 -204991 -45067 -88494 -138726 -30698 -63466 -192041 -130756 -105450 -175334 -88693
81 -88693 -6311 -144856 -179007 -100034 -170471 -170747 -47273 -97139 -148101 -89141 -149478 -190982
93 -190982 -57940 -22609 -98971 -56987 -37837 -137714 -98504 -6247 -61963 -39177 25065 -102202
105 -102202 -137810 -11376 -34447 -68734 33426 8812 -97786 -44731 -4297 -64069 8421
116 8421 75463 -54422 -82627 2418 -65891 -77947 40372 6096 -67122 -24025 -47430 -88094
$$ packed form
0@%%%%%%%%%%%%%%Qj6J6j6J6j6K4l2L8m6M9n7P1p9Q8j04J20j36J53j73J96k20
36a16K47k77L10l47L86m27M73n25N80o41P09p79Q57r45J041j148J266j396J543
55H11j710J900k117K371k671L029l473M036m770N776p245R593j3928K4473r5205
70g9130j25861J59924m3427n0232J08028l2768j28575O1285K5306o9884Q6641
81h8693Q2382j38545l4151P8973p0437k76J23474m9866n0962N8960o0337m1504
93a90982J33042L5331p6362M1984J9150r9877L9210R2257n5716K2786O4242j27267
105a02202l5608J26434k3071l4287J02160k4614j06598N3055M0434n9772P2490
116H421O7042j29885k8205Q5045o8309j2056J18319l4276p3218M3097k3405m0664
$$ plain form
128 -88094 5740 47021 -27216 -9543 16700 -69120 -49046 42575 3818 1981 47534 -36781
140 -36781 -61391 35488 29775 8768 83829 68946 -16169 24697 72460 33562 84326 134121
152 134121 35444 20817 88089 36000 39699 139906 104998 38042 78419 70878 32121 102723
164 102723 141988 69314 69763 94154 18632 25894 106277 71030 43726 71463 14950 -16988
176 -16988 43993 49356 25896 61513 44004 -30366 -9470 30089 -4934 21412 51876 -29195
188 -29195 -48442 -1668 -36863 -29741 41606 9554 -46757 -16709 -17125 -47495 9396 45011 -17588
201 -17588 -19355 3408 -54919 -38939 34677 4393 -19421 10457 -26246 -53696 2127 23223
213 23223 -500 18764 15812 -42386 -30325 12857 -8752 2730 24868 -31981 -51560 -19043
$$ packed form
128h8094R3834M1281p4237J7673K6243q5820K0074R1621l8757j837M5553q4315
140c6781k4610R6879n713k1007P5061j4883q5115M0866M7763l8898N0764M9795
152A34121r8677j4627O7272n2089L699J00207l4908o6956M0377p541l8757P0602
164A02723L9265p2674M49K4391p5522P262Q0383l5247k7304K7737n6513l1938
176a6988O0981N363k3460L5617j7509p4370K0896L9559l5023K6346L0464q1071
188b9195j9247M6774l5195P122P1347l2052n6311L0048m16l0370N6891L5615o2599
201a7588j767K2763n8327J5980P3616l0284k3814K9878l6703k7450N5823K1096
213B3223k3723J9264k952n8198J2061M3182k1609J1482K2138n6849j9579L2517
$$ plain form
225 -19043 -32636 -22971 20121 -4667 -47541 -32146 -31294 -51124 -9154 15222 -38777 -46462 -31438
238 -31438 -73988 -56925 -501 -24467 -45351 -26956 -53427 -72425 -25495 -905 -23582 -13177
250 -13177 -12648 -59590 -46512 -2256 -15944 -8492 12163 -28382 -44510 -12399 -6421 2154 31142
263 31142 22004 -11114 -4963 7847 2089 31226 50252 13097 4371 12200 -10311 10020 48707
276 48707 31893 17482 23736 3984 -6131 29526 48105 26096 27570 23750 -14810 -5865 29264
289 29264 18632 19232 27110 -4994 -20422 1193 12834 17675 30355 22986 -7439 -9749 5339
302 5339 4618 21998 34858 6245 -7349 -3631 -9204 8800 32458 27262 15000 8584 573 1974
316 1974 25183 41084 29312 23982 15415 -7975 4582 29081 25092 27598 25540 1313 -7166
$$ packed form
225a9043j3593R665M3092k4788m2874J5395Q52j9830M1970K4376n3999p685J5024
238c1438m2550J7063N6424k3966k0884J8395k6471j8998M6930K4590k2677J0405
250a3177N29m6942J3078M4256j3688P452K0655m0545j6128L2111N978Q575K8988
263C1142r138l3118O151J2810n758K9137J9026l7155q726P829k2511K0331L8687
276D8707j6814j4411O254j9752j0115L5657J8579k2009J474l820l8560Q945L5129
289B9264j0632O00P878l2104j5428K1615J1641M841J2680p369l0425k310J5088
302E339p21J7380J2860k8613j3594L718n573J8004K3658n196j2262o416q011J401
316A974K3209J5901j1772n330q567k3390J2557K4499l989K506k058k4227q479
$$ plain form
329 -7166 8793 22223 25466 27681 20830 -5516 -12537 2005 4295 12011 16022 -5564 -21227 -25154
343 -25154 -21451 -6643 1720 497 -12173 -29105 -31649 -26107 -14517 -2461 -9272 -22627 -34690
356 -34690 -43956 -32691 -18626 -12162 -9031 -22625 -35191 -33581 -26045 -9227 1579 -1989 -10704
369 -10704 -24956 -27600 -15023 -4151 5438 4348 -7697 -17261 -21143 -7650 8466 10893 15378
382 15378 6507 -13934 -9851 3005 6882 16203 16213 -287 -16301 -12951 -2845 637 12610 14782
396 14782 -8812 -14468 -8652 -10952 4578 16889 3424 -8458 -14060 -19726 -14391 2690 9230
409 9230 -3220 -8328 -13148 -23918 -6615 13032 6975 9404 5679 -14808 -10603 6820 10659 15812
423 15812 20004 4595 -10983 1330 12811 11295 29835 31734 2920 5675 17366 9152 24404
$$ packed form
329g166J5959J3430L243K215o851k6346p021J4542K290P716M011k1586j5663l927
343b5154L703J4808Q363j223j2670j6932k544N542J1590J2056o811j3355j2063
356c4690r266J1265J4065O464L131j3594j2566J610P536J6818J0806l568q715
369a0704j4252k644J2577J0872R589j090j2045r564l882J3493J6116K427M485
382A5378q871k0441M083J2856L877R321J0j6500j6014L350J0106L482J1973K172
396A4782k3594n656N816k300J5530J2311j3465j1882n602n666N335J7081O540
409I230j2450n108m820j0770J7303J9647o057K429l725k0487M205J7423L839N153
423A5812M192j5409j5578J2313J1481j516J8540J899k8814K755J1691q214J5252
$$ plain form
436 24404 42034 22907 6999 11834 6681 4693 27429 32555 9985 10187 8719 -8868 9276
449 9276 28734 13111 11876 11169 -12840 -12808 8458 7686 1603 8705 -6082 -28582 -12099 753
463 753 -9480 7562 9481 -22944 -19608 -4520 -14436 -1804 15889 -5481 -21929 -9597 -13715
476 -13715 -18705 10894 14950 -13468 -5578 -808 -21716 -488 24176 4051 653 7855 -13708
489 -13708 -16218 11858 12093 -732 10398 312 -24655 -4265 11039 -4151 11213 14866 -19545
502 -19545 -16715 2282 -10259 -4489 14939 -6467 -28150 -11786 -13867 -24343 4493 7339 -25740
515 -25740 -16076 -8794 -32449 -12412 12126 -11530 -17128 -5207 -26265 -30002 2899 2286 -17449
528 -17449 75 -4805 -33240 -8952 11697 -6454 6277 14801 -16790 -14081 10331 442 1790
$$ packed form
436B4404J7630j9127j5908M835n153j988K2736N126k2570K02j468j7587J8144
449I276J9458j5623j235p07k4009L2K1266p72o083P102j4787k2500J6483J2852
463G53j0233J7042J919l2425L336J5088r916J2632J7693k1370j6448J2332m118
476a3715m990K9599M056k8418P890M770k0908K1228K4664k0125l398P202k1563
489a3708k510K8076K35j2825J1130j0086k4967K0390J5304j5190J5364L653l4411
502a9545K830J8997j2541N770J9428k1406k1683J6364k081j0476K8836K846l3079
515b5740R664P282k3655K0037K4538k3656n598J1921k1058l737L2901o13j9735
528a7449J7524m880k8435K4288K0649j8151J2731Q524l1591K709K4412r889J348
$$ plain form
541 1790 24383 7003 -16240 3687 7188 -4661 23743 27213 -7034 4435 14979 -8515 8774
554 8774 34452 10107 -609 13251 -2697 -10491 21853 19753 -4035 14320 9801 -20664 3775
567 3775 24610 1332 9191 18707 -11768 -11586 14355 2824 -1683 22732 6725 -22218 1583
580 1583 9861 -7113 16879 22381 -10413 -1193 11393 -10046 4470 29820 6506 -7977 9159
593 9159 -2093 -11490 19959 19059 -5601 12278 9000 -20745 5014 26709 872 3761 15965
606 15965 -10105 -13695 11524 3564 -4529 17305 1893 -26875 -1651 8210 -12308 6867 14053
619 14053 -17205 -12031 854 -16712 -6845 16984 -5462 -23268 -2552 -9743 -23810 4900 8095
632 8095 -16112 -2531 -3942 -28395 -4207 15577 -9319 -7794 6617 -15777 -21100 6203 1674
$$ packed form
541A790K2593j7380k3243J9927L501j1849K8404L470l4247J1469J0544k3494J7289
554H774K5678k4345j0716J3860j5948p794L2344k100k3788J8355m519l0465K4439
567C775K0835k3278P859R516l0475J82K5941j1531m507K4415j6007k8943K3801
580A583Q278j6974K3992N502l2794R220J2586k1439J4516K5350k3314j4483J7136
593I159j1252r397L1449r00k4660J7879l278k9745K5759K1695k5837K889J2204
606A5965k6070l590K5219p960q093K1834j5412k8768K5224R861k0518J9175P186
619A4053l1258N174J2885j7566R867K3829k2446j7806K0716p191j4067K8710L195
632H095k4207J3581j411k4453K4188J9784k4896J525J4411k2394n323K7303m529
$$ plain form
645 1674 -8811 12417 -922 -26866 817 11350 -10127 7887 17391 -11804 -9974 6299 -5633
658 -5633 255 20825 1295 -14983 5882 596 -14121 13977 17991 -7588 1948 3962 -15565
671 -15565 3397 20076 -1564 -3203 10933 -8472 -16398 10550 8542 -4894 10818 1145 -20639
684 -20639 3305 11390 -8022 7720 15516 -12550 -11867 6898 -3291 -2508 16552 609 -16434
697 -16434 4131 765 -13863 12009 16615 -9780 -2227 2971 -12622 1206 16237 -1705 -5364
710 -5364 7440 -9074 -16022 10776 9256 -6667 7190 1158 -18738 732 9679 -6219 4644
723 4644 10586 -13343 -13682 4963 -2206 -5150 11231 -1484 -17529 546 -1445 -12974 9345
736 9345 11154 -12679 -6105 1181 -12126 -3217 12607 -1478 -8648 3164 -7816 -14811 9225
$$ packed form
645A674j0485K1228j3339k5944K7683J0533k1477J8014R504k9195J830J6273j1932
658e633N888K0570j9530j6278K0865n286j4717K8098M014k5579R536K014j9527
671a5565J8962J6679k1640j639J4136j9405p926K6948k008j3436J5712r673k1784
684b0639K3944Q085j9412J5742P796k8066O83J8765j0189P83J9060j5943j7043
697a6434K0565l366j4628K5872M606k6395P553N198j5593J3828J5031j7942l659
710e364J2804j6514o948K6798j520j5923J3857o032j9896J9470Q947j5898J0863
723D644N942k3929l39J8645p169k944J6381j2715j6045J8075j991j1529K2319
736I345J809k3833O574P286j3307Q909J5824j4085p170J1812j0980o995K4036
$$ plain form
749 9225 8849 -7087 5194 1523 -14588 466 10395 -1591 5338 9625 -9099 -9422 8885 3058
763 3058 -1200 14377 4092 -11814 4200 5747 -3908 12880 14323 -5998 -1313 5784 -4058 1867
777 1867 16172 4030 -4919 6028 -2162 -8158 12279 11608 -3421 5985 3855 -10295 1857 11557
791 11557 1540 2659 7328 -5966 -8862 6877 4338 -1212 10465 2562 -11091 1779 4253
804 4253 -2746 9157 9683 -5383 -3765 3199 -3301 166 12403 3109 -6544 2388 -1135 -6710 9561
819 9561 9795 -2410 2913 1050 -8527 482 9023 1785 416 3926 -5883 -8888 4965 3880 -1714
834 -1714 6433 466 -11047 -1316 2494 -2505 4184 4938 -6588 -7900 -1602 -4192 -2513 6155 -655
849 -655 -9265 -2970 -5249 -7849 4495 3644 -5779 -3255 -4406 -9716 -3890 4016 -697 -4708 -2120
$$ packed form
749I225l76j5936J2281l671j6111J5054R929j1986O929M287j8724l23J8307n827
763C058m258J5577j0285j5906J6014J547r655J6788J443k0321M685P097r842N925
777A867J4305j2142q949J0947q190n996K0437o71j5029R406k130j4150J2152R700
791A1557j0017J119M669j3294k896J5739k539n550J1677p903j3653J2870K474
804D253o999J1903N26j5066J618O964o500L467J2237r294r653Q932l523n575J6271
819I561K34j2205N323j863r577R009Q541p238j369L510r809l005J3853j085n594
834a714Q147n967j1513R731L810m999O689P54j1526j312O298k590J679Q668o810
849f55q610O295k279k600J2344q51r423K524j151n310N826P906m713m011K588
$$ plain form
864 -2120 -7767 -10699 244 1158 -3127 1116 -3475 -11199 -4369 -770 -2292 942 424 -7254 -9316
879 -9316 -3699 -3247 -2697 3646 -1318 -8514 -4553 -4296 -5065 3052 2881 -3198 -3921 -5110 -5636 -1805 3458
896 3458 1604 -2302 -1615 -4949 -5861 2615 3862 997 2767 -1282 -4937 -706 3079 4149 4020 2947
912 2947 -1185 -3490 814 3637 3998 6687 3647 -1037 516 1313 3850 7911 6481 3636 1015 -77
928 -77 2064 4189 7613 7131 2955 1899 1093 1402 6323 8166 7264 5114 1062 1342 3022 5092 8708
945 8708 6660 3583 2226 412 2755 6584 7306 6830 4082 1475 927 2026 6523 6990 4972 4748
961 4748 -80 -1845 2761 3774 4069 5074 1410 -2447 -2016 762 2340 2775 3679 -1130 -5226 -2111
977 -2111 -2675 -1934 3158 -633 -5105 -4387 -6125 -5584 -1206 480 -3078 -5647 -5020 -7839 -7112 -85 -1887
$$ packed form
864b120n647k932J0943R14m285M243m591p724O830L599j522L234n18p678k062
879i316N617M52N50O343m964p196L961K57p69Q117j71o079p23j189n26L831N263
896C458j854l906O87l334r12Q476J247k865J770m049l655M231L785J070j29j073
912B947m132k305M304K823L61K689l040m684J553P97K537M061j430k845k621j092
928g7K141K125L424m82m176j056q06L09M921J843r02k150m052K80J680K070L616
945H708k048l077j357j814K343L829P22m76k748k607n48J099M497M67k018k24
961D748m828j765M606J013K95J005l664l857M31K778J578M35R04m809m096L115
977b111n64P41N092l791m472P18j738N41M378J686l558k569O27k819P27P027j802
$$ plain form
994 -1887 -5316 -3104 -7871 -10010 -3280 -2070 -3647 -1261 -3620 -8686 -6709 -1544 -2882 -2038 1540
1009 1540 -5039 -8574 -1905 -3543 -3910 3066 -296 -6214 -3787 -3078 -4934 167 3402 -2250 -4342
1024 -4342 -1428 -5460 -4805 3730 210 -4152 344 -4737 -7992 160 1645 -2458 22 -234 -7040
1039 -7040 -4860 2186 -1021 -1369 4229 -3387 -6868 1101 -714 -2378 5365 2362 -4744 -311 1551
1054 1551 -1840 3177 8264 348 -1516 4676 -405 -300 9949 5559 138 5993 2489 -1838 6779
1069 6779 9227 3220 5734 6806 -966 1148 9925 4605 3598 10088 1297 -3002 7082 4464 1019
1084 1019 8062 5861 -2786 1229 4774 -720 3147 9205 -686 -2873 4625 -2141 -2485 8047 2791
1099 2791 -3876 2676 -296 -5507 2835 6270 -1721 473 4176 -5223 -3540 7023 1171 -1429 6077
$$ packed form
994a887l429K212m767k139O730J210j577K386k359n066J977N165j338Q44L578
1009A540o579l535O669j638l67O976l362n918K427P09j856N101L235n652k092
1024d342K914m032O55Q535l520m362M496n081l255Q152J485m103K480k56o806
1039g040K180P046l207l48N598p616l481P969j815j664P743l003p106M433J862
1054A551l391N017N087p916j864O192n081J05J0249m390n421N855l504m327Q617
1069F779K448o007K514J072p772K114Q777n320j007O490q791m299J0084k618l445
1084A019P043k201q647M015L545n494L867O058r891k187P498o766l44J0532n256
1099B791o667O552k972n211Q342L435p991K194L703r399J683J0563n852k600P506
$$ plain form
1114 6077 -1652 -6190 3876 2106 -1994 5498 3747 -6018 -1449 4394 -2270 700 7447 -2792
1128 -2792 -4907 3681 -3137 -4340 6390 1167 -6948 -113 -1409 -7329 -336 3461 -5370 -3578 596
1143 596 -9155 -7614 3679 -3979 -7132 954 -6087 -11513 -1064 -1897 -7479 -767 -629 -11323 -6645
1158 -6645 1053 -6203 -4065 3673 -6009 -8680 898 -4428 -5770 4984 92 -7544 -49 949 -6211
1173 -6211 737 6859 -2715 -1710 4512 -4841 -2801 9162 1354 -2776 6176 486 -5507 4196 5420
1188 5420 -789 4596 5129 -5117 -390 7848 -978 387 8924 -1308 -4910 4940 460 -1943 7487
1203 7487 2885 -5056 1991 4071 -4323 1847 8568 -1282 -1836 5017 -3515 -2032 8805 1424 -2571
1218 -2571 6158 1327 -5273 4496 7074 -780 3719 6290 -3887 -53 8842 -92 894 9999 165
$$ packed form
1114F077p729m538J0066j770m100P492j751r765M569N843o664K970O747j0239
1128b792k115Q588o818j203J0730n223q115O835j296n920O993L797q831J792M174
1143E96r751J541J1293p658l153Q086p041n426J0449q33n582O712J38j0694M678
1158f645P698p256K138P738r682k671R578n326j342J0754m892p636P495R98p160
1173f211O948O122r574J005O222r353K040J1963p808m130Q952n690n993R703J224
1188E420o209N385N33j0246M727Q238q826J365Q537j0232l602R850m480k403R430
1203G487m602p941P047K080q394O170O721r850n54O853q532J483J0837p381l995
1218b571Q729m831o600R769K578p854M499K571j0177L834Q895q934R86R105r834
$$ plain form
1233 165 -3971 5730 2999 -608 6919 4500 -3987 2117 4640 -3890 1584 8755 -2284 -3518 3973
1248 3973 -3575 -3852 6054 -157 -5023 2145 -1904 -8684 36 3125 -5576 -2543 1312 -8040 -5614
1263 -5614 2798 -5358 -4495 3719 -5645 -9617 398 -1148 -6017 1078 933 -7670 -2937 1351 -5844
1278 -5844 -1074 5958 -4255 -5070 3268 -2908 -3394 5606 1148 -3878 2309 658 -5356 2384 6207
1293 6207 -2838 -63 4935 -4375 -2648 5742 -562 -1622 4699 -2146 -5872 2229 1733 -3640 2073
1308 2073 2308 -6077 -2674 2047 -4609 -1514 4618 -4499 -5533 1555 -3279 -4687 3102 313 -5324
1323 -5324 -710 -409 -5551 179 4390 -3482 -1047 3558 -4085 -2419 5448 455 -720 4918 -87
1338 -87 -3189 4039 4726 -183 4164 5690 -2354 939 6022 466 2671 7940 620 -822 4906 972
$$ packed form
1233A65m136R701k731l607P527k419q487O104K523q530N474P171j1039j234P491
1248C973p548k77R906o211m866P168m049o780Q720L089q701L033L855r352K426
1263e614Q412q156Q63Q214r364l972J0015j546m869P095j45q603M733M288p195
1278e844M770P032j0213q15Q338o176m86R000m458n026O187j651o014P740L823
1293F207r045K775M998r310J727Q390o304j060O321o845l726Q101m96n373N713
1308B073K35q385L403M721o656L095O132r117j034P088m834j408P789k789n637
1323e324M614L01n142N730M211p872K435M605p643J666P867m993j175N638n005
1338h7l102P228O87m909M347J526q044L293N083n556K205N269p320j442N728l934
$$ plain form
1354 972 -79 5880 4118 -1654 1625 2456 -2588 1954 5625 -1872 -920 3097 -3348 -2161 3860 58
1370 58 -2048 1828 -1428 -4487 399 2002 -2510 579 2027 -4677 -2425 2696 -1941 -80 3805
1385 3805 -1663 -2682 1776 632 -930 4063 3225 -1736 838 3176 -1085 2556 5690 188 441
1400 441 3456 -841 235 5154 2094 154 2556 655 -2352 1500 3295 -868 622 1759 -3841
1415 -3841 -2409 1214 -1997 -1603 862 -3425 -4606 -1991 -2259 -3451 -1116 -1214 -5478 -4076 -2097 -4992
1431 -4992 -2586 253 -4245 -4228 -1773 -4535 -3698 59 -772 -2968 -1514 -1486 -3707 -657 1642 -944
1447 -944 135 1058 -2284 -565 2249 935 1373 2599 164 -754 1642 1850 1381 2626 3121 -192 62
1464 62 2475 168 1612 3308 365 -129 685 -810 4 1718 1326 -728 -576 -676 -2050 -307 1381
$$ packed form
1354I72j051N959j762n772L279Q31n044M542L671p497R52M017o445J187O021l802
1370E8k106L876l256l059M886J603m512L089J448o704K252N121m637J861L885
1385C805n468j019M458j144j562M993q38m961K574K338m261L641L134n502K53
1400D41L015m297J076M919l060j940K402j901l007L852J795m163J490J137n600
1415c841J432L623l211L94K465m287j181K615k68j192K335r8m264J402J979k895
1431d992K406K839m498J7K455k762Q37L757q31k196J454K8k221L050K299k586
1447i44J079R23l342J719K814j314M38J226k435r18K396K08m69J245M95l313K54
1464F2K413k307J444J696k943m94Q14j495Q14J714l92k054J52j00j374J743J688
$$ plain form
1481 1381 -624 -579 -94 -2127 -1480 602 -56 141 167 -425 -1220 -505 827 806 1141 1399 -523 -236 1484
1500 1484 1019 2483 2976 1487 1478 1375 1569 2742 3221 3376 2219 1460 2074 1545 2351 3373 2502 2036 1270
1519 1270 401 1457 1680 1625 1930 404 116 -134 -657 590 726 -256 -488 -1467 -1849 -1333 -510 -287 -1128
1538 -1128 -1515 -1495 -3176 -1625 -658 -1524 -1193 -1205 -2282 -2227 -1290 -880 -535 -146 -832 -2347 -1430 -17 -833
1557 -833 907 1342 -1139 -665 380 -937 763 1860 601 -524 -119 -505 -656 616 1598 -810 -227
1574 -227 117 -2324 -621 958 -1064 -725 -218 -2847 -2401 -745 -814 -1940 -754 -1545 -4225 -2272 -922
1591 -922 -3498 -1426 -646 -3738 -3237 -1678 -3385 -1903 -37 -2012 -3393 -1584 -1755 -2966 -187 226
1607 226 -2713 -735 -99 -2734 -758 2028 -350 -294 1362 -935 -1209 1656 1511 -62 2230 1693 -1676
$$ packed form
1481A381k005M5M85k033O47K082o58J97K6n92p95P15J332k1L35K58j922K87J720
1500A484m65J464M93j489rj03J94J173M79J55j157p59O14n29Q06J022q71m66p66
1519A270q69J056K23n5L05j526k88k50n23J247J36r82k32r79l82N16Q23K23q41
1538a128l87K0j681J551R67q66L31j2j077N5R37M10L45L89o86j515R17J413q16
1557h33J740M35k481M74J045j317J700J097j259j125M05l86j51J272R82k408N83
1574b27L44k441J703J579k022L39N07k629M46J656o9j126J186p91k680J953J350
1591i22k576K072P80l092N01J559j707J482J866j975j381J809j71j211K779M13
1607B26k939J978O36k635J976K786k378N6J656k297k74K865j45j573K292n37l369
$$ plain form
1624 -1676 1115 2594 -167 2381 3243 -495 464 2543 318 518 3659 1390 -1297 1809 1263 -1233
1640 -1233 2708 2944 -983 901 2073 -1213 858 3336 -57 -2 2653 -319 -1353 2608 2078 -778
1656 -778 2651 2011 -1556 1218 3362 -374 2023 3790 -421 -50 3262 1229 536 4439 2219 -845
1672 -845 2912 2864 -271 3619 4538 -744 1708 3248 -709 1257 4432 918 -339 2820 -14 -1830
1688 -1830 2759 1896 -2187 1646 1077 -3360 -12 1499 -2589 -324 1455 -3048 -2946 1000 -1710 -3073
1704 -3073 1080 -827 -4660 -715 -489 -4159 -29 830 -4239 -1867 509 -3341 -2097 1708 -1611
1719 -1611 -2748 854 -1494 -3631 1325 1091 -3359 830 1474 -3692 -308 2470 -1660 -480 2373
1734 2373 -1883 -2472 2323 -202 -2357 2124 720 -3515 478 1210 -3018 717 2049 -3283 -1513
$$ packed form
1624a676K791J479k761K548Q62l738R59K079k225K00L141k269k687L106n46k496
1640a233L941K36l927J884J172l286K071K478l393N5K655k972j034L961n30k856
1656g78L429o40l567K774K144l736K397J767m211L71L312k033o93L903k220l064
1672h45L757m8l135L890R19n282K452J540l957J966L175l514j257L159k834j816
1688a830M589q63m083L833n69m437L348J511m088K265J779m503J02L946k710j363
1704c073M153j907l833L945K26l670M130Q59n069K372K376l850J244L805l319
1719a611j137L602k348k137M956k34m450M189O44n166L384K778m130J180K853
1734B373m256n89M795k525k155M481j404m235L993P32m228L735J332n332J770
$$ plain form
1749 -1513 1668 -2503 -2319 2140 -953 -3595 731 -499 -4153 1101 1006 -4082 -330 624 -4144 -1316
1765 -1316 2271 -2263 -1631 1578 -1768 -2851 1985 -32 -2863 2307 1145 -3832 584 2199 -2165
1780 -2165 966 2771 -1629 -447 2727 -582 -641 3804 1272 -2207 2098 1422 -2160 2366 2960 -1980
1796 -1980 1384 2609 -2227 218 3901 -406 -911 2496 -54 -2379 2412 1230 -2201 2406 1275
1811 1275 -3425 698 2584 -1833 369 2562 -1467 -952 2329 -865 -1431 3382 968 -2579 2174
1826 2174 1759 -2324 1890 2912 -1326 1093 2459 -1342 351 3857 568 -478 3372 1327 -1423
1841 -1423 2768 2207 -1164 2513 2432 -2051 1437 3030 -571 798 2999 -757 -1124 2427 -44 -1261
1857 -1261 2405 691 -2926 1273 691 -2721 644 1722 -2540 -963 660 -2845 -1815 1786 -1093
$$ packed form
1749a513L181m171J84M459l093k642M326j230l654N254r5n088L752R54m768K828
1765a316L587m534O32L209l346j083M836k017k831N170j162m977M416J615m364
1780b165L131J805m400J182L174l309n9M445k532l479M305o76l582M526N94m940
1796a980L364J225m836K445L683m307n05L407k550k325M791j182l431M607j131
1811A275m700M123J886m417K202K193m029N15L281l194n66M813k414l547M753
1826B174m15m083M214J022m238K419J366l801J693L506l289j046L850k045k750
1841a423M191n61l371L677q1m483L488J593l601J369K201l756l67L551k471j217
1857a261L666j714l617M199n82l412L365J078m262J577J623l505J030L601k879
$$ plain form
1872 -1093 -2901 903 -1304 -3900 458 281 -3086 272 -24 -3573 -896 1020 -2303 -950 1245
1887 1245 -1751 -2665 1186 -549 -2289 1633 267 -3026 454 688 -2519 631 1634 -1622 -859 1131
1903 1131 -1395 -1327 2003 11 -2036 1226 -265 -2672 1238 1133 -1969 650 798 -2545 -365 1375
1919 1375 -1124 -770 1313 -796 -2108 1046 365 -1698 1313 472 -2202 356 714 -1611 495 1794
1935 1794 -950 -748 1460 -401 -682 1965 450 -1248 1549 666 -1631 1659 1948 -746 1036 1548
1951 1548 -1125 187 2124 206 59 1952 98 -1307 1620 951 -851 1764 1089 -1570 662 1380
1967 1380 -894 711 1852 -690 -783 917 -331 -955 1372 367 -1440 705 261 -1526 1149 1063
1983 1063 -1103 150 799 -1182 -905 900 -168 -952 1119 -351 -1637 1007 542 -1036 772 530
$$ packed form
1872a093j808L804k207k596M358j77l367L358k96l549K677J916l323J353K195
1887A245k996r14L851j735j740L922j366l293L480K34l207L150J003l256P63J990
1903A131k526O8L330j992k047L262j491k407L910j05l102K619J48l343K180J740
1919A375k499L54K083k109j312L154o81k063L011q41k674K558L58k325K106J299
1935A794k744K02K208j861k81K647j515j698K797q83k297L290K89k694J782N12
1951A548k673J312J937j918j47J893j854j405K927o69j802K615o75k659K232P18
1967A380k274J605J141k542r3J700j248o24K327j005j807K145m44j787K675q6
1983A063k166J253O49j981K77J805j068p84K071j470j286K644m65j578J808k42
$$ plain form
1999 530 -1089 -280 870 -61 121 1005 -152 -815 837 -19 -488 1169 364 -1092 465 266 -660 916
2017 916 1094 -580 -120 322 -530 -392 1034 383 -835 149 -99 -1135 800 460 -687 510 149 -910
2035 -910 -236 255 -302 -234 607 -251 -1239 92 -72 -777 366 -187 -1271 -407 -478 -813 361 98 -527
2054 -527 -465 -379 -678 -721 181 249 -743 -183 -402 -623 155 10 -332 167 -338 -481 -162 -137 176 257 269 48
2076 48 -425 139 228 -132 539 30 -382 298 144 248 624 400 332 -66 -236 528 -67 456 565 283 198
2097 198 -187 -43 586 588 374 730 116 414 369 481 777 350 184 452 -14 91 425 552 532 -36 358
2118 358 104 -264 711 417 319 442 123 4 674 423 244 382 383 96 -110 161 -103 -151 575 -147 -857
2139 -857 390 -210 -575 386 279 -638 -248 -463 -527 -438 407 -634 -560 -71 -716 -1150 481 -199 -791 -132
$$ packed form
1999E30j619Q09J150r31J82Q84j157o63J652q56m69J657q05j456J557j99r26J576
2017I16J78j674M60M42q52J38J426o51j218R84k48j036J935l40j147J197l61j059
2035i10O74M91n57O8Q41q58r88J331j64p05J143n53j084Q64p1l35J174k63o25
2054e27O2Q6k99m3R02O8r92N60k19k21P78j45l42M99n05j43L19K5L13Q1J2k21
2076D8m73N64Q9l60O71n09m12O80j54J04L76k24o8l98j70P64n95N23J09k82q5
2097A98l85J44O29Kk14L56o14K98m5J12K96m27j66K68m66J05L34J27k0n68L94
2118C58k54l68R75k94r8J23l19j19O70k51j79J38Jk87k06K71k64m8P26p22p10
2139h57J247o00l65R61j07r17L90k15o4Q9Q45j041P4M89o45m34J631o80n92O59
$$ plain form
2159 -132 -406 -1452 -337 -396 -994 -606 -154 -723 -1216 -94 -682 -1039 318 -695 -1547 36 -337 -922
2177 -922 117 -159 -841 -443 -95 -1055 -621 803 -624 -950 300 -726 -1291 522 193 -929 526
2194 526 5 -1293 216 670 -335 -64 1024 -310 -912 1259 -79 -966 1184 19 -888 593 410
2211 410 -526 657 1069 -804 55 897 -521 -292 1178 -265 -896 837 -90 -945 1267 589 -806
2228 -806 843 440 -1036 116 1031 -728 -255 1328 -43 -734 1532 360 -850 1609 236 -898
2244 -898 911 669 -695 489 1348 -377 -96 1661 -160 0 1915 252 -581 1613 444 -685
2260 -685 1407 906 -585 887 1179 -386 332 1517 -406 -309 1497 -44 -1115 1680 270 -947
2276 -947 1157 374 -1292 431 789 -1118 143 1169 -957 -826 1281 -380 -766 1652 77 -1410
$$ packed form
2159a32k74j046J115n9n98L88M52n69m93J122n88l57J357j013q52J583l73n85
2177i22J039k76o82L98L48r60M34J424j427l26J250j026n65J813l29j122J455
2194E26n21j298J509M54j005K71J088j334o02K171j338q87K150j165r07J481j83
2211D10r36J183M12j873Q59Q42j418K29J470j443o31J733r27q55K212o78j395
2228h06J649m03j476J152R15j759M73J583j371o91K266j172j210K459j373j134
2244h98J809k42j364J184Q59j725K81J757j821J60J915j663q33K194j169j129
2260f85K092n01j491J472K92j565P18J185j923R7J806j541j071K795j410j217
2276i47K104p83j666J723L58j907J261J026k126J31K107j661l86K418j575j487
$$ plain form
2292 -1410 909 262 -1186 737 556 -1046 67 1110 -1020 -402 1406 -934 -795 1507 -847 -1288
2308 -1288 1104 113 -1139 789 182 -1543 212 482 -1490 -581 1049 -1194 -1412 1082 -718 -1187
2324 -1187 976 -492 -1774 381 -355 -2280 -61 276 -1564 -737 649 -1480 -1346 674 -1139 -1658
2340 -1658 932 -877 -1983 767 -130 -1558 369 262 -1896 58 735 -1149 -478 1069 -1065 -997
2356 -997 1434 -69 -876 1295 459 -1035 940 665 -835 767 1405 -652 57 1530 -461 -277 2120
2373 2120 249 -695 1890 190 -889 1653 964 -764 816 1045 -867 139 1422 -339 -12 1845
2389 1845 -542 -824 1643 -241 -882 1661 144 -1360 701 805 -961 396 1330 -1014 -283 1605
2405 1605 -523 -619 1556 -135 -909 1336 109 -1137 1380 786 -1023 725 1066 -988 53 1543
$$ packed form
2292a410K319o47j448J923j81j602J113J043k130O18J808k340J39K302k354m41
2308a288K392r91j252J928o07j725J755K70j972R09J630k243k18K494j800m69
2324a187K163j468j282K155p36j925K219L37j840Q27J386k129J34K020j813n19
2340a658K590j809j106K750q97j428J927j07k158J954O77j884O71J547k134O8
2356i97K431j503q07K171q36j494J975k75j500J602O38k057P09J473j991J84K397
2373B120j871r44K585j700j079K542o89j728J580K29j912J006J283j761L27J857
2389A845k387k82K467j884o41K543j517j504K061J04j766J357R34k344P31J888
2405A605k128r6K175j691p74K245j227j246K517n94j809J748L41k054J041J490
$$ plain form
2421 1543 -374 -489 1839 -323 -941 1941 -1 -877 1468 172 -1573 448 706 -990 309 1003
2437 1003 -917 -755 1475 -713 -1096 1334 -409 -1474 525 -173 -1225 472 410 -1401 -70 979
2453 979 -1316 -751 924 -773 -912 1007 -627 -953 1058 4 -918 428 142 -1129 240 1222 -967
2470 -967 -215 1483 -464 -578 1571 -372 -585 1534 -213 -573 1116 532 -792 748 953 -540 304
2487 304 980 -680 -58 1280 -280 -768 1139 -518 -1070 787 -302 -1193 428 253 -1173 -501 427
2504 427 -1078 -535 546 -981 -1101 519 -795 -1097 594 -497 -1294 260 69 -904 -192 447 -920
2521 -920 -413 710 -889 -639 937 -292 -517 1195 -35 -666 888 555 -412 433 388 -608 -160 1073
2539 1073 -213 -208 1103 -477 -240 1137 -245 -686 939 233 -690 301 -1 -572 42 631 -568 -546
$$ packed form
2421A543j917j15K328k162o18K882j942q76K345j296j745K021K58j696J299O94
2437A003j920J62K230k188l83K430j743j065J999o98j052J697o2j811J331J049
2453I79k295N65J675j697j39J919j634l26K011j054r22J346k86j271J369R82k189
2470i67P52J698j947j14K149j943k13K119j747l60J689n84j324J540K05j493Q44
2487C04O76j660O22J338j560m88J907j657n52J857j089q91J621j75j426O72R28
2504D27j505N43J081j527j20J620j314l02J691j091p97J554j91r73P12O39j367
2521i20N07J123j599K50J576j229k25J712j230o31J554l33r67Q45m5r96M48J233
2539A073j286NJ311j580K37J377j382m41J625p06r23R91l02n71O14N89j199K2
$$ plain form
2557 -546 764 -797 -251 761 -436 -436 711 -168 -685 290 408 -638 8 850 -533 70 1106 -466
2575 -466 -258 987 -87 -347 777 221 26 1205 696 -38 332 647 -92 345 1020 141 133 1036 -119
2594 -119 331 963 85 -192 672 261 -405 39 455 -100 -141 393 -554 -369 702 -637 -408 409 -671
2613 -671 -561 50 -297 -417 -46 252 -741 -508 8 -527 -246 312 -466 -413 448 -343 -410 633 -66 -201
2633 -201 376 -182 -176 177 726 198 241 755 215 10 729 415 216 503 345 471 439 385 212 262 427 154
2655 154 -79 271 96 -51 577 -197 -135 -46 -50 -228 -204 -542 -308 -569 -422 -191 -347 -370 -288 -545 -493 -654 -583
2678 -583 64 -629 -543 -509 -697 -112 -322 -285 168 -348 -254 -95 -68 -28 81 45 -85 90 108 -16 52 604 -60
2701 -60 31 333 -139 -38 251 292 128 151 -12 -100 -125 362 -279 -234 304 -387 -178 224 -513 -379 404 -421
$$ packed form
2557e46J310j561N46J012j197%J147q79n17R75J18j046O46Q42j383O03J036j572
2575d66K08J245j074k60J124n56j95J179n09p34L70L15p39M37O75q79qR03j155
2594a19M50O32q78k77Q64m11o66M44M16n55m1N34r47J85J071j339K29Q17j080
2613f71J10O11l47j20L71K98r93K33N16n35K81N58p78N3Q61p91o7J043o99j35
2633b01N77n58OL53N49n28M3N14n40k05P19l14j99K87j58J26l2n4j73N0J65k73
2655A54k33L50j75j47O28p74O2Q9mj78K4l38K34k61J47K31j56k3Q2k57N2j61P1
2678e83O47o93Q6L4j88N85k10L7M53n16R4J59K7M0J09l6j30J75J8j24O8N52o64
2701f0R1L02m72J01K89M1j64K3j63q8k5M87o41M5N38o91K09M02p37J34P83q25
$$ plain form
2723 -421 -495 -161 -479 -140 -261 -132 -630 -411 -54 -751 -251 380 -687 -199 422 -542 -206 153 -90 -99 211
2744 211 108 -313 327 729 226 225 921 -6 436 1113 39 119 995 164 286 843 259 -20 807 490 -307
2765 -307 117 674 -272 10 602 11 -199 505 -762 -488 296 -188 -344 64 -210 -1102 -365 63 -1200
2784 -1200 -350 241 -1193 -771 98 -795 -613 463 -496 -488 -43 70 -685 43 523 -842 -52 553 -655
2803 -655 -59 980 -346 -14 1094 -577 136 878 380 -252 653 752 -533 563 962 -513 202 986
2821 986 -520 -144 859 -202 -108 855 -59 -607 244 343 -948 247 521 -1112 -16 764 -880 -483
2839 -483 707 -898 -539 403 -474 -663 599 401 -905 316 419 -897 162 1200 -732 -97 809
2856 809 -485 108 1113 -78 -410 1030 352 -485 625 977 -711 502 1178 -568 351 1182 -510
$$ packed form
2723d21p4L34l18L39j21J29m98K19L57o97N00O31j067M88O21r64L36L59k43rL10
2744B11j03m21O40M02n03jO96r27M42O77j074Q0Q76q31J22N57n84k79Q27l17p97
2765c07M24N57r46K82N92n91k10P04j267K74P84m84j56M08k74q92P37M28j263
2784a200Q50N91j434M22Q69q93J82J076r59QM45J13p55P28M80j365P90O05j208
2803f55N96J039j326L32J108j671P13P42m98o32R05R9j285J096L99j475P15P84
2821I86j506L76J003j061R4R63r14n48Q51R9j291J195K74j633J096P80j644L97
2839d83J190j605L59R42q77j89J262j98j306J221J03j316J059J038j932O35R06
2856H09j294N93J005j191l32J440o78q37J110L52j688J213O76j746R19Q31j692
$$ plain form
2873 -510 -10 1174 -376 -385 1070 -11 -746 656 574 -948 364 602 -1230 -26 914 -1091 -369 832
2891 832 -1112 -744 591 -516 -998 410 -160 -1028 125 503 -1308 246 680 -1219 -125 1054 -782
2908 -782 -162 1124 -323 -369 497 438 -811 572 664 -1186 725 1194 -699 502 1288 -612 -40 1502
2926 1502 -196 -338 936 315 -225 588 698 -1301 280 815 -1267 218 874 -1034 -429 754 -311
2943 -311 -654 737 -538 -1055 545 -125 -1226 128 297 -1225 -65 447 -1650 -240 515 -828 -733
2960 -733 713 -299 -766 579 92 -916 475 569 -1144 304 859 -1080 -128 839 -689 -260 1031
2977 1031 -318 -289 917 350 -965 861 465 -1093 464 730 -903 114 926 -713 -112 967 -402
2994 -402 -459 832 -307 -1106 715 346 -1223 140 451 -1071 222 967 -927 -45 830 -730 -610
$$ packed form
2873e10N00J184j550rJ455j081p35J402q2j522J312K38j832J204R40k005P22J201
2891H32j944L68J335j107m82J408n70q68J153L78j811J554M34j899J094J179j836
2908g82O20J286j447m6Q66n9j249J383R2j850J911M69j893J201P86j900N72J542
2926A502j698j42J274o21n40Q13J10j999J581N35k082J485O56j908O05J183j065
2943c11l43J391j275n17J600o70j101J354J69j522J160N12k097J410P55j343R5
2960g33J446j012m67J345m87j008J391R4j713J448N55j939R52R67j528M29J291
2977A031j349K9J206n67j315J826l96j558J557K66j633J017Q12j639O01J079j369
2994d02n7J291j139p99J821l69j569J363L11j522J293P45j894Q82Q75j560J20
$$ plain form
3011 -610 646 -208 -713 781 364 -1046 649 538 -1137 234 797 -726 351 1141 -649 207 1110
3028 1110 -38 -197 1184 257 -376 762 700 -670 615 748 -628 383 995 -490 417 1024 -454
3045 -454 -172 825 -305 -829 597 131 -1144 221 201 -1069 86 563 -1002 -193 637 -862 -425 313
3063 313 -783 -631 411 -168 -1034 287 214 -1085 343 455 -1013 -279 595 -385 -115 752 -366 -272
3081 -272 435 151 -446 445 376 -891 566 826 -676 165 794 -515 -75 1143 -428 -105 541 115
3099 115 -506 508 312 -800 531 437 -853 94 476 -964 161 636 -190 -454 81 -423 -431 527 27
3118 27 -676 -26 220 -717 112 285 -770 36 -24 -479 -244 186 -8 -213 574 161 -367 406 312 -540 713
3139 713 499 -386 422 516 -410 -22 558 -123 155 526 35 -308 581 270 -426 149 608 -313 116 533
$$ packed form
3011f10J256q54n05J494m17j410J695j11j675J371N63j523J077P90j790Q56R03
3028A110j148j59J381r27o33J138o2j370J285J33j376J011O12j485R07O07j478
3045d54K82R97j130n24J426m66j275J365k0j270J155M77j565Q09Q30j499M37P38
3063C13j096J52J042n79q66J321p3j299J428J12j468P34Q74r80K70Q67j118R4
3081b72P07k84n97Q91o9j267J457K60j502Q41O29j309M40J218j571L23O46m26
3099A15o21J014j96j112J331r4j290R47L82j440J125M75q26k64N35n04qR58n00
3118B7p03O50K46r37Q29J73j055Q06o0m55K35M30j94k05P87m13n28P73r4q52J253
3139G13k14q85Q08R4r26L88N80o81K78L71m91l43Q89l11o96N75M59r21M29M17
$$ plain form
3159 533 -382 223 380 -155 -79 366 54 -143 203 128 -471 116 -63 -421 366 65 -484 204 413 -294 -119
3180 -119 313 -56 -226 372 229 -249 564 322 -178 496 26 -254 244 448 181 256 205 178 220 330 371 265
3202 265 -25 395 -106 183 330 -259 303 312 -163 144 232 58 -9 139 -35 -138 -166 -128 -441 -39 134 -231
3224 -231 -56 -248 -602 33 -493 -331 -250 -223 -191 -644 -308 -1 -393 -172 -93 -291 -11 -301 -379 86 26 -243
3246 -243 23 -254 -99 -282 -172 -188 -339 -161 148 -317 275 77 46 -25 77 -164 42 -328 158 40 13
3267 13 474 22 56 266 -117 145 138 16 198 -155 2 331 -52 86 -68 -150 98 50 -377 191 324 86
3289 86 118 147 -65 6 32 31 119 139 -81 -432 215 381 -206 220 309 149 490 127 -135 -48 229 258 -40 477
3313 477 83 -332 439 308 -229 444 281 -132 226 255 -159 -30 231 -439 -30 154 -16 -335 529 -202
$$ packed form
3159E33r15O05J57n35P6M45l12j97L46p5n99N87j79l58P87l01n49O88K09p07J75
3180a19M32l69j70N98j43m78Q13k42n00O74m70k80M98K04k67P5n1k7M2J10M1j06
3202B65k90M20n01K89J47n89N62Rm75L07Q8j74o7J48j74j03k8L8l13M02J73l65
3224b31J75j92l54O35n26J62Q1K7L2m53L36L07l92K21P9j98K80k90p8M65o0k69
3246b43K66k77J55j83J10j6j51J78L09m65N92j98l1p1J02k41K06l70M86j18k7
3267A3M61m52L4K10l83K62pj22J82l53J57L29l83J38j54q2K48m8m27N68J33k38
3289H6L2K9k12P1K6jQ8K0k20l51O47J66n87M26Q9j60L41l63k62Q7K77K9k98N17
3313D77l94m15P71j31n37O73j63m13L58K9m14J29K61o70M09J84j70l19Q64p31
$$ plain form
3333 -202 -588 134 -88 -331 175 295 -553 -16 115 -368 -387 40 -258 -622 591 20 -549 332 -164 -465
3353 -465 138 92 -635 173 217 -165 -385 494 -5 -92 588 257 -463 524 244 -359 460 263 -385 243 311
3374 311 -322 -128 480 -92 -83 199 -91 -378 477 53 -490 553 104 -399 373 243 -539 -9 470 -402
3394 -402 -397 93 -338 -706 449 70 -692 264 -34 -615 432 229 -322 204 408 -308 -530 569 8 -494
3414 -494 779 124 -873 659 195 -591 266 320 -747 -150 336 -395 -111 379 -337 -711 814 -404 -464
3433 -464 457 39 -738 683 324 -476 461 78 -482 -290 460 -456 -159 592 -256 -465 485 -131 -596 543
3453 543 334 -751 191 322 -738 205 602 -480 -189 805 -302 -620 1044 0 -687 722 308 -474
3471 -474 843 454 -750 14 555 -362 192 811 -203 -633 730 76 -910 715 152 -885 606 292
$$ packed form
3333b02l86P22k22k43N06J20q48N37J31m83j9M27k98l64J213n71n69Q81m96l01
3353d65O03m6p27Q08M4l82k20Q79m99q7O80l31p20R87k80o03Q19j97o48O28O8
3374C11o33J94O08n72RK82k90k87Q55m24n43J043m49n03P72j30p82N30M79q72
3394d02NM90m31l68J155l79p62R56k98n81J047k03n51N26K04p16k22J099n61n02
3414d94J273o55r97J532m64p86Q57N4j067N97M86p31K84M90p16l74J525j218o0
3433d64R21m18p77J421l59q00R37l83n60J92P50r16K97P51q48k09R50o16m65J139
3453E43k09j085R42J31j060R43L97j082K91R94j107l18J664j044o87J409m14p82
3471d74J317l89j204P64N41r17N54O19j014m30J363o54r86J625n63j037J491l14
$$ plain form
3489 292 -1021 453 315 -715 -114 727 -452 -368 823 -380 -547 483 -289 -725 650 -73 -917 210
3507 210 467 -484 -144 758 -464 -537 585 -258 -764 517 42 -761 483 74 -748 283 364 -593 33
3526 33 487 -566 -394 686 -434 -629 563 -90 -623 502 -117 -823 740 -63 -645 473 659 -275
3544 -275 159 843 -310 -334 821 -190 -424 997 -175 -528 799 528 -628 526 643 -302 316 712
3562 712 -254 -296 849 -145 -569 958 -40 -809 724 154 -790 432 242 -841 118 786 -182 -178 581
3581 581 -299 -563 601 -472 -282 461 -196 -629 881 182 -663 318 395 -523 -311 520 -225 -375 651
3600 651 -518 -652 535 -338 -829 364 -252 -900 67 164 -690 -9 454 -298 -186 414 -674 -505 807
3619 807 -276 -540 546 -203 -770 62 131 -369 56 323 -515 -195 536 -731 -639 791 -539 -663 476
$$ packed form
3489B92j313J474j38j030O01Q41j179Q4J191j203j67J030p72m36J375p23q44J127
3507B10K57r51L40R02j222p3J122q43n06J281m75q03J244m09q22J031Q1r57O26
3526C3M54j053J72J080j120j95J192o53n33J125o19p06J563q03n82J118J86r34
3544b75M34O84j153k4J155j011k34J421j172l53J327k71j156J154J17r45O18L96
3562G12r66m2J145r94m24J527r98p69J533n70r44J222j90j083R59O68r68MP59
3581E81q80k64J164j073J90P43o57m33J510o99q45R81P7r18K12Q31p45j50J026
3600F51j169j34J187q73m91J193o16o48R67R7q54O81M63p52J12O00j088J69J312
3619H07j083k64J086p49n67Q32O9n00M25K67q38L20P31j267R2J430j330j24J139
$$ plain form
3638 476 16 -383 503 108 -533 -104 426 -292 207 364 -451 -256 666 -258 -442 514 108 -629 471 114
3658 114 -587 408 172 -387 -234 344 -347 -210 573 -417 -358 572 -33 -710 545 96 -426 216 127 -428
3678 -428 30 235 -47 -149 464 -205 -430 417 -429 -468 303 -68 -502 407 -210 -634 22 239 -404 256
3698 256 616 -368 -176 712 -48 -340 758 -223 60 162 -76 -47 542 186 -55 82 450 -82 -120 680
3718 680 -61 -211 229 31 147 570 160 -192 336 146 -233 242 380 77 13 634 -179 -65 591 -359
3738 -359 -294 555 -40 -244 348 -13 -206 -163 200 -446 -181 349 -273 -135 260 -210 -233 47 -61 -204 257
3759 257 -97 -238 -152 -129 -293 -86 35 -397 -226 271 -225 -17 -42 -400 -399 124 -265 -400 -24 -290 -130 -140
3781 -140 -19 -30 -273 164 -372 -373 -135 -576 -42 198 -176 -76 -238 -217 -130 142 82 -310 -199 84 -431 -388
$$ packed form
3638D76m60l99Q86l95o41M29N30p18M99J57q15J95R22r24j84R56m06p37J100l57
3658A14p01R95k36n59J53N78o91J37P83r90N9R30o05o77J255m49n22O42q9n55
3678d28M58K05k82j02O13o69k25Q47q46l9P71l71m34R09o17m24O56K17o43O60
3698B56L60r84J92Q88p60k92J098r81K83J02k38K9N89l56k41J37L68n32l8Q00
3718F80p41j50M40j98J16M23m10l52N28j90l79M75J38l03o4O21q13J14O56r50
3738c59O5Q49n95k04N92l61j93M3L63o46K65N30o22J38L95m70k3K80j08j43M61
3759B57l54j41Q6K3j64K07J21m32J71M97m96K08k5l58JN23l89j35L76k66J60j0
3781a40J21j1k43M37n36jK38m41N34K40l74J00j62K1Q7K72o0l92J11K83n15M3
$$ plain form
3803 -388 68 -151 -210 220 -181 -221 -45 -227 -179 2 25 256 -95 229 16 141 165 28 132 133 139 215 108
3826 108 -92 290 12 77 114 -118 422 272 36 92 10 -67 53 99 225 95 -68 200 -194 -81 332 -154
3848 -154 -127 263 -111 270 46 -87 231 78 117 -247 -187 221 3 103 267 -67 -117 294 -275 -121 355
3869 355 94 -113 27 196 -57 216 53 -249 180 16 -84 -193 365 -82 97 139 -218 75 109 125 -244
3890 -244 50 90 -226 -24 406 -186 -192 130 -295 -186 275 -279 -166 323 -183 -336 20 311 -324 -86 210
3911 210 -251 176 272 -228 -186 236 -67 -66 135 -96 -52 31 245 -61 102 88 -248 -269 262 -427 -72 414 -357
3934 -357 24 561 -180 -362 41 122 -379 70 638 -322 42 251 -226 -7 511 -491 -205 205 -338 -242
3954 -242 196 -120 -366 237 50 -387 -169 271 -338 70 319 -431 -128 345 -75 -402 213 103 -464 252
$$ packed form
3803c88M56k19n9M30m01m0J76j82M8J81K3K31l51L24k13J25K4j37J04JOP6j07
3826A08k00L82k78O5L7k32N40j50k36N6q2p7J20M6J26j30j63K68l94J13M13m86
3848a54K7L90l74L81k24j33L18j53L9l64O0M08k18J00J64l34n0M11n69J54M76
3869C55k61k07J40J69k53K73j63l02M29j64j00j09N58m47J79M2l57K93L4J6l69
3890b44K94M0l16K02M30n92oL22m25J09M61n54J13M89n06j53L56K91o35K38K96
3911B10m61M27R6n00M2M22l03JK01k31M4Q3K14l06J63j4l36k1N31o89L55M86p71
3934c57L81N37p41j82M03Q1n01M49N68r60L64K09m77K19N18j002K86M10n43R6
3954b42M38l16k46O03j87m37K18M40o09M08K49p50L03M73m20l27O15j10n67P16
$$ plain form
3974 252 -20 -637 51 -31 -497 126 81 -310 -62 288 -435 377 306 104 -480 256 408 -540 352 421 -314
3995 -314 253 605 -551 -192 635 -288 -45 384 -156 -244 304 7 -274 278 336 -248 164 425 -407 -4
4015 -4 642 -515 -46 423 -154 -300 36 -165 -255 170 -97 -651 -51 144 -632 37 331 -449 -27 248 -470
4036 -470 -324 377 -252 -567 217 -41 -458 240 243 -561 106 481 -663 256 614 -534 -22 415 -288 -376
4056 -376 305 -285 -433 323 -149 -574 67 447 -533 -49 462 -615 -208 320 -293 -377 607 140 -562 310
4076 310 4 -561 431 282 -853 173 335 -191 257 512 -175 32 471 -93 -223 440 188 -199 430
4095 430 391 -498 244 327 -230 1 539 -141 -34 520 -131 57 605 202 -157 546 211 -449 274 648 -536
4116 -536 220 660 -589 -18 545 -365 37 552 -289 -324 343 -18 -645 154 161 -852 -271 37 -556 56
$$ packed form
3974B52k72o17O88q2m66O23m5l91K48L50p23Q12p1k02n84P36J52r48Q92O9p35
3995c14N67L52j156L59Q27r23K43M29n40q8N48k97k81N52N8n84M12K61q32M03
4015dO46j157M69M69n77j46L36k01r0M25k67n54O00J95p76O69K94p80M22K75p18
4036d70J46P01o29l15P84k58m17O98Lq04O67L75j144R19L58j148N12M37p03q8
4056c76O81n90j48P56m72m25O41L80r80M84N11j077M07N28o13q4R84m67p02Q72
4076C10l06n65R92j49j135J026J62n26M48K55o87K07M39n64j30O63k52l87O29
4095D30l9q89P42Q3n57K31N38o80J07N54o51J88N48m03l59P03l35o60P23L74j184
4116e36P56M40j249N71N63r10M02N15q41l5O67l61o27P99Pj013N81L08n93O12
$$ plain form
4136 56 348 -459 120 129 -368 -530 135 -145 -513 393 44 -700 -14 423 -477 -177 448 -534 -30 184 86
4157 86 -120 410 127 -365 391 241 -553 169 162 -208 138 620 -153 153 277 -234 83 357 -60 -494 239
4178 239 113 -320 277 440 -465 256 264 -637 -14 352 -313 -245 304 -156 -402 405 -202 -579 473 330 -748
4199 -748 208 442 -828 140 442 -424 77 342 -86 -273 243 -123 -417 111 71 -669 133 333 -365 5
4219 5 221 -400 200 127 -174 -206 333 -38 -318 464 81 -351 375 -45 -346 87 111 -496 -5 257 -232 -2
4241 -2 266 -82 -550 369 -33 -76 135 455 -521 332 196 -212 178 163 -135 -132 233 -255 -46 452 66 -362
4263 -362 410 52 -253 319 419 -375 307 166 -258 -192 325 58 185 487 -39 -113 511 486 -117 455 197
4284 197 -188 288 262 -176 -149 -10 -186 147 295 -31 -168 13 90 -329 420 245 -545 135 -20 -187 -73
$$ packed form
4136E6K92q07N79Rm97j62O65k80l68R06l49p44O86M37r00L00O25r82N04K14r8
4157H6k06N30k83m92P56j50p94P22pl70L46M82p73L06J24n11L17K74m17m34P33
4178B39j26m33N97J63r05P21Qr01O23L66o65O8N49m60k46Q07o07l77J052j43j078
4199g48R56K34j270R68L02q66N01K65m28j87N16l66k94N28m0p40Q02K00o98L70
4219EK16o21O00p3l01l2N39l71k80P82l83m32P26m20l01M33K4o07M91K62m89K30
4241bK68l48m68R19m02m3K11L20r76Q53j36m08L90j5k98LL65m88K09M98l86m28
4263c62P72l58l05N72J00p94O82j41m24O6N17k67J27L02n26p4O24k5o03N72k58
4284A97l85M76k6m38K7J39j76L33J48l26j37J81P7m19P49j75p90O80j55j67J14
$$ plain form
4305 -73 65 -243 -146 0 -68 -172 3 136 -346 118 111 -282 216 83 -377 176 -254 -292 46 146 -269 -132
4327 -132 173 -308 -113 201 147 -193 107 -159 -359 -83 249 -262 0 -109 -104 16 -97 -46 -36 92 84 33 120
4350 120 245 23 124 340 -159 169 201 -130 140 258 -10 40 218 146 -23 176 361 -106 192 -14 -46
4371 -46 295 68 -132 27 0 94 63 -126 -37 125 389 214 93 209 91 -69 150 -183 -157 212 2 102
4393 102 19 -156 304 -285 -193 33 -238 -45 -142 -316 9 -58 145 -75 60 60 -104 -180 257 -273 15 118
4415 118 -100 -137 -261 -101 -70 -35 -124 -54 -152 -134 -188 -273 199 326 -187 158 95 250 -45 228 164 -99 217 218
4439 218 106 385 171 -59 257 278 -219 331 208 -94 311 6 290 18 272 257 -1 29 207 4 204
4460 204 -292 178 124 106 -258 -301 -33 -173 33 146 52 92 158 -20 -78 288 21 -370 278 -85 -342 411
$$ packed form
4305g3J38l08R7J46o8j04J75J33m82M64pl93M98j33m60N53m30l8L38J00m15J37
4327a32L05m81J95L14n4l40L00k66k00K76L32n11K62j09NJ20j13N1J0J28qn1Q7
4350A20J25k22J01K16m99L28L2l31K70J18k68N0J78p2j69J99J85m67K98k06l2
4371d6L41k27k00J59k7R4l1j89Q9J62K64j75j21J16j18j60K19l33K6L69k10J00
4393A02q3j75M60n89R2K26k71J93r7j74L25o7K03k20J35%j64p6M37n30K88J03
4415A18k18l7j24J60L1L5q9P0r8J8n4q5M72J27n13L45o3J55k95K73o4k63L16J
4439B18j12K79k14k30L16K1m97N50j23l02M05l05K84k72K54j5k58L0J78k03K00
4460B04m96M70n4j8l64m3K68j40K06J13r4M0O6j78n8L66k67l91O48l63k57P53
$$ plain form
4482 411 -106 -272 191 -45 7 -14 314 72 -383 263 -24 -302 157 144 -83 15 83 -95 -31 -41 -57 15 88
4505 88 -12 -167 137 192 -316 368 -197 -328 117 91 -298 -66 -43 -196 -90 141 -203 -285 240 -274 -186 358
4527 358 -269 -216 122 -148 -109 389 36 -166 -85 310 12 242 429 -287 -140 551 -359 -309 634 105 -92
4548 -92 44 155 -27 46 40 -395 178 368 -364 -91 140 -64 -147 412 80 -132 258 243 -135 250 253 -163 73
4571 73 360 -115 -266 -57 -288 -582 346 -31 -369 157 -156 -332 119 14 -125 -288 131 -328 -192 409
4591 409 -45 -511 352 168 -372 201 -69 -155 243 95 -279 108 103 -147 -171 364 112 -236 553 -293 -276 532
4613 532 -85 -25 360 156 -226 221 190 -297 112 455 -201 -244 389 -57 -307 527 131 -284 487 -246 69
4634 69 370 202 80 90 370 -225 -56 516 -245 -239 407 -161 -325 302 -3 -109 301 48 -403 -73 136
$$ packed form
4482D11n17j66M63k36N2k1L28k42m55O46k87k78M59j3k27R8O8j78O4j0j6P2P3
4505H8j00j55L04N5n08O84n65j31M45k6l89K32K3j53J06K31l44q2N25n14Q8N44
4527C58o27N3L38k70L9M98l53k02Q1L95k98K30J87p16J47O91r10N0R43n29j97
4548i2J36J11j82P3om35N73J90p32K73K31k04q3N59l32k12L90j5l78L85Lm16K36
4571G3K87m75j51K09k31k94R28l77l38N26l13j76M51j05j39j63M19m59J36O01
4591D09m54m66Q63j84n40N73k70q6L98j48l74L87nk50k4N35k52l48P89q46J7Q08
4613E32o17O0L85k04l82M47l1m87M09L43o56m3O33m46k50Q34l96m15P71p33L15
4634F9L01j68j22J0K80n95J69N72p61OO46n68j64O27l05j06M10k53m51L30K09
$$ plain form
4655 136 -406 -4 244 -232 -285 260 -198 -198 56 84 -238 287 16 -483 182 264 -301 -3 282 -293 -67 246
4677 246 169 -191 381 -277 -207 426 -3 -511 -227 92 -53 204 189 -472 -422 417 -366 -284 343 48 -364 220
4699 220 -109 -358 87 77 -123 -93 221 -294 28 545 -348 -231 328 -277 -143 483 -170 -297 334 116 -158
4720 -158 159 217 -216 114 256 -145 99 719 -395 -43 541 7 -137 235 -41 -282 173 137 -467 23
4740 23 242 -110 -307 227 -181 -303 463 -146 -391 272 -59 -62 8 215 -515 -60 158 -302 52 388 -511
4761 -511 -66 420 -401 -168 176 -74 -97 291 -265 -474 176 232 -313 -173 407 -328 1 342 -115 -318 280
4782 280 -100 -287 318 -97 -54 27 281 -327 101 306 -256 121 512 -257 -78 397 -478 -176 255 -143 -252
4803 -252 131 67 84 -109 267 -31 129 297 141 -146 694 -72 134 502 -183 5 321 35 -211 102 274
$$ packed form
4655A36n42M02K48m76n3N45m58%K54K8l22N25k71m99O65Q2n65K98K85n75K26L13
4677B46p7l60N72o58P0O33m29n08K84L19j45K57j5o61N0Q39p83Q2O27k95m12N84
4699B20l29k49M45j0k00L0L14n15L22N17q93J17N59o05J34O26o53j27O31k18k74
4720a58L17N8m33L30J42m01K44O20j114L52N84n34j44L72k76k41M55l6o04M90
4740B3K19l52j97N34m08j22P66o09k45O63l31lP0K07p30M55K18m60L54L36q99
4761e11M45M86q21K33L44k50k3L88n56k09O50N6n45J40N80p35L29L41m57k03N98
4782B80l80j87O05m15M3Q1K54o08M28K05n62L77L91p69J79M75q75L02M31l98j09
4803b52L83o4J7j93L76k98J60J68j56k87Q40p66K06L68o85J88L16k86k46L13J72
$$ plain form
4824 274 -131 -108 171 -155 -170 383 -261 73 423 -100 -100 253 -329 6 1 163 -370 13 30 -335 -255 343 -207
4847 -207 -14 85 -291 -271 129 98 -66 67 45 16 -234 160 -186 -73 317 -336 -195 359 -199 -67 154 -41
4869 -41 -251 212 88 -104 176 106 -151 87 51 -341 35 227 -175 209 221 -45 -177 237 54 102 14 -147
4891 -147 159 -22 102 -193 -136 369 51 214 112 -91 -25 305 7 -28 136 316 141 75 291 -225 -19
4912 -19 378 107 -270 123 -84 -209 -93 -222 -358 -22 338 270 -20 332 -133 19 -18 -58 101 -34 -113 90
4934 90 85 -101 -96 -53 -141 -81 -115 217 -173 -171 313 -163 271 -48 316 -34 -92 -31 -37 137 137 -66 -99 167 24 -13
4960 -13 166 -52 -199 33 27 38 -140 -96 68 -3 -157 12 -59 -176 12 -70 226 101 -69 174 -9 270 -264
4983 -264 -327 -58 -75 -118 70 136 154 87 -36 93 144 -54 -34 -105 253 315 -170 229 125 -182 49 -177 111
$$ packed form
4824B74m05K3K79l26j5N53o44L34L50n23%L53n82L35nJ62n33L83J7l65Q0N98n50
4847b07J93R9l76K0M00l1j64J33k2k9k50L94l46J13L90o53J41N54n58J32K21j95
4869d1k10M63j24j92K80p0k57K38l6l92L76J92m02L84J2k66j32M14j83M8q8j61
4891a47L06j81J24k95N7N05l18J63j02k03O6L30k98l5J64J80j75o6K16n16K06
4912a9L97k71l77L93k07j25J16j29j36L36L60o8k90L52m65J52l7m0J59j35p9K03
4934I0nj86NM3q8O0l4L32l90KM84m76M34l19L64l50n8O1oJ74%k03l3K66j43l7
4960a3J79k18j47K32oJ1j78M4J64p1j54J69p1j17J88q2K96j25j70K43j83K79n34
4983b64o3K69j7m3J88O6J8o7j23J29N1j98K0p1L58O2m85L99j04l07K31k26K88
$$ plain form
5006 111 86 72 56 -32 -330 -48 -55 -155 127 32 65 -202 87 176 -288 225 69 -141 -30 -52 -320 -32 52 -191
5030 -191 -131 -133 48 -264 55 -250 -302 84 7 -181 88 91 -47 113 43 -275 -208 -148 -230 130 92 -229 -17 83
5054 83 287 144 5 -45 -92 -237 101 -29 -43 303 -210 -51 -192 45 -44 273 192 -136 77 -92 -250 54
5076 54 129 -416 -130 130 42 -154 468 234 -241 -5 265 -294 70 146 -322 70 266 -163 223 -27 -459
5097 -459 -315 -42 44 -157 79 116 -186 -46 170 -320 77 120 -289 102 -185 -260 -59 199 -447 -183 201
5118 201 124 -227 192 136 -264 174 73 -525 58 135 -215 16 -133 -369 -138 408 220 -149 -26 -101 -273
5139 -273 2 89 -136 115 225 -377 77 95 25 -181 70 136 119 309 167 -45 260 186 -86 340 159 -155
$$ packed form
5006A11k5j4j6q8k98K82pj00K82r5L3k67K89Q9m64N13j56k10J11k2k68K88Q4k43
5030a91O0kJ81l12L19l05n2L86p7j88K69Lj38J60p0l18O7O0q2L60l8l21K12J00
5054H3K04j43j39n0m7j45L38j30j4L46n13J59j41K37q9L17q1l28K13j69j58L04
5076E4P5n45K86K60q8j96O22k34m75K36K70n59L64P6m68L92J96m29L86k50m32
5097d59J44K73Q6k01K36L7l02J40K16m90L97M3m09L91k87p5K01K58o46K64L84
5118B01p7l51M19n6m00M38j01n98N83P7l50K31j49k36K31N46j88l69J23p5j72
5139b73K75Q7k25K51J10o02M54J8p0k06K51O6j7J90j42k12L05p4k72M26j81l14
$$ [...]
8191F7
##END NTUPLES=NMR FID
##END=
